$ mpirun -machinefile $OAR_NODEFILE dolfinx-scaling-test --output 03
[1715270862.433294] [econome-9:24949:0]      rdmacm_cm.c:638  UCX  ERROR rdma_create_event_channel failed: No such device
[1715270862.433349] [econome-9:24949:0]     ucp_worker.c:1432 UCX  ERROR failed to open CM on component rdmacm with status Input/output error
[1715270862.434165] [econome-9:24953:0]      rdmacm_cm.c:638  UCX  ERROR rdma_create_event_channel failed: No such device
[1715270862.434209] [econome-9:24953:0]     ucp_worker.c:1432 UCX  ERROR failed to open CM on component rdmacm with status Input/output error
[econome-9.nantes.grid5000.fr:24949] ../../../../../../ompi/mca/pml/ucx/pml_ucx.c:273  Error: Failed to create UCP worker
[econome-9.nantes.grid5000.fr:24953] ../../../../../../ompi/mca/pml/ucx/pml_ucx.c:273  Error: Failed to create UCP worker
[1715270862.436514] [econome-9:24956:0]      rdmacm_cm.c:638  UCX  ERROR rdma_create_event_channel failed: No such device
[1715270862.436555] [econome-9:24956:0]     ucp_worker.c:1432 UCX  ERROR failed to open CM on component rdmacm with status Input/output error
[1715270862.436803] [econome-9:24955:0]      rdmacm_cm.c:638  UCX  ERROR rdma_create_event_channel failed: No such device
[1715270862.436848] [econome-9:24955:0]     ucp_worker.c:1432 UCX  ERROR failed to open CM on component rdmacm with status Input/output error
[1715270862.437144] [econome-9:24951:0]      rdmacm_cm.c:638  UCX  ERROR rdma_create_event_channel failed: No such device
[1715270862.437190] [econome-9:24951:0]     ucp_worker.c:1432 UCX  ERROR failed to open CM on component rdmacm with status Input/output error
[econome-9.nantes.grid5000.fr:24956] ../../../../../../ompi/mca/pml/ucx/pml_ucx.c:273  Error: Failed to create UCP worker
[econome-9.nantes.grid5000.fr:24955] ../../../../../../ompi/mca/pml/ucx/pml_ucx.c:273  Error: Failed to create UCP worker
[econome-9.nantes.grid5000.fr:24951] ../../../../../../ompi/mca/pml/ucx/pml_ucx.c:273  Error: Failed to create UCP worker
[1715270862.438909] [econome-9:24958:0]      rdmacm_cm.c:638  UCX  ERROR rdma_create_event_channel failed: No such device
[1715270862.438966] [econome-9:24958:0]     ucp_worker.c:1432 UCX  ERROR failed to open CM on component rdmacm with status Input/output error
[econome-9.nantes.grid5000.fr:24958] ../../../../../../ompi/mca/pml/ucx/pml_ucx.c:273  Error: Failed to create UCP worker
[1715270862.442506] [econome-9:24969:0]      rdmacm_cm.c:638  UCX  ERROR rdma_create_event_channel failed: No such device
[1715270862.442550] [econome-9:24969:0]     ucp_worker.c:1432 UCX  ERROR failed to open CM on component rdmacm with status Input/output error
[1715270862.443215] [econome-9:24963:0]      rdmacm_cm.c:638  UCX  ERROR rdma_create_event_channel failed: No such device
[1715270862.443255] [econome-9:24963:0]     ucp_worker.c:1432 UCX  ERROR failed to open CM on component rdmacm with status Input/output error
[econome-9.nantes.grid5000.fr:24969] ../../../../../../ompi/mca/pml/ucx/pml_ucx.c:273  Error: Failed to create UCP worker
[econome-9.nantes.grid5000.fr:24963] ../../../../../../ompi/mca/pml/ucx/pml_ucx.c:273  Error: Failed to create UCP worker
[1715270862.448055] [econome-9:24954:0]      rdmacm_cm.c:638  UCX  ERROR rdma_create_event_channel failed: No such device
[1715270862.448126] [econome-9:24954:0]     ucp_worker.c:1432 UCX  ERROR failed to open CM on component rdmacm with status Input/output error
[1715270862.448722] [econome-9:24952:0]      rdmacm_cm.c:638  UCX  ERROR rdma_create_event_channel failed: No such device
[1715270862.448784] [econome-9:24952:0]     ucp_worker.c:1432 UCX  ERROR failed to open CM on component rdmacm with status Input/output error
[econome-9.nantes.grid5000.fr:24954] ../../../../../../ompi/mca/pml/ucx/pml_ucx.c:273  Error: Failed to create UCP worker
[econome-9.nantes.grid5000.fr:24952] ../../../../../../ompi/mca/pml/ucx/pml_ucx.c:273  Error: Failed to create UCP worker
[1715270862.451832] [econome-9:24950:0]      rdmacm_cm.c:638  UCX  ERROR rdma_create_event_channel failed: No such device
[1715270862.451872] [econome-9:24950:0]     ucp_worker.c:1432 UCX  ERROR failed to open CM on component rdmacm with status Input/output error
[1715270862.451920] [econome-9:24961:0]      rdmacm_cm.c:638  UCX  ERROR rdma_create_event_channel failed: No such device
[1715270862.451959] [econome-9:24961:0]     ucp_worker.c:1432 UCX  ERROR failed to open CM on component rdmacm with status Input/output error
[econome-9.nantes.grid5000.fr:24950] ../../../../../../ompi/mca/pml/ucx/pml_ucx.c:273  Error: Failed to create UCP worker
[econome-9.nantes.grid5000.fr:24961] ../../../../../../ompi/mca/pml/ucx/pml_ucx.c:273  Error: Failed to create UCP worker
[1715270862.453500] [econome-9:24974:0]      rdmacm_cm.c:638  UCX  ERROR rdma_create_event_channel failed: No such device
[1715270862.453538] [econome-9:24974:0]     ucp_worker.c:1432 UCX  ERROR failed to open CM on component rdmacm with status Input/output error
[econome-9.nantes.grid5000.fr:24974] ../../../../../../ompi/mca/pml/ucx/pml_ucx.c:273  Error: Failed to create UCP worker
[1715270862.455811] [econome-9:24977:0]      rdmacm_cm.c:638  UCX  ERROR rdma_create_event_channel failed: No such device
[1715270862.455862] [econome-9:24977:0]     ucp_worker.c:1432 UCX  ERROR failed to open CM on component rdmacm with status Input/output error
[econome-9.nantes.grid5000.fr:24977] ../../../../../../ompi/mca/pml/ucx/pml_ucx.c:273  Error: Failed to create UCP worker
[1715270862.457094] [econome-9:24971:0]      rdmacm_cm.c:638  UCX  ERROR rdma_create_event_channel failed: No such device
[1715270862.457142] [econome-9:24971:0]     ucp_worker.c:1432 UCX  ERROR failed to open CM on component rdmacm with status Input/output error
[1715270862.457312] [econome-9:24979:0]      rdmacm_cm.c:638  UCX  ERROR rdma_create_event_channel failed: No such device
[1715270862.457358] [econome-9:24979:0]     ucp_worker.c:1432 UCX  ERROR failed to open CM on component rdmacm with status Input/output error
[econome-9.nantes.grid5000.fr:24971] ../../../../../../ompi/mca/pml/ucx/pml_ucx.c:273  Error: Failed to create UCP worker
[econome-9.nantes.grid5000.fr:24979] ../../../../../../ompi/mca/pml/ucx/pml_ucx.c:273  Error: Failed to create UCP worker
UnitCube (92x88x96) to be refined 0 times
----------------------------------------------------------------
Test problem summary
  dolfinx version: 2019.2.9.99
  dolfinx hash:    unknown
  ufl hash:        ac78d56bf5c7fcc5585cc7f0654188e75f1c73b1
  petsc version:   Petsc Release Version 3.14.5, Mar 03, 2021 
  Problem type:    poisson
  Scaling type:    weak
  Num processes:   16
  Num cells        4663296
  Total degrees of freedom:               802869
  Average degrees of freedom per process: 50179
----------------------------------------------------------------

[MPI_AVG] Summary of timings                                   |  reps  wall avg  wall tot
------------------------------------------------------------------------------------------
Build BoxMesh                                                  |     1  2.551623  2.551623
Build dofmap data                                              |     2  0.123052  0.246104
Build sparsity                                                 |     1  0.068052  0.068052
Compute SCOTCH graph re-ordering                               |     2  0.011153  0.022306
Compute connectivity 2-3                                       |     1  0.008633  0.008633
Compute dof reordering map                                     |     2  0.070117  0.140234
Compute entities of dim = 1                                    |     1  1.355765  1.355765
Compute entities of dim = 2                                    |     1  1.112399  1.112399
Compute graph partition (SCOTCH)                               |     1  1.794098  1.794098
Compute local part of mesh dual graph                          |     1  0.258600  0.258600
Compute local-to-local map                                     |     1  0.008462  0.008462
Compute non-local part of mesh dual graph                      |     1  0.054460  0.054460
Compute-local-to-global links for global/local adjacency list  |     1  0.005185  0.005185
Distribute in graph creation AdjacencyList                     |     1  0.064644  0.064644
Extract partition boundaries from SCOTCH graph                 |     1  0.005192  0.005192
Fetch float data from remote processes                         |     1  0.005415  0.005415
Get SCOTCH graph data                                          |     1  0.000006  0.000006
Init dofmap from element dofmap                                |     2  0.035479  0.070957
PETSc Krylov solver                                            |     1  3.774541  3.774541
SCOTCH: call SCOTCH_dgraphBuild                                |     1  0.000945  0.000945
SCOTCH: call SCOTCH_dgraphHalo                                 |     1  0.004651  0.004651
SCOTCH: call SCOTCH_dgraphPart                                 |     1  1.766365  1.766365
SCOTCH: call SCOTCH_graphBuild                                 |     2  0.000061  0.000122
SCOTCH: call SCOTCH_graphOrder                                 |     2  0.010077  0.020155
SparsityPattern::assemble                                      |     1  0.133681  0.133681
TOPOLOGY: Create sets                                          |     1  0.090499  0.090499
ZZZ Assemble                                                   |     1  1.520074  1.520074
ZZZ Assemble matrix                                            |     1  0.254093  0.254093
ZZZ Assemble vector                                            |     1  0.048308  0.048308
ZZZ Create Mesh                                                |     1  2.552032  2.552032
ZZZ Create mesh entity permutations                            |     1  2.553472  2.553472
ZZZ FunctionSpace                                              |     1  0.122242  0.122242
ZZZ Output                                                     |     1  0.975883  0.975883
ZZZ Solve                                                      |     1  3.775003  3.775003
*** Number of Krylov iterations: 499
*** Solution norm:  130531
