Release 1.8.0

1 job for 1.8.0 in 4 minutes and 6 seconds (queued for 2 seconds)
latest
Status Job ID Name Coverage
  Test
failed #110398
test

00:04:06

 
Name Stage Failure
failed
test Test
               ^~~~~~
error: command 'x86_64-linux-gnu-gcc' failed with exit status 1
E: pybuild pybuild:338: build: plugin distutils failed with: exit code=1: /usr/bin/python setup.py build
dh_auto_build: pybuild --build -i python{version} -p 2.7 returned exit code 13
make[1]: *** [debian/rules:18: override_dh_auto_build] Error 25
make[1]: Leaving directory '/builds/apt-team/python-apt'
make: *** [debian/rules:15: build] Error 2
dpkg-buildpackage: error: debian/rules build subprocess returned exit status 2
ERROR: Job failed: exit code 1