Release 1.7.1

1 job for 1.7.1 in 3 minutes and 51 seconds
latest
Status Job ID Name Coverage
  Test
failed #164322
test

00:03:51

 
Name Stage Failure
failed
test Test
    APT_HIDDEN FileFd(const FileFd &);
^~~~~~
error: command 'x86_64-linux-gnu-gcc' failed with exit status 1
dh_auto_build: python2.7-dbg setup.py build --force returned exit code 1
make[1]: *** [debian/rules:19: override_dh_auto_build] Error 1
make[1]: Leaving directory '/builds/apt-team/python-apt'
make: *** [debian/rules:16: build] Error 2
dpkg-buildpackage: error: debian/rules build subprocess returned exit status 2
ERROR: Job failed: exit code 1