<define-tag pagetitle>DLA-927-1 fop</define-tag>
<define-tag report_date>2017-4-29</define-tag>
<define-tag secrefs>CVE-2017-5661 Bug#860567</define-tag>
<define-tag packages>fop</define-tag>
<define-tag isvulnerable>yes</define-tag>
<define-tag fixed>yes</define-tag>
<define-tag fixed-section>no</define-tag>

#use wml::debian::security

