<define-tag pagetitle>DLA-1428-1 389-ds-base</define-tag>
<define-tag report_date>2018-7-15</define-tag>
<define-tag secrefs>CVE-2015-1854 CVE-2017-15134 CVE-2018-1054 CVE-2018-1089 CVE-2018-10850</define-tag>
<define-tag packages>389-ds-base</define-tag>
<define-tag isvulnerable>yes</define-tag>
<define-tag fixed>yes</define-tag>
<define-tag fixed-section>no</define-tag>

#use wml::debian::security

