<define-tag pagetitle>DSA-4576-1 php-imagick</define-tag>
<define-tag report_date>2019-11-25</define-tag>
<define-tag secrefs>CVE-2019-11037 Bug#928420</define-tag>
<define-tag packages>php-imagick</define-tag>
<define-tag isvulnerable>yes</define-tag>
<define-tag fixed>yes</define-tag>
<define-tag fixed-section>no</define-tag>

#use wml::debian::security



</dl>
