<define-tag pagetitle>DLA-723-1 libsoap-lite-perl</define-tag>
<define-tag report_date>2016-11-25</define-tag>
<define-tag secrefs>CVE-2015-8978</define-tag>
<define-tag packages>libsoap-lite-perl</define-tag>
<define-tag isvulnerable>yes</define-tag>
<define-tag fixed>yes</define-tag>
<define-tag fixed-section>no</define-tag>

#use wml::debian::security

