<define-tag pagetitle>DSA-4344-1 roundcube</define-tag>
<define-tag report_date>2018-11-24</define-tag>
<define-tag secrefs>CVE-2018-19206</define-tag>
<define-tag packages>roundcube</define-tag>
<define-tag isvulnerable>yes</define-tag>
<define-tag fixed>yes</define-tag>
<define-tag fixed-section>no</define-tag>

#use wml::debian::security



</dl>
