<define-tag pagetitle>DLA-1793-1 dhcpcd5</define-tag>
<define-tag report_date>2019-05-19</define-tag>
<define-tag secrefs>CVE-2019-11579</define-tag>
<define-tag packages>dhcpcd5</define-tag>
<define-tag isvulnerable>yes</define-tag>
<define-tag fixed>yes</define-tag>
<define-tag fixed-section>no</define-tag>

#use wml::debian::security
