<define-tag pagetitle>DLA-1886-1 openjdk-7</define-tag>
<define-tag report_date>2019-8-15</define-tag>
<define-tag secrefs>CVE-2019-2745 CVE-2019-2762 CVE-2019-2769 CVE-2019-2816</define-tag>
<define-tag packages>openjdk-7</define-tag>
<define-tag isvulnerable>yes</define-tag>
<define-tag fixed>yes</define-tag>
<define-tag fixed-section>no</define-tag>

#use wml::debian::security

