Backport changelog fixup

12 jobs for master in 11 minutes and 55 seconds (queued for 4 seconds)
Status Job ID Name Coverage
  Build
failed #123716
build arch

00:11:55

failed #123715
build full

00:02:50

passed #123717
build indep

00:03:39

 
  Test
skipped #123721
autopkgtest mysql
skipped #123722
autopkgtest pgsql
skipped #123720
autopkgtest sqlite3
skipped #123719
build log scanner
skipped #123718
lintian
skipped #123725
piuparts mysql
skipped #123726
piuparts pgsql
skipped #123724
piuparts sqlite3
skipped #123723
reprotest
 
Name Stage Failure
failed
build arch Build
make[1]: *** [debian/rules:133: override_dh_install-arch] Error 25
make[1]: Leaving directory '/tmp/building/package'
make: *** [debian/rules:113: binary-arch] Error 2
dpkg-buildpackage: error: debian/rules binary-arch subprocess returned exit status 2
+ cleanup
+ docker rm -f 9a9b76e94a469ce72cc961a5960965a9f790e8a2b4fcc7317ab86872d5151eb1
9a9b76e94a469ce72cc961a5960965a9f790e8a2b4fcc7317ab86872d5151eb1
gbp:error: 'docker-build.sh registry.salsa.debian.org/bacula-team/images/dockerbuilder:unstable --build=any' failed: it exited with 1
ERROR: Job failed: exit code 1
failed
build full Build
dpkg-source: info: the patch has fuzz which is not allowed, or is malformed
dpkg-source: info: if patch 'backport/fix-changelog' is correctly applied by quilt, use 'quilt refresh' to update it
dpkg-source: error: LC_ALL=C patch -t -F 0 -N -p1 -u -V never -E -b -B .pc/backport/fix-changelog/ --reject-file=- < package.orig.eOJTik/debian/patches/backport/fix-changelog subprocess returned exit status 1
dpkg-buildpackage: error: dpkg-source -b . subprocess returned exit status 2
+ cleanup
+ docker rm -f ed051d7abe556b6262b816d43897bd814541be025c4e66261b70bd450ba21ad5
ed051d7abe556b6262b816d43897bd814541be025c4e66261b70bd450ba21ad5
gbp:error: 'docker-build.sh registry.salsa.debian.org/bacula-team/images/dockerbuilder:unstable --build=full' failed: it exited with 1
ERROR: Job failed: exit code 1