Remove arch-any and arch-all build jobs, now provided by salsa-ci.yml

8 jobs for master in 45 minutes and 1 second (queued for 1 second)
latest
Status Job ID Name Coverage
  Build
passed #281232
build

00:18:32

 
  Test
failed #281237
autopkgtest

00:04:38

passed #281238
blhc

00:01:34

passed #281236
lintian

00:02:24

passed #281239
piuparts

00:25:06

passed #281235
reprotest

00:26:26

failed #281234
test-build-all

00:05:03

passed #281233
test-build-any

00:07:25

 
Name Stage Failure
failed
test-build-all Test
make[1]: *** [debian/rules:200: override_dh_makeshlibs] Error 2
make[1]: Leaving directory '/builds/bacula-team/bacula/debian/output/bacula-9.4.4'
make: *** [debian/rules:113: binary-indep] Error 2
dpkg-buildpackage: error: debian/rules binary-indep subprocess returned exit status 2
+ cleanup
+ docker rm -f c97d1ff63a8c66f081cfe963ed9f56b182569d8238ddb1f4325467f6a48985cc
c97d1ff63a8c66f081cfe963ed9f56b182569d8238ddb1f4325467f6a48985cc
gbp:error: 'docker-build.sh registry.salsa.debian.org/salsa-ci-team/pipeline/dockerbuilder:unstable --build=all' failed: it exited with 1
ERROR: Job failed: exit code 1
failed
autopkgtest Test
    shutil.copy(tb, host)
File "/usr/lib/python3.7/shutil.py", line 248, in copy
copyfile(src, dst, follow_symlinks=follow_symlinks)
File "/usr/lib/python3.7/shutil.py", line 120, in copyfile
with open(src, 'rb') as fsrc:
FileNotFoundError: [Errno 2] No such file or directory: '/tmp/autopkgtest-lxc.0z8im39k/downtmp/program-test-pgsql-stdout'
autopkgtest [04:42:42]: ERROR: testbed failure: unexpected eof from the testbed
I: test artifacts available at /tmp/debci-localtest.WyZf9Vv3fI
ERROR: Job failed: exit code 1