<?xml version="1.0" encoding="UTF-8" standalone="no"?>
<!-- Created with Inkscape (http://www.inkscape.org/) -->

<svg
   xmlns:dc="http://purl.org/dc/elements/1.1/"
   xmlns:cc="http://creativecommons.org/ns#"
   xmlns:rdf="http://www.w3.org/1999/02/22-rdf-syntax-ns#"
   xmlns:svg="http://www.w3.org/2000/svg"
   xmlns="http://www.w3.org/2000/svg"
   xmlns:sodipodi="http://sodipodi.sourceforge.net/DTD/sodipodi-0.dtd"
   xmlns:inkscape="http://www.inkscape.org/namespaces/inkscape"
   width="19.131245mm"
   height="22.286255mm"
   viewBox="0 0 67.787875 78.967046"
   id="svg3571"
   version="1.1"
   inkscape:version="0.92.1 r15371"
   sodipodi:docname="DC17 swirl.svg">
  <defs
     id="defs3573" />
  <sodipodi:namedview
     id="base"
     pagecolor="#ffffff"
     bordercolor="#666666"
     borderopacity="1.0"
     inkscape:pageopacity="0.0"
     inkscape:pageshadow="2"
     inkscape:zoom="1.5826732"
     inkscape:cx="-51.520281"
     inkscape:cy="-47.557502"
     inkscape:document-units="px"
     inkscape:current-layer="layer1"
     showgrid="false"
     inkscape:window-width="1280"
     inkscape:window-height="773"
     inkscape:window-x="0"
     inkscape:window-y="27"
     inkscape:window-maximized="1"
     fit-margin-top="0"
     fit-margin-left="0"
     fit-margin-right="0"
     fit-margin-bottom="0" />
  <metadata
     id="metadata3576">
    <rdf:RDF>
      <cc:Work
         rdf:about="">
        <dc:format>image/svg+xml</dc:format>
        <dc:type
           rdf:resource="http://purl.org/dc/dcmitype/StillImage" />
        <dc:title></dc:title>
      </cc:Work>
    </rdf:RDF>
  </metadata>
  <g
     inkscape:label="Camada 1"
     inkscape:groupmode="layer"
     id="layer1"
     transform="translate(-420.81064,-86.587955)">
    <path
       inkscape:connector-curvature="0"
       style="color:#000000;font-style:normal;font-variant:normal;font-weight:normal;font-stretch:normal;font-size:medium;line-height:normal;font-family:sans-serif;text-indent:0;text-align:start;text-decoration:none;text-decoration-line:none;text-decoration-style:solid;text-decoration-color:#000000;letter-spacing:normal;word-spacing:normal;text-transform:none;writing-mode:lr-tb;direction:ltr;baseline-shift:baseline;text-anchor:start;white-space:normal;clip-rule:nonzero;display:inline;overflow:visible;visibility:visible;opacity:1;isolation:auto;mix-blend-mode:normal;color-interpolation:sRGB;color-interpolation-filters:linearRGB;solid-color:#000000;solid-opacity:1;fill:#be1e2d;fill-opacity:1;fill-rule:nonzero;stroke:none;stroke-width:0.80000001;stroke-linecap:square;stroke-linejoin:miter;stroke-miterlimit:10;stroke-dasharray:none;stroke-dashoffset:0;stroke-opacity:1;color-rendering:auto;image-rendering:auto;shape-rendering:auto;text-rendering:auto;enable-background:accumulate"
       d="m 455.22834,86.587955 -0.21577,1.536871 0.76844,0.106015 c 5.71435,0.809204 11.21032,3.167702 15.73587,6.749347 4.52554,3.581645 8.0823,8.388062 10.1827,13.763672 2.12288,5.43317 2.73531,11.53207 1.16968,17.09482 -1.0323,3.66781 -3.0051,7.0764 -5.69323,9.7701 -2.68776,2.69333 -6.0986,4.67366 -9.77388,5.64022 -4.1124,1.08151 -8.56346,0.88182 -12.5637,-0.56024 -4.00024,-1.44205 -7.55487,-4.1292 -10.03129,-7.58591 l -0.45425,-0.63216 -1.25674,0.9047 0.45046,0.62837 c 2.66325,3.71755 6.46357,6.59531 10.76566,8.14617 4.30206,1.55087 9.06086,1.76119 13.48355,0.59809 3.95041,-1.03893 7.59596,-3.15728 10.47796,-6.04527 2.88164,-2.88759 4.98676,-6.52538 6.0907,-10.44767 1.67387,-5.94739 1.00987,-12.37105 -1.21891,-18.07525 -2.20211,-5.63594 -5.92252,-10.659659 -10.66723,-14.414766 -4.74471,-3.755087 -10.49048,-6.218903 -16.48158,-7.067315 l -0.76844,-0.109697 z m -2.67248,2.979103 c -0.85461,-0.02927 -1.70891,-0.02151 -2.56271,0.02268 -2.27679,0.117838 -4.54356,0.501062 -6.73799,1.162116 -5.58869,1.683509 -10.62619,5.105279 -14.252,9.679236 l -0.48074,0.60567 1.21511,0.96526 0.48075,-0.60944 c 3.42483,-4.320421 8.20842,-7.566655 13.48733,-9.156863 8.27936,-2.49405 17.70039,-0.761138 24.75646,4.26993 7.63338,5.442683 12.4575,14.689203 12.55613,24.063713 l 0.008,0.776 1.55201,-0.0155 -0.008,-0.77601 c -0.10408,-9.89353 -5.155,-19.56888 -13.211,-25.312904 -4.88819,-3.48532 -10.82105,-5.469742 -16.80335,-5.674291 z m -0.38233,2.767112 c -5.76077,-0.123071 -11.55148,1.729694 -16.10304,5.28062 -3.10987,2.42616 -5.58628,5.56659 -7.4913,8.97138 -3.23517,5.78211 -4.88321,12.39974 -4.93614,19.01022 -0.0965,12.03735 5.26031,23.97966 14.31255,31.91464 l 0.58295,0.51103 1.02207,-1.1659 -0.58295,-0.51102 c -8.69931,-7.62562 -13.87531,-19.16937 -13.78261,-30.73739 0.051,-6.36062 1.64073,-12.72653 4.7393,-18.26451 1.82416,-3.26029 4.17446,-6.23412 7.08625,-8.505768 4.25404,-3.318816 9.7138,-5.07047 15.11885,-4.955074 5.9278,0.126559 11.80086,2.502364 16.15227,6.529792 l 0.57159,0.52618 1.05234,-1.139416 -0.56781,-0.526161 c -4.638,-4.292683 -10.85611,-6.803788 -17.17432,-6.938623 z m 25.7028,2.627063 -1.04098,1.150758 0.57537,0.518603 c 7.11449,6.435916 10.74689,16.580906 9.33478,26.069976 -0.88311,5.93433 -3.6488,11.58796 -7.79033,15.92892 l -0.53752,0.56024 1.12424,1.07127 0.53374,-0.56023 c 4.36728,-4.57759 7.27171,-10.51527 8.20296,-16.77307 1.49235,-10.02834 -2.31189,-20.64619 -9.83067,-27.447865 z m -44.39883,9.690597 -0.40505,0.65867 c -3.75026,6.0537 -5.82715,13.12018 -5.94305,20.24046 -0.15505,9.53247 3.25695,19.06151 9.4294,26.32741 6.17243,7.26592 15.02523,12.17511 24.4574,13.56306 l 0.76465,0.11357 0.22713,-1.53687 -0.76843,-0.10969 c -9.04867,-1.33151 -17.57828,-6.06264 -23.4997,-13.03311 -5.9215,-6.97045 -9.20725,-16.15287 -9.05844,-25.29776 0.11125,-6.83557 2.10807,-13.64147 5.70836,-19.45312 l 0.40883,-0.65867 -1.3211,-0.81385 z m 25.05927,5.94685 c -2.28871,-0.0913 -4.59118,0.44689 -6.60172,1.54445 -1.90708,1.04104 -3.53368,2.57198 -4.68632,4.41376 -1.15262,1.84179 -1.82032,3.97715 -1.92296,6.14746 -0.10272,2.17033 0.35882,4.35654 1.33245,6.29889 0.97362,1.94236 2.45072,3.62132 4.251,4.83774 l 0.63973,0.43532 0.87063,-1.28705 -0.64352,-0.43152 c -1.57639,-1.06513 -2.87607,-2.5502 -3.72861,-4.25099 -0.85254,-1.70082 -1.2634,-3.6301 -1.17346,-5.53047 0.0899,-1.90038 0.67899,-3.78142 1.68828,-5.39417 1.00928,-1.61273 2.4448,-2.96844 4.11473,-3.88002 1.75994,-0.96075 3.79185,-1.43514 5.79542,-1.35517 2.00351,0.08 3.99282,0.71511 5.67051,1.81321 l 0.64731,0.42774 0.85171,-1.29839 -0.65109,-0.42396 c -1.91655,-1.25443 -4.16533,-1.97539 -6.45409,-2.06683 z m -35.30632,0.64351 -0.23091,0.73816 c -1.84009,5.81224 -2.53369,11.98068 -2.02898,18.05631 0.4823,5.80556 2.05394,11.51763 4.61439,16.75036 l 0.34068,0.6965 1.39303,-0.68136 -0.34068,-0.69653 c -2.47494,-5.05795 -3.9968,-10.58597 -4.46297,-16.19768 -0.48785,-5.87252 0.18218,-11.84028 1.96081,-17.45821 l 0.23471,-0.73815 z m 25.18419,0.0227 -0.57159,0.52239 c -2.35578,2.16117 -4.02008,5.04411 -4.71282,8.16508 -0.69271,3.12097 -0.40257,6.44045 0.81765,9.39534 1.83592,4.44584 5.6833,7.84516 10.1032,9.59974 3.253,1.29137 6.82835,1.742 10.30004,1.29841 3.47174,-0.44358 6.81761,-1.77817 9.64139,-3.84597 l 0.6246,-0.45804 -0.91607,-1.25295 -0.62458,0.45803 c -2.60884,1.91041 -5.7147,3.14844 -8.92217,3.55826 -3.20745,0.40983 -6.52621,-0.008 -9.53162,-1.19997 -4.06665,-1.61436 -7.59471,-4.75432 -9.24392,-8.74803 -1.09629,-2.65476 -1.35674,-5.66395 -0.73435,-8.46792 0.62233,-2.80397 2.13069,-5.41712 4.2472,-7.35878 l 0.57159,-0.52619 z m 9.06223,2.02518 c -0.35844,0.0155 -0.71577,0.0558 -1.07128,0.11726 -2.84398,0.49193 -5.3539,2.42176 -6.56385,5.04213 l -0.32555,0.70031 1.40816,0.65109 0.32555,-0.70408 c 0.98561,-2.13453 3.104,-3.75943 5.42067,-4.16016 2.31671,-0.40074 4.85416,0.41769 6.49952,2.09711 1.35595,1.38403 2.13944,3.3548 2.10089,5.29197 -0.0386,1.93717 -0.89918,3.87211 -2.30908,5.20114 l -0.56403,0.52994 1.0637,1.12804 0.56403,-0.52994 c 1.72365,-1.6248 2.74651,-3.9306 2.7936,-6.29889 0.0471,-2.36832 -0.88229,-4.71284 -2.54,-6.40488 -1.76735,-1.80398 -4.29336,-2.77608 -6.80233,-2.66113 z m -10.10321,42.09355 -0.72679,1.36653 0.68514,0.36339 c 5.73395,3.03969 11.96056,5.14625 18.36293,6.20805 3.10872,0.51556 6.25561,0.78661 9.4067,0.81006 l 0.77601,0.004 0.0116,-1.54823 -0.776,-0.008 c -3.06984,-0.0229 -6.13587,-0.2851 -9.16444,-0.78737 -6.23621,-1.03423 -12.30461,-3.08823 -17.88975,-6.04904 l -0.68515,-0.35962 z"
       id="path5952" />
  </g>
</svg>
