<?xml version="1.0" encoding="UTF-8" standalone="no"?>
<!-- Created with Inkscape (http://www.inkscape.org/) -->

<svg
   xmlns:dc="http://purl.org/dc/elements/1.1/"
   xmlns:cc="http://creativecommons.org/ns#"
   xmlns:rdf="http://www.w3.org/1999/02/22-rdf-syntax-ns#"
   xmlns:svg="http://www.w3.org/2000/svg"
   xmlns="http://www.w3.org/2000/svg"
   xmlns:sodipodi="http://sodipodi.sourceforge.net/DTD/sodipodi-0.dtd"
   xmlns:inkscape="http://www.inkscape.org/namespaces/inkscape"
   width="33in"
   height="79in"
   viewBox="0 0 838.20001 2006.6001"
   version="1.1"
   id="svg1419"
   inkscape:version="0.92.1 r15371"
   sodipodi:docname="roll-up-banners2_33x79.svg">
  <defs
     id="defs1413" />
  <sodipodi:namedview
     id="base"
     pagecolor="#ffffff"
     bordercolor="#666666"
     borderopacity="1.0"
     inkscape:pageopacity="0.0"
     inkscape:pageshadow="2"
     inkscape:zoom="0.069042969"
     inkscape:cx="2751.9497"
     inkscape:cy="2170.5072"
     inkscape:document-units="mm"
     inkscape:current-layer="layer1"
     showgrid="false"
     units="in"
     inkscape:window-width="1920"
     inkscape:window-height="1016"
     inkscape:window-x="0"
     inkscape:window-y="27"
     inkscape:window-maximized="1" />
  <metadata
     id="metadata1416">
    <rdf:RDF>
      <cc:Work
         rdf:about="">
        <dc:format>image/svg+xml</dc:format>
        <dc:type
           rdf:resource="http://purl.org/dc/dcmitype/StillImage" />
        <dc:title></dc:title>
      </cc:Work>
    </rdf:RDF>
  </metadata>
  <g
     inkscape:label="Camada 1"
     inkscape:groupmode="layer"
     id="layer1"
     transform="translate(0,1709.6)">
    <g
       id="g4228"
       transform="matrix(0.74515481,0,0,0.74515481,-53.294345,-837.36855)">
      <g
         style="color:#000000;clip-rule:nonzero;display:inline;overflow:visible;visibility:visible;opacity:1;isolation:auto;mix-blend-mode:normal;color-interpolation:sRGB;color-interpolation-filters:linearRGB;solid-color:#000000;solid-opacity:1;fill:#bc312e;fill-opacity:1;fill-rule:nonzero;stroke:none;stroke-width:0.52402526;stroke-linecap:butt;stroke-linejoin:miter;stroke-miterlimit:4;stroke-dasharray:none;stroke-dashoffset:0;stroke-opacity:1;marker:none;color-rendering:auto;image-rendering:auto;shape-rendering:auto;text-rendering:auto;enable-background:accumulate"
         transform="matrix(1.8506257,0,0,1.9083048,-50.499744,-402.48632)"
         id="g3454">
        <path
           inkscape:connector-curvature="0"
           id="path3365"
           style="color:#000000;font-style:normal;font-variant:normal;font-weight:normal;font-stretch:normal;font-size:medium;line-height:120.00000477%;font-family:Monoton;-inkscape-font-specification:'Monoton, Normal';text-indent:0;text-align:center;text-decoration:none;text-decoration-line:none;text-decoration-style:solid;text-decoration-color:#000000;letter-spacing:0px;word-spacing:0px;text-transform:none;writing-mode:lr-tb;direction:ltr;baseline-shift:baseline;text-anchor:middle;white-space:normal;clip-rule:nonzero;display:inline;overflow:visible;visibility:visible;isolation:auto;mix-blend-mode:normal;color-interpolation:sRGB;color-interpolation-filters:linearRGB;solid-color:#000000;solid-opacity:1;fill:#bc312e;fill-opacity:1;fill-rule:nonzero;stroke:none;stroke-width:0.52402526;stroke-linecap:butt;stroke-linejoin:miter;stroke-miterlimit:4;stroke-dasharray:none;stroke-dashoffset:0;stroke-opacity:1;marker:none;color-rendering:auto;image-rendering:auto;shape-rendering:auto;text-rendering:auto;enable-background:accumulate"
           d="m 140.49318,309.19511 v -29.85714 q 0,0 18.50992,0 4.48612,0 7.69047,4.41072 3.24207,4.37302 3.24207,10.51786 0,6.18253 -3.24207,10.55556 -3.20435,4.373 -7.69047,4.373 z m 2.71428,-2.71428 h 15.79564 q 3.35516,0 5.73016,-3.58134 2.41269,-3.58135 2.41269,-8.63294 0,-5.08929 -2.41269,-8.63294 -2.375,-3.58134 -5.73016,-3.58134 h -15.79564 z m -5.42855,5.42857 h 21.22419 q 5.61706,0 9.6508,-5.16469 4.07141,-5.20238 4.07141,-12.47816 0,-4.7877 -1.88492,-8.85913 -1.84721,-4.07141 -5.01388,-6.40873 -3.12896,-2.375 -6.82341,-2.375 h -21.22419 z m -2.71429,2.71428 v -40.71426 h 23.93848 q 4.41071,0 8.21825,2.71427 3.80754,2.71428 6.03175,7.42659 2.2619,4.6746 2.2619,10.21627 0,5.50396 -2.2619,10.21627 -2.22421,4.71229 -6.03175,7.42658 -3.80754,2.71428 -8.21825,2.71428 z m -2.71429,2.71429 h 26.65277 q 5.16468,0 9.57538,-3.09127 4.44842,-3.09128 7.08731,-8.40675 2.63889,-5.31547 2.63889,-11.5734 0,-6.22024 -2.63889,-11.53571 -2.63889,-5.35317 -7.08731,-8.44445 -4.4484,-3.09126 -9.57538,-3.09126 h -26.65277 z m -2.71428,2.71428 v -51.57141 h 29.36705 q 5.88096,0 10.97023,3.46825 5.08929,3.43055 8.10516,9.38692 3.01587,5.95633 3.01587,12.93054 0,6.97419 -3.01587,12.93055 -3.01587,5.95635 -8.10516,9.4246 -5.08927,3.43055 -10.97023,3.43055 z m -2.71429,2.71429 h 32.08134 q 4.93849,0 9.53768,-2.26191 4.59921,-2.26191 7.95437,-6.06944 3.35517,-3.80754 5.35317,-9.08532 2.03572,-5.31547 2.03572,-11.08332 0,-5.76786 -2.03572,-11.04563 -1.998,-5.27778 -5.35317,-9.08532 -3.35516,-3.84524 -7.95437,-6.10714 -4.59919,-2.2619 -9.53768,-2.2619 h -32.08134 z m 32.08134,2.71428 h -34.79562 v -62.42855 h 34.79562 q 7.35119,0 13.72221,4.18452 6.37103,4.18452 10.14088,11.38492 3.80752,7.20039 3.80752,15.64484 0,6.33333 -2.26189,12.13889 -2.22421,5.76784 -5.95635,9.95236 -3.73214,4.18453 -8.85912,6.67262 -5.08928,2.4504 -10.59325,2.4504 z" />
        <path
           inkscape:connector-curvature="0"
           id="path3367"
           style="color:#000000;font-style:normal;font-variant:normal;font-weight:normal;font-stretch:normal;font-size:medium;line-height:120.00000477%;font-family:Monoton;-inkscape-font-specification:'Monoton, Normal';text-indent:0;text-align:center;text-decoration:none;text-decoration-line:none;text-decoration-style:solid;text-decoration-color:#000000;letter-spacing:0px;word-spacing:0px;text-transform:none;writing-mode:lr-tb;direction:ltr;baseline-shift:baseline;text-anchor:middle;white-space:normal;clip-rule:nonzero;display:inline;overflow:visible;visibility:visible;isolation:auto;mix-blend-mode:normal;color-interpolation:sRGB;color-interpolation-filters:linearRGB;solid-color:#000000;solid-opacity:1;fill:#bc312e;fill-opacity:1;fill-rule:nonzero;stroke:none;stroke-width:0.52402526;stroke-linecap:butt;stroke-linejoin:miter;stroke-miterlimit:4;stroke-dasharray:none;stroke-dashoffset:0;stroke-opacity:1;marker:none;color-rendering:auto;image-rendering:auto;shape-rendering:auto;text-rendering:auto;enable-background:accumulate"
           d="m 206.23919,325.48082 h -2.71429 v -54.28569 h 2.71429 z m -5.42856,0 h -2.7143 v -54.28569 h 2.7143 z m -5.42858,0 h -2.71429 v -54.28569 h 2.71429 z m 16.28571,-13.57142 h 25.9742 v 2.71428 h -25.9742 v 2.71429 h 25.9742 v 2.71428 h -25.9742 v 2.71429 h 25.9742 v 2.71428 h -28.68849 v -54.28569 h 28.68849 v 2.71429 h -25.9742 v 2.71427 h 25.9742 v 2.71428 h -25.9742 v 2.7143 h 25.9742 v 2.71429 h -25.9742 v 6.748 h 24.46627 v 2.71429 h -24.46627 v 2.71429 h 24.46627 v 2.71427 h -24.46627 v 2.71429 h 24.46627 v 2.71428 h -24.46627 z" />
        <path
           inkscape:connector-curvature="0"
           id="path3369"
           style="color:#000000;font-style:normal;font-variant:normal;font-weight:normal;font-stretch:normal;font-size:medium;line-height:120.00000477%;font-family:Monoton;-inkscape-font-specification:'Monoton, Normal';text-indent:0;text-align:center;text-decoration:none;text-decoration-line:none;text-decoration-style:solid;text-decoration-color:#000000;letter-spacing:0px;word-spacing:0px;text-transform:none;writing-mode:lr-tb;direction:ltr;baseline-shift:baseline;text-anchor:middle;white-space:normal;clip-rule:nonzero;display:inline;overflow:visible;visibility:visible;isolation:auto;mix-blend-mode:normal;color-interpolation:sRGB;color-interpolation-filters:linearRGB;solid-color:#000000;solid-opacity:1;fill:#bc312e;fill-opacity:1;fill-rule:nonzero;stroke:none;stroke-width:0.52402526;stroke-linecap:butt;stroke-linejoin:miter;stroke-miterlimit:4;stroke-dasharray:none;stroke-dashoffset:0;stroke-opacity:1;marker:none;color-rendering:auto;image-rendering:auto;shape-rendering:auto;text-rendering:auto;enable-background:accumulate"
           d="m 286.76297,298.03639 -0.0754,-0.0377 q 4.25992,-4.14683 4.25992,-10.10317 0,-5.65476 -4.22222,-9.80159 -4.18453,-4.18451 -9.91469,-4.18451 h -29.85713 v 51.5714 h -2.71428 v -54.28569 h 32.57141 q 4.44841,0 8.33136,2.29959 3.92063,2.26191 6.22023,6.14484 2.29961,3.84524 2.29961,8.25596 0,6.03175 -3.24208,10.36705 3.24208,4.48612 3.24208,9.87699 0,5.16468 -2.33731,9.12301 -2.3373,3.92064 -6.14485,5.91864 -3.76983,1.99801 -8.36904,1.99801 h -17.15277 v -2.71427 h 17.15277 q 5.80557,0 9.95238,-4.10913 4.18453,-4.14683 4.18453,-10.21626 0,-2.78969 -1.20636,-5.50398 -1.20635,-2.71427 -3.01586,-4.5615 0,-0.0377 0.0377,-0.0377 z m -9.95239,13.57143 h -17.15276 v 2.71427 h 17.15276 q 2.48811,0 4.22223,-1.65873 1.77182,-1.69642 1.77182,-4.5238 0,-2.4504 -1.80952,-4.29762 -1.80952,-1.88492 -4.18453,-1.88492 h -17.19046 v 2.71429 h 17.19046 q 1.28176,0 2.26191,1.05555 1.01787,1.05555 1.01787,2.4127 0,1.65873 -0.94247,2.56348 -0.94245,0.90478 -2.33731,0.90478 z m 0,5.42856 h -17.15276 v 2.71428 h 17.15276 q 4.67462,0 8.02978,-3.31746 3.39285,-3.35515 3.39285,-8.29364 0,-3.12898 -1.69643,-5.88095 -1.65873,-2.78968 -4.41071,-4.29762 2.75198,-1.43254 4.41071,-4.07143 1.69643,-2.67658 1.69643,-5.99404 0,-4.52381 -3.43056,-7.87897 -3.39285,-3.39286 -7.99207,-3.39286 h -27.14283 v 48.85713 h 2.71428 v -46.14285 h 24.42855 q 3.46826,0 6.06945,2.6012 2.63889,2.5635 2.63889,5.95635 0,3.76984 -2.56349,6.22024 -2.56348,2.41269 -6.14485,2.41269 h -8.29364 -8.85912 v 2.71429 h 8.85912 8.29364 q 3.46826,0 6.06945,2.67658 2.63889,2.67659 2.63889,6.22024 0,3.92064 -2.56349,6.40872 -2.56348,2.4881 -6.14485,2.4881 z m 0,-25.9365 h -17.15276 v 2.71428 h 17.15276 q 2.5258,0 4.25993,-1.58334 1.73412,-1.62102 1.73412,-4.3353 0,-2.2996 -1.80952,-4.07143 -1.80952,-1.77182 -4.18453,-1.77182 h -21.71427 v 43.42855 h 2.71429 v -40.71426 h 18.99998 q 1.28176,0 2.26191,0.98015 1.01787,0.94247 1.01787,2.14881 0,1.54563 -0.94247,2.37499 -0.94245,0.82937 -2.33731,0.82937 z" />
      </g>
      <g
         transform="matrix(2.4989829,0,0,2.5768696,-300.30689,-508.95789)"
         style="color:#000000;clip-rule:nonzero;display:inline;overflow:visible;visibility:visible;opacity:1;isolation:auto;mix-blend-mode:normal;color-interpolation:sRGB;color-interpolation-filters:linearRGB;solid-color:#000000;solid-opacity:1;fill:#1b75bc;fill-opacity:1;fill-rule:nonzero;stroke:none;stroke-width:0.75200349;stroke-linecap:square;stroke-linejoin:miter;stroke-miterlimit:10;stroke-dasharray:none;stroke-dashoffset:0;stroke-opacity:1;marker:none;color-rendering:auto;image-rendering:auto;shape-rendering:auto;text-rendering:auto;enable-background:accumulate"
         id="g3424">
        <path
           inkscape:connector-curvature="0"
           id="path3371"
           style="color:#000000;font-style:normal;font-variant:normal;font-weight:normal;font-stretch:normal;font-size:medium;line-height:120.00000477%;font-family:Monoton;-inkscape-font-specification:'Monoton, Normal';text-indent:0;text-align:center;text-decoration:none;text-decoration-line:none;text-decoration-style:solid;text-decoration-color:#000000;letter-spacing:0px;word-spacing:0px;text-transform:none;writing-mode:lr-tb;direction:ltr;baseline-shift:baseline;text-anchor:middle;white-space:normal;clip-rule:nonzero;display:inline;overflow:visible;visibility:visible;isolation:auto;mix-blend-mode:normal;color-interpolation:sRGB;color-interpolation-filters:linearRGB;solid-color:#000000;solid-opacity:1;fill:#1b75bc;fill-opacity:1;fill-rule:nonzero;stroke:none;stroke-width:0.75200349;stroke-linecap:square;stroke-linejoin:miter;stroke-miterlimit:10;stroke-dasharray:none;stroke-dashoffset:0;stroke-opacity:1;marker:none;color-rendering:auto;image-rendering:auto;shape-rendering:auto;text-rendering:auto;enable-background:accumulate"
           d="m 356.93863,251.92332 -1.64714,1.08879 q -1.50755,-2.23341 -3.93638,-3.51762 -2.40091,-1.31213 -5.22059,-1.31213 -4.57849,0 -7.81693,3.23845 -3.23845,3.23844 -3.23845,7.81693 0,4.57848 3.23845,7.81693 3.23844,3.23844 7.81693,3.23844 2.81968,0 5.22059,-1.31213 2.42883,-1.31213 3.93638,-3.54554 l 1.61922,1.17254 q -1.78672,2.62426 -4.63432,4.15973 -2.8476,1.53547 -6.14187,1.53547 -2.65218,0 -5.08101,-1.03295 -2.40091,-1.03296 -4.15972,-2.79177 -1.75881,-1.75881 -2.79176,-4.15972 -1.03295,-2.42883 -1.03295,-5.081 0,-2.65218 1.03295,-5.05309 1.03295,-2.42883 2.79176,-4.18764 1.75881,-1.75881 4.15972,-2.79176 2.42883,-1.03296 5.08101,-1.03296 3.32219,0 6.16979,1.56339 2.84759,1.53547 4.63432,4.18764 z m 3.3222,-2.28924 -1.67506,1.08879 q -2.0659,-3.01511 -5.36018,-4.77392 -3.26636,-1.78672 -7.09107,-1.78672 -4.10389,0 -7.56567,2.03798 -3.46179,2.01007 -5.49977,5.47185 -2.01007,3.46179 -2.01007,7.56568 0,4.10388 2.01007,7.56567 2.03798,3.46178 5.49977,5.49977 3.46178,2.01006 7.56567,2.01006 3.82471,0 7.11899,-1.78672 3.29428,-1.78673 5.36018,-4.82975 l 1.64714,1.14462 q -2.34508,3.46179 -6.08604,5.47185 -3.71304,2.01007 -8.04027,2.01007 -4.63433,0 -8.57071,-2.28924 -3.93638,-2.28925 -6.22563,-6.22563 -2.28924,-3.93638 -2.28924,-8.5707 0,-4.63433 2.28924,-8.57071 2.28925,-3.93638 6.22563,-6.22563 3.93638,-2.28924 8.57071,-2.28924 4.32723,0 8.04027,2.01007 3.74096,2.01006 6.08604,5.47185 z m 3.35011,-2.23341 -1.67506,1.08879 q -2.62425,-3.85263 -6.81189,-6.08604 -4.15973,-2.26133 -8.98947,-2.26133 -3.88055,0 -7.42609,1.50755 -3.54553,1.50755 -6.11395,4.07597 -2.54051,2.54051 -4.04806,6.08604 -1.50755,3.54554 -1.50755,7.42609 0,3.88054 1.50755,7.42608 1.50755,3.54554 4.04806,6.11396 2.56842,2.5405 6.11395,4.04805 3.54554,1.50755 7.42609,1.50755 4.85766,0 9.01738,-2.26133 4.15973,-2.26132 6.78398,-6.11395 l 1.61922,1.20045 q -2.90343,4.24348 -7.50983,6.72815 -4.57849,2.45675 -9.91075,2.45675 -5.72311,0 -10.58078,-2.81968 -4.85766,-2.8476 -7.70526,-7.70526 -2.81967,-4.85766 -2.81967,-10.58077 0,-5.72311 2.81967,-10.58078 2.8476,-4.85766 7.70526,-7.67734 4.85767,-2.8476 10.58078,-2.8476 5.36018,0 9.96658,2.51259 4.60641,2.48467 7.50984,6.75606 z m 3.29428,-2.28924 -1.67506,1.08878 q -3.18261,-4.66224 -8.23569,-7.37025 -5.02517,-2.708 -10.85995,-2.708 -4.69016,0 -8.98947,1.84256 -4.2714,1.81464 -7.37025,4.9135 -3.09886,3.09885 -4.94142,7.39816 -1.81464,4.2714 -1.81464,8.96156 0,4.69015 1.81464,8.98947 1.84256,4.27139 4.94142,7.37024 3.09885,3.09886 7.37025,4.94142 4.29931,1.81465 8.98947,1.81465 5.83478,0 10.88786,-2.73593 5.05309,-2.73593 8.2357,-7.39817 l 1.61922,1.22838 q -3.46178,5.02517 -8.93363,7.98443 -5.47186,2.93135 -11.80915,2.93135 -5.10893,0 -9.77117,-2.01006 -4.63432,-1.98215 -8.01235,-5.33227 -3.35011,-3.37803 -5.36018,-8.01235 -1.98215,-4.66224 -1.98215,-9.77116 0,-5.10893 1.98215,-9.74325 2.01007,-4.66224 5.36018,-8.01235 3.37803,-3.37803 8.01235,-5.36018 4.66224,-2.01007 9.77117,-2.01007 6.36521,0 11.83706,2.95926 5.47185,2.95927 8.93364,8.04028 z" />
        <path
           inkscape:connector-curvature="0"
           id="path3373"
           style="color:#000000;font-style:normal;font-variant:normal;font-weight:normal;font-stretch:normal;font-size:medium;line-height:120.00000477%;font-family:Monoton;-inkscape-font-specification:'Monoton, Normal';text-indent:0;text-align:center;text-decoration:none;text-decoration-line:none;text-decoration-style:solid;text-decoration-color:#000000;letter-spacing:0px;word-spacing:0px;text-transform:none;writing-mode:lr-tb;direction:ltr;baseline-shift:baseline;text-anchor:middle;white-space:normal;clip-rule:nonzero;display:inline;overflow:visible;visibility:visible;isolation:auto;mix-blend-mode:normal;color-interpolation:sRGB;color-interpolation-filters:linearRGB;solid-color:#000000;solid-opacity:1;fill:#1b75bc;fill-opacity:1;fill-rule:nonzero;stroke:none;stroke-width:0.75200349;stroke-linecap:square;stroke-linejoin:miter;stroke-miterlimit:10;stroke-dasharray:none;stroke-dashoffset:0;stroke-opacity:1;marker:none;color-rendering:auto;image-rendering:auto;shape-rendering:auto;text-rendering:auto;enable-background:accumulate"
           d="m 386.08461,256.58556 q -2.34507,2.34508 -2.34507,5.66728 0,3.32219 2.34507,5.69519 2.373,2.34508 5.6952,2.34508 3.32219,0 5.66727,-2.34508 2.373,-2.373 2.373,-5.69519 0,-3.3222 -2.373,-5.66728 -2.34508,-2.37299 -5.66727,-2.37299 -3.3222,0 -5.6952,2.37299 z m -1.42379,12.78627 q -2.93135,-2.95927 -2.93135,-7.11899 0,-4.15973 2.93135,-7.09108 2.95926,-2.95926 7.11899,-2.95926 4.15972,0 7.09107,2.95926 2.95927,2.93135 2.95927,7.09108 0,4.15972 -2.95927,7.11899 -2.93135,2.93135 -7.09107,2.93135 -4.15973,0 -7.11899,-2.93135 z m -1.4238,-15.63386 q -3.51762,3.54553 -3.51762,8.51487 0,4.96933 3.51762,8.51487 3.54553,3.54553 8.54279,3.54553 4.99725,0 8.51487,-3.54553 3.54553,-3.54554 3.54553,-8.51487 0,-4.96934 -3.54553,-8.51487 -3.51762,-3.54554 -8.51487,-3.54554 -4.99726,0 -8.54279,3.54554 z m -3.65721,15.57802 q -1.87048,-3.23844 -1.87048,-7.06315 0,-3.82471 1.87048,-7.06316 1.8984,-3.23844 5.13684,-5.10892 3.23844,-1.8984 7.06316,-1.8984 3.82471,0 7.06315,1.8984 3.23844,1.87048 5.10892,5.10892 1.8984,3.23845 1.8984,7.06316 0,3.82471 -1.8984,7.06315 -1.87048,3.23844 -5.10892,5.13684 -3.23844,1.87048 -7.06315,1.87048 -3.82472,0 -7.06316,-1.87048 -3.23844,-1.8984 -5.13684,-5.13684 z m -2.62425,-13.28878 q -1.2563,2.95927 -1.2563,6.22563 0,3.26636 1.2563,6.25354 1.28421,2.95927 3.43386,5.13684 2.17758,2.14966 5.13684,3.43387 2.98719,1.25629 6.25355,1.25629 3.26636,0 6.22562,-1.25629 2.98719,-1.28421 5.13684,-3.43387 2.17758,-2.17757 3.43387,-5.13684 1.28421,-2.98718 1.28421,-6.25354 0,-3.26636 -1.28421,-6.22563 -1.25629,-2.98718 -3.43387,-5.13684 -2.14965,-2.17757 -5.13684,-3.43387 -2.95926,-1.28421 -6.22562,-1.28421 -3.26636,0 -6.25355,1.28421 -2.95926,1.2563 -5.13684,3.43387 -2.14965,2.14966 -3.43386,5.13684 z m -1.84257,13.26086 q -1.42379,-3.35011 -1.42379,-7.03523 0,-3.68513 1.42379,-7.03524 1.45172,-3.35011 3.85263,-5.75103 2.42884,-2.42883 5.77895,-3.85263 3.35011,-1.45171 7.03524,-1.45171 3.68512,0 7.03523,1.45171 3.35012,1.4238 5.75103,3.85263 2.42883,2.40092 3.85263,5.75103 1.45172,3.35011 1.45172,7.03524 0,3.68512 -1.45172,7.03523 -1.4238,3.35012 -3.85263,5.77895 -2.40091,2.40091 -5.75103,3.85263 -3.35011,1.4238 -7.03523,1.4238 -3.68513,0 -7.03524,-1.4238 -3.35011,-1.45172 -5.77895,-3.85263 -2.40091,-2.42883 -3.85263,-5.77895 z m -1.84256,-14.82425 q -1.5913,3.71305 -1.5913,7.78902 0,4.07597 1.5913,7.81693 1.59131,3.71304 4.2714,6.42105 2.708,2.68009 6.42105,4.27139 3.74096,1.59131 7.81693,1.59131 4.07597,0 7.78901,-1.59131 3.74096,-1.5913 6.42105,-4.27139 2.70801,-2.70801 4.29931,-6.42105 1.5913,-3.74096 1.5913,-7.81693 0,-4.07597 -1.5913,-7.78902 -1.5913,-3.74095 -4.29931,-6.42105 -2.68009,-2.708 -6.42105,-4.29931 -3.71304,-1.5913 -7.78901,-1.5913 -4.07597,0 -7.81693,1.5913 -3.71305,1.59131 -6.42105,4.29931 -2.68009,2.6801 -4.2714,6.42105 z m -1.84256,16.38764 q -1.75881,-4.10389 -1.75881,-8.59862 0,-4.49474 1.75881,-8.57071 1.75881,-4.10389 4.71808,-7.06315 2.95926,-2.95927 7.03523,-4.71808 4.10389,-1.75881 8.59863,-1.75881 4.49473,0 8.5707,1.75881 4.10389,1.75881 7.06316,4.71808 2.95926,2.95926 4.71807,7.06315 1.75881,4.07597 1.75881,8.57071 0,4.49473 -1.75881,8.59862 -1.75881,4.07597 -4.71807,7.03524 -2.95927,2.95926 -7.06316,4.71807 -4.07597,1.75881 -8.5707,1.75881 -4.49474,0 -8.59863,-1.75881 -4.07597,-1.75881 -7.03523,-4.71807 -2.95927,-2.95927 -4.71808,-7.03524 z" />
        <path
           inkscape:connector-curvature="0"
           id="path3375"
           style="color:#000000;font-style:normal;font-variant:normal;font-weight:normal;font-stretch:normal;font-size:medium;line-height:120.00000477%;font-family:Monoton;-inkscape-font-specification:'Monoton, Normal';text-indent:0;text-align:center;text-decoration:none;text-decoration-line:none;text-decoration-style:solid;text-decoration-color:#000000;letter-spacing:0px;word-spacing:0px;text-transform:none;writing-mode:lr-tb;direction:ltr;baseline-shift:baseline;text-anchor:middle;white-space:normal;clip-rule:nonzero;display:inline;overflow:visible;visibility:visible;isolation:auto;mix-blend-mode:normal;color-interpolation:sRGB;color-interpolation-filters:linearRGB;solid-color:#000000;solid-opacity:1;fill:#1b75bc;fill-opacity:1;fill-rule:nonzero;stroke:none;stroke-width:0.75200349;stroke-linecap:square;stroke-linejoin:miter;stroke-miterlimit:10;stroke-dasharray:none;stroke-dashoffset:0;stroke-opacity:1;marker:none;color-rendering:auto;image-rendering:auto;shape-rendering:auto;text-rendering:auto;enable-background:accumulate"
           d="m 450.12761,266.13339 -2.01007,-3.65721 v -20.32402 h 2.01007 z m 4.02013,6.95148 -2.01007,-3.40595 v -27.52676 h 2.01007 z m -27.69427,-14.71258 2.01007,3.65721 v 20.32402 h -2.01007 z m -4.02013,-7.23066 2.01007,3.68512 v 27.52677 h -2.01007 z m 0.69794,-8.98947 h 2.34508 l 23.28328,40.20136 h -2.34508 z m 4.74599,0 h 2.373 l 23.25537,40.20136 h -2.40092 z m 4.71808,0 h 2.34508 l 21.21738,36.71165 v -36.71165 h 2.01007 v 40.20136 h -2.373 z m -12.17208,3.46178 v 36.73958 h -2.01007 v -40.20136 h 2.40092 l 23.19953,40.20136 h -2.31716 z" />
        <path
           inkscape:connector-curvature="0"
           id="path3377"
           style="color:#000000;font-style:normal;font-variant:normal;font-weight:normal;font-stretch:normal;font-size:medium;line-height:120.00000477%;font-family:Monoton;-inkscape-font-specification:'Monoton, Normal';text-indent:0;text-align:center;text-decoration:none;text-decoration-line:none;text-decoration-style:solid;text-decoration-color:#000000;letter-spacing:0px;word-spacing:0px;text-transform:none;writing-mode:lr-tb;direction:ltr;baseline-shift:baseline;text-anchor:middle;white-space:normal;clip-rule:nonzero;display:inline;overflow:visible;visibility:visible;isolation:auto;mix-blend-mode:normal;color-interpolation:sRGB;color-interpolation-filters:linearRGB;solid-color:#000000;solid-opacity:1;fill:#1b75bc;fill-opacity:1;fill-rule:nonzero;stroke:none;stroke-width:0.75200349;stroke-linecap:square;stroke-linejoin:miter;stroke-miterlimit:10;stroke-dasharray:none;stroke-dashoffset:0;stroke-opacity:1;marker:none;color-rendering:auto;image-rendering:auto;shape-rendering:auto;text-rendering:auto;enable-background:accumulate"
           d="m 477.48687,282.35352 h -2.01007 v -40.20136 h 19.1794 v 2.01007 h -17.16933 v 2.01006 h 17.16933 v 2.01007 h -17.16933 v 2.01007 h 17.16933 v 2.01007 h -17.16933 v 6.14187 h 15.82928 v 2.01007 h -15.82928 v 2.01007 h 15.82928 v 2.01007 h -15.82928 v 2.01006 h 15.82928 v 2.01007 h -15.82928 z m -4.02014,0 h -2.01007 v -40.20136 h 2.01007 z m -4.02013,0 h -2.01007 v -40.20136 h 2.01007 z m -4.02014,0 h -2.01007 v -40.20136 h 2.01007 z" />
      </g>
      <g
         style="color:#000000;clip-rule:nonzero;display:inline;overflow:visible;visibility:visible;opacity:1;isolation:auto;mix-blend-mode:normal;color-interpolation:sRGB;color-interpolation-filters:linearRGB;solid-color:#000000;solid-opacity:1;fill:#bc312e;fill-opacity:1;fill-rule:nonzero;stroke:none;stroke-width:0.52402526;stroke-linecap:butt;stroke-linejoin:miter;stroke-miterlimit:4;stroke-dasharray:none;stroke-dashoffset:0;stroke-opacity:1;marker:none;color-rendering:auto;image-rendering:auto;shape-rendering:auto;text-rendering:auto;enable-background:accumulate"
         transform="matrix(1.8506257,0,0,1.9083048,-50.499744,-402.48632)"
         id="g3459">
        <path
           inkscape:connector-curvature="0"
           id="path3379"
           style="color:#000000;font-style:normal;font-variant:normal;font-weight:normal;font-stretch:normal;font-size:medium;line-height:120.00000477%;font-family:Monoton;-inkscape-font-specification:'Monoton, Normal';text-indent:0;text-align:center;text-decoration:none;text-decoration-line:none;text-decoration-style:solid;text-decoration-color:#000000;letter-spacing:0px;word-spacing:0px;text-transform:none;writing-mode:lr-tb;direction:ltr;baseline-shift:baseline;text-anchor:middle;white-space:normal;clip-rule:nonzero;display:inline;overflow:visible;visibility:visible;isolation:auto;mix-blend-mode:normal;color-interpolation:sRGB;color-interpolation-filters:linearRGB;solid-color:#000000;solid-opacity:1;fill:#bc312e;fill-opacity:1;fill-rule:nonzero;stroke:none;stroke-width:0.52402526;stroke-linecap:butt;stroke-linejoin:miter;stroke-miterlimit:4;stroke-dasharray:none;stroke-dashoffset:0;stroke-opacity:1;marker:none;color-rendering:auto;image-rendering:auto;shape-rendering:auto;text-rendering:auto;enable-background:accumulate"
           d="m 537.68351,276.62369 v -2.71427 h 27.36903 v 51.5714 h -2.71429 v -48.85713 h -2.71429 v 48.85713 h -2.71428 v -48.85713 h -2.71428 v 48.85713 h -2.71429 v -48.85713 h -2.71429 v 48.85713 h -2.71428 v -48.85713 z m 0,-5.42856 v -2.71429 h 27.36903 v 2.71429 z m 0,-5.42857 v -2.71429 h 27.36903 v 2.71429 z" />
        <path
           inkscape:connector-curvature="0"
           id="path3381"
           style="color:#000000;font-style:normal;font-variant:normal;font-weight:normal;font-stretch:normal;font-size:medium;line-height:120.00000477%;font-family:Monoton;-inkscape-font-specification:'Monoton, Normal';text-indent:0;text-align:center;text-decoration:none;text-decoration-line:none;text-decoration-style:solid;text-decoration-color:#000000;letter-spacing:0px;word-spacing:0px;text-transform:none;writing-mode:lr-tb;direction:ltr;baseline-shift:baseline;text-anchor:middle;white-space:normal;clip-rule:nonzero;display:inline;overflow:visible;visibility:visible;isolation:auto;mix-blend-mode:normal;color-interpolation:sRGB;color-interpolation-filters:linearRGB;solid-color:#000000;solid-opacity:1;fill:#bc312e;fill-opacity:1;fill-rule:nonzero;stroke:none;stroke-width:0.52402526;stroke-linecap:butt;stroke-linejoin:miter;stroke-miterlimit:4;stroke-dasharray:none;stroke-dashoffset:0;stroke-opacity:1;marker:none;color-rendering:auto;image-rendering:auto;shape-rendering:auto;text-rendering:auto;enable-background:accumulate"
           d="m 612.66564,263.05227 h 2.82738 l -15.38094,62.42855 h -2.82738 z m -21.18649,10.85715 -0.64087,2.71427 h -20.28175 v -2.71427 z m 1.28173,-5.42858 -0.64086,2.71429 h -21.56349 v -2.71429 z m 1.20636,-5.42857 -0.52778,2.71429 h -22.88293 v -2.71429 z m 1.92262,0 h 2.78967 l -15.38094,62.42855 h -2.78968 z m 5.57936,0 h 2.82737 l -15.38093,62.42855 h -2.82739 z m 5.61707,0 h 2.78967 l -15.38095,62.42855 h -2.78968 z" />
      </g>
      <path
         inkscape:connector-curvature="0"
         id="path4431-9"
         d="m 637.92557,-276.8869 -2.04995,1.43494 c -11.14433,7.8248 -34.62759,16.80573 -55.09111,23.58547 -20.46355,6.77973 -38.01328,11.50947 -38.01328,11.50947 l -0.97652,0.26462 -0.51808,0.87587 C 422.02258,-37.975297 183.61114,34.85628 183.61114,34.85628 l -2.38911,0.719334 1.45358,4.781945 2.3891,-0.730518 c 0,0 239.30791,-72.824764 359.95026,-275.448111 0.83445,-0.22574 17.22849,-4.64188 37.33865,-11.30448 20.61443,-6.82975 44.07057,-15.57393 56.39936,-24.23025 l 2.03877,-1.44615 z m 2.9929,10.49568 -2.03875,1.43494 c -11.14432,7.82474 -34.63878,16.79454 -55.1023,23.57429 -20.4636,6.77971 -38.00204,11.50946 -38.00212,11.50946 l -0.98396,0.26463 -0.51806,0.87961 C 425.0192,-27.487044 186.60404,45.340772 186.60404,45.340772 l -2.3891,0.723076 1.45359,4.778204 2.38911,-0.730517 c 0,0 239.30659,-72.818848 359.95024,-275.436935 0.83441,-0.22573 17.23216,-4.65299 37.34241,-11.31565 13.96914,-4.6281 29.16508,-10.14431 41.39753,-15.90753 -15.11338,13.10688 -35.26381,34.66827 -58.20703,61.00241 -29.82251,34.23027 -64.02111,76.26507 -96.37311,117.111012 C 409.9134,4.1639071 355.81981,76.585618 351.72085,82.07938 c -0.14714,0.06851 -0.29636,0.132621 -0.44354,0.201249 -0.9606,-0.05382 -1.309,0.238557 -1.34922,0.622451 -14.21331,6.668799 -28.16956,13.884733 -41.84854,21.59889 h 9.8099 c 26.277,-14.344317 53.57773,-26.791883 81.62473,-37.264145 L 435.90242,54.8972 c 7.60862,-2.331681 15.26165,-4.519476 22.95186,-6.56724 1.2316,-0.09389 2.34683,-0.311168 2.17665,-0.57772 62.98493,-16.535995 128.47927,-23.534588 193.5103,-20.245911 95.05262,4.806924 188.9257,31.423004 272.47013,76.995641 h 9.82852 C 850.78812,56.027432 753.43229,27.731986 654.77977,22.743028 c -11.35581,-0.574284 -22.72556,-0.839996 -34.09233,-0.797613 -3.78889,0.01337 -7.57598,0.06298 -11.36409,0.145412 -45.26403,0.984915 -90.41169,6.834784 -134.4684,17.282829 7.3349,-30.8717907 45.04243,-163.401476 167.24503,-236.722966 l 1.2113,-0.72306 v -63.90211 l -2.39281,-4.41669 z m -2.60155,10.99137 v 54.56933 C 511.88925,-124.18913 475.28457,14.608956 469.38722,40.69302 432.34604,49.817483 396.11287,62.210988 361.26983,77.733502 371.19897,64.452426 418.17385,1.7897091 476.08866,-71.33044 c 32.32392,-40.81051 66.48223,-82.80683 96.21656,-116.93583 27.58724,-31.66462 51.4604,-56.45809 66.0117,-67.13358 z m -173.09293,149.80193 c -1.70739,1.6707 -3.42075,3.33565 -5.13977,4.99439 h 12.89226 c 1.7965,-1.6731 3.60419,-3.33333 5.41182,-4.99439 z m -14.89373,14.275009 c -1.77113,1.664748 -3.52828,3.342244 -5.31119,4.994397 h 12.90714 c 1.73076,-1.673773 3.47634,-3.331995 5.21802,-4.994397 z m -15.49007,14.275018 c -1.85136,1.670015 -3.70493,3.337873 -5.56837,4.994377 h 14.17811 c 1.66388,-1.669481 3.33104,-3.335602 5.00558,-4.994377 z m -16.13113,14.278737 c -1.9432,1.680377 -3.91452,3.328637 -5.87027,4.994396 h 16.64175 c 1.60272,-1.667381 3.20232,-3.337129 4.81549,-4.994396 z m -16.91384,14.275015 c -2.01801,1.670493 -4.0371,3.339363 -6.06783,4.994377 h 20.27203 c 1.54832,-1.669156 3.10033,-3.334817 4.65892,-4.994377 z m -17.64064,14.275018 c -2.10921,1.66887 -4.21393,3.342128 -6.33618,4.994377 h 25.15832 c 1.49697,-1.671523 3.00645,-3.331996 4.51358,-4.994377 z m -18.41962,14.275016 c -2.22367,1.678792 -4.46411,3.333788 -6.70142,4.994376 h 31.38639 c 1.44348,-1.668736 2.88867,-3.334323 4.34213,-4.994376 z m -19.39612,14.2749967 c -2.3332,1.6769037 -4.67851,3.3371674 -7.02569,4.99439603 h 38.97115 c 1.39399,-1.66793393 2.78923,-3.33472393 4.19305,-4.99439603 z M 325.94754,8.605907 c -2.45426,1.675204 -4.91478,3.340545 -7.38349,4.994395 h 47.98342 c 1.3489,-1.670052 2.70773,-3.332243 4.06634,-4.994395 z m -21.49451,14.275015 c -2.59291,1.676046 -5.18928,3.345488 -7.7972,4.998118 h 58.56854 c 1.30232,-1.668087 2.60164,-3.337549 3.91352,-4.998118 z m 316.23441,9.388707 c -3.78889,0.01335 -7.57598,0.06297 -11.36409,0.145413 C 511.42378,34.545264 414.0615,59.374942 327.1477,104.502 h 10.45841 C 435.19994,55.656037 545.5288,32.317719 654.54123,37.830601 742.16781,42.261971 828.78794,65.237598 907.24251,104.502 h 10.51432 C 836.52061,62.333616 746.20882,37.69097 654.77977,33.067282 643.42396,32.493015 632.05421,32.227284 620.68744,32.269667 Z M 281.7211,37.15966 c -2.74775,1.67616 -5.49974,3.344094 -8.2631,4.994396 h 70.79362 c 1.26088,-1.67051 2.53508,-3.331079 3.80543,-4.994396 z m 338.96634,5.546011 c -3.78889,0.01335 -7.57598,0.06297 -11.36409,0.145412 -90.0773,1.960059 -179.70225,23.130601 -261.15075,61.650937 h 11.36037 c 92.03198,-41.702034 194.08229,-61.33931 295.00826,-56.235358 79.56123,4.023489 158.29699,23.327479 230.84153,56.235358 h 11.34917 C 821.07374,68.698231 738.39209,47.731725 654.77977,43.503342 643.42396,42.929076 632.05421,42.663345 620.68744,42.705728 Z m -363.09968,8.729005 c -2.92905,1.679022 -5.86555,3.344305 -8.811,4.994398 h 84.89347 c 1.21454,-1.664177 2.41759,-3.337036 3.64143,-4.994398 z m -25.73603,14.275017 c -3.14179,1.68343 -6.29664,3.34375 -9.45581,4.994396 H 323.4131 c 1.17874,-1.670396 2.37139,-3.330583 3.55941,-4.994396 z m -29.63836,15.266438 c -3.39765,1.680911 -6.80005,3.351268 -10.21613,4.994396 h 120.84563 c 1.13459,-1.666599 2.26666,-3.334038 3.41034,-4.994396 z"
         style="color:#000000;font-style:normal;font-variant:normal;font-weight:normal;font-stretch:normal;font-size:medium;line-height:normal;font-family:sans-serif;text-indent:0;text-align:start;text-decoration:none;text-decoration-line:none;text-decoration-style:solid;text-decoration-color:#000000;letter-spacing:normal;word-spacing:normal;text-transform:none;writing-mode:lr-tb;direction:ltr;baseline-shift:baseline;text-anchor:start;white-space:normal;clip-rule:nonzero;display:inline;overflow:visible;visibility:visible;opacity:1;isolation:auto;mix-blend-mode:normal;color-interpolation:sRGB;color-interpolation-filters:linearRGB;solid-color:#000000;solid-opacity:1;fill:#1b75bc;fill-opacity:1;fill-rule:nonzero;stroke:none;stroke-width:1;stroke-linecap:square;stroke-linejoin:miter;stroke-miterlimit:10;stroke-dasharray:none;stroke-dashoffset:0;stroke-opacity:1;color-rendering:auto;image-rendering:auto;shape-rendering:auto;text-rendering:auto;enable-background:accumulate" />
      <g
         transform="matrix(1.9083048,0,0,1.9083048,-57.663921,-402.48632)"
         id="g4231">
        <path
           inkscape:connector-curvature="0"
           id="path4183"
           style="color:#000000;font-style:normal;font-variant:normal;font-weight:normal;font-stretch:normal;font-size:medium;line-height:120.00000477%;font-family:'PT Sans';-inkscape-font-specification:'PT Sans, Normal';text-indent:0;text-align:center;text-decoration:none;text-decoration-line:none;text-decoration-style:solid;text-decoration-color:#000000;letter-spacing:0px;word-spacing:0px;text-transform:none;writing-mode:lr-tb;direction:ltr;baseline-shift:baseline;text-anchor:middle;white-space:normal;clip-rule:nonzero;display:inline;overflow:visible;visibility:visible;opacity:1;isolation:auto;mix-blend-mode:normal;color-interpolation:sRGB;color-interpolation-filters:linearRGB;solid-color:#000000;solid-opacity:1;fill:#bc312e;fill-opacity:1;fill-rule:nonzero;stroke:none;stroke-width:0.51604509;stroke-linecap:butt;stroke-linejoin:miter;stroke-miterlimit:4;stroke-dasharray:none;stroke-dashoffset:0;stroke-opacity:1;marker:none;color-rendering:auto;image-rendering:auto;shape-rendering:auto;text-rendering:auto;enable-background:accumulate"
           d="m 519.6493,344.77946 q 0,-0.51695 0.28719,-0.80415 0.30634,-0.30634 0.80415,-0.30634 0.51696,0 0.8233,0.30634 0.30634,0.2872 0.30634,0.80415 0,0.49781 -0.30634,0.80415 -0.30634,0.30635 -0.8233,0.30635 -0.49781,0 -0.80415,-0.30635 -0.28719,-0.30634 -0.28719,-0.80415 z" />
        <path
           inkscape:connector-curvature="0"
           id="path4195"
           style="color:#000000;font-style:normal;font-variant:normal;font-weight:normal;font-stretch:normal;font-size:medium;line-height:120.00000477%;font-family:'PT Sans';-inkscape-font-specification:'PT Sans, Normal';text-indent:0;text-align:center;text-decoration:none;text-decoration-line:none;text-decoration-style:solid;text-decoration-color:#000000;letter-spacing:0px;word-spacing:0px;text-transform:none;writing-mode:lr-tb;direction:ltr;baseline-shift:baseline;text-anchor:middle;white-space:normal;clip-rule:nonzero;visibility:visible;isolation:auto;mix-blend-mode:normal;color-interpolation:sRGB;color-interpolation-filters:linearRGB;solid-color:#000000;solid-opacity:1;fill:#1b75bc;fill-opacity:1;fill-rule:nonzero;stroke:none;stroke-width:1;stroke-linecap:square;stroke-linejoin:miter;stroke-miterlimit:10;stroke-dasharray:none;stroke-dashoffset:0;stroke-opacity:1;marker:none;color-rendering:auto;image-rendering:auto;shape-rendering:auto;text-rendering:auto"
           d="m 594.21957,346.7324 h -4.93978 l -1.34025,3.71441 h -1.57001 l 5.07381,-13.61312 h 0.72756 l 5.09295,13.61312 h -1.66574 z m -4.42283,-1.37854 h 3.94417 l -1.49342,-4.07819 -0.47866,-2.02953 h -0.0191 l -0.47866,2.06782 -1.47428,4.0399 z M 575.8025,337.0443 q 0.36378,-0.0574 0.80415,-0.0766 0.45952,-0.0383 0.93818,-0.0383 0.4978,-0.0191 0.95732,-0.0191 0.47866,-0.0192 0.88073,-0.0192 1.60831,0 2.77624,0.49781 1.18708,0.49781 1.95293,1.39769 0.76586,0.88074 1.12964,2.12525 0.38293,1.24452 0.38293,2.73794 0,1.3594 -0.36378,2.62307 -0.34464,1.24451 -1.11049,2.22098 -0.76586,0.95732 -1.99123,1.55086 -1.22537,0.5744 -2.9677,0.5744 -0.30634,0 -0.80415,-0.0191 -0.47866,0 -0.99561,-0.0383 -0.51696,-0.0192 -0.95733,-0.0383 -0.44036,-0.0191 -0.63183,-0.0574 v -13.42165 z m 3.61868,1.26367 q -0.24891,0 -0.55525,0 -0.2872,0 -0.57439,0.0191 -0.2872,0.0191 -0.5361,0.0383 -0.22976,0.0191 -0.36378,0.0383 v 10.722 q 0.0957,0.0192 0.36378,0.0383 0.26805,0 0.55524,0.0191 0.2872,0 0.55525,0.0192 0.26805,0 0.36378,0 1.34025,0 2.24014,-0.45951 0.91902,-0.45952 1.45513,-1.22538 0.55524,-0.785 0.785,-1.78062 0.22976,-1.01476 0.22976,-2.08696 0,-0.93817 -0.21061,-1.87635 -0.21062,-0.95732 -0.72757,-1.72318 -0.51695,-0.76585 -1.39769,-1.24451 -0.86159,-0.49781 -2.18269,-0.49781 z m -8.46153,8.42443 h -4.93978 l -1.34025,3.71441 h -1.57001 l 5.07381,-13.61312 h 0.72756 l 5.09295,13.61312 h -1.66574 z m -4.42282,-1.37854 h 3.94416 l -1.49342,-4.07819 -0.47866,-2.02953 h -0.0191 l -0.47866,2.06782 -1.47427,4.0399 z m -12.4419,-3.67612 -1.03391,-1.93379 h -0.0766 l 0.19147,1.93379 v 8.76907 h -1.49342 v -13.61312 h 0.84244 l 6.41405,8.94139 0.99562,1.83806 h 0.0957 l -0.21061,-1.83806 v -8.73078 h 1.49342 v 13.61312 h -0.84244 l -6.37576,-8.97968 z m -7.2553,5.05466 h -4.93978 l -1.34025,3.71441 h -1.57001 l 5.0738,-13.61312 h 0.72757 l 5.09295,13.61312 h -1.66574 z m -4.42283,-1.37854 h 3.94416 l -1.49342,-4.07819 -0.47866,-2.02953 h -0.0191 l -0.47867,2.06782 -1.47427,4.0399 z m -3.77125,4.5377 q -0.5744,0.44037 -1.45513,0.61269 -0.88074,0.17232 -1.87635,0.17232 -1.20623,0 -2.25928,-0.40208 -1.05306,-0.42122 -1.83806,-1.26366 -0.785,-0.84245 -1.24452,-2.14441 -0.45951,-1.3211 -0.45951,-3.12086 0,-1.87635 0.4978,-3.17831 0.51696,-1.32111 1.34025,-2.1444 0.84245,-0.84245 1.87635,-1.22538 1.03391,-0.38292 2.10611,-0.38292 1.14879,0 1.87635,0.13402 0.72757,0.11488 1.24452,0.32549 l -0.38293,1.39769 q -0.91903,-0.44037 -2.62306,-0.44037 -0.785,0 -1.55086,0.2872 -0.76586,0.2872 -1.37854,0.93817 -0.59354,0.65098 -0.95732,1.70404 -0.36379,1.05305 -0.36379,2.58477 0,1.37854 0.34464,2.41245 0.34463,1.0339 0.93817,1.72318 0.61269,0.68927 1.41684,1.0339 0.8233,0.34464 1.78062,0.34464 0.86159,0 1.49342,-0.17232 0.65098,-0.17232 1.09135,-0.44037 z m -25.10756,0.55525 h -7.92662 V 337.0443 h 1.58915 v 11.98567 h 6.33747 z m -12.76947,-3.71441 h -4.93978 l -1.34025,3.71441 h -1.57001 l 5.07381,-13.61312 h 0.72756 l 5.09295,13.61312 h -1.66574 z m -4.42283,-1.37854 h 3.94417 l -1.49342,-4.07819 -0.47866,-2.02953 h -0.0192 l -0.47866,2.06782 -1.47428,4.0399 z m -12.19927,-8.30956 h 7.29479 v 1.41684 h -5.70564 v 4.38453 h 5.22698 v 1.41684 h -5.22698 v 4.76746 h 5.80137 v 1.41684 h -7.39052 z m 4.69088,-3.25489 h 2.18269 v 0.40207 l -3.12087,1.85721 h -1.3211 z m -16.09647,3.38892 q 0.72756,-0.13403 1.66574,-0.21061 0.95732,-0.0766 1.74232,-0.0766 0.88074,0 1.66574,0.19147 0.80415,0.19146 1.39769,0.63183 0.61269,0.44037 0.97647,1.14878 0.36378,0.70842 0.36378,1.72318 0,1.57001 -0.86159,2.54648 -0.86158,0.97647 -2.18269,1.30196 l 0.91903,0.70842 3.33148,5.30356 h -1.8572 l -3.69527,-5.78223 -1.87635,-0.28719 v 6.06942 h -1.58915 v -13.26848 z m 3.44636,1.09135 q -0.24891,0 -0.51696,0 -0.26805,0 -0.51695,0.0191 -0.2489,0.0192 -0.47866,0.0383 -0.21061,0.0191 -0.34464,0.0574 v 4.93978 h 1.49343 q 1.3211,0 2.18269,-0.65097 0.86159,-0.65098 0.86159,-2.02953 0,-1.0339 -0.70842,-1.70403 -0.70842,-0.67012 -1.97208,-0.67012 z m -5.41246,0.19146 h -4.17392 v 11.98567 h -1.58916 v -11.98567 h -4.17392 v -1.41684 h 9.937 z m -19.14314,3.2166 -1.03391,-1.93379 h -0.0766 l 0.19147,1.93379 v 8.76907 h -1.49343 v -13.61312 h 0.84245 l 6.41405,8.94139 0.99562,1.83806 h 0.0957 l -0.21061,-1.83806 v -8.73078 h 1.49342 v 13.61312 h -0.84244 l -6.37576,-8.97968 z m -16.05609,2.06782 q 0,-3.35063 1.41684,-5.13125 1.41684,-1.79976 4.0399,-1.79976 1.41683,0 2.45074,0.4978 1.03391,0.49781 1.70403,1.41684 0.68928,0.89988 1.01477,2.18269 0.32549,1.26367 0.32549,2.83368 0,3.35062 -1.43599,5.15039 -1.41683,1.78062 -4.05904,1.78062 -1.39769,0 -2.4316,-0.49781 -1.01476,-0.49781 -1.70403,-1.39769 -0.67013,-0.91903 -0.99562,-2.1827 -0.32549,-1.28281 -0.32549,-2.85281 z m 1.68489,0 q 0,1.11049 0.21061,2.1061 0.22976,0.99562 0.68927,1.76148 0.45952,0.74671 1.16794,1.20622 0.72756,0.44037 1.70403,0.44037 1.78062,0 2.79538,-1.34025 1.01476,-1.3594 1.01476,-4.17392 0,-1.09135 -0.22976,-2.08697 -0.21061,-1.01476 -0.68927,-1.76147 -0.45951,-0.76586 -1.18708,-1.20622 -0.70842,-0.45952 -1.70403,-0.45952 -1.76147,0 -2.77623,1.3594 -0.99562,1.34025 -0.99562,4.15478 z m -5.97399,-2.29758 0.19147,-2.01037 h -0.0957 l -0.72757,1.83806 -3.48465,6.05027 h -0.47866 l -3.69526,-6.06942 -0.68927,-1.81891 h -0.0957 l 0.26805,1.99123 v 9.01797 h -1.49342 V 337.0443 h 1.18708 l 4.19307,6.85443 0.63183,1.49342 h 0.0383 l 0.59353,-1.53172 4.00161,-6.81613 h 1.24452 v 13.40251 h -1.58916 v -8.99883 z" />
      </g>
    </g>
    <path
       inkscape:connector-curvature="0"
       style="color:#000000;font-style:normal;font-variant:normal;font-weight:normal;font-stretch:normal;font-size:medium;line-height:normal;font-family:sans-serif;text-indent:0;text-align:start;text-decoration:none;text-decoration-line:none;text-decoration-style:solid;text-decoration-color:#000000;letter-spacing:normal;word-spacing:normal;text-transform:none;writing-mode:lr-tb;direction:ltr;baseline-shift:baseline;text-anchor:start;white-space:normal;clip-rule:nonzero;display:inline;overflow:visible;visibility:visible;opacity:1;isolation:auto;mix-blend-mode:normal;color-interpolation:sRGB;color-interpolation-filters:linearRGB;solid-color:#000000;solid-opacity:1;fill:#bc312e;fill-opacity:1;fill-rule:nonzero;stroke:none;stroke-width:2.52265429;stroke-linecap:butt;stroke-linejoin:miter;stroke-miterlimit:4;stroke-dasharray:none;stroke-dashoffset:0;stroke-opacity:1;marker:none;color-rendering:auto;image-rendering:auto;shape-rendering:auto;text-rendering:auto;enable-background:accumulate"
       d="m 422.62198,-1632.5627 -1.45064,10.3353 5.16787,0.7055 c 38.42931,5.4426 75.39024,21.3039 105.82489,45.3897 30.43482,24.0876 54.35439,56.4106 68.47957,92.5628 14.2764,36.5375 18.39519,77.5536 7.86606,114.9629 -6.9423,24.6664 -20.2094,47.5909 -38.28732,65.706 -18.07538,18.1131 -41.01351,31.4312 -65.73022,37.9302 -27.65617,7.2731 -57.58996,5.9311 -84.49186,-3.7677 -26.90191,-9.6969 -50.8072,-27.7686 -67.46142,-51.0149 l -3.05467,-4.2526 -8.45174,6.0849 3.02935,4.2253 c 17.91062,25.001 43.46823,44.355 72.39995,54.7845 28.93172,10.4294 60.93513,11.8439 90.67791,4.0227 26.56691,-6.9873 51.08375,-21.2334 70.46526,-40.6561 19.37934,-19.4191 33.53654,-43.8829 40.96053,-70.2605 11.25698,-39.9977 6.79144,-83.1969 -8.19725,-121.5577 -14.80944,-37.9032 -39.82947,-71.6877 -71.73811,-96.942 -31.90862,-25.2525 -70.54919,-41.8209 -110.8399,-47.5276 l -5.1679,-0.7416 z m -17.97283,20.0341 c -5.74723,-0.1991 -11.4923,-0.1809 -17.2343,0.1809 -15.31156,0.7957 -30.55601,3.3697 -45.31354,7.8158 -37.58441,11.3211 -71.46207,34.3343 -95.84596,65.0944 l -3.23304,4.0717 8.17173,6.4917 3.23321,-4.0987 c 23.03201,-29.0545 55.20218,-50.8848 90.70341,-61.5801 55.67934,-16.7729 119.03662,-5.1189 166.48923,28.7163 51.33518,36.6027 83.77777,98.7851 84.44104,161.8303 l 0.0543,5.2184 10.43723,-0.1809 -0.0542,-5.2183 c -0.69999,-66.5346 -34.66776,-131.6021 -88.84508,-170.2323 -32.87361,-23.4382 -72.77254,-36.7834 -113.00395,-38.1599 z m -2.57119,18.6088 c -38.74168,-0.8321 -77.68467,11.6341 -108.29423,35.5136 -20.91409,16.3154 -37.56831,37.4365 -50.37977,60.334 -21.75662,38.8834 -32.83996,83.3886 -33.19594,127.845 -0.64755,80.9523 35.37607,161.2642 96.25332,214.6288 l 3.92036,3.4367 6.8734,-7.841 -3.92037,-3.4368 c -58.50357,-51.2828 -93.31258,-128.9158 -92.6891,-206.7117 0.34367,-42.7761 11.03396,-85.5865 31.87191,-122.8311 12.26773,-21.9243 28.07381,-41.9241 47.65591,-57.2011 28.60868,-22.3205 65.32614,-34.0992 101.67552,-33.3233 39.86493,0.8502 79.36178,16.8291 108.62542,43.9138 l 3.84367,3.538 7.07742,-7.6621 -3.81871,-3.5398 c -31.19089,-28.8682 -73.00842,-45.755 -115.49881,-46.663 z m 172.85363,17.6682 -7.00073,7.738 3.86937,3.4891 c 47.84565,43.2806 72.27404,111.5081 62.77738,175.3222 -5.93917,39.909 -24.53855,77.9297 -52.39061,107.1236 l -3.61523,3.7676 7.56091,7.2044 3.58936,-3.7678 c 29.37054,-30.7855 48.9029,-70.7163 55.16564,-112.8013 10.03606,-67.4407 -15.54778,-138.8461 -66.11224,-184.5885 z m -298.58582,65.1706 -2.72403,4.4297 c -25.221,40.7103 -39.18808,88.2345 -39.96768,136.1185 -1.04367,64.1069 21.90333,128.1904 63.41353,177.0531 41.51021,48.8642 101.04606,81.8809 164.47822,91.2144 l 5.14219,0.7596 1.52663,-10.3354 -5.1677,-0.7416 c -60.85321,-8.9536 -118.21544,-40.7728 -158.0375,-87.6493 -39.8226,-46.8764 -61.91964,-108.6284 -60.91886,-170.129 0.74703,-45.9704 14.17691,-91.7399 38.38934,-130.8242 l 2.74935,-4.4297 -8.8844,-5.4733 z m 168.52555,39.9922 c -15.39168,-0.6149 -30.87598,3.0062 -44.39703,10.386 -12.82537,7.0019 -23.76438,17.2975 -31.51593,29.6841 -7.75156,12.3865 -12.24187,26.7465 -12.9321,41.3417 -0.68915,14.5951 2.4131,29.2986 8.96091,42.3599 6.54762,13.063 16.48112,24.3553 28.58823,32.5346 l 4.3022,2.9285 5.85523,-8.6569 -4.32789,-2.9014 c -10.60129,-7.1627 -19.34172,-17.1508 -25.07521,-28.5878 -5.73331,-11.4388 -8.49659,-24.4132 -7.89137,-37.1941 0.60413,-12.779 4.56592,-25.4297 11.35357,-36.2752 6.78765,-10.8453 16.44151,-19.9635 27.67191,-26.0935 11.83579,-6.461 25.50064,-9.6518 38.97465,-9.1145 13.47382,0.5426 26.85215,4.8096 38.13483,12.1948 l 4.3532,2.8761 5.72789,-8.7312 -4.37872,-2.8505 c -12.88887,-8.4361 -28.01213,-13.2855 -43.40437,-13.9006 z m -237.43815,4.3284 -1.55194,4.9634 c -12.37463,39.0879 -17.03913,80.5705 -13.64495,121.4311 3.24352,39.0426 13.81298,77.4559 31.03227,112.6475 l 2.29102,4.683 9.36824,-4.5816 -2.29119,-4.6849 c -16.64409,-34.014 -26.87875,-71.1901 -30.01392,-108.9304 -3.2806,-39.493 1.22455,-79.6264 13.1866,-117.4084 l 1.57908,-4.9633 z m 169.36592,0.1809 -3.84385,3.5127 c -15.8428,14.5337 -27.0354,33.9219 -31.69411,54.9112 -4.65853,20.9892 -2.7074,43.3113 5.49871,63.1845 12.34678,29.8974 38.22075,52.7586 67.9449,64.5592 21.87655,8.684 45.9213,11.7137 69.26858,8.731 23.34782,-2.9827 45.84912,-11.9578 64.83939,-25.8638 l 4.20018,-3.0804 -6.16054,-8.4271 -4.20036,3.0803 c -17.5447,12.8479 -38.43165,21.1737 -60.00235,23.9304 -21.57032,2.7564 -43.88931,0 -64.10087,-8.0709 -27.34867,-10.8564 -51.07507,-31.9721 -62.16619,-58.8308 -7.37242,-17.8527 -9.12423,-38.0894 -4.93871,-56.9479 4.18536,-18.8566 14.32922,-36.4306 28.56292,-49.4883 l 3.84403,-3.538 z m 60.94435,13.6185 c -2.41058,0.1807 -4.81354,0.3797 -7.20439,0.7957 -19.12612,3.3082 -36.00553,16.2863 -44.14254,33.9094 l -2.18937,4.71 9.4701,4.3773 2.18935,-4.7335 c 6.6283,-14.3564 20.8745,-25.2833 36.45465,-27.9783 15.57981,-2.6952 32.64445,2.809 43.70968,14.103 9.11883,9.308 14.38782,22.5611 14.12863,35.5897 -0.26047,13.0269 -6.04713,26.0394 -15.52898,34.9784 l -3.79303,3.5633 7.15358,7.586 3.79302,-3.5633 c 11.59161,-10.9269 18.4706,-26.4337 18.78733,-42.3618 0.31653,-15.9264 -5.93355,-31.6935 -17.08183,-43.0726 -11.88554,-12.1316 -28.87312,-18.6685 -45.7462,-17.8961 z m -67.9449,283.0822 -4.88771,9.1906 4.6077,2.4435 c 38.56135,20.4439 80.43567,34.6103 123.4922,41.7513 20.90632,3.4676 42.0695,5.2907 63.26087,5.4482 h 5.21872 l 0.0724,-10.4115 h -5.21853 c -20.64496,-0.1809 -41.26423,-1.9173 -61.63152,-5.296 -41.93925,-6.9549 -82.74965,-20.7695 -120.31018,-40.6806 l -4.6077,-2.4183 z"
       id="path5952-33" />
    <g
       style="opacity:1;vector-effect:none;fill:#1b75bc;fill-opacity:1;stroke:none;stroke-width:0.31282106;stroke-linecap:square;stroke-linejoin:miter;stroke-miterlimit:10;stroke-dasharray:none;stroke-dashoffset:0;stroke-opacity:1;marker:none"
       id="g7250-8"
       transform="matrix(5.7460155,0,0,5.7460155,-4833.8097,-2114.2776)">
      <g
         style="vector-effect:none;fill:#1b75bc;fill-opacity:1;stroke:none;stroke-width:0.31282106;stroke-linecap:square;stroke-linejoin:miter;stroke-miterlimit:10;stroke-dasharray:none;stroke-dashoffset:0;stroke-opacity:1;marker:none"
         id="g7252-5">
        <path
           d="m 892.35,360.146 v -2.032 h 6.805 c 0.069,0.358 0.11,0.785 0.11,1.246 0,1.524 -0.418,3.412 -1.76,4.754 -1.306,1.361 -2.976,2.087 -5.19,2.087 -4.101,10e-4 -7.549,-3.339 -7.549,-7.44 0,-4.101 3.448,-7.44 7.549,-7.44 2.268,0 3.884,0.889 5.099,2.051 l -1.433,1.433 c -0.871,-0.817 -2.051,-1.452 -3.665,-1.452 -2.994,0 -5.335,2.414 -5.335,5.408 0,2.994 2.341,5.408 5.335,5.408 1.941,0 3.049,-0.78 3.756,-1.488 0.577,-0.576 0.956,-1.403 1.104,-2.535 z m 17.284,1.264 c 0,2.758 -2.159,4.791 -4.809,4.791 -2.65,0 -4.809,-2.032 -4.809,-4.791 0,-2.777 2.159,-4.791 4.809,-4.791 2.65,0 4.809,2.015 4.809,4.791 z m -2.105,0 c 0,-1.724 -1.252,-2.903 -2.703,-2.903 -1.452,0 -2.704,1.18 -2.704,2.903 0,1.705 1.252,2.903 2.704,2.903 1.451,0.001 2.703,-1.197 2.703,-2.903 z m 12.596,0 c 0,2.758 -2.159,4.791 -4.809,4.791 -2.65,0 -4.809,-2.032 -4.809,-4.791 0,-2.777 2.159,-4.791 4.809,-4.791 2.65,0 4.809,2.015 4.809,4.791 z m -2.105,0 c 0,-1.724 -1.252,-2.903 -2.703,-2.903 -1.451,0 -2.704,1.18 -2.704,2.903 0,1.705 1.252,2.903 2.704,2.903 1.451,0.001 2.703,-1.197 2.703,-2.903 z m 12.16,-4.5 v 8.602 c 0,3.539 -2.087,4.99 -4.555,4.99 -2.323,0 -3.72,-1.561 -4.247,-2.831 l 1.833,-0.762 c 0.327,0.78 1.125,1.706 2.414,1.706 1.579,0 2.559,-0.98 2.559,-2.813 v -0.69 h -0.072 c -0.472,0.581 -1.379,1.089 -2.523,1.089 -2.395,0 -4.591,-2.087 -4.591,-4.773 0,-2.704 2.196,-4.809 4.591,-4.809 1.143,0 2.051,0.508 2.523,1.071 h 0.072 v -0.781 h 1.996 z m -1.85,4.519 c 0,-1.688 -1.125,-2.922 -2.559,-2.922 -1.452,0 -2.667,1.234 -2.667,2.922 0,1.669 1.216,2.886 2.667,2.886 1.433,-10e-4 2.559,-1.217 2.559,-2.886 z m 5.416,-9.553 v 14.035 h -2.105 v -14.035 z m 8.129,11.113 1.633,1.089 c -0.527,0.78 -1.797,2.123 -3.992,2.123 -2.722,0 -4.754,-2.105 -4.754,-4.791 0,-2.849 2.051,-4.791 4.519,-4.791 2.486,0 3.702,1.978 4.101,3.049 l 0.218,0.544 -6.406,2.65 c 0.49,0.962 1.253,1.452 2.323,1.452 1.069,0 1.813,-0.526 2.358,-1.325 z m -5.027,-1.724 4.283,-1.778 c -0.236,-0.599 -0.943,-1.016 -1.779,-1.016 -1.07,0 -2.558,0.943 -2.504,2.794 z"
           inkscape:connector-curvature="0"
           inkscape:export-xdpi="900.08636"
           inkscape:export-ydpi="900.08636"
           id="path84_15_-92"
           style="vector-effect:none;fill:#1b75bc;fill-opacity:1;stroke:none;stroke-width:0.31282106;stroke-linecap:square;stroke-linejoin:miter;stroke-miterlimit:10;stroke-dasharray:none;stroke-dashoffset:0;stroke-opacity:1;marker:none" />
      </g>
    </g>
    <g
       style="opacity:1;vector-effect:none;fill:#1b75bc;fill-opacity:1;stroke:none;stroke-width:0.31990239;stroke-linecap:square;stroke-linejoin:miter;stroke-miterlimit:10;stroke-dasharray:none;stroke-dashoffset:0;stroke-opacity:1;marker:none"
       id="g7255-7"
       transform="matrix(5.6188229,0,0,5.6188229,-5638.626,-2270.2143)">
      <g
         style="vector-effect:none;fill:#1b75bc;fill-opacity:1;stroke:none;stroke-width:0.31990239;stroke-linecap:square;stroke-linejoin:miter;stroke-miterlimit:10;stroke-dasharray:none;stroke-dashoffset:0;stroke-opacity:1;marker:none"
         id="g7257-3">
        <path
           d="m 1048.279,346.123 v 5.77 0 h 20.418 v -5.77 z m 19.142,4.514 h -17.865 v -3.259 h 17.865 z m -17.866,10.792 h -1.276 v -5.77 h 1.276 v 2.28 h 2.28 v -2.28 h 1.276 v 5.77 h -1.276 v -2.391 h -2.28 z m 6.456,0.092 c -1.295,0 -2.177,-0.803 -2.177,-2.123 0,-1.283 0.864,-2.17 2.008,-2.17 1.248,0 1.867,0.822 1.867,2.05 v 0.462 h -2.665 c 0.15,0.637 0.657,0.803 1.164,0.803 0.441,0 0.76,-0.092 1.154,-0.332 h 0.047 v 0.951 c -0.338,0.239 -0.816,0.359 -1.398,0.359 z m -0.967,-2.622 h 1.52 c -0.028,-0.425 -0.206,-0.72 -0.704,-0.72 -0.374,0 -0.703,0.157 -0.816,0.72 z m 5.997,0.111 -0.657,2.419 h -1.117 l -1.276,-4.062 v -0.046 h 1.22 l 0.694,2.428 0.657,-2.428 h 0.995 l 0.666,2.428 0.704,-2.428 h 1.173 v 0.046 l -1.276,4.062 h -1.117 z m 5.132,2.511 c -1.014,0 -1.426,-0.397 -1.426,-1.329 v -4.533 h 1.239 v 4.45 c 0,0.286 0.113,0.388 0.356,0.388 0.085,0 0.207,-0.028 0.282,-0.056 h 0.019 v 1.006 c -0.103,0.037 -0.282,0.074 -0.47,0.074 z m 2.994,0 c -1.295,0 -2.177,-0.803 -2.177,-2.123 0,-1.283 0.863,-2.17 2.008,-2.17 1.248,0 1.867,0.822 1.867,2.05 v 0.462 h -2.665 c 0.15,0.637 0.657,0.803 1.164,0.803 0.441,0 0.76,-0.092 1.154,-0.332 h 0.047 v 0.951 c -0.338,0.239 -0.817,0.359 -1.398,0.359 z m -0.967,-2.622 h 1.52 c -0.028,-0.424 -0.206,-0.72 -0.704,-0.72 -0.375,0 -0.703,0.157 -0.816,0.72 z m 7.751,-1.579 h 0.92 v 0.978 h -0.92 v 1.671 c 0,0.36 0.141,0.526 0.516,0.526 0.103,0 0.235,-0.009 0.375,-0.056 h 0.028 v 0.96 c -0.16,0.056 -0.404,0.12 -0.76,0.12 -1.004,0 -1.398,-0.452 -1.398,-1.496 v -1.726 h -1.586 v 1.671 c 0,0.36 0.141,0.526 0.516,0.526 0.103,0 0.235,-0.009 0.375,-0.056 h 0.028 v 0.96 c -0.159,0.056 -0.404,0.12 -0.76,0.12 -1.004,0 -1.398,-0.452 -1.398,-1.496 v -1.726 h -0.638 v -0.978 h 0.638 v -1.126 h 1.239 v 1.126 h 1.586 v -1.126 h 1.239 z m 7.345,0.296 c 0,1.256 -0.854,1.939 -2.149,1.939 h -0.91 v 1.874 h -1.276 v -5.77 h 2.186 c 1.295,0 2.149,0.683 2.149,1.957 z m -2.252,0.877 c 0.648,0 0.957,-0.36 0.957,-0.877 0,-0.535 -0.31,-0.895 -0.957,-0.895 h -0.807 v 1.772 z m 5.011,2.529 c -0.272,0.323 -0.675,0.48 -1.107,0.48 -0.816,0 -1.483,-0.489 -1.483,-1.357 0,-0.803 0.666,-1.339 1.623,-1.339 0.3,0 0.61,0.047 0.929,0.139 v -0.074 c 0,-0.443 -0.253,-0.637 -0.919,-0.637 -0.423,0 -0.826,0.12 -1.173,0.314 h -0.047 v -0.979 c 0.319,-0.185 0.882,-0.342 1.435,-0.342 1.258,0 1.942,0.591 1.942,1.625 v 2.576 h -1.201 z m -0.038,-0.886 v -0.351 c -0.188,-0.102 -0.431,-0.138 -0.685,-0.138 -0.404,0 -0.647,0.148 -0.647,0.48 0,0.342 0.244,0.49 0.61,0.49 0.347,-0.001 0.61,-0.176 0.722,-0.481 z m 1.868,-0.757 c 0,-1.32 0.948,-2.151 2.186,-2.151 0.441,0 0.854,0.093 1.164,0.314 v 1.043 h -0.047 c -0.272,-0.203 -0.591,-0.323 -0.957,-0.323 -0.619,0 -1.088,0.416 -1.088,1.117 0,0.701 0.469,1.108 1.088,1.108 0.366,0 0.685,-0.12 0.957,-0.323 h 0.047 v 1.043 c -0.31,0.222 -0.722,0.314 -1.164,0.314 -1.239,0 -2.186,-0.822 -2.186,-2.142 z m 5.366,0.185 v 1.865 h -1.238 v -5.77 h 1.238 v 3.286 l 1.249,-1.625 h 1.407 v 0.046 l -1.501,1.865 1.501,2.151 v 0.046 h -1.417 z m 5.472,1.458 c -0.272,0.323 -0.676,0.48 -1.107,0.48 -0.816,0 -1.483,-0.489 -1.483,-1.357 0,-0.803 0.666,-1.339 1.624,-1.339 0.3,0 0.61,0.047 0.929,0.138 v -0.074 c 0,-0.443 -0.254,-0.637 -0.92,-0.637 -0.422,0 -0.826,0.12 -1.173,0.314 h -0.047 v -0.978 c 0.319,-0.185 0.882,-0.342 1.436,-0.342 1.257,0 1.942,0.591 1.942,1.625 v 2.576 h -1.201 z m -0.038,-0.886 v -0.351 c -0.188,-0.102 -0.432,-0.138 -0.685,-0.138 -0.403,0 -0.647,0.148 -0.647,0.48 0,0.342 0.244,0.49 0.61,0.49 0.347,-0.001 0.61,-0.176 0.722,-0.481 z m 3.322,-2.151 c 0.225,-0.452 0.553,-0.711 1.013,-0.711 0.169,0 0.338,0.037 0.403,0.074 v 1.163 h -0.047 c -0.141,-0.056 -0.31,-0.093 -0.544,-0.093 -0.385,0 -0.685,0.222 -0.788,0.646 v 2.364 h -1.239 v -4.108 h 1.201 z m 4.738,3.019 c -0.262,0.332 -0.675,0.517 -1.238,0.517 -1.07,0 -1.755,-0.96 -1.755,-2.142 0,-1.182 0.685,-2.151 1.755,-2.151 0.544,0 0.938,0.166 1.201,0.471 v -2.04 h 1.239 v 5.77 h -1.201 v -0.425 z m -0.037,-0.969 v -1.32 c -0.206,-0.295 -0.478,-0.425 -0.788,-0.425 -0.544,0 -0.91,0.388 -0.91,1.089 0,0.702 0.366,1.08 0.91,1.08 0.309,0 0.581,-0.129 0.788,-0.424 z m -58.429,3.278 h 3.622 v 0.701 h -2.806 v 1.763 h 2.543 v 0.683 h -2.543 v 1.92 h 2.806 v 0.701 h -3.622 z m 6.615,1.624 c 0.929,0 1.445,0.6 1.445,1.588 v 2.557 h -0.779 v -2.538 c 0,-0.526 -0.272,-0.905 -0.863,-0.905 -0.488,0 -0.901,0.305 -1.042,0.739 v 2.705 h -0.779 v -4.062 h 0.779 v 0.591 c 0.244,-0.379 0.657,-0.675 1.239,-0.675 z m 3.538,0.084 h 1.06 v 0.656 h -1.06 v 2.188 c 0,0.462 0.244,0.619 0.685,0.619 0.122,0 0.253,-0.018 0.347,-0.055 h 0.028 v 0.655 c -0.112,0.047 -0.272,0.083 -0.488,0.083 -0.967,0 -1.351,-0.434 -1.351,-1.228 v -2.261 h -0.713 v -0.656 h 0.713 v -1.08 h 0.779 z m 3.594,4.144 c -1.21,0 -2.036,-0.794 -2.036,-2.068 0,-1.274 0.769,-2.16 1.886,-2.16 1.135,0 1.727,0.803 1.727,1.994 v 0.351 h -2.834 c 0.084,0.822 0.619,1.219 1.361,1.219 0.46,0 0.788,-0.102 1.154,-0.369 h 0.028 v 0.674 c -0.339,0.258 -0.78,0.36 -1.286,0.359 z m -1.229,-2.511 h 2.055 c -0.028,-0.6 -0.328,-1.061 -0.966,-1.061 -0.592,0 -0.977,0.434 -1.089,1.061 z m 4.503,-1.006 c 0.179,-0.434 0.573,-0.692 1.023,-0.692 0.178,0 0.338,0.028 0.404,0.065 v 0.757 h -0.028 c -0.112,-0.055 -0.3,-0.083 -0.488,-0.083 -0.422,0 -0.779,0.277 -0.91,0.739 v 2.649 h -0.779 v -4.062 h 0.779 v 0.627 z m 4.073,-0.711 c 1.229,0 1.886,0.988 1.886,2.114 0,1.127 -0.657,2.114 -1.886,2.114 -0.507,0 -0.938,-0.258 -1.154,-0.536 v 2.013 h -0.779 v -5.622 h 0.779 v 0.461 c 0.216,-0.285 0.647,-0.544 1.154,-0.544 z m -0.132,3.536 c 0.77,0 1.22,-0.6 1.22,-1.422 0,-0.812 -0.45,-1.421 -1.22,-1.421 -0.422,0 -0.816,0.249 -1.023,0.646 v 1.56 c 0.207,0.397 0.601,0.637 1.023,0.637 z m 3.717,-2.825 c 0.178,-0.434 0.572,-0.692 1.023,-0.692 0.178,0 0.338,0.028 0.403,0.065 v 0.757 h -0.028 c -0.113,-0.055 -0.3,-0.083 -0.488,-0.083 -0.422,0 -0.779,0.277 -0.91,0.739 v 2.649 h -0.779 v -4.062 h 0.779 z m 2.552,-2.271 c 0.272,0 0.497,0.212 0.497,0.48 0,0.267 -0.225,0.48 -0.497,0.48 -0.263,0 -0.497,-0.212 -0.497,-0.48 -10e-4,-0.268 0.234,-0.48 0.497,-0.48 z m -0.385,1.644 h 0.779 v 4.062 h -0.779 z m 3.556,1.689 c 0.591,0.184 1.248,0.424 1.248,1.2 0,0.831 -0.694,1.256 -1.585,1.256 -0.544,0 -1.089,-0.129 -1.398,-0.369 v -0.729 h 0.037 c 0.347,0.314 0.863,0.452 1.351,0.452 0.441,0 0.835,-0.166 0.835,-0.517 0,-0.36 -0.328,-0.443 -0.976,-0.655 -0.582,-0.185 -1.229,-0.397 -1.229,-1.163 0,-0.785 0.657,-1.246 1.492,-1.246 0.488,0 0.919,0.102 1.267,0.332 v 0.739 h -0.028 c -0.338,-0.268 -0.732,-0.425 -1.22,-0.425 -0.488,0 -0.76,0.212 -0.76,0.499 0,0.321 0.3,0.413 0.966,0.626 z m 3.96,2.456 c -1.211,0 -2.036,-0.794 -2.036,-2.068 0,-1.274 0.769,-2.16 1.886,-2.16 1.136,0 1.727,0.803 1.727,1.994 v 0.351 h -2.834 c 0.085,0.822 0.62,1.219 1.361,1.219 0.46,0 0.788,-0.102 1.154,-0.369 h 0.028 v 0.674 c -0.338,0.257 -0.779,0.359 -1.286,0.359 z m -1.229,-2.512 h 2.055 c -0.028,-0.6 -0.328,-1.061 -0.966,-1.061 -0.592,0 -0.977,0.434 -1.089,1.061 z"
           inkscape:connector-curvature="0"
           inkscape:export-xdpi="900.08636"
           inkscape:export-ydpi="900.08636"
           id="path177_15_-64"
           style="vector-effect:none;fill:#1b75bc;fill-opacity:1;stroke:none;stroke-width:0.31990239;stroke-linecap:square;stroke-linejoin:miter;stroke-miterlimit:10;stroke-dasharray:none;stroke-dashoffset:0;stroke-opacity:1;marker:none" />
      </g>
    </g>
    <g
       style="opacity:1;vector-effect:none;fill:#1b75bc;fill-opacity:1;stroke:none;stroke-width:0.31380075;stroke-linecap:square;stroke-linejoin:miter;stroke-miterlimit:10;stroke-dasharray:none;stroke-dashoffset:0;stroke-opacity:1;marker:none"
       id="g7260-7"
       transform="matrix(5.7280766,0,0,5.7280766,-5285.79,-2528.1749)">
      <g
         style="vector-effect:none;fill:#1b75bc;fill-opacity:1;stroke:none;stroke-width:0.31380075;stroke-linecap:square;stroke-linejoin:miter;stroke-miterlimit:10;stroke-dasharray:none;stroke-dashoffset:0;stroke-opacity:1;marker:none"
         id="g7262-9">
        <path
           d="m 990.195,352.978 c -0.395,0 -0.857,-0.454 -1.628,-0.454 -0.686,0 -1.13,0.388 -1.13,0.907 0,0.438 0.255,0.813 1.336,0.959 1.508,0.212 2.073,0.601 2.073,1.38 0,1.007 -0.875,1.624 -2.348,1.624 -1.114,0 -2.005,-0.469 -2.005,-0.713 0,-0.179 0.206,-0.156 0.377,-0.156 0.36,0 0.748,0.421 1.691,0.421 0.789,0 1.074,-0.453 1.074,-0.94 0,-0.617 -0.143,-0.917 -1.103,-1.031 -1.388,-0.162 -2.04,-0.536 -2.04,-1.38 0,-0.941 0.789,-1.558 2.091,-1.558 0.857,0 1.903,0.422 1.903,0.714 -0.006,0.129 -0.178,0.227 -0.298,0.227"
           inkscape:connector-curvature="0"
           id="path287_15_-7"
           style="vector-effect:none;fill:#1b75bc;fill-opacity:1;stroke:none;stroke-width:0.31380075;stroke-linecap:square;stroke-linejoin:miter;stroke-miterlimit:10;stroke-dasharray:none;stroke-dashoffset:0;stroke-opacity:1;marker:none" />
        <path
           d="m 993.007,357.037 c 0.651,0 1.2,-0.456 1.2,-1.039 0,-0.374 -0.308,-0.682 -0.771,-0.682 -0.566,0 -1.252,0.454 -1.252,0.973 -0.002,0.422 0.376,0.748 0.823,0.748 m -1.51,-0.634 c 0,-0.666 0.635,-1.039 1.423,-1.137 0.806,-0.097 1.251,-0.405 1.251,-0.747 0,-0.487 -0.377,-0.845 -0.823,-0.845 h -0.137 c -0.497,0 -0.72,0.487 -1.097,0.487 -0.103,0 -0.205,0.016 -0.205,-0.113 0,-0.324 0.686,-0.536 1.303,-0.536 1.817,0 1.68,0.634 1.68,2.209 v 1.184 c 0,0.212 -0.104,0.325 -0.309,0.325 -0.172,0 -0.479,-0.113 -0.754,-0.113 -0.513,0 -0.651,0.226 -1.199,0.226 -0.619,10e-4 -1.134,-0.356 -1.133,-0.94"
           inkscape:connector-curvature="0"
           id="path289_15_-2"
           style="vector-effect:none;fill:#1b75bc;fill-opacity:1;stroke:none;stroke-width:0.31380075;stroke-linecap:square;stroke-linejoin:miter;stroke-miterlimit:10;stroke-dasharray:none;stroke-dashoffset:0;stroke-opacity:1;marker:none" />
        <path
           d="m 997.412,355.754 c 0.239,0 0.444,-0.179 0.547,-0.519 l 0.36,-1.283 c 0.086,-0.276 0.274,-0.421 0.532,-0.421 0.051,0 0.291,0.015 0.308,0.227 0.017,0.114 -0.121,0.422 -0.121,0.439 l -0.976,2.695 c -0.104,0.291 -0.291,0.438 -0.582,0.438 -0.378,0 -0.617,-0.098 -0.772,-0.536 l -0.96,-2.679 c -0.155,-0.421 -0.069,-0.568 0.205,-0.568 0.394,0 0.514,0.066 0.685,0.812 0.225,0.956 0.361,1.395 0.774,1.395"
           inkscape:connector-curvature="0"
           id="path291_15_-2"
           style="vector-effect:none;fill:#1b75bc;fill-opacity:1;stroke:none;stroke-width:0.31380075;stroke-linecap:square;stroke-linejoin:miter;stroke-miterlimit:10;stroke-dasharray:none;stroke-dashoffset:0;stroke-opacity:1;marker:none" />
        <path
           d="m 1001.807,357.004 c 0.686,0 1.372,-0.536 1.372,-1.542 0,-1.136 -0.669,-1.591 -1.388,-1.591 -0.687,0 -1.388,0.536 -1.388,1.46 0,1.039 0.547,1.673 1.404,1.673 m -0.017,0.357 c -1.269,0 -2.057,-0.764 -2.057,-1.932 0,-1.104 0.806,-1.916 1.886,-1.916 1.439,0 2.244,0.666 2.244,1.932 0,1.169 -0.804,1.916 -2.072,1.916"
           inkscape:connector-curvature="0"
           id="path293_15_-1"
           style="vector-effect:none;fill:#1b75bc;fill-opacity:1;stroke:none;stroke-width:0.31380075;stroke-linecap:square;stroke-linejoin:miter;stroke-miterlimit:10;stroke-dasharray:none;stroke-dashoffset:0;stroke-opacity:1;marker:none" />
        <path
           d="m 1005.244,352.523 c -0.257,0 -0.342,-0.081 -0.342,-0.211 0,-0.131 0.085,-0.212 0.274,-0.212 0.171,0 0.342,0.05 0.342,0.212 0,0.13 -0.17,0.211 -0.273,0.211 m 0.36,4.205 c 0,0.373 -0.12,0.569 -0.359,0.569 -0.376,0 -0.429,-0.097 -0.429,-0.844 v -2.305 c 0,-0.39 0.087,-0.584 0.377,-0.584 0.411,0 0.411,0.178 0.411,0.876 z"
           inkscape:connector-curvature="0"
           id="path295_15_-6"
           style="vector-effect:none;fill:#1b75bc;fill-opacity:1;stroke:none;stroke-width:0.31380075;stroke-linecap:square;stroke-linejoin:miter;stroke-miterlimit:10;stroke-dasharray:none;stroke-dashoffset:0;stroke-opacity:1;marker:none" />
        <path
           d="m 1008.663,353.611 c 0.138,0 0.291,0.016 0.291,0.259 0,0.195 -0.291,0.243 -0.566,0.39 -0.446,0.228 -0.411,0.244 -0.565,0.39 -0.154,0.211 -0.241,0.438 -0.241,0.714 v 1.396 c 0,0.373 -0.12,0.552 -0.342,0.552 -0.446,0 -0.514,-0.097 -0.514,-0.78 v -2.451 c 0,-0.374 0.138,-0.569 0.428,-0.569 0.241,0 0.737,0.131 0.823,0.131 0.275,0.001 0.447,-0.032 0.686,-0.032"
           inkscape:connector-curvature="0"
           id="path297_15_-3"
           style="vector-effect:none;fill:#1b75bc;fill-opacity:1;stroke:none;stroke-width:0.31380075;stroke-linecap:square;stroke-linejoin:miter;stroke-miterlimit:10;stroke-dasharray:none;stroke-dashoffset:0;stroke-opacity:1;marker:none" />
        <path
           d="m 1011.537,355.416 c 0,0.315 -0.171,0.473 -0.462,0.473 h -0.566 c -0.291,0 -0.445,-0.223 -0.445,-0.473 0,-0.278 0.138,-0.45 0.394,-0.45 h 0.652 c 0.277,0 0.429,0.197 0.429,0.45"
           inkscape:connector-curvature="0"
           id="path299_15_-02"
           style="vector-effect:none;fill:#1b75bc;fill-opacity:1;stroke:none;stroke-width:0.31380075;stroke-linecap:square;stroke-linejoin:miter;stroke-miterlimit:10;stroke-dasharray:none;stroke-dashoffset:0;stroke-opacity:1;marker:none" />
        <path
           d="m 1014.611,352.636 c -0.067,0.049 -0.189,0.308 -0.189,0.406 0,0.081 0.035,0.178 0.087,0.258 0.051,0.082 0.325,0.244 0.325,0.392 0,0.145 -0.103,0.129 -0.325,0.323 -0.138,0.115 -0.327,0.374 -0.327,0.699 v 1.672 c 0,0.747 -0.068,0.877 -0.41,0.877 -0.344,0 -0.411,-0.131 -0.411,-0.877 l -0.017,-1.64 c 0,-0.357 -0.102,-0.503 -0.241,-0.682 -0.102,-0.13 -0.308,-0.228 -0.308,-0.358 0,-0.162 0.122,-0.162 0.308,-0.389 0.086,-0.114 0.12,-0.188 0.378,-0.829 0.085,-0.211 0.291,-0.511 0.959,-0.511 0.376,0 0.496,0.106 0.496,0.283 0,0.147 0.016,0.115 -0.326,0.375"
           inkscape:connector-curvature="0"
           id="path301_15_-1"
           style="vector-effect:none;fill:#1b75bc;fill-opacity:1;stroke:none;stroke-width:0.31380075;stroke-linecap:square;stroke-linejoin:miter;stroke-miterlimit:10;stroke-dasharray:none;stroke-dashoffset:0;stroke-opacity:1;marker:none" />
        <path
           d="m 1016.993,357.037 c 0.652,0 1.201,-0.456 1.201,-1.039 0,-0.374 -0.309,-0.682 -0.772,-0.682 -0.566,0 -1.252,0.454 -1.252,0.973 0,0.422 0.377,0.748 0.823,0.748 m -1.51,-0.634 c 0,-0.666 0.635,-1.039 1.423,-1.137 0.805,-0.097 1.251,-0.405 1.251,-0.747 0,-0.487 -0.377,-0.845 -0.823,-0.845 h -0.138 c -0.496,0 -0.72,0.487 -1.096,0.487 -0.102,0 -0.206,0.016 -0.206,-0.113 0,-0.324 0.686,-0.536 1.303,-0.536 1.819,0 1.681,0.634 1.681,2.209 v 1.184 c 0,0.212 -0.102,0.325 -0.308,0.325 -0.171,0 -0.481,-0.113 -0.755,-0.113 -0.515,0 -0.652,0.226 -1.201,0.226 -0.618,0 -1.132,-0.357 -1.132,-0.941"
           inkscape:connector-curvature="0"
           id="path303_15_-5"
           style="vector-effect:none;fill:#1b75bc;fill-opacity:1;stroke:none;stroke-width:0.31380075;stroke-linecap:square;stroke-linejoin:miter;stroke-miterlimit:10;stroke-dasharray:none;stroke-dashoffset:0;stroke-opacity:1;marker:none" />
        <path
           d="m 1020.473,352.523 c -0.257,0 -0.342,-0.081 -0.342,-0.211 0,-0.131 0.085,-0.212 0.274,-0.212 0.171,0 0.342,0.05 0.342,0.212 0,0.13 -0.17,0.211 -0.273,0.211 m 0.36,4.205 c 0,0.373 -0.119,0.569 -0.36,0.569 -0.376,0 -0.428,-0.097 -0.428,-0.844 v -2.305 c 0,-0.39 0.087,-0.584 0.377,-0.584 0.411,0 0.411,0.178 0.411,0.876 z"
           inkscape:connector-curvature="0"
           id="path305_15_-6"
           style="vector-effect:none;fill:#1b75bc;fill-opacity:1;stroke:none;stroke-width:0.31380075;stroke-linecap:square;stroke-linejoin:miter;stroke-miterlimit:10;stroke-dasharray:none;stroke-dashoffset:0;stroke-opacity:1;marker:none" />
        <path
           d="m 1023.721,353.611 c 0.137,0 0.291,0.016 0.291,0.259 0,0.195 -0.12,0.243 -0.393,0.39 -0.446,0.228 -0.412,0.244 -0.566,0.39 -0.154,0.211 -0.24,0.438 -0.24,0.714 v 1.396 c 0,0.373 -0.121,0.552 -0.343,0.552 -0.446,0 -0.514,-0.097 -0.514,-0.78 v -2.451 c 0,-0.374 0.137,-0.569 0.428,-0.569 0.24,0 0.738,0.131 0.823,0.131 0.274,0.001 0.274,-0.032 0.514,-0.032"
           inkscape:connector-curvature="0"
           id="path307_15_-5"
           style="vector-effect:none;fill:#1b75bc;fill-opacity:1;stroke:none;stroke-width:0.31380075;stroke-linecap:square;stroke-linejoin:miter;stroke-miterlimit:10;stroke-dasharray:none;stroke-dashoffset:0;stroke-opacity:1;marker:none" />
        <path
           d="m 1026.326,355.251 h 0.292 c 0.411,0 0.805,-0.293 0.805,-0.617 0,-0.406 -0.343,-0.796 -0.959,-0.796 -0.652,0 -1.046,0.325 -1.046,0.747 0,0.389 0.393,0.666 0.908,0.666 m 1.526,0.113 -1.081,-0.016 c -1.063,0 -1.439,0.178 -1.439,0.73 0,0.487 0.565,0.959 1.148,0.959 0.275,0 0.481,-0.033 0.6,-0.114 l 0.445,-0.277 c 0.087,-0.048 0.103,-0.114 0.274,-0.114 0.463,0 -0.034,0.829 -1.371,0.829 -1.131,0 -1.885,-0.73 -1.885,-1.868 0,-1.2 0.652,-1.98 1.885,-1.98 1.474,0 1.8,1.137 1.8,1.559 0,0.195 -0.101,0.293 -0.373,0.293"
           inkscape:connector-curvature="0"
           id="path309_15_-0"
           style="vector-effect:none;fill:#1b75bc;fill-opacity:1;stroke:none;stroke-width:0.31380075;stroke-linecap:square;stroke-linejoin:miter;stroke-miterlimit:10;stroke-dasharray:none;stroke-dashoffset:0;stroke-opacity:1;marker:none" />
        <path
           d="m 988.936,364.128 c 0.368,0.371 1.625,0.458 3.963,0.458 0.584,0 0.984,0.154 0.984,0.459 0,0.372 -0.339,0.569 -0.984,0.569 h -5.256 c -0.584,0 -0.892,-0.197 -0.892,-0.743 v -5.381 c 0,-0.458 0.338,-0.676 0.923,-0.676 0.678,0 0.954,0.24 0.954,0.676 -0.031,4.629 -0.031,4.287 0.308,4.638"
           inkscape:connector-curvature="0"
           id="path313_15_-0"
           style="vector-effect:none;fill:#1b75bc;fill-opacity:1;stroke:none;stroke-width:0.31380075;stroke-linecap:square;stroke-linejoin:miter;stroke-miterlimit:10;stroke-dasharray:none;stroke-dashoffset:0;stroke-opacity:1;marker:none" />
        <path
           d="m 997.422,364.998 c 0,0.415 -0.284,0.614 -0.747,0.614 -0.409,0 -0.668,-0.087 -0.668,-1.092 v -4.975 c 0.009,-0.371 0.297,-0.589 0.707,-0.589 0.492,0 0.706,0.196 0.707,1.067 l 10e-4,4.975 h 0.002 z"
           inkscape:connector-curvature="0"
           id="path315_15_-3"
           style="vector-effect:none;fill:#1b75bc;fill-opacity:1;stroke:none;stroke-width:0.31380075;stroke-linecap:square;stroke-linejoin:miter;stroke-miterlimit:10;stroke-dasharray:none;stroke-dashoffset:0;stroke-opacity:1;marker:none" />
        <path
           d="m 1001.932,359.395 1.998,2.567 c 0.801,1.045 1.751,1.362 2.367,1.362 0.769,0 1.201,-0.544 1.201,-1.225 v -2.613 c 0,-0.317 0.122,-0.477 0.4,-0.477 0.247,0 0.369,0.227 0.369,0.659 v 5.518 c 0,0.342 -0.184,0.524 -0.585,0.524 h -0.246 c -0.37,0 -0.708,-0.159 -0.924,-0.409 l -3.012,-3.111 c -0.339,-0.432 -0.831,-0.772 -1.293,-0.772 -0.831,0 -1.262,0.454 -1.262,1.249 v 2.43 c 0,0.318 -0.061,0.569 -0.4,0.569 -0.246,0 -0.368,-0.159 -0.368,-0.659 v -5.521 c 0,-0.34 0.154,-0.523 0.461,-0.523 h 0.4 c 0.369,0 0.644,0.091 0.891,0.431"
           inkscape:connector-curvature="0"
           id="path317_15_-4"
           style="vector-effect:none;fill:#1b75bc;fill-opacity:1;stroke:none;stroke-width:0.31380075;stroke-linecap:square;stroke-linejoin:miter;stroke-miterlimit:10;stroke-dasharray:none;stroke-dashoffset:0;stroke-opacity:1;marker:none" />
        <path
           d="m 1012.27,359.629 v 3.603 c 0,1.179 1.017,1.987 2.555,1.987 1.538,0 2.553,-0.808 2.553,-1.987 v -3.603 c 0,-0.46 0.124,-0.721 0.708,-0.721 0.523,0 0.738,0.109 0.738,1.026 v 3.211 c 0,1.245 -0.862,2.751 -4,2.751 -2.954,0 -4.001,-1.267 -4.001,-2.751 v -3.516 c 0,-0.415 0.154,-0.699 0.493,-0.699 h 0.401 c 0.365,0 0.551,0.24 0.551,0.699"
           inkscape:connector-curvature="0"
           id="path319_15_-6"
           style="vector-effect:none;fill:#1b75bc;fill-opacity:1;stroke:none;stroke-width:0.31380075;stroke-linecap:square;stroke-linejoin:miter;stroke-miterlimit:10;stroke-dasharray:none;stroke-dashoffset:0;stroke-opacity:1;marker:none" />
        <path
           d="m 1026.559,359.279 c 0.216,-0.217 0.492,-0.415 1.263,-0.415 0.338,0 0.523,0.021 0.523,0.218 0,0.197 -0.156,0.372 -0.862,1.027 -1.324,1.223 -1.478,1.528 -1.478,1.921 0,0.415 0.308,0.721 0.493,0.918 2.4,2.424 2.462,2.401 2.462,2.597 0,0.176 -0.155,0.241 -0.586,0.241 -0.924,0 -1.109,-0.109 -2.155,-1.331 -0.738,-0.873 -1.168,-1.092 -1.569,-1.092 -0.738,0 -1.015,0.173 -2.061,1.398 -0.924,1.069 -1.262,1.025 -1.877,1.025 -0.4,0 -0.616,-0.087 -0.616,-0.241 0,-0.173 0.43,-0.502 0.955,-1.047 -0.524,0.524 1.568,-1.549 1.661,-1.66 0.247,-0.284 0.401,-0.568 0.401,-0.808 0,-0.262 -0.277,-0.698 -0.431,-0.852 l -1.692,-1.681 c -0.615,-0.589 -0.03,-0.634 0.184,-0.634 1.047,0 1.11,0.044 2.031,1.093 0.462,0.524 0.862,0.765 1.323,0.765 0.308,0 0.708,-0.088 1.016,-0.371 0.316,-0.283 0.683,-0.742 1.023,-1.069"
           inkscape:connector-curvature="0"
           id="path321_15_-6"
           style="vector-effect:none;fill:#1b75bc;fill-opacity:1;stroke:none;stroke-width:0.31380075;stroke-linecap:square;stroke-linejoin:miter;stroke-miterlimit:10;stroke-dasharray:none;stroke-dashoffset:0;stroke-opacity:1;marker:none" />
        <path
           d="m 972.403,349.244 c -4.876,0.077 -8.997,3.835 -9.423,8.797 -0.454,5.294 3.468,9.953 8.762,10.407 5.294,0.455 9.953,-3.467 10.407,-8.761 0.454,-5.293 -3.468,-9.952 -8.762,-10.408 -0.33,-0.029 -0.659,-0.04 -0.984,-0.035 z m 1.578,2.669 c 0.301,-0.005 0.477,0.08 0.719,0.192 0,0 0.022,0.176 -0.113,0.259 -0.123,0.074 -0.312,0.231 -0.598,0.4 -0.286,0.169 -0.601,0.582 -0.895,0.895 -0.294,0.312 -0.341,0.756 -0.26,1.065 0.073,0.275 0.471,0.605 0.715,0.898 0.356,0.306 0.736,0.606 0.736,0.606 0,0 1.025,0.53 2.234,1.378 2.949,2.065 3.83,3.6 3.33,4.18 -0.22,0.252 -1.349,-1.153 -2.016,-1.356 -0.816,-0.247 -1.758,-0.663 -2.453,-0.953 0.144,0.568 0.285,1.778 0.276,2.584 -0.018,1.886 -0.691,4.065 -2.764,4.065 -2.043,0 -3.179,-1.7 -2.868,-3.559 0.166,-0.993 0.494,-2.208 0.46,-2.239 -0.002,-0.002 -0.299,-0.043 -0.602,-0.031 -0.367,0.014 -0.59,0.119 -1.053,0.168 -0.476,0.052 -0.987,0.254 -1.613,0.561 -0.716,0.35 -1.417,1.473 -1.638,1.127 -0.323,-0.506 0.793,-2.637 2.137,-3.57 1.215,-0.841 1.941,-1.253 2.24,-1.505 0.3,-0.253 0.611,-0.526 0.691,-0.85 0.046,-0.184 -0.046,-0.529 -0.138,-0.804 -0.065,-0.193 -0.31,-0.59 -0.494,-1.106 -0.184,-0.516 -0.046,-1.2 0.434,-1.702 0.48,-0.503 1.615,-0.534 2.279,-0.521 0.664,0.013 0.365,-0.049 0.905,-0.145 0.134,-0.024 0.248,-0.036 0.349,-0.037 z"
           inkscape:connector-curvature="0"
           id="path329_15_-0"
           style="vector-effect:none;fill:#1b75bc;fill-opacity:1;stroke:none;stroke-width:0.31380075;stroke-linecap:square;stroke-linejoin:miter;stroke-miterlimit:10;stroke-dasharray:none;stroke-dashoffset:0;stroke-opacity:1;marker:none" />
      </g>
    </g>
    <g
       id="g3571-2"
       transform="matrix(19.39199,0,0,19.39199,-2219.6141,-3614.8206)">
      <g
         transform="matrix(0.3344049,0,0,0.3344049,-160.45603,64.156872)"
         id="g7240-5"
         style="opacity:1;vector-effect:none;fill:#1b75bc;fill-opacity:1;stroke:none;stroke-width:0.19415981;stroke-linecap:square;stroke-linejoin:miter;stroke-miterlimit:10;stroke-dasharray:none;stroke-dashoffset:0;stroke-opacity:1;marker:none">
        <g
           id="g7242-8"
           style="vector-effect:none;fill:#1b75bc;fill-opacity:1;stroke:none;stroke-width:0.19415981;stroke-linecap:square;stroke-linejoin:miter;stroke-miterlimit:10;stroke-dasharray:none;stroke-dashoffset:0;stroke-opacity:1;marker:none">
          <path
             style="vector-effect:none;fill:#1b75bc;fill-opacity:1;stroke:none;stroke-width:0.19415981;stroke-linecap:square;stroke-linejoin:miter;stroke-miterlimit:10;stroke-dasharray:none;stroke-dashoffset:0;stroke-opacity:1;marker:none"
             id="path30_15_-95"
             inkscape:connector-curvature="0"
             d="m 886.681,385.355 v 8.262 h 34.732 v -8.262 z m -1.063,-1.092 h 36.857 v 10.417 h -36.857 v -10.417" />
          <path
             style="vector-effect:none;fill:#1b75bc;fill-opacity:1;stroke:none;stroke-width:0.19415981;stroke-linecap:square;stroke-linejoin:miter;stroke-miterlimit:10;stroke-dasharray:none;stroke-dashoffset:0;stroke-opacity:1;marker:none"
             id="path32_15_-0"
             inkscape:connector-curvature="0"
             d="m 897.982,387.45 -0.649,2.597 h 1.357 z m -0.797,-1.032 h 1.653 l 1.741,6.138 h -1.239 l -0.413,-1.534 h -1.829 c 0,0 -0.317,1.235 -0.384,1.505 -0.369,0.028 -1.269,0 -1.269,0 l 1.74,-6.109" />
          <path
             style="vector-effect:none;fill:#1b75bc;fill-opacity:1;stroke:none;stroke-width:0.19415981;stroke-linecap:square;stroke-linejoin:miter;stroke-miterlimit:10;stroke-dasharray:none;stroke-dashoffset:0;stroke-opacity:1;marker:none"
             id="path34_15_-6"
             inkscape:connector-curvature="0"
             d="m 916.159,386.418 h 2.568 v 0.797 h -1.652 v 0.885 h 1.505 v 0.797 h -1.505 v 0.915 h 1.652 v 0.797 h -2.567 l -10e-4,-4.191" />
          <path
             style="vector-effect:none;fill:#1b75bc;fill-opacity:1;stroke:none;stroke-width:0.19415981;stroke-linecap:square;stroke-linejoin:miter;stroke-miterlimit:10;stroke-dasharray:none;stroke-dashoffset:0;stroke-opacity:1;marker:none"
             id="path36_15_-0"
             inkscape:connector-curvature="0"
             d="m 908.812,386.418 h 1.24 l 1.18,4.574 1.15,-4.574 h 1.239 l -1.859,6.138 h -1.091 l -1.859,-6.138" />
          <path
             style="vector-effect:none;fill:#1b75bc;fill-opacity:1;stroke:none;stroke-width:0.19415981;stroke-linecap:square;stroke-linejoin:miter;stroke-miterlimit:10;stroke-dasharray:none;stroke-dashoffset:0;stroke-opacity:1;marker:none"
             id="path38_15_-8"
             inkscape:connector-curvature="0"
             d="m 903.561,386.418 h 1.209 v 5.105 h 2.567 v 1.033 h -3.777 l 0.001,-6.138" />
          <path
             style="vector-effect:none;fill:#1b75bc;fill-opacity:1;stroke:none;stroke-width:0.19415981;stroke-linecap:square;stroke-linejoin:miter;stroke-miterlimit:10;stroke-dasharray:none;stroke-dashoffset:0;stroke-opacity:1;marker:none"
             id="path40_15_-3"
             inkscape:connector-curvature="0"
             d="m 888.835,386.418 h 1.21 l 1.181,4.633 1.151,-4.633 h 1.269 l -1.859,6.138 h -1.121 l -1.831,-6.138" />
        </g>
      </g>
      <g
         transform="matrix(0.26623276,0,0,0.26623276,-164.21638,89.57529)"
         id="g7282-7"
         style="opacity:1;vector-effect:none;fill:#1b75bc;fill-opacity:1;stroke:none;stroke-width:0.2438768;stroke-linecap:square;stroke-linejoin:miter;stroke-miterlimit:10;stroke-dasharray:none;stroke-dashoffset:0;stroke-opacity:1;marker:none">
        <g
           id="g7284-8"
           style="vector-effect:none;fill:#1b75bc;fill-opacity:1;stroke:none;stroke-width:0.2438768;stroke-linecap:square;stroke-linejoin:miter;stroke-miterlimit:10;stroke-dasharray:none;stroke-dashoffset:0;stroke-opacity:1;marker:none">
          <path
             style="vector-effect:none;fill:#1b75bc;fill-opacity:1;stroke:none;stroke-width:0.2438768;stroke-linecap:square;stroke-linejoin:miter;stroke-miterlimit:10;stroke-dasharray:none;stroke-dashoffset:0;stroke-opacity:1;marker:none"
             id="path4167_12_-2"
             inkscape:connector-curvature="0"
             d="m 1101.099,384.381 c -2.841,0 -5.145,2.324 -5.145,5.19 0,2.867 2.303,5.191 5.145,5.191 2.841,0 5.144,-2.324 5.144,-5.191 10e-4,-2.866 -2.302,-5.19 -5.144,-5.19 m 0,8.531 c -1.828,0 -3.311,-1.495 -3.311,-3.34 0,-1.845 1.482,-3.34 3.311,-3.34 1.828,0 3.311,1.496 3.311,3.34 0,1.845 -1.483,3.34 -3.311,3.34" />
          <path
             style="vector-effect:none;fill:#1b75bc;fill-opacity:1;stroke:none;stroke-width:0.2438768;stroke-linecap:square;stroke-linejoin:miter;stroke-miterlimit:10;stroke-dasharray:none;stroke-dashoffset:0;stroke-opacity:1;marker:none"
             id="path4169_12_-1"
             inkscape:connector-curvature="0"
             d="m 1092.971,386.911 -1.3,1.312 1.45,1.378 -1.438,1.368 1.299,1.311 2.655,-2.679 -2.666,-2.69" />
          <path
             style="vector-effect:none;fill:#1b75bc;fill-opacity:1;stroke:none;stroke-width:0.2438768;stroke-linecap:square;stroke-linejoin:miter;stroke-miterlimit:10;stroke-dasharray:none;stroke-dashoffset:0;stroke-opacity:1;marker:none"
             id="path4171_12_-0"
             inkscape:connector-curvature="0"
             d="m 1088.192,394.821 c -1.282,0 -2.446,-0.449 -3.457,-1.337 -1.134,-1 -1.709,-2.318 -1.709,-3.918 0,-1.42 0.52,-2.653 1.546,-3.666 1.016,-1.008 2.255,-1.52 3.682,-1.52 1.416,0 2.647,0.517 3.658,1.537 l -1.342,1.354 c -0.651,-0.657 -1.408,-0.976 -2.316,-0.976 -0.925,0 -1.694,0.318 -2.353,0.972 -0.658,0.65 -0.977,1.401 -0.977,2.299 0,1.037 0.346,1.846 1.058,2.473 0.664,0.582 1.387,0.866 2.21,0.866 0.94,0 1.719,-0.317 2.382,-0.969 l 1.325,1.372 c -1.021,1.004 -2.268,1.513 -3.707,1.513" />
          <path
             style="vector-effect:none;fill:#1b75bc;fill-opacity:1;stroke:none;stroke-width:0.2438768;stroke-linecap:square;stroke-linejoin:miter;stroke-miterlimit:10;stroke-dasharray:none;stroke-dashoffset:0;stroke-opacity:1;marker:none"
             id="path4173_12_-5"
             inkscape:connector-curvature="0"
             d="m 1089.222,402.542 c 0.553,0 1.097,-0.395 1.097,-1.19 0,-0.795 -0.544,-1.19 -1.097,-1.19 -0.548,0 -1.092,0.395 -1.092,1.19 0,0.795 0.543,1.19 1.092,1.19 m 0,-2.905 c 0.857,0 1.663,0.636 1.663,1.715 0,1.083 -0.806,1.72 -1.663,1.72 -0.857,0 -1.659,-0.637 -1.659,-1.72 0,-1.079 0.802,-1.715 1.659,-1.715" />
          <path
             style="vector-effect:none;fill:#1b75bc;fill-opacity:1;stroke:none;stroke-width:0.2438768;stroke-linecap:square;stroke-linejoin:miter;stroke-miterlimit:10;stroke-dasharray:none;stroke-dashoffset:0;stroke-opacity:1;marker:none"
             id="path4175_12_-85"
             inkscape:connector-curvature="0"
             d="m 1092.246,403.002 v -3.296 h 0.553 v 2.766 h 1.498 v 0.53 h -2.051" />
          <path
             style="vector-effect:none;fill:#1b75bc;fill-opacity:1;stroke:none;stroke-width:0.2438768;stroke-linecap:square;stroke-linejoin:miter;stroke-miterlimit:10;stroke-dasharray:none;stroke-dashoffset:0;stroke-opacity:1;marker:none"
             id="path4177_12_-5"
             inkscape:connector-curvature="0"
             d="m 1095.578,403.002 v -3.296 h 0.553 v 2.766 h 1.498 v 0.53 h -2.051" />
          <path
             style="vector-effect:none;fill:#1b75bc;fill-opacity:1;stroke:none;stroke-width:0.2438768;stroke-linecap:square;stroke-linejoin:miter;stroke-miterlimit:10;stroke-dasharray:none;stroke-dashoffset:0;stroke-opacity:1;marker:none"
             id="path4179_12_-0"
             inkscape:connector-curvature="0"
             d="m 1099.854,401.659 h 0.995 l -0.498,-1.348 z m 1.189,0.516 h -1.382 l -0.304,0.828 h -0.585 l 1.271,-3.296 h 0.641 l 1.272,3.296 h -0.603 l -0.31,-0.828" />
          <path
             style="vector-effect:none;fill:#1b75bc;fill-opacity:1;stroke:none;stroke-width:0.2438768;stroke-linecap:square;stroke-linejoin:miter;stroke-miterlimit:10;stroke-dasharray:none;stroke-dashoffset:0;stroke-opacity:1;marker:none"
             id="path4181_12_-7"
             inkscape:connector-curvature="0"
             d="m 1104.498,402.528 c 0.332,0 0.548,-0.181 0.548,-0.474 0,-0.283 -0.189,-0.483 -0.53,-0.483 h -0.581 v 0.957 z m -0.06,-1.427 c 0.323,0 0.516,-0.186 0.516,-0.46 0,-0.279 -0.194,-0.46 -0.53,-0.46 h -0.489 v 0.921 h 0.503 z m 0.074,-1.395 c 0.627,0 0.995,0.372 0.995,0.888 0,0.349 -0.203,0.609 -0.484,0.711 0.346,0.093 0.585,0.395 0.585,0.786 0,0.53 -0.405,0.911 -1.013,0.911 h -1.207 v -3.296 h 1.124" />
          <path
             style="vector-effect:none;fill:#1b75bc;fill-opacity:1;stroke:none;stroke-width:0.2438768;stroke-linecap:square;stroke-linejoin:miter;stroke-miterlimit:10;stroke-dasharray:none;stroke-dashoffset:0;stroke-opacity:1;marker:none"
             id="path4183_12_-3"
             inkscape:connector-curvature="0"
             d="m 1108.64,402.542 c 0.553,0 1.096,-0.395 1.096,-1.19 0,-0.795 -0.544,-1.19 -1.096,-1.19 -0.548,0 -1.092,0.395 -1.092,1.19 0,0.795 0.544,1.19 1.092,1.19 m 0,-2.905 c 0.857,0 1.663,0.636 1.663,1.715 0,1.083 -0.807,1.72 -1.663,1.72 -0.857,0 -1.659,-0.637 -1.659,-1.72 0,-1.079 0.802,-1.715 1.659,-1.715" />
          <path
             style="vector-effect:none;fill:#1b75bc;fill-opacity:1;stroke:none;stroke-width:0.2438768;stroke-linecap:square;stroke-linejoin:miter;stroke-miterlimit:10;stroke-dasharray:none;stroke-dashoffset:0;stroke-opacity:1;marker:none"
             id="path4185_12_-8"
             inkscape:connector-curvature="0"
             d="m 1116.395,401.659 h 0.995 l -0.497,-1.348 z m 1.189,0.516 h -1.382 l -0.304,0.828 h -0.586 l 1.272,-3.296 h 0.64 l 1.272,3.296 h -0.603 l -0.309,-0.828" />
          <path
             style="vector-effect:none;fill:#1b75bc;fill-opacity:1;stroke:none;stroke-width:0.2438768;stroke-linecap:square;stroke-linejoin:miter;stroke-miterlimit:10;stroke-dasharray:none;stroke-dashoffset:0;stroke-opacity:1;marker:none"
             id="path4187_12_-2"
             inkscape:connector-curvature="0"
             d="m 1085.858,401.843 c -0.172,0.467 -0.59,0.699 -1.013,0.699 -0.548,0 -1.092,-0.395 -1.092,-1.19 0,-0.795 0.544,-1.19 1.092,-1.19 0.425,0 0.843,0.234 1.015,0.704 h 0.588 c -0.202,-0.781 -0.884,-1.229 -1.603,-1.229 -0.857,0 -1.659,0.637 -1.659,1.715 0,1.083 0.802,1.72 1.659,1.72 0.718,0 1.4,-0.447 1.603,-1.229 h -0.59" />
          <path
             style="vector-effect:none;fill:#1b75bc;fill-opacity:1;stroke:none;stroke-width:0.2438768;stroke-linecap:square;stroke-linejoin:miter;stroke-miterlimit:10;stroke-dasharray:none;stroke-dashoffset:0;stroke-opacity:1;marker:none"
             id="path4189_12_-30"
             inkscape:connector-curvature="0"
             d="m 1113.009,401.233 c 0.341,0 0.539,-0.2 0.539,-0.502 0,-0.307 -0.221,-0.507 -0.562,-0.507 h -0.641 v 1.009 z m -0.189,0.493 h -0.475 v 1.302 h -0.557 v -3.296 h 1.3 c 0.631,0 1.023,0.442 1.023,1 0,0.469 -0.258,0.827 -0.714,0.939 l 0.784,1.357 h -0.627 l -0.734,-1.302" />
        </g>
      </g>
    </g>
  </g>
</svg>
