<?xml version="1.0" encoding="UTF-8" standalone="no"?>
<!-- Created with Inkscape (http://www.inkscape.org/) -->

<svg
   xmlns:dc="http://purl.org/dc/elements/1.1/"
   xmlns:cc="http://creativecommons.org/ns#"
   xmlns:rdf="http://www.w3.org/1999/02/22-rdf-syntax-ns#"
   xmlns:svg="http://www.w3.org/2000/svg"
   xmlns="http://www.w3.org/2000/svg"
   xmlns:sodipodi="http://sodipodi.sourceforge.net/DTD/sodipodi-0.dtd"
   xmlns:inkscape="http://www.inkscape.org/namespaces/inkscape"
   width="8.0934563in"
   height="1.1512624in"
   viewBox="0 0 205.57379 29.242065"
   version="1.1"
   id="svg8"
   inkscape:version="0.92.1 r15371"
   sodipodi:docname="dessin2.svg">
  <defs
     id="defs2" />
  <sodipodi:namedview
     id="base"
     pagecolor="#ffffff"
     bordercolor="#666666"
     borderopacity="1.0"
     inkscape:pageopacity="0.0"
     inkscape:pageshadow="2"
     inkscape:zoom="0.89526682"
     inkscape:cx="284.39211"
     inkscape:cy="119.93865"
     inkscape:document-units="mm"
     inkscape:current-layer="g4517"
     showgrid="false"
     inkscape:window-width="1920"
     inkscape:window-height="1173"
     inkscape:window-x="0"
     inkscape:window-y="27"
     inkscape:window-maximized="1"
     units="in"
     showguides="true"
     inkscape:guide-bbox="true"
     inkscape:lockguides="false"
     fit-margin-top="0"
     fit-margin-left="0"
     fit-margin-right="0"
     fit-margin-bottom="0" />
  <metadata
     id="metadata5">
    <rdf:RDF>
      <cc:Work
         rdf:about="">
        <dc:format>image/svg+xml</dc:format>
        <dc:type
           rdf:resource="http://purl.org/dc/dcmitype/StillImage" />
        <dc:title />
      </cc:Work>
    </rdf:RDF>
  </metadata>
  <g
     inkscape:label="Calque 1"
     inkscape:groupmode="layer"
     id="layer1"
     transform="translate(-0.23687574,-17.689107)">
    <g
       id="g4517"
       transform="matrix(1.2676841,0,0,1.2676841,-10.889541,-114.82665)">
      <rect
         ry="1.3306307"
         y="104.53374"
         x="8.7769632"
         height="23.067312"
         width="162.16484"
         id="rect4485"
         style="opacity:1;fill:#1b75bc;fill-opacity:1;fill-rule:evenodd;stroke:none;stroke-width:0.09806036;stroke-linecap:butt;stroke-linejoin:miter;stroke-miterlimit:4;stroke-dasharray:none;stroke-dashoffset:0;stroke-opacity:1;paint-order:markers stroke fill" />
      <g
         inkscape:label="Camada 1"
         id="layer1-6"
         transform="matrix(0.16601132,0,0,0.16601132,-20.295166,92.563923)">
        <path
           inkscape:connector-curvature="0"
           style="fill:#bc312e;fill-opacity:1;stroke-width:1.17000771"
           d="m 205.63736,108.47743 v 50.56958 h 30.15663 c 3.17467,0 5.89669,-0.4553 8.84459,-1.81586 2.9479,-1.36057 5.66992,-3.17554 7.71077,-5.44316 2.26761,-2.26762 3.85229,-4.98787 5.21286,-8.16254 1.36057,-2.94789 2.04175,-6.35109 2.04175,-9.7525 0,-4.53523 -0.90794,-8.84283 -3.17556,-12.69777 -2.26761,-3.85494 -5.21197,-7.02872 -8.84015,-9.29633 -3.62819,-2.26762 -7.48578,-3.40142 -11.79426,-3.40142 z m 2.4935,1.58556 h 27.66313 c 2.72114,0 5.4414,0.68205 8.16253,1.81586 2.49439,1.36057 4.762,2.94613 6.80285,4.98698 1.81409,2.26762 3.40142,4.537 4.53523,7.48489 1.1338,2.94791 1.81586,5.89581 1.81586,9.07046 0,3.17467 -0.68206,6.12257 -1.81586,9.07047 -1.13381,2.9479 -2.49438,5.44404 -4.53523,7.4849 -1.81409,2.04085 -4.30846,3.85317 -6.80285,4.98698 -2.49438,1.13381 -5.21463,1.81586 -8.16253,1.81586 h -27.66313 z m 2.26761,2.94967 v 41.72499 h 25.39552 c 3.40143,0 6.57874,-0.68293 9.52664,-2.72379 2.94789,-2.04084 5.21463,-4.53169 7.02872,-7.70635 1.58734,-3.17466 2.49349,-6.57962 2.49349,-10.43456 0,-3.6282 -0.6794,-7.25549 -2.49349,-10.43015 -1.81409,-3.40143 -4.08083,-5.89669 -7.02872,-7.71078 -2.9479,-1.81409 -6.12521,-2.71936 -9.52664,-2.71936 z m 54.42276,2.04173 v 43.99262 h 2.26762 v -43.99262 z m 4.76111,0 v 43.99262 h 2.26762 v -43.99262 z m 4.76111,0 v 43.99262 h 2.26761 v -43.99262 z m 34.92215,0 v 43.99262 h 2.26762 v -41.725 h 25.85169 c 3.40143,0 6.11992,1.1338 8.61429,3.40142 2.49438,2.26761 3.63173,4.98875 3.63173,7.93665 0,3.17467 -1.13735,5.89491 -3.63173,8.16253 0.90705,0.90705 1.81674,2.26674 2.72379,3.6273 0.68029,1.58733 1.13381,2.9479 1.13381,4.53523 0,3.17467 -1.13292,5.89491 -3.62729,8.16253 -2.49439,2.26761 -5.21729,3.40142 -8.61871,3.40142 h -14.7395 v 2.26762 h 14.7395 c 2.72113,0 4.98698,-0.45176 7.25459,-1.58556 2.04086,-1.13381 3.85672,-2.4935 5.21729,-4.76112 1.36057,-2.26761 2.04174,-4.76375 2.04174,-7.48489 0,-2.9479 -0.9097,-5.44228 -2.72379,-7.93665 1.81409,-2.26762 2.72379,-5.21374 2.72379,-8.38841 0,-2.49437 -0.68117,-4.76199 -2.04174,-6.80284 -1.36057,-2.04086 -3.17555,-3.8576 -5.44317,-4.99141 -2.26761,-1.13381 -4.76022,-1.81144 -7.2546,-1.81144 z m -96.37363,0.22586 h 23.12789 c 2.94791,0 5.67259,0.90616 8.16696,2.49348 2.49438,1.58734 4.53347,3.85496 6.12079,6.80285 1.58733,2.72113 2.26762,5.89492 2.26762,9.29634 0,3.40143 -0.68029,6.35285 -2.26762,9.30076 -1.58732,2.9479 -3.62641,5.21552 -6.12079,6.80285 -2.72113,1.58732 -5.44493,2.49348 -8.39283,2.49348 h -22.90202 z m 65.98671,0 v 43.99261 h 24.71788 v -2.26762 h -22.45027 v -2.26761 h 22.45027 v -2.26762 h -22.45027 v -2.2676 h 22.45027 v -2.26762 h -22.45027 v -4.53523 h 21.0906 v -2.26762 h -21.0906 v -2.26761 h 21.0906 v -2.26762 h -21.0906 v -2.26761 h 21.0906 v -2.26762 h -21.0906 v -5.44317 h 22.45027 v -2.26761 h -22.45027 v -2.2676 h 22.45027 v -2.26762 h -22.45027 v -2.26762 h 22.45027 v -2.26761 z m -63.71909,1.81585 v 33.10631 0.22584 h 20.6344 c 2.49438,0 4.76111,-0.90705 7.02872,-2.26761 2.26762,-1.58733 3.85672,-3.62642 5.21729,-6.12079 1.36057,-2.72114 2.04173,-5.44493 2.04173,-8.39283 0,-3.17466 -0.68116,-5.89403 -2.04173,-8.38841 -1.36057,-2.49437 -2.94967,-4.53434 -5.21729,-5.89492 -2.04084,-1.58732 -4.53434,-2.26761 -7.02872,-2.26761 h -20.6344 z m 2.2676,2.03732 h 18.3668 c 2.04086,0 4.08083,0.45529 5.89491,1.81587 1.8141,1.36056 3.17556,2.94966 4.30936,5.21727 1.13381,2.26762 1.58999,4.76023 1.58999,7.2546 0,4.08171 -1.13381,7.25638 -3.40143,10.20427 -2.26761,2.94791 -5.21816,4.30936 -8.39283,4.30936 h -18.3668 z m 96.59953,0.45618 v 39.68326 h 2.26761 v -37.41565 h 21.09058 c 2.04086,0 3.8523,0.68117 5.21287,2.04174 1.58733,1.36056 2.26761,2.94701 2.26761,4.76111 0,2.04086 -0.68028,3.62642 -2.26761,4.98698 -1.58733,1.36057 -3.17201,2.04174 -5.21287,2.04174 h -7.25902 -7.70635 v 2.26761 h 7.70635 7.25902 c 2.04086,0 3.8523,0.68029 5.21287,2.26762 1.58733,1.36056 2.26761,3.17289 2.26761,4.98698 0,2.04086 -0.68028,3.85672 -2.26761,5.21729 -1.36057,1.1338 -3.17201,1.81586 -5.21287,1.81586 h -14.7395 v 2.26762 h 14.7395 c 2.72115,0 4.98788,-0.90971 7.02873,-2.72379 2.04086,-1.8141 2.94967,-4.08172 2.94967,-6.80285 0,-1.58734 -0.45706,-3.17377 -1.36411,-4.76111 -0.90705,-1.58733 -2.26585,-2.72114 -3.85317,-3.40143 1.58732,-0.68027 2.94612,-1.81408 3.85317,-3.40142 0.90705,-1.36057 1.36411,-2.94701 1.36411,-4.7611 0,-2.49437 -0.90881,-4.537 -2.94967,-6.35109 -2.04085,-1.81409 -4.30758,-2.71937 -7.02873,-2.71937 z m -94.33191,2.04176 v 24.26171 0.22586 h 16.09918 c 2.49438,0 4.76288,-1.35969 6.57697,-3.62731 1.8141,-2.49437 2.71937,-5.21727 2.71937,-8.6187 0,-3.40142 -0.90527,-6.34667 -2.71937,-8.61428 -1.81409,-2.49438 -4.08259,-3.62731 -6.57697,-3.62731 h -16.09918 z m 2.49349,2.03732 h 13.60569 c 2.04086,0 3.63084,1.13557 4.99141,2.94966 1.36057,2.04085 2.03731,4.30759 2.03731,7.02873 0,2.72113 -0.67674,4.98787 -2.03731,7.02871 -1.36057,2.04086 -2.95055,2.94967 -4.99141,2.94967 H 222.1883 Z m 96.37365,0.23029 v 35.14804 h 2.26761 v -33.11072 h 16.32948 c 0.68028,0 1.35704,0.22853 2.03732,0.68205 0.68029,0.45353 0.90792,1.13558 0.90792,1.81586 0,0.90705 -0.22763,1.58468 -0.90792,1.81144 -0.22676,0.68029 -0.9044,0.90793 -1.81145,0.90793 h -14.7395 v 2.26761 h 14.7395 c 1.36057,0 2.72026,-0.45264 3.62731,-1.35967 0.90705,-0.90705 1.58556,-2.04086 1.58556,-3.40143 0,-1.1338 -0.45175,-2.26761 -1.58556,-3.40142 -1.13381,-0.90705 -2.26674,-1.35969 -3.62731,-1.35969 z m 4.08346,16.09919 v 2.26762 h 14.7395 c 0.68029,0 1.36146,0.22763 2.04175,0.90792 0.68028,0.68029 0.9035,1.13028 0.9035,2.03731 0,0.90705 -0.22313,1.58822 -0.9035,2.04175 -0.68029,0.45352 -1.1347,0.45617 -2.04175,0.45617 h -14.7395 v 2.26762 h 14.7395 c 1.36057,0 2.72026,-0.45707 3.62731,-1.36411 0.90705,-0.90704 1.58556,-2.03997 1.58556,-3.6273 0,-1.36056 -0.45175,-2.49437 -1.58556,-3.40142 -1.13381,-0.90705 -2.26674,-1.58556 -3.62731,-1.58556 z"
           id="path6196" />
        <path
           inkscape:connector-curvature="0"
           style="fill:#ffffff;fill-opacity:1;stroke-width:1.17000771"
           d="m 385.23071,105.75805 c -3.87635,0.0423 -7.74302,0.81727 -11.33808,2.26761 -3.42248,1.38074 -6.6005,3.37454 -9.29633,5.89492 -2.6686,2.49493 -4.86295,5.50822 -6.35109,8.84458 -1.49045,3.34157 -2.26764,6.99714 -2.26762,10.65602 2e-5,3.6589 0.77725,7.31442 2.26762,10.65603 1.48806,3.33644 3.68224,6.34993 6.35109,8.84459 2.69606,2.52007 5.87441,4.5129 9.29633,5.89491 3.5947,1.45179 7.46146,2.23065 11.33808,2.26761 4.77472,0.0454 9.55871,-1.03976 13.83157,-3.17112 4.07087,-2.03058 7.66765,-5.00433 10.43014,-8.61871 l -1.81144,-1.35969 c -2.46515,3.4266 -5.76332,6.25047 -9.52663,8.16254 -3.91121,1.98722 -8.31082,2.98458 -12.69776,2.94967 -3.56299,-0.0283 -7.11707,-0.73054 -10.43015,-2.04175 -3.17842,-1.25791 -6.14494,-3.08409 -8.6187,-5.44315 -2.41368,-2.30177 -4.34623,-5.10081 -5.66904,-8.16253 -1.32619,-3.06956 -2.03732,-6.40871 -2.03732,-9.75251 0,-3.3438 0.71113,-6.67854 2.03732,-9.7481 1.32281,-3.06171 3.25536,-5.86518 5.66904,-8.16695 2.47376,-2.35907 5.44028,-4.18082 8.6187,-5.43874 3.31308,-1.31121 6.86716,-2.01339 10.43015,-2.04174 4.38694,-0.035 8.78655,0.95803 12.69776,2.94525 3.76331,1.91208 7.06148,4.74036 9.52663,8.16695 l 2.04175,-1.13381 c -2.70824,-3.91851 -6.41063,-7.14945 -10.66045,-9.30075 -4.26146,-2.15718 -9.05552,-3.22351 -13.83157,-3.17113 z m 0,4.53523 c -4.25955,0.0229 -8.50414,1.13569 -12.246,3.17113 -3.65744,1.98952 -6.84795,4.8721 -9.07047,8.39283 -2.17353,3.44317 -3.40135,7.49213 -3.40142,11.56394 -7e-5,4.07183 1.22764,8.12092 3.40142,11.56396 2.22273,3.52054 5.4135,6.40252 9.07047,8.39283 3.74156,2.03637 7.98625,3.15072 12.246,3.17112 3.99675,0.0181 7.9908,-0.92863 11.56396,-2.71937 3.43736,-1.72268 6.48378,-4.21983 8.84458,-7.25459 l -1.81587,-1.36412 c -2.05604,2.854 -4.80178,5.20747 -7.93665,6.80285 -3.21495,1.63613 -6.82289,2.47388 -10.43014,2.49792 -2.93889,0.0204 -5.88552,-0.49847 -8.61429,-1.58998 -2.60464,-1.04188 -4.99875,-2.60366 -7.03314,-4.53523 -1.97443,-1.87467 -3.61911,-4.10543 -4.76111,-6.57698 -1.17838,-2.55031 -1.81146,-5.35314 -1.81144,-8.16252 2e-5,-2.8094 0.63313,-5.61219 1.81144,-8.16254 1.14195,-2.47158 2.78652,-4.70248 4.76111,-6.57696 2.03453,-1.93137 4.42886,-3.49254 7.03314,-4.53524 2.72856,-1.09244 5.67528,-1.60869 8.61429,-1.58555 3.60637,0.0283 7.20793,0.87362 10.43014,2.49349 3.09593,1.55639 5.83195,3.82427 7.93665,6.57697 l 2.04175,-1.13381 c -2.35778,-3.23807 -5.49485,-5.90546 -9.07046,-7.71077 -3.56835,-1.80165 -7.56665,-2.74206 -11.56396,-2.71938 z m 53.28896,2.71938 c -3.40142,0 -6.80373,0.45528 -9.9784,1.81585 -3.17465,1.36058 -5.89491,2.94525 -8.16252,5.21286 -2.26762,2.04086 -4.08259,4.76288 -5.44317,7.71078 -1.36057,2.9479 -2.04173,6.12168 -2.04173,9.29634 0,3.17466 0.68116,6.34844 2.04173,9.29633 1.36058,3.17466 3.17555,5.66993 5.44317,7.71079 2.26761,2.26761 4.98787,3.8567 8.16252,5.21727 3.17467,1.13381 6.57698,1.81144 9.9784,1.81144 3.40143,0 6.80373,-0.45086 9.97839,-1.81144 3.17466,-1.36057 5.89491,-2.94966 8.16252,-5.21727 2.26762,-2.04086 4.08259,-4.76288 5.44317,-7.71079 1.36057,-2.94789 2.04174,-6.12167 2.04174,-9.29633 0,-3.17466 -0.68117,-6.34844 -2.04174,-9.29634 -1.36058,-2.9479 -3.17555,-5.44316 -5.44317,-7.71078 -2.26761,-2.26761 -4.98786,-4.07905 -8.16252,-5.21286 -3.17466,-1.13381 -6.57696,-1.81585 -9.97839,-1.81585 z m 0.22585,1.81585 c 3.17466,0 6.12257,0.67763 9.07046,1.81144 2.94791,1.13381 5.44405,2.72026 7.4849,4.76111 2.04086,2.04085 3.85318,4.31201 4.98699,7.03314 1.1338,2.72115 1.81586,5.66638 1.81586,8.61429 0,2.94789 -0.68206,5.89756 -1.81586,8.61871 -1.13381,2.72113 -2.94613,4.98786 -4.98699,7.02872 -2.04085,2.04085 -4.53699,3.6273 -7.4849,4.76111 -2.94789,1.13381 -5.8958,1.81585 -9.07046,1.81585 -3.17467,0 -6.12256,-0.68204 -9.07046,-1.81585 -2.9479,-1.13381 -5.43963,-2.72026 -7.48047,-4.76111 -2.04086,-2.04086 -3.85761,-4.30759 -4.99141,-7.02872 -1.1338,-2.72115 -1.81144,-5.67082 -1.81144,-8.61871 0,-2.94791 0.67764,-5.89314 1.81144,-8.61429 1.1338,-2.72113 2.95055,-4.99229 4.99141,-7.03314 2.04084,-2.04085 4.53257,-3.6273 7.48047,-4.76111 2.9479,-1.13381 5.89579,-1.81144 9.07046,-1.81144 z m 31.06898,0.22586 v 43.99262 h 2.26762 v -40.13945 l 24.71346,40.13945 h 2.72379 l -26.98548,-43.9926 h -2.71937 z m 5.43874,0 27.21138,43.99262 h 2.72379 l -27.21138,-43.99262 z m 5.44316,0 27.21138,43.99262 h 2.72379 l -27.21138,-43.99262 z m 5.66904,0 26.98551,43.99262 h 2.71936 v -43.99262 h -2.26761 v 40.13502 l -24.71347,-40.13502 z m 18.14091,0 v 22.21998 l 2.26762,4.08346 v -26.30344 z m 4.76112,0 v 30.15662 l 2.26761,3.63173 v -33.78835 z m 13.15396,0 v 43.99262 h 2.2676 v -43.99262 z m 4.5352,0 v 43.99262 h 2.26755 v -43.99262 z m 4.761,0 v 43.99262 h 2.26765 v -43.99262 z m 4.761,0 v 43.99262 h 2.26765 0.2302 v -14.51362 h 18.3666 v -2.26762 h -18.3666 v -2.26761 h 18.3666 v -2.26762 h -18.3666 v -2.26761 h 18.3666 v -2.26762 h -18.3666 v -6.80285 h 19.9522 v -2.26761 h -19.9522 v -2.26762 h 19.9522 v -2.26761 h -19.9522 v -2.26762 h 19.9522 v -2.26761 z m -151.02204,0.22586 c -3.46548,-0.0358 -6.93688,0.83214 -9.97839,2.49348 -2.94193,1.60697 -5.48124,3.95813 -7.25461,6.80285 -1.73057,2.77606 -2.71961,6.02503 -2.71936,9.29634 2.5e-4,3.27124 0.98966,6.52425 2.71936,9.30076 1.77265,2.8454 4.31089,5.19875 7.25461,6.80284 3.04257,1.65795 6.51349,2.5164 9.97839,2.4935 3.21895,-0.0204 6.43066,-0.80134 9.29633,-2.26762 2.74566,-1.40488 5.17171,-3.43578 7.03315,-5.89492 l -1.81586,-1.36406 c -1.70738,2.16902 -3.89177,3.96366 -6.3511,5.21728 -2.58818,1.31931 -5.48335,2.04011 -8.3884,2.04174 -3.07484,0.001 -6.1412,-0.80257 -8.84458,-2.26762 -2.56902,-1.39219 -4.82803,-3.39853 -6.34667,-5.89491 -1.52461,-2.50616 -2.26762,-5.45935 -2.26762,-8.39282 0,-2.93348 0.74301,-5.88224 2.26762,-8.38841 1.51864,-2.49638 3.77765,-4.50272 6.34667,-5.89492 2.70338,-1.46504 5.76974,-2.26934 8.84458,-2.26762 2.90505,0.001 5.80022,0.71803 8.3884,2.03733 2.45933,1.25363 4.64372,3.04825 6.3511,5.21727 l 2.04173,-1.13381 c -2.00052,-2.35595 -4.48901,-4.29798 -7.25902,-5.66902 -2.88308,-1.42701 -6.07958,-2.23428 -9.29633,-2.26762 z m 53.28895,1.81585 c -2.72113,0 -5.44139,0.45176 -8.16252,1.58557 -2.72115,1.13381 -4.98876,2.49525 -6.80285,4.30935 -1.8141,1.8141 -3.40142,3.8523 -4.53523,6.34667 -1.13381,2.49437 -1.58556,4.98964 -1.58556,7.71077 0,2.72114 0.45175,5.2164 1.58556,7.71077 1.13381,2.49438 2.72113,4.537 4.53523,6.3511 2.04086,1.8141 4.30846,3.17112 6.80285,4.30493 2.49437,1.1338 5.44139,1.58999 8.16252,1.58999 2.72115,0 5.44139,-0.45619 8.16254,-1.58999 2.72113,-1.13381 4.98875,-2.49083 6.80284,-4.30493 1.81409,-1.8141 3.40143,-3.85672 4.53523,-6.3511 1.13381,-2.49437 1.58999,-4.98963 1.58999,-7.71077 0,-2.72113 -0.45618,-5.2164 -1.58999,-7.71077 -1.1338,-2.49437 -2.72114,-4.53257 -4.53523,-6.34667 -2.04085,-1.8141 -4.30847,-3.17554 -6.80284,-4.30935 -2.49438,-1.13381 -5.44139,-1.58557 -8.16254,-1.58557 z m 0,2.26761 c 2.49438,0 4.99141,0.22586 7.25902,1.35969 2.26762,1.13381 4.30759,2.26585 5.89492,3.85318 1.81409,1.58734 3.17201,3.40142 4.07906,5.66904 1.13381,2.04085 1.58998,4.30847 1.58998,6.80284 0,2.26762 -0.68294,4.53523 -1.58998,6.80285 -1.13381,2.26761 -2.49173,4.0817 -4.07906,5.66904 -1.58733,1.58732 -3.6273,2.95055 -5.89492,3.85759 -2.26761,0.90705 -4.76464,1.35969 -7.25902,1.35969 -2.49437,0 -4.98698,-0.45264 -7.2546,-1.35969 -2.26761,-1.1338 -4.30758,-2.27027 -5.89492,-3.85759 -1.81408,-1.58734 -2.94966,-3.62819 -4.08346,-5.66904 -1.13381,-2.04086 -1.58556,-4.30847 -1.58556,-6.80285 0,-2.26761 0.67851,-4.53523 1.58556,-6.80284 0.90704,-2.26762 2.26938,-4.0817 4.08346,-5.66904 1.58734,-1.58733 3.62731,-2.94613 5.89492,-3.85318 2.26762,-0.90705 4.76023,-1.35969 7.2546,-1.35969 z m -53.51483,0.65111 c -2.01413,0.005 -4.03507,0.3607 -5.89491,1.13381 -1.77748,0.73885 -3.39027,1.8508 -4.76111,3.20211 -1.32202,1.30318 -2.42762,2.83623 -3.17554,4.53523 -0.75201,1.70832 -1.13835,3.57667 -1.13381,5.44317 0.005,1.86579 0.39451,3.73007 1.13381,5.44316 0.73632,1.70622 1.81971,3.26437 3.17554,4.53523 1.37043,1.28456 3.00974,2.26636 4.76111,2.94525 1.87593,0.72715 3.88313,1.10795 5.89491,1.13381 2.49853,0.0319 5.01018,-0.4873 7.2546,-1.58556 2.14153,-1.04792 4.02624,-2.61779 5.44317,-4.53523 l -1.81145,-1.35969 c -1.17221,1.62472 -2.74288,2.95801 -4.53523,3.85317 -1.88838,0.94312 -4.01469,1.3937 -6.12521,1.35969 -3.33106,-0.0537 -6.64225,-1.34637 -9.07046,-3.6273 -2.3585,-2.21546 -3.85318,-5.38285 -3.85318,-8.6187 0,-3.23587 1.49468,-6.39883 3.85318,-8.61429 2.42821,-2.28093 5.7394,-3.57355 9.07046,-3.6273 2.11052,-0.034 4.23683,0.41655 6.12521,1.35968 1.79235,0.89517 3.36302,2.22846 4.53523,3.85318 l 1.81145,-1.13381 c -1.50146,-1.72909 -3.36935,-3.13877 -5.44317,-4.11005 -2.26045,-1.05868 -4.75849,-1.5901 -7.2546,-1.58556 z m 53.28896,1.61656 c -2.9479,0 -5.66816,0.67674 -8.16253,2.03732 -2.49438,1.36057 -4.53435,3.40142 -5.89491,5.66904 -1.58734,2.26761 -2.26762,4.98964 -2.26762,7.71077 0,2.72113 0.90704,5.44316 2.26762,7.71077 1.58732,2.26762 3.40053,4.30847 5.89491,5.66904 2.49437,1.36057 5.21463,2.04173 8.16253,2.04173 2.94789,0 5.66815,-0.68116 8.16253,-2.04173 2.49437,-1.36057 4.53434,-3.40142 5.89492,-5.66904 1.58732,-2.26761 2.26761,-4.98964 2.26761,-7.71077 0,-2.72113 -0.90705,-5.44316 -2.26761,-7.71077 -1.36058,-2.49439 -3.40055,-4.30847 -5.89492,-5.66904 -2.49438,-1.36058 -5.21464,-2.03732 -8.16253,-2.03732 z m 0.22585,2.26761 c 3.85495,0 7.25725,1.3588 9.97839,3.85318 2.72114,2.49438 4.08348,5.66816 4.08348,9.29634 0,3.62818 -1.36234,6.80196 -4.08348,9.29633 -2.72114,2.49439 -6.12344,3.8576 -9.97839,3.8576 -3.85494,0 -7.25726,-1.36321 -9.97839,-3.8576 -2.72113,-2.49437 -4.07906,-5.66815 -4.07906,-9.29633 0,-3.62818 1.35793,-6.80196 4.07906,-9.29634 2.72113,-2.72114 6.12345,-3.85318 9.97839,-3.85318 z m 35.60421,0.90352 v 34.24452 h 2.26762 v -30.16106 z m -35.60421,1.3641 c -3.40142,0 -6.12079,1.13027 -8.38841,3.17113 -2.26761,2.04084 -3.40142,4.76286 -3.40142,7.71077 0,2.94789 1.13381,5.66992 3.40142,7.71077 2.26762,2.26762 5.21374,3.17554 8.38841,3.17554 3.40142,0 6.12521,-1.13468 8.39283,-3.17554 2.26761,-2.04085 3.40142,-4.76288 3.40142,-7.71077 0,-2.94791 -1.13381,-5.66993 -3.40142,-7.71077 -2.49438,-2.04086 -5.21817,-3.17113 -8.39283,-3.17113 z m 0,2.26761 c 2.49437,0 4.76288,0.6794 6.57697,2.4935 1.81409,1.58733 2.71937,3.85317 2.71937,6.12079 0,2.26761 -0.90528,4.31112 -2.71937,6.12521 -1.81409,1.58733 -4.0826,2.4935 -6.57697,2.4935 -2.49438,0 -4.76287,-0.6794 -6.57697,-2.4935 -1.81409,-1.58732 -2.71936,-3.8576 -2.71936,-6.12521 0,-2.26762 0.90527,-4.30671 2.71936,-6.12079 1.8141,-1.8141 3.85583,-2.72026 6.57697,-2.4935 z m 40.36531,4.30494 v 26.30787 h 2.26762 v -22.2244 z"
           id="path6202" />
        <path
           inkscape:connector-curvature="0"
           style="fill:#bc312e;fill-opacity:1;stroke-width:1.17000771"
           d="m 562.78638,108.25154 v 2.26762 h 23.57964 v -2.26762 z m 28.57104,0.22586 v 2.26762 h 19.72654 l 0.4561,-2.26762 z m 21.76824,0 -13.3798,50.56959 h 2.4934 l 13.3799,-50.56956 h -2.4935 z m 4.7611,0 -13.3797,50.56959 h 2.4978 l 13.3754,-50.56959 z m 4.99144,0 -13.37984,50.56959 h 2.4935 L 625.3717,108.4774 Z m 4.7611,0 -13.37984,50.56959 h 2.4936 l 13.37974,-50.56956 h -2.4935 z m -64.85292,4.30935 v 2.26762 h 23.57964 v -2.26762 z m 28.57104,0 v 2.26762 h 18.59274 l 0.4562,-2.26762 z m -28.57104,4.30935 v 2.03732 h 7.7063 v 39.68326 h 2.26764 v -39.68326 h 2.2676 v 39.68326 h 2.2676 v -39.68326 h 2.2676 v 39.68326 h 2.2677 v -39.68326 h 2.2676 v 39.68326 h 2.2676 V 117.0961 Z m 28.57104,0.22586 v 2.26761 h 17.45884 l 0.4562,-2.26761 z"
           id="path6210" />
        <path
           inkscape:connector-curvature="0"
           style="fill:#ffffff;fill-opacity:1;stroke-width:1.17000771"
           d="m 559.15458,168.79509 c -0.6803,0 -1.357,0.22942 -2.0373,0.45619 -0.6803,0.22676 -1.1356,0.45352 -1.8158,1.13381 -0.6804,0.68028 -1.133,1.35702 -1.3598,2.03731 -0.2268,0.90705 -0.4561,1.81586 -0.4561,2.94967 0,0.90705 0.2293,1.81232 0.4561,2.71937 0.2268,0.90705 0.6803,1.58821 1.1338,2.04173 0.4535,0.45353 1.1312,0.90705 1.8114,1.13381 0.6804,0.22676 1.5874,0.45617 2.2677,0.45617 0.6803,0 1.1355,-0.23029 1.8159,-0.23029 0.4535,0 0.9062,-0.22495 1.3597,-0.45175 l -0.6777,-1.81587 c -0.4535,0.22676 -0.6802,0.45618 -1.1337,0.45618 -0.2269,0.22676 -0.9107,0.22586 -1.3642,0.22586 -0.6803,0 -1.3579,8.8e-4 -1.8115,-0.22586 -0.4535,-0.22676 -0.9061,-0.45441 -1.3596,-0.90793 -0.4535,-0.45353 -0.6812,-0.90528 -0.908,-1.58557 -0.2267,-0.68028 -0.2258,-1.36056 -0.2258,-2.2676 0,-0.90705 0.2249,-1.58734 0.4518,-2.26762 0.2267,-0.68029 0.4544,-1.13646 0.9079,-1.58999 0.4535,-0.45352 0.9062,-0.68117 1.3597,-0.90793 0.6802,-0.22676 1.1321,-0.22586 1.5855,-0.22586 1.1338,0 1.8177,0.22942 2.4979,0.45619 l 0.4517,-1.36413 c -0.2267,0 -0.6802,-0.22586 -1.1337,-0.22586 h -1.8159 z m -88.66242,0.45619 c -1.58734,0 -2.94614,0.45175 -3.85318,1.58556 -0.90705,1.13381 -1.35969,2.72026 -1.35969,4.7611 0,0.90705 -8.9e-4,1.81321 0.22586,2.4935 0.22676,0.90705 0.45441,1.58821 0.90793,2.04173 0.45352,0.68029 0.90528,1.13293 1.58556,1.35969 0.68029,0.22676 1.36056,0.45617 2.26761,0.45617 1.58734,0 2.94614,-0.45617 3.85318,-1.58998 0.90705,-1.13381 1.36411,-2.72025 1.36411,-4.76111 0,-0.90704 -0.005,-1.81321 -0.2303,-2.49349 -0.22676,-0.90704 -0.44999,-1.58821 -0.90351,-2.04174 -0.45352,-0.68028 -1.13646,-1.13292 -1.58998,-1.35968 -0.45353,-0.22676 -1.36057,-0.45175 -2.26762,-0.45175 z m -19.27473,0.22585 v 12.246 h 1.35969 v -8.16695 l -0.22586,-1.81144 0.68205,1.58556 3.62727,5.44319 h 0.68206 l 3.40142,-5.44317 0.67764,-1.58555 -0.22586,1.81144 v 8.16694 h 1.58556 v -12.246 h -1.13381 l -3.85318,6.12079 -0.68205,1.35969 -0.67762,-1.35969 -4.08348,-6.12079 h -1.13381 z m 27.43725,0 v 12.246 h 1.36411 v -7.93664 l -0.2303,-1.81587 0.90794,1.81587 6.12521,8.16252 h 0.9035 v -12.246 h -1.35967 v 7.93665 l 0.22584,1.58556 -0.9035,-1.58556 -6.12521,-8.16253 h -0.90794 z m 10.88633,0 v 1.35969 h 4.08348 v 10.88631 h 1.58556 v -10.88631 h 3.85317 v -1.35969 z m 13.15393,0 c -0.68028,0 -1.13645,0.22585 -1.58999,0.22585 h -0.22584 v 12.24601 h 1.58556 v -5.44316 l 1.81586,0.22586 3.62729,5.21727 h 1.81587 l -3.17557,-4.76104 -0.90793,-0.68204 c 0.68029,-0.22676 1.58821,-0.45353 2.04174,-1.13381 0.68028,-0.45353 0.90793,-1.36057 0.90793,-2.26762 0,-0.68028 -0.22942,-1.13204 -0.45618,-1.58555 -0.22676,-0.45353 -0.44998,-0.90705 -0.90351,-1.13381 -0.45352,-0.45353 -0.91058,-0.4553 -1.3641,-0.68206 -0.45353,-0.22676 -0.90528,-0.22586 -1.58556,-0.22586 h -1.58557 z m 9.52222,0 v 12.47188 h 7.2546 v -1.35968 h -5.66904 v -4.30936 h 4.99141 v -1.35968 h -4.99141 v -4.08347 h 5.44316 v -1.35969 z m 13.37977,0 -4.99136,12.246 h 1.58998 l 1.35968,-3.40141 h 4.76105 l 1.3597,3.40141 h 1.58995 l -4.9913,-12.246 z m 7.25445,0 v 12.246 h 7.71065 v -1.3641 h -6.12055 v -10.8819 z m 34.4701,0 -4.9913,12.246 h 1.5899 l 1.3597,-3.40141 h 4.7611 l 1.3598,3.40141 h 1.58994 l -4.99144,-12.246 z m 7.70644,0 v 12.246 h 1.3641 v -7.93664 l -0.2302,-1.81587 0.9079,1.81587 6.1251,8.16252 h 0.9036 v -12.246 h -1.3597 v 7.93665 l 0.2258,1.58556 -0.9034,-1.58556 -6.1253,-8.16253 z m 15.8733,0 -4.987,12.246 h 1.3597 l 1.3597,-3.40141 h 4.7655 l 1.5856,3.40141 h 1.5855 l -4.9869,-12.246 z m 7.25904,0 v 12.47188 h 0.6777 0.9079 0.908 0.682 c 1.1338,0 2.265,-0.002 2.9452,-0.45617 0.6803,-0.22676 1.3624,-0.6794 1.8159,-1.35969 0.4535,-0.68028 0.907,-1.36145 1.1338,-2.04174 0.2268,-0.68029 0.4518,-1.36056 0.4518,-2.26761 0,-0.90705 -0.225,-1.81321 -0.4518,-2.4935 -0.2268,-0.90704 -0.6803,-1.58821 -1.1338,-2.04173 -0.4535,-0.68029 -1.1356,-1.13292 -1.8159,-1.35969 -0.6802,-0.22676 -1.5856,-0.45175 -2.7193,-0.45175 h -0.9079 -0.908 -0.9079 z m 14.9654,0 -4.9869,12.246 h 1.5854 l 1.3598,-3.40141 h 4.761 l 1.3641,3.40141 h 1.5856 l -4.9869,-12.246 z m -142.6335,1.1338 c 0.68028,0 1.13645,0.22495 1.58998,0.45176 0.45352,0.22677 0.90705,0.68029 1.13381,1.1338 0.22676,0.45353 0.45086,0.90971 0.67763,1.59 0.22676,0.45352 0.22585,1.13115 0.22585,1.81143 0,1.81409 -0.22313,2.95056 -0.90351,3.85761 -0.68028,0.68027 -1.58998,1.1338 -2.72379,1.1338 -0.68028,0 -1.13204,-0.22941 -1.58555,-0.45618 -0.45353,-0.22676 -0.90705,-0.68028 -1.13381,-1.13381 -0.22677,-0.45352 -0.4553,-1.13203 -0.68206,-1.58556 -0.22676,-0.45352 -0.22586,-1.13557 -0.22586,-1.81586 0,-1.81409 0.45441,-2.94613 0.90794,-3.85318 0.68028,-0.68028 1.58556,-1.13381 2.71937,-1.13381 z m 32.20278,0 h 0.45176 0.45175 0.45618 0.45175 c 0.90705,0 1.5891,0.22495 1.81586,0.45176 0.45352,0.45353 0.67764,0.9097 0.67764,1.58999 0,0.90704 -0.44999,1.35791 -0.90352,1.81143 -0.45352,0.45353 -1.13469,0.68205 -2.04173,0.68205 h -1.35969 z m 97.05092,0 h 0.4561 0.4519 0.4517 0.4562 c 0.907,0 1.5872,0.22586 2.2676,0.22586 0.6802,0.22676 1.1329,0.68029 1.3597,1.13381 0.2267,0.45352 0.4552,0.90528 0.682,1.58556 0.2268,0.68029 0.2259,1.36233 0.2259,1.81586 0,0.68028 8e-4,1.13558 -0.2259,1.81587 0,0.68027 -0.2286,1.13203 -0.682,1.58556 -0.2268,0.45351 -0.6795,0.90704 -1.3597,1.1338 -0.6804,0.22676 -1.3606,0.45176 -2.2676,0.45176 h -0.4562 -0.4517 -0.4519 -0.4561 v -9.7481 z m -73.69713,0.90794 0.4562,1.81143 1.35965,3.62731 h -3.85755 l 1.5899,-3.62731 z m 41.95045,0 0.4562,1.81143 1.3597,3.62731 h -3.8577 l 1.5901,-3.62731 z m 23.13234,0 0.4518,1.81143 1.3597,3.62731 h -3.8532 l 1.5856,-3.62731 z m 22.44584,0 0.4562,1.81143 1.3597,3.62731 h -3.8532 l 1.5856,-3.62731 z m -66.89463,3.85318 c -0.2267,0 -0.4509,-8.9e-4 -0.6777,0.22584 -0.2267,0.22677 -0.2258,0.4553 -0.2258,0.68206 0,0.45353 0.2258,0.67763 0.2258,0.67763 0,0.22676 0.451,0.23031 0.6777,0.23031 0.4535,0 0.6812,-0.005 0.90785,-0.23031 0.2268,-0.22676 0.2259,-0.45087 0.2259,-0.67763 0,-0.22676 9e-4,-0.45529 -0.2259,-0.68206 -0.22665,-0.22676 -0.68105,-0.22584 -0.90785,-0.22584 z"
           id="path6216" />
      </g>
      <g
         aria-label="WELCOME INFORMATION"
         transform="matrix(0.23497414,0,0,0.23497414,15.823738,25.992874)"
         style="font-style:normal;font-variant:normal;font-weight:normal;font-stretch:normal;font-size:24px;line-height:25px;font-family:'PT Sans Caption';-inkscape-font-specification:'PT Sans Caption';text-align:end;letter-spacing:0px;word-spacing:0px;text-anchor:end;fill:#ffffff;fill-opacity:1;stroke:none;stroke-width:1px;stroke-linecap:butt;stroke-linejoin:miter;stroke-opacity:1"
         id="flowRoot4505">
        <g
           aria-label="AIRPORT ARRIVAL"
           transform="matrix(1.4155376,0,0,1.4155376,-452.14023,327.65353)"
           style="font-style:normal;font-variant:normal;font-weight:normal;font-stretch:normal;font-size:24px;line-height:25px;font-family:'Droid Sans Mono';-inkscape-font-specification:'Droid Sans Mono';letter-spacing:0px;word-spacing:0px;fill:#ffffff;fill-opacity:1;stroke:none;stroke-width:1px;stroke-linecap:butt;stroke-linejoin:miter;stroke-opacity:1"
           id="flowRoot4518">
          <path
             d="m 593.43239,44.282984 h -6.192 l -1.68,4.656 h -1.968 l 6.36,-17.064 h 0.912 l 6.384,17.064 h -2.088 z m -5.544,-1.728 h 4.944 l -1.872,-5.112 -0.6,-2.544 h -0.024 l -0.6,2.592 z"
             style="font-style:normal;font-variant:normal;font-weight:normal;font-stretch:normal;font-family:'PT Sans';-inkscape-font-specification:'PT Sans'"
             id="path4549"
             inkscape:connector-curvature="0" />
          <path
             d="m 599.95889,32.138984 h 1.992 v 16.8 h -1.992 z"
             style="font-style:normal;font-variant:normal;font-weight:normal;font-stretch:normal;font-family:'PT Sans';-inkscape-font-specification:'PT Sans'"
             id="path4551"
             inkscape:connector-curvature="0" />
          <path
             d="m 606.48727,32.306984 q 0.912,-0.168 2.088,-0.264 1.2,-0.096 2.184,-0.096 1.104,0 2.088,0.24 1.008,0.24 1.752,0.792 0.768,0.552 1.224,1.44 0.456,0.888 0.456,2.16 0,1.968 -1.08,3.192 -1.08,1.224 -2.736,1.632 l 1.152,0.888 4.176,6.648 h -2.328 l -4.632,-7.248 -2.352,-0.36 v 7.608 h -1.992 z m 4.32,1.368 q -0.312,0 -0.648,0 -0.336,0 -0.648,0.024 -0.312,0.024 -0.6,0.048 -0.264,0.024 -0.432,0.072 v 6.192 h 1.872 q 1.656,0 2.736,-0.816 1.08,-0.816 1.08,-2.544 0,-1.296 -0.888,-2.136 -0.888,-0.84 -2.472,-0.84 z"
             style="font-style:normal;font-variant:normal;font-weight:normal;font-stretch:normal;font-family:'PT Sans';-inkscape-font-specification:'PT Sans'"
             id="path4553"
             inkscape:connector-curvature="0" />
          <path
             d="m 620.78414,32.306984 q 0.912,-0.216 1.968,-0.288 1.056,-0.072 2.088,-0.072 1.104,0 2.232,0.216 1.152,0.216 2.088,0.792 0.936,0.576 1.512,1.584 0.6,1.008 0.6,2.568 0,1.536 -0.552,2.592 -0.552,1.056 -1.464,1.728 -0.912,0.648 -2.088,0.936 -1.176,0.288 -2.424,0.288 -0.12,0 -0.408,0 -0.264,0 -0.576,0 -0.288,-0.024 -0.576,-0.048 -0.288,-0.024 -0.408,-0.048 v 6.384 h -1.992 z m 4.104,1.368 q -0.624,0 -1.2,0.024 -0.576,0.024 -0.912,0.12 v 6.96 q 0.12,0.048 0.384,0.072 0.264,0 0.552,0.024 0.288,0 0.552,0 0.264,0 0.384,0 0.816,0 1.608,-0.144 0.816,-0.168 1.464,-0.576 0.648,-0.408 1.032,-1.152 0.408,-0.744 0.408,-1.896 0,-0.984 -0.384,-1.632 -0.36,-0.672 -0.984,-1.056 -0.6,-0.408 -1.368,-0.576 -0.768,-0.168 -1.536,-0.168 z"
             style="font-style:normal;font-variant:normal;font-weight:normal;font-stretch:normal;font-family:'PT Sans';-inkscape-font-specification:'PT Sans'"
             id="path4555"
             inkscape:connector-curvature="0" />
          <path
             d="m 633.07252,40.538984 q 0,-4.2 1.776,-6.432 1.776,-2.256 5.064,-2.256 1.776,0 3.072,0.624 1.296,0.624 2.136,1.776 0.864,1.128 1.272,2.736 0.408,1.584 0.408,3.552 0,4.2 -1.8,6.456 -1.776,2.232 -5.088,2.232 -1.752,0 -3.048,-0.624 -1.272,-0.624 -2.136,-1.752 -0.84,-1.152 -1.248,-2.736 -0.408,-1.608 -0.408,-3.576 z m 2.112,0 q 0,1.392 0.264,2.64 0.288,1.248 0.864,2.208 0.576,0.936 1.464,1.512 0.912,0.552 2.136,0.552 2.232,0 3.504,-1.68 1.272,-1.704 1.272,-5.232 0,-1.368 -0.288,-2.616 -0.264,-1.272 -0.864,-2.208 -0.576,-0.96 -1.488,-1.512 -0.888,-0.576 -2.136,-0.576 -2.208,0 -3.48,1.704 -1.248,1.68 -1.248,5.208 z"
             style="font-style:normal;font-variant:normal;font-weight:normal;font-stretch:normal;font-family:'PT Sans';-inkscape-font-specification:'PT Sans'"
             id="path4557"
             inkscape:connector-curvature="0" />
          <path
             d="m 650.17477,32.306984 q 0.912,-0.168 2.088,-0.264 1.2,-0.096 2.184,-0.096 1.104,0 2.088,0.24 1.008,0.24 1.752,0.792 0.768,0.552 1.224,1.44 0.456,0.888 0.456,2.16 0,1.968 -1.08,3.192 -1.08,1.224 -2.736,1.632 l 1.152,0.888 4.176,6.648 h -2.328 l -4.632,-7.248 -2.352,-0.36 v 7.608 h -1.992 z m 4.32,1.368 q -0.312,0 -0.648,0 -0.336,0 -0.648,0.024 -0.312,0.024 -0.6,0.048 -0.264,0.024 -0.432,0.072 v 6.192 h 1.872 q 1.656,0 2.736,-0.816 1.08,-0.816 1.08,-2.544 0,-1.296 -0.888,-2.136 -0.888,-0.84 -2.472,-0.84 z"
             style="font-style:normal;font-variant:normal;font-weight:normal;font-stretch:normal;font-family:'PT Sans';-inkscape-font-specification:'PT Sans'"
             id="path4559"
             inkscape:connector-curvature="0" />
          <path
             d="m 673.86652,33.914984 h -5.232 v 15.024 h -1.992 v -15.024 h -5.232 v -1.776 h 12.456 z"
             style="font-style:normal;font-variant:normal;font-weight:normal;font-stretch:normal;font-family:'PT Sans';-inkscape-font-specification:'PT Sans'"
             id="path4561"
             inkscape:connector-curvature="0" />
          <path
             d="m 689.05739,44.282984 h -6.192 l -1.68,4.656 h -1.968 l 6.36,-17.064 h 0.912 l 6.384,17.064 h -2.088 z m -5.544,-1.728 h 4.944 l -1.872,-5.112 -0.6,-2.544 h -0.024 l -0.6,2.592 z"
             style="font-style:normal;font-variant:normal;font-weight:normal;font-stretch:normal;font-family:'PT Sans';-inkscape-font-specification:'PT Sans'"
             id="path4563"
             inkscape:connector-curvature="0" />
          <path
             d="m 695.12789,32.306984 q 0.912,-0.168 2.088,-0.264 1.2,-0.096 2.184,-0.096 1.104,0 2.088,0.24 1.008,0.24 1.752,0.792 0.768,0.552 1.224,1.44 0.456,0.888 0.456,2.16 0,1.968 -1.08,3.192 -1.08,1.224 -2.736,1.632 l 1.152,0.888 4.176,6.648 h -2.328 l -4.632,-7.248 -2.352,-0.36 v 7.608 h -1.992 z m 4.32,1.368 q -0.312,0 -0.648,0 -0.336,0 -0.648,0.024 -0.312,0.024 -0.6,0.048 -0.264,0.024 -0.432,0.072 v 6.192 h 1.872 q 1.656,0 2.736,-0.816 1.08,-0.816 1.08,-2.544 0,-1.296 -0.888,-2.136 -0.888,-0.84 -2.472,-0.84 z"
             style="font-style:normal;font-variant:normal;font-weight:normal;font-stretch:normal;font-family:'PT Sans';-inkscape-font-specification:'PT Sans'"
             id="path4565"
             inkscape:connector-curvature="0" />
          <path
             d="m 709.42477,32.306984 q 0.912,-0.168 2.088,-0.264 1.2,-0.096 2.184,-0.096 1.104,0 2.088,0.24 1.008,0.24 1.752,0.792 0.768,0.552 1.224,1.44 0.456,0.888 0.456,2.16 0,1.968 -1.08,3.192 -1.08,1.224 -2.736,1.632 l 1.152,0.888 4.176,6.648 h -2.328 l -4.632,-7.248 -2.352,-0.36 v 7.608 h -1.992 z m 4.32,1.368 q -0.312,0 -0.648,0 -0.336,0 -0.648,0.024 -0.312,0.024 -0.6,0.048 -0.264,0.024 -0.432,0.072 v 6.192 h 1.872 q 1.656,0 2.736,-0.816 1.08,-0.816 1.08,-2.544 0,-1.296 -0.888,-2.136 -0.888,-0.84 -2.472,-0.84 z"
             style="font-style:normal;font-variant:normal;font-weight:normal;font-stretch:normal;font-family:'PT Sans';-inkscape-font-specification:'PT Sans'"
             id="path4567"
             inkscape:connector-curvature="0" />
          <path
             d="m 724.17764,32.138984 h 1.992 v 16.8 h -1.992 z"
             style="font-style:normal;font-variant:normal;font-weight:normal;font-stretch:normal;font-family:'PT Sans';-inkscape-font-specification:'PT Sans'"
             id="path4569"
             inkscape:connector-curvature="0" />
          <path
             d="m 735.07402,43.682984 0.576,2.544 h 0.024 l 0.624,-2.592 4.056,-11.496 h 1.992 l -6.36,17.064 h -0.888 l -6.48,-17.064 h 2.184 z"
             style="font-style:normal;font-variant:normal;font-weight:normal;font-stretch:normal;font-family:'PT Sans';-inkscape-font-specification:'PT Sans'"
             id="path4571"
             inkscape:connector-curvature="0" />
          <path
             d="m 751.26052,44.282984 h -6.192 l -1.68,4.656 h -1.968 l 6.36,-17.064 h 0.912 l 6.384,17.064 h -2.088 z m -5.544,-1.728 h 4.944 l -1.872,-5.112 -0.6,-2.544 h -0.024 l -0.6,2.592 z"
             style="font-style:normal;font-variant:normal;font-weight:normal;font-stretch:normal;font-family:'PT Sans';-inkscape-font-specification:'PT Sans'"
             id="path4573"
             inkscape:connector-curvature="0" />
          <path
             d="m 767.26702,48.938984 h -9.936 v -16.8 h 1.992 v 15.024 h 7.944 z"
             style="font-style:normal;font-variant:normal;font-weight:normal;font-stretch:normal;font-family:'PT Sans';-inkscape-font-specification:'PT Sans'"
             id="path4575"
             inkscape:connector-curvature="0" />
        </g>
      </g>
      <g
         transform="matrix(0.03261472,0,0,0.03261472,116.35833,148.47289)"
         id="g3127">
        <path
           d="m -563.02592,-1061.8516 c 0.0225,-12.7375 19.22178,-12.7375 19.21055,0.3589 v 53.4547 l 74.83423,44.98065 v 19.74999 l -74.4746,-24.51142 v 39.94955 l 17.2363,13.46761 v 15.61794 l -26.57185,-8.25664 -26.57184,8.25664 v -15.61794 l 17.05648,-13.46761 v -39.94955 l -74.48585,24.51142 v -19.74999 l 73.76658,-44.98065 v -53.8106 z"
           style="fill:#ffffff;stroke-width:0.37462071"
           id="path3131"
           inkscape:connector-curvature="0" />
      </g>
    </g>
  </g>
</svg>
