<?xml version="1.0" encoding="UTF-8" standalone="no"?>
<!-- Created with Inkscape (http://www.inkscape.org/) -->

<svg
   xmlns:dc="http://purl.org/dc/elements/1.1/"
   xmlns:cc="http://creativecommons.org/ns#"
   xmlns:rdf="http://www.w3.org/1999/02/22-rdf-syntax-ns#"
   xmlns:svg="http://www.w3.org/2000/svg"
   xmlns="http://www.w3.org/2000/svg"
   xmlns:sodipodi="http://sodipodi.sourceforge.net/DTD/sodipodi-0.dtd"
   xmlns:inkscape="http://www.inkscape.org/namespaces/inkscape"
   width="17in"
   height="11in"
   viewBox="0 0 431.8 279.4"
   version="1.1"
   id="svg44"
   inkscape:version="0.92.1 r15371"
   sodipodi:docname="dblock-garden.svg">
  <defs
     id="defs38" />
  <sodipodi:namedview
     id="base"
     pagecolor="#ffffff"
     bordercolor="#666666"
     borderopacity="1.0"
     inkscape:pageopacity="0.0"
     inkscape:pageshadow="2"
     inkscape:zoom="0.38640687"
     inkscape:cx="761.75831"
     inkscape:cy="432.4363"
     inkscape:document-units="in"
     inkscape:current-layer="layer1"
     showgrid="false"
     units="in"
     inkscape:window-width="1280"
     inkscape:window-height="773"
     inkscape:window-x="0"
     inkscape:window-y="27"
     inkscape:window-maximized="1">
    <inkscape:grid
       type="xygrid"
       id="grid578" />
  </sodipodi:namedview>
  <metadata
     id="metadata41">
    <rdf:RDF>
      <cc:Work
         rdf:about="">
        <dc:format>image/svg+xml</dc:format>
        <dc:type
           rdf:resource="http://purl.org/dc/dcmitype/StillImage" />
        <dc:title></dc:title>
      </cc:Work>
    </rdf:RDF>
  </metadata>
  <g
     inkscape:label="Calque 1"
     inkscape:groupmode="layer"
     id="layer1"
     transform="translate(0,-17.6)">
    <text
       id="text1418-9"
       y="204.06102"
       x="42.198677"
       style="font-style:normal;font-variant:normal;font-weight:normal;font-stretch:normal;font-size:31.68049622px;line-height:1.25;font-family:Monoton;-inkscape-font-specification:'Monoton, Normal';font-variant-ligatures:normal;font-variant-caps:normal;font-variant-numeric:normal;font-feature-settings:normal;text-align:start;letter-spacing:0px;word-spacing:0px;writing-mode:lr-tb;text-anchor:start;opacity:1;vector-effect:none;fill:#1b75bc;fill-opacity:1;stroke:none;stroke-width:0.18996397;stroke-linecap:butt;stroke-linejoin:miter;stroke-miterlimit:4;stroke-dasharray:none;stroke-dashoffset:0;stroke-opacity:1;marker:none"
       xml:space="preserve"><tspan
         style="font-style:normal;font-variant:normal;font-weight:normal;font-stretch:normal;font-size:31.68049622px;font-family:Monoton;-inkscape-font-specification:'Monoton, Normal';font-variant-ligatures:normal;font-variant-caps:normal;font-variant-numeric:normal;font-feature-settings:normal;text-align:start;writing-mode:lr-tb;text-anchor:start;vector-effect:none;fill:#1b75bc;fill-opacity:1;stroke:none;stroke-width:0.18996397;stroke-linecap:butt;stroke-linejoin:miter;stroke-miterlimit:4;stroke-dasharray:none;stroke-dashoffset:0;stroke-opacity:1;marker:none"
         y="204.06102"
         x="42.198677"
         sodipodi:role="line"
         id="tspan6797">INTERIOR   GARDEN</tspan></text>
    <g
       id="g94"
       transform="matrix(-1,0,0,1,434.82346,-15.875004)">
      <path
         inkscape:connector-curvature="0"
         style="fill:#ba302e;fill-opacity:1;fill-rule:nonzero;stroke:none;stroke-width:0.30465409"
         d="m 300.04766,64.133729 v 31.536463 l 1.95528,1.95169 V 64.68115 c -0.60575,-0.349875 -1.27811,-0.531956 -1.95528,-0.547421 z m -1.95287,0.44746 c -0.37605,0.192786 -0.73307,0.445083 -1.05079,0.762822 l -0.8997,0.900877 v 25.519544 l 1.95049,1.95169 z m 5.86101,1.846959 v 33.146614 l 1.9517,1.952888 V 68.381032 Z m -9.76676,1.770804 -1.95289,1.95408 v 17.70445 l 1.95289,1.95407 z m 13.67253,2.13497 v 33.146598 l 1.95289,1.95287 V 72.287992 Z m -17.57591,1.7708 -1.95407,1.95407 v 9.89293 l 1.95407,1.95287 z m 21.47929,2.13496 v 33.145408 l 1.95409,1.95407 V 76.192562 Z m -25.38507,1.7708 -0.0774,0.0821 c -1.61965,1.6161 -1.61965,4.20566 0,5.82532 l 0.0774,0.0821 z m 29.29323,2.13495 v 33.146618 l 1.95049,1.95168 V 80.098322 Z m 3.90456,3.90576 V 115.1978 l 1.09723,1.09605 -1.09723,1.09604 v 33.14781 l 1.95287,-1.95406 V 84.005272 Z m 3.90693,3.90695 v 60.672598 l 1.9505,-1.95169 V 87.911032 Z m 3.90458,3.90578 v 52.861058 l 1.95407,-1.95289 V 91.816792 Z m 3.90456,3.90575 v 45.049558 l 1.95528,-1.95289 V 95.722542 Z m 3.90814,3.90577 v 37.238018 l 1.9541,-1.95407 V 99.629502 Z m 3.90459,3.906938 v 29.42532 l 1.95404,-1.9517 v -25.52193 z m 3.90813,3.90457 v 21.61497 l 1.95049,-1.95287 v -17.70921 z m 3.90453,3.90696 v 13.80107 l 1.9529,-1.95169 v -9.89769 z m 3.90696,3.90576 v 5.98954 l 0.0774,-0.0773 c 1.62086,-1.61608 1.62086,-4.20684 0,-5.82651 z m -33.20249,6.0431 -1.95049,1.95289 v 33.14661 l 1.95049,-1.95289 z m -3.90456,3.90576 -1.95409,1.95407 v 33.1466 l 1.95409,-1.95286 z m -3.90458,3.90576 -1.95289,1.95408 v 33.14542 l 1.95289,-1.95288 z m -3.90696,3.90696 -1.9517,1.95169 v 33.14781 l 1.9517,-1.95288 z m -3.90456,3.90576 -1.95528,1.95289 v 31.53526 c 0.67717,-0.0185 1.34953,-0.19874 1.95528,-0.54861 z m -3.90815,3.90695 -1.95049,1.9505 v 25.51955 l 0.8997,0.89968 c 0.31772,0.31895 0.67474,0.57359 1.05079,0.7652 z m -3.90575,3.90339 -1.95289,1.95406 v 17.70564 l 1.95289,1.95289 z m -3.90338,3.90693 -1.95407,1.95407 v 9.89176 l 1.95407,1.95407 z m -3.90578,3.90577 -0.0774,0.0773 c -1.61965,1.61609 -1.61965,4.20446 0,5.8265 l 0.0774,0.0774 z m 0,0"
         id="path6807" />
      <path
         inkscape:connector-curvature="0"
         style="fill:#ba302e;fill-opacity:1;fill-rule:nonzero;stroke:none;stroke-width:0.30465409"
         d="m 200.36826,64.133736 v 31.536456 l 1.95406,1.95169 V 64.681153 c -0.60573,-0.349874 -1.27694,-0.531952 -1.95406,-0.547417 z m -1.95407,0.447457 c -0.37607,0.192787 -0.73307,0.445083 -1.05083,0.762824 l -0.89967,0.900877 v 25.519538 l 1.9505,1.95169 z m 5.86102,1.846962 v 33.146607 l 1.95168,1.952888 V 68.381032 Z m -9.7656,1.770797 -1.95408,1.95408 v 17.70445 l 1.95408,1.95407 z m 13.67136,2.13497 v 33.146598 l 1.95405,1.95287 V 72.287992 Z m -17.57711,1.7708 -1.95289,1.95407 v 9.89293 l 1.95289,1.95287 z m 21.48168,2.13496 v 33.145408 l 1.95407,1.95407 V 76.192562 Z m -25.38626,1.7708 -0.0786,0.0821 c -1.61965,1.6161 -1.61965,4.20566 0,5.82532 l 0.0786,0.0821 z m 29.29438,2.13495 v 33.146618 l 1.95052,1.95168 V 80.098322 Z m 3.9046,3.90576 V 115.1978 l 1.09723,1.09605 -1.09723,1.09604 v 33.14781 l 1.95407,-1.95406 V 84.005272 Z m 3.90696,3.90695 v 60.672598 l 1.95167,-1.95169 V 87.911032 Z m 3.90574,3.90578 v 52.861058 l 1.95287,-1.95289 V 91.816792 Z m 3.90459,3.90575 v 45.049558 l 1.95407,-1.95289 V 95.722542 Z m 3.90693,3.90577 v 37.238018 l 1.95407,-1.95407 V 99.629502 Z m 3.90455,3.906938 v 29.42532 l 1.95407,-1.9517 v -25.52193 z m 3.90818,3.90457 v 21.61497 l 1.95049,-1.95287 v -17.70921 z m 3.90454,3.90696 v 13.80107 l 1.95407,-1.95169 v -9.89769 z m 3.90696,3.90576 v 5.98954 l 0.0774,-0.0773 c 1.62085,-1.61608 1.62085,-4.20684 0,-5.82651 z m -33.20253,6.0431 -1.95052,1.95289 v 33.14661 l 1.95052,-1.95289 z m -3.90457,3.90576 -1.95407,1.95407 v 33.1466 l 1.95407,-1.95286 z m -3.90459,3.90576 -1.95405,1.95408 v 33.14542 l 1.95405,-1.95288 z m -3.90813,3.90696 -1.95168,1.95169 v 33.14781 l 1.95168,-1.95288 z m -3.90457,3.90576 -1.95406,1.95289 v 31.53526 c 0.67712,-0.0185 1.34833,-0.19874 1.95406,-0.54861 z m -3.90813,3.90695 -1.9505,1.9505 v 25.51955 l 0.89967,0.89968 c 0.31776,0.31895 0.67476,0.57359 1.05083,0.7652 z m -3.90458,3.90339 -1.95408,1.95406 v 17.70564 l 1.95408,1.95289 z m -3.90575,3.90693 -1.95289,1.95407 v 9.89176 l 1.95289,1.95407 z m -3.90458,3.90577 -0.0786,0.0773 c -1.61965,1.61609 -1.61965,4.20446 0,5.8265 l 0.0786,0.0774 z m 0,0"
         id="path6809" />
      <path
         inkscape:connector-curvature="0"
         style="fill:#ba302e;fill-opacity:1;fill-rule:nonzero;stroke:none;stroke-width:0.30465409"
         d="m 100.69003,64.133739 v 31.536453 l 1.95404,1.95169 V 64.681155 c -0.60572,-0.349873 -1.27811,-0.531954 -1.95404,-0.547416 z m -1.954111,0.447456 c -0.376055,0.192787 -0.733048,0.445082 -1.05078,0.762824 l -0.89971,0.900876 v 25.519537 l 1.95049,1.95171 z m 5.861041,1.846962 v 33.146605 l 1.95166,1.952888 V 68.381032 Z m -9.765601,1.770805 -1.954071,1.95408 v 17.70444 l 1.954071,1.95407 z m 13.671331,2.13496 v 33.146618 l 1.95412,1.95287 V 72.287992 Z m -17.577098,1.77081 -1.952913,1.95407 v 9.89292 l 1.952913,1.95289 z m 21.481698,2.13495 v 33.145428 l 1.95407,1.95407 V 76.192562 Z m -25.386258,1.7708 -0.0785,0.0821 c -1.61965,1.6161 -1.61965,4.20566 0,5.82532 l 0.0785,0.0821 z m 29.294368,2.13495 v 33.146618 l 1.95052,1.95168 V 80.098322 Z m 3.90455,3.90576 v 33.146628 l 1.09729,1.09603 -1.09729,1.09604 v 33.14781 l 1.95413,-1.95406 V 84.005272 Z m 3.90699,3.90695 v 60.672618 l 1.95051,-1.9517 V 87.911032 Z m 3.90577,3.90578 v 52.861058 l 1.95287,-1.95289 V 91.816792 Z m 3.90337,3.90576 v 45.049548 l 1.95527,-1.95287 V 95.722542 Z m 3.90815,3.90576 v 37.238018 l 1.95408,-1.95407 V 99.629502 Z m 3.90457,3.906938 v 29.42532 l 1.95405,-1.9517 v -25.52193 z m 3.90695,3.90457 v 21.61497 l 1.9517,-1.95287 v -17.70921 z m 3.90577,3.90696 v 13.80107 l 1.95287,-1.95169 v -9.89769 z m 3.90696,3.90576 v 5.98954 l 0.0774,-0.0773 c 1.62088,-1.61608 1.62088,-4.20684 0,-5.82651 z m -33.20256,6.0431 -1.95052,1.95289 v 33.14661 l 1.95052,-1.95289 z m -3.90456,3.90576 -1.95407,1.95407 v 33.1466 l 1.95407,-1.95286 z m -3.90455,3.90576 -1.95412,1.95408 v 33.14542 l 1.95412,-1.95288 z m -3.90819,3.90696 -1.95166,1.95169 v 33.14781 l 1.95166,-1.95288 z m -3.90456,3.90576 -1.95403,1.95289 v 31.53526 c 0.67593,-0.0185 1.34832,-0.19874 1.95403,-0.54861 z m -3.908141,3.90695 -1.95049,1.9505 v 25.51955 l 0.89971,0.89968 c 0.317732,0.31895 0.674725,0.57359 1.05078,0.7652 z m -3.90456,3.90339 -1.954071,1.95406 v 17.70564 l 1.954071,1.95289 z m -3.905767,3.90693 -1.952913,1.95407 v 9.89176 l 1.952913,1.95407 z m -3.90456,3.90577 -0.0785,0.0773 c -1.61965,1.61609 -1.61965,4.20446 0,5.8265 l 0.0785,0.0774 z m 0,0"
         id="path6811" />
    </g>
    <text
       xml:space="preserve"
       style="font-style:normal;font-variant:normal;font-weight:normal;font-stretch:normal;font-size:22.86512947px;line-height:1.25;font-family:Monoton;-inkscape-font-specification:'Monoton, Normal';font-variant-ligatures:normal;font-variant-caps:normal;font-variant-numeric:normal;font-feature-settings:normal;text-align:start;letter-spacing:0px;word-spacing:0px;writing-mode:lr-tb;text-anchor:start;opacity:1;vector-effect:none;fill:#008000;fill-opacity:1;stroke:none;stroke-width:0.13710488;stroke-linecap:butt;stroke-linejoin:miter;stroke-miterlimit:4;stroke-dasharray:none;stroke-dashoffset:0;stroke-opacity:1;marker:none"
       x="100.20669"
       y="234.61983"
       id="text83"><tspan
         sodipodi:role="line"
         x="100.20669"
         y="234.61983"
         style="font-style:normal;font-variant:normal;font-weight:normal;font-stretch:normal;font-size:22.86512947px;font-family:Monoton;-inkscape-font-specification:'Monoton, Normal';font-variant-ligatures:normal;font-variant-caps:normal;font-variant-numeric:normal;font-feature-settings:normal;text-align:start;writing-mode:lr-tb;text-anchor:start;vector-effect:none;fill:#008000;fill-opacity:1;stroke:none;stroke-width:0.13710488;stroke-linecap:butt;stroke-linejoin:miter;stroke-miterlimit:4;stroke-dasharray:none;stroke-dashoffset:0;stroke-opacity:1;marker:none"
         id="tspan87">GREEN  HACKLAB</tspan></text>
    <text
       id="text180"
       y="278.07904"
       x="18.952251"
       style="font-style:normal;font-variant:normal;font-weight:normal;font-stretch:normal;font-size:19.21705055px;line-height:1.25;font-family:Monoton;-inkscape-font-specification:'Monoton, Normal';font-variant-ligatures:normal;font-variant-caps:normal;font-variant-numeric:normal;font-feature-settings:normal;text-align:start;letter-spacing:0px;word-spacing:0px;writing-mode:lr-tb;text-anchor:start;opacity:1;vector-effect:none;fill:#ba302e;fill-opacity:1;stroke:none;stroke-width:0.11523011;stroke-linecap:butt;stroke-linejoin:miter;stroke-miterlimit:4;stroke-dasharray:none;stroke-dashoffset:0;stroke-opacity:1;marker:none"
       xml:space="preserve"><tspan
         id="tspan178"
         style="font-style:normal;font-variant:normal;font-weight:normal;font-stretch:normal;font-size:19.21705055px;font-family:Monoton;-inkscape-font-specification:'Monoton, Normal';font-variant-ligatures:normal;font-variant-caps:normal;font-variant-numeric:normal;font-feature-settings:normal;text-align:start;writing-mode:lr-tb;text-anchor:start;vector-effect:none;fill:#ba302e;fill-opacity:1;stroke:none;stroke-width:0.11523011;stroke-linecap:butt;stroke-linejoin:miter;stroke-miterlimit:4;stroke-dasharray:none;stroke-dashoffset:0;stroke-opacity:1;marker:none"
         y="278.07904"
         x="18.952251"
         sodipodi:role="line">COFFEE / TEA</tspan></text>
    <text
       xml:space="preserve"
       style="font-style:normal;font-variant:normal;font-weight:normal;font-stretch:normal;font-size:19.27177238px;line-height:1.25;font-family:Monoton;-inkscape-font-specification:'Monoton, Normal';font-variant-ligatures:normal;font-variant-caps:normal;font-variant-numeric:normal;font-feature-settings:normal;text-align:start;letter-spacing:0px;word-spacing:0px;writing-mode:lr-tb;text-anchor:start;opacity:1;vector-effect:none;fill:#ba302e;fill-opacity:1;stroke:none;stroke-width:0.11555824;stroke-linecap:butt;stroke-linejoin:miter;stroke-miterlimit:4;stroke-dasharray:none;stroke-dashoffset:0;stroke-opacity:1;marker:none"
       x="215.18777"
       y="277.85248"
       id="text184"><tspan
         sodipodi:role="line"
         x="215.18777"
         y="277.85248"
         style="font-style:normal;font-variant:normal;font-weight:normal;font-stretch:normal;font-size:19.27177238px;font-family:Monoton;-inkscape-font-specification:'Monoton, Normal';font-variant-ligatures:normal;font-variant-caps:normal;font-variant-numeric:normal;font-feature-settings:normal;text-align:start;writing-mode:lr-tb;text-anchor:start;vector-effect:none;fill:#ba302e;fill-opacity:1;stroke:none;stroke-width:0.11555824;stroke-linecap:butt;stroke-linejoin:miter;stroke-miterlimit:4;stroke-dasharray:none;stroke-dashoffset:0;stroke-opacity:1;marker:none"
         id="tspan182">DEBCAMP   MEALS</tspan></text>
  </g>
</svg>
