<?xml version="1.0" encoding="UTF-8" standalone="no"?>
<!-- Created with Inkscape (http://www.inkscape.org/) -->
<svg id="svg8" xmlns:rdf="http://www.w3.org/1999/02/22-rdf-syntax-ns#" xmlns="http://www.w3.org/2000/svg" height="2.4375in" viewBox="0 0 100.0125 61.9125" width="3.9375in" version="1.1" xmlns:cc="http://creativecommons.org/ns#" xmlns:dc="http://purl.org/dc/elements/1.1/">
 <metadata id="metadata5">
  <rdf:RDF>
   <cc:Work rdf:about="">
    <dc:format>image/svg+xml</dc:format>
    <dc:type rdf:resource="http://purl.org/dc/dcmitype/StillImage"/>
    <dc:title/>
   </cc:Work>
  </rdf:RDF>
 </metadata>
 <g id="layer1" transform="translate(0 -235.09)">
  <rect id="rect1649" fill-rule="evenodd" ry=".12747" height="61.462" width="99.775" stroke="#000" y="235.39" x=".11273" stroke-width=".265" fill="#fff"/>
  <g id="text28" aria-label="DebConf 17" stroke-width=".31729px" transform="matrix(.83388 0 0 .83388 -7.2075 40.588)">
   <path id="path26" fill="#bc312e" d="m13.349 245.48v-4.737t2.9367 0q0.71174 0 1.2201 0.69978 0.51437 0.6938 0.51437 1.6687 0 0.98089-0.51437 1.6747-0.50839 0.6938-1.2201 0.6938zm0.43064-0.43063h2.5061q0.53231 0 0.90912-0.5682 0.38279-0.5682 0.38279-1.3697 0-0.80744-0.38279-1.3697-0.3768-0.5682-0.90912-0.5682h-2.507zm-0.86127 0.86127h3.3673q0.89118 0 1.5311-0.81941 0.64595-0.82538 0.64595-1.9797 0-0.75959-0.29905-1.4056-0.29307-0.64595-0.79548-1.0168-0.49643-0.37681-1.0826-0.37681h-3.368zm-0.43064 0.43063v-6.4595h3.798q0.69978 0 1.3039 0.43063 0.60408 0.43064 0.95697 1.1783 0.35886 0.74165 0.35886 1.6209 0 0.87323-0.35886 1.6209-0.35288 0.74763-0.95697 1.1783-0.60408 0.43063-1.3039 0.43063zm-0.43064 0.43064h4.2286q0.8194 0 1.5192-0.49045 0.70576-0.49044 1.1244-1.3338 0.41867-0.84333 0.41867-1.8362 0-0.98687-0.41867-1.8302-0.41867-0.84931-1.1244-1.3398-0.70576-0.49045-1.5192-0.49045h-4.229zm-0.43064 0.43063v-8.1821h4.6592q0.93304 0 1.7405 0.55025 0.80744 0.54428 1.2859 1.4893 0.47848 0.94501 0.47848 2.0515t-0.47848 2.0515q-0.47848 0.94501-1.2859 1.4953-0.80744 0.54427-1.7405 0.54427zm-0.43064 0.43064h5.0899q0.78352 0 1.5132-0.35887 0.72969-0.35886 1.262-0.96294 0.53231-0.60409 0.84931-1.4414 0.32298-0.84332 0.32298-1.7584 0-0.9151-0.32298-1.7524-0.317-0.83734-0.84931-1.4414-0.53231-0.61006-1.262-0.96893-0.72969-0.35886-1.5132-0.35886h-5.089zm5.0899 0.43063h-5.5205v-9.9046h5.5205q1.1663 0 2.1771 0.66389 1.0108 0.6639 1.6089 1.8063 0.60408 1.1424 0.60408 2.4821 0 1.0048-0.35886 1.9259-0.35288 0.9151-0.945 1.579-0.59212 0.66389-1.4055 1.0586-0.80744 0.38877-1.6807 0.38877z"/>
   <path id="path28" fill="#bc312e" d="m23.78 248.06h-0.43064v-8.6127h0.431zm-0.86127 0h-0.43064v-8.6127h0.43064zm-0.86127 0h-0.43064v-8.6127h0.43064zm2.5838-2.1532h4.1209v0.43063h-4.122v0.43064h4.1209v0.43063h-4.121v0.43064h4.1209v0.43063h-4.5516v-8.6127h4.5516v0.43064h-4.121v0.43063h4.1209v0.43064h-4.121v0.43063h4.1209v0.43064h-4.121v1.0706h3.8817v0.43064h-3.882v0.43063h3.8817v0.43064h-3.882v0.43063h3.8817v0.43064h-3.882z"/>
   <path id="path30" fill="#bc312e" d="m36.555 243.71-0.01196-0.006q0.67586-0.65791 0.67586-1.6029 0-0.89715-0.66988-1.5551-0.6639-0.66389-1.573-0.66389h-4.737v8.1821h-0.43v-8.6127h5.1676q0.70576 0 1.3218 0.36485 0.62203 0.35886 0.98687 0.9749 0.36484 0.61007 0.36484 1.3098 0 0.95697-0.51437 1.6448 0.51437 0.71174 0.51437 1.567 0 0.8194-0.37082 1.4474-0.37082 0.62203-0.97491 0.93903-0.5981 0.31699-1.3278 0.31699h-2.7214v-0.43063h2.7214q0.92108 0 1.579-0.65194 0.6639-0.65791 0.6639-1.6209 0-0.4426-0.19139-0.87323-0.19139-0.43064-0.47848-0.72371 0-0.006 0.006-0.006zm-1.579 2.1532h-2.7214v0.43063h2.7214q0.39475 0 0.66988-0.26316 0.28111-0.26915 0.28111-0.71773 0-0.38877-0.28709-0.68184-0.28709-0.29905-0.6639-0.29905h-2.7274v0.43064h2.7274q0.20336 0 0.35886 0.16747 0.16149 0.16746 0.16149 0.38278 0 0.26317-0.14953 0.40671-0.14953 0.14355-0.37082 0.14355zm0 0.86127h-2.7214v0.43063h2.7214q0.74165 0 1.274-0.52633 0.53829-0.53231 0.53829-1.3158 0-0.49642-0.26915-0.93304-0.26317-0.4426-0.69978-0.68184 0.43662-0.22728 0.69978-0.64595 0.26915-0.42466 0.26915-0.95099 0-0.71772-0.54427-1.25-0.53829-0.5383-1.268-0.5383h-4.3064v7.7514h0.43064v-7.3208h3.8757q0.55026 0 0.96295 0.41269 0.41867 0.40671 0.41867 0.945 0 0.59811-0.40671 0.98687-0.40671 0.38279-0.97491 0.38279h-2.722v0.43064h2.7213q0.55026 0 0.96295 0.42465 0.41867 0.42465 0.41867 0.98687 0 0.62203-0.40671 1.0168-0.40671 0.39475-0.97491 0.39475zm0-4.115h-2.7214v0.43064h2.7214q0.40073 0 0.67586-0.25121 0.27513-0.25718 0.27513-0.68782 0-0.36484-0.28709-0.64595t-0.6639-0.28111h-3.4451v6.8902h0.43064v-6.4595h3.0144q0.20336 0 0.35886 0.1555 0.16149 0.14953 0.16149 0.34092 0 0.24523-0.14953 0.37681t-0.37082 0.13158z"/>
   <path id="path32" fill="#bc312e" d="m46.113 241.54-0.35288 0.23326q-0.32298-0.47849-0.84333-0.75361-0.51437-0.28111-1.1185-0.28111-0.98089 0-1.6747 0.6938-0.6938 0.6938-0.6938 1.6747 0 0.98089 0.6938 1.6747 0.6938 0.6938 1.6747 0.6938 0.60408 0 1.1185-0.28111 0.52035-0.28111 0.84333-0.75959l0.3469 0.2512q-0.38279 0.56222-0.99285 0.89118-0.61007 0.32896-1.3158 0.32896-0.5682 0-1.0885-0.2213-0.51437-0.2213-0.89118-0.59811-0.37681-0.3768-0.5981-0.89117-0.2213-0.52035-0.2213-1.0886 0-0.5682 0.2213-1.0826 0.2213-0.52035 0.5981-0.89716 0.3768-0.3768 0.89118-0.5981 0.52035-0.2213 1.0885-0.2213 0.71174 0 1.3218 0.33494 0.61007 0.32896 0.99285 0.89716zm0.71174-0.49045-0.35886 0.23326q-0.4426-0.64595-1.1484-1.0228-0.69978-0.38278-1.5192-0.38278-0.87921 0-1.6209 0.43661-0.74165 0.43064-1.1783 1.1723-0.43064 0.74165-0.43064 1.6209 0 0.87921 0.43064 1.6209 0.43662 0.74165 1.1783 1.1783 0.74165 0.43063 1.6209 0.43063 0.8194 0 1.5252-0.38279 0.70576-0.38278 1.1484-1.0347l0.35288 0.24523q-0.50241 0.74165-1.3039 1.1723-0.79548 0.43064-1.7225 0.43064-0.99285 0-1.8362-0.49045-0.84333-0.49044-1.3338-1.3338-0.49044-0.84333-0.49044-1.8362 0-0.99285 0.49044-1.8362 0.49045-0.84333 1.3338-1.3338 0.84333-0.49045 1.8362-0.49045 0.92706 0 1.7225 0.43064 0.80146 0.43063 1.3039 1.1723zm0.71772-0.47848-0.35886 0.23326q-0.56222-0.82539-1.4594-1.3039-0.89118-0.48446-1.9259-0.48446-0.83136 0-1.591 0.32297-0.75959 0.32298-1.3098 0.87323-0.54427 0.54428-0.86725 1.3039-0.32298 0.75959-0.32298 1.591 0 0.83136 0.32298 1.591 0.32298 0.75959 0.86725 1.3098 0.55026 0.54428 1.3098 0.86725 0.75959 0.32298 1.591 0.32298 1.0407 0 1.9319-0.48446 0.89118-0.48447 1.4534-1.3098l0.3469 0.25718q-0.62203 0.90912-1.6089 1.4414-0.98089 0.52634-2.1233 0.52634-1.2261 0-2.2668-0.60409-1.0407-0.61007-1.6508-1.6508-0.60408-1.0407-0.60408-2.2668t0.60408-2.2668q0.61007-1.0407 1.6508-1.6448 1.0407-0.61007 2.2668-0.61007 1.1484 0 2.1352 0.5383 0.98687 0.53231 1.6089 1.4474zm0.70576-0.49045-0.35886 0.23326q-0.68184-0.99883-1.7644-1.579-1.0766-0.58016-2.3266-0.58016-1.0048 0-1.9259 0.39475-0.9151 0.38876-1.579 1.0527-0.6639 0.66389-1.0586 1.585-0.38877 0.9151-0.38877 1.9199t0.38877 1.9259q0.39475 0.9151 1.0586 1.579 0.6639 0.66389 1.579 1.0586 0.92108 0.38877 1.9259 0.38877 1.25 0 2.3326-0.58614t1.7644-1.585l0.3469 0.26317q-0.74165 1.0766-1.9139 1.7106-1.1723 0.62801-2.53 0.62801-1.0945 0-2.0934-0.43064-0.99285-0.42465-1.7166-1.1424-0.71772-0.7237-1.1484-1.7166-0.42465-0.99883-0.42465-2.0934 0-1.0945 0.42465-2.0874 0.43064-0.99884 1.1484-1.7166 0.72371-0.72371 1.7166-1.1484 0.99883-0.43064 2.0934-0.43064 1.3637 0 2.536 0.63399t1.9139 1.7225z"/>
   <path id="path34" fill="#bc312e" d="m52.357 242.54q-0.50241 0.50241-0.50241 1.2142 0 0.71175 0.50241 1.2201 0.50839 0.50241 1.2201 0.50241 0.71174 0 1.2142-0.50241 0.50839-0.50838 0.50839-1.2201 0-0.71174-0.50839-1.2142-0.50241-0.50839-1.2142-0.50839-0.71174 0-1.2201 0.50839zm-0.30503 2.7393q-0.62801-0.63399-0.62801-1.5252 0-0.89117 0.62801-1.5192 0.63399-0.63399 1.5252-0.63399 0.89118 0 1.5192 0.63399 0.63399 0.62801 0.63399 1.5192 0 0.89118-0.63399 1.5252-0.62801 0.62801-1.5192 0.62801-0.89118 0-1.5252-0.62801zm-0.30503-3.3494q-0.75361 0.7596-0.75361 1.8242t0.75361 1.8242q0.75959 0.75959 1.8302 0.75959t1.8242-0.75959q0.75959-0.75959 0.75959-1.8242t-0.75959-1.8242q-0.75361-0.75959-1.8242-0.75959t-1.8302 0.75959zm-0.78352 3.3374q-0.40073-0.6938-0.40073-1.5132t0.40073-1.5132q0.40671-0.6938 1.1005-1.0945 0.6938-0.40671 1.5132-0.40671t1.5132 0.40671q0.6938 0.40073 1.0945 1.0945 0.40671 0.6938 0.40671 1.5132t-0.40671 1.5132q-0.40073 0.69381-1.0945 1.1005-0.6938 0.40073-1.5132 0.40073t-1.5132-0.40073q-0.6938-0.40671-1.1005-1.1005zm-0.56222-2.847q-0.26915 0.63399-0.26915 1.3338 0 0.69978 0.26915 1.3398 0.27513 0.63399 0.73567 1.1005 0.46652 0.46054 1.1005 0.73566 0.63997 0.26915 1.3398 0.26915 0.69978 0 1.3338-0.26915 0.63997-0.27512 1.1005-0.73566 0.46652-0.46653 0.73567-1.1005 0.27513-0.63997 0.27513-1.3398 0-0.69978-0.27513-1.3338-0.26915-0.63997-0.73567-1.1005-0.46054-0.46652-1.1005-0.73567-0.63399-0.27513-1.3338-0.27513-0.69978 0-1.3398 0.27513-0.63399 0.26915-1.1005 0.73567-0.46054 0.46054-0.73567 1.1005zm-0.39475 2.841q-0.30503-0.71772-0.30503-1.5072 0-0.7895 0.30503-1.5072 0.31101-0.71773 0.82538-1.2321 0.52035-0.52035 1.2381-0.82538 0.71772-0.31101 1.5072-0.31101 0.7895 0 1.5072 0.31101 0.71772 0.30503 1.2321 0.82538 0.52035 0.51437 0.82538 1.2321 0.31101 0.71772 0.31101 1.5072 0 0.7895-0.31101 1.5072-0.30503 0.71773-0.82538 1.2381-0.51437 0.51437-1.2321 0.82538-0.71772 0.30504-1.5072 0.30504-0.7895 0-1.5072-0.30504-0.71772-0.31101-1.2381-0.82538-0.51437-0.52035-0.82538-1.2381zm-0.39475-3.1759q-0.34092 0.79548-0.34092 1.6687 0 0.87323 0.34092 1.6747 0.34092 0.79548 0.9151 1.3756 0.58016 0.57418 1.3756 0.9151 0.80146 0.34092 1.6747 0.34092 0.87323 0 1.6687-0.34092 0.80146-0.34092 1.3756-0.9151 0.58016-0.58016 0.92108-1.3756 0.34092-0.80146 0.34092-1.6747 0-0.87323-0.34092-1.6687-0.34092-0.80146-0.92108-1.3756-0.57418-0.58016-1.3756-0.92108-0.79548-0.34092-1.6687-0.34092-0.87323 0-1.6747 0.34092-0.79548 0.34092-1.3756 0.92108-0.57418 0.57418-0.9151 1.3756zm-0.39475 3.5109q-0.37681-0.87921-0.37681-1.8422 0-0.96295 0.37681-1.8362 0.3768-0.87921 1.0108-1.5132 0.63399-0.63399 1.5072-1.0108 0.87921-0.3768 1.8422-0.3768 0.96295 0 1.8362 0.3768 0.87921 0.37681 1.5132 1.0108t1.0108 1.5132q0.3768 0.87323 0.3768 1.8362 0 0.96295-0.3768 1.8422-0.37681 0.87323-1.0108 1.5072-0.63399 0.63399-1.5132 1.0108-0.87323 0.37681-1.8362 0.37681-0.96295 0-1.8422-0.37681-0.87323-0.37681-1.5072-1.0108-0.63399-0.63399-1.0108-1.5072z"/>
   <path id="path36" fill="#bc312e" d="m66.078 244.59-0.43064-0.78352v-4.3542h0.431zm0.86127 1.4893-0.43063-0.72969v-5.8973h0.43063zm-5.9332-3.152 0.43064 0.78351v4.3542h-0.43064zm-0.86127-1.5491 0.43064 0.78949v5.8973h-0.431zm0.14953-1.9259h0.50241l4.9882 8.6127h-0.50241zm1.0168 0h0.507l4.9822 8.6127h-0.51437zm1.0108 0h0.50241l4.5456 7.8651v-7.8651h0.43064v8.6127h-0.50839zm-2.6077 0.74165v7.871h-0.43064v-8.6127h0.51437l4.9702 8.6127h-0.49643z"/>
   <path id="path38" fill="#bc312e" d="m71.939 248.06h-0.431v-8.6127h4.109v0.43064h-3.6783v0.43063h3.6783v0.43064h-3.6783v0.43063h3.6783v0.43064h-3.6783v1.3158h3.3912v0.43063h-3.3912v0.43064h3.3912v0.43063h-3.3912v0.43064h3.3912v0.43063h-3.3912zm-0.86127 0h-0.431v-8.6127h0.43064zm-0.86127 0h-0.431v-8.6127h0.43064zm-0.86127 0h-0.431v-8.6127h0.43064z"/>
   <path id="path40" fill="#1b75bc" d="m77.705 240.31v-0.43063h4.3422v8.1821h-0.43064v-7.7514h-0.43064v7.7514h-0.43064v-7.7514h-0.43064v7.7514h-0.429v-7.7514h-0.429v7.7514h-0.43064v-7.7514zm0-0.86127v-0.43063h4.3422v0.43063zm0-0.86127v-0.43063h4.3422v0.43063z"/>
   <path id="path42" fill="#1b75bc" d="m89.601 238.16h0.44858l-2.4403 9.9046h-0.449zm-3.3613 1.7225-0.10168 0.43063h-3.2178v-0.43063zm0.20336-0.86127-0.10168 0.43063h-3.4212v-0.43063zm0.19139-0.86127-0.08374 0.43063h-3.6305v-0.43063zm0.30503 0h0.4426l-2.4403 9.9046h-0.443zm0.88519 0h0.44858l-2.4403 9.9046h-0.44858zm0.89118 0h0.4426l-2.4403 9.9046h-0.442z"/>
  </g>
  <rect id="rect4812" ry="0" height="61.612" width="99.75" stroke="#000" y="235.24" x=".13753" stroke-width=".265" fill="none"/>
  <text id="text4545-9-0-9" style="word-spacing:0px;letter-spacing:0px" xml:space="preserve" font-size="9.541px" text-anchor="middle" line-height="125%" y="263.4516" x="49.973" font-family="Monoton" fill="#000000"><tspan id="tspan4543-7-31-1" font-size="9.541px" font-family="&apos;PT Sans Narrow&apos;" font-weight="bold" font-stretch="condensed" y="263.4516" x="49.973" stroke-width=".26458px" fill="#000000">{Name}</tspan></text>
  <flowRoot id="flowRoot243" style="word-spacing:0px;letter-spacing:0px" line-height="125%" xml:space="preserve" font-size="4px" transform="matrix(.26458 0 0 .26458 3.5641e-7 196.99)" font-family="Sans" fill="#000000"><flowRegion id="flowRegion245"><rect id="rect247" y="-50.507" x="-74.953" width="43.841" height="15.556"/></flowRegion><flowPara id="flowPara249"/></flowRoot>
  <text id="text4545-9-0-9-3" style="word-spacing:0px;letter-spacing:0px;text-anchor:middle" xml:space="preserve" font-size="5.183px" text-anchor="middle" line-height="125%" y="276.30377" x="49.973141" font-family="Monoton" fill="#000000"><tspan id="tspan4543-7-31-1-6" font-size="6.35px" font-family="&apos;PT Sans Narrow&apos;" font-weight="bold" font-stretch="condensed" y="276.30377" x="49.973141" stroke-width=".26458px" fill="#000000">{Line 2}</tspan></text>
  <text id="text4545-9-0-9-7" style="word-spacing:0px;letter-spacing:0px;text-anchor:middle" xml:space="preserve" font-size="10.707px" text-anchor="middle" line-height="125%" y="292.26147" x="42.76878" font-family="Monoton" fill="#000000"><tspan id="tspan910" font-size="9.8778px" font-family="&apos;PT Sans Narrow&apos;" font-weight="bold" font-stretch="condensed" y="292.26147" x="42.76878" stroke-width=".26458px" fill="#000000">{Line 3}</tspan></text>
  <text id="text4545-9-0-9-7-3" style="word-spacing:0px;letter-spacing:0px" xml:space="preserve" font-size="8.8549px" line-height="125%" y="294.08109" x="2.499315" font-family="Monoton" fill="#000000"><tspan id="tspan910-5" font-size="6.35px" font-family="&apos;PT Sans Narrow&apos;" font-weight="bold" font-stretch="condensed" y="294.08109" x="2.499315" stroke-width=".26458px" fill="#000000">{Languages}</tspan></text>
  <rect id="rect1626-3" ry=".093266" height="14.002" width="19.815" stroke="#000" y="281.79" x="79.014" stroke-width=".265" fill="none"/>
  <rect id="rect1676" fill-rule="evenodd" rx="0" ry=".011257" height=".31543" width="100.04" y="251.23" x="-.020463"/>
  <g id="layer1-3" stroke-width="1.1993" transform="matrix(.23531 0 0 .23531 -39.397 376.69)">
   <path id="path6152" style="color-rendering:auto;text-decoration-color:#000000;color:#000000;isolation:auto;mix-blend-mode:normal;shape-rendering:auto;solid-color:#000000;text-decoration-line:none;image-rendering:auto;white-space:normal;text-indent:0;text-transform:none;text-decoration-style:solid" fill="#1b75bc" d="m540.97-595.97-0.31288 0.21902c-1.7022 1.1952-5.2894 2.5671-8.415 3.6026-3.1256 1.0356-5.8062 1.7581-5.8062 1.7581l-0.14899 0.0402-0.079 0.1341c-18.215 30.738-54.631 41.862-54.631 41.862l-0.36503 0.11025 0.222 0.73006 0.36503-0.11175s36.552-11.123 54.979-42.072c0.12746-0.0345 2.6317-0.70915 5.7034-1.7268 3.1487-1.0432 6.7316-2.3788 8.6147-3.701l0.31139-0.22051-0.43803-0.62427zm0.4574 1.6032-0.31139 0.21902c-1.7022 1.1952-5.2909 2.5656-8.4165 3.6011-3.1256 1.0356-5.8047 1.7581-5.8047 1.7581l-0.15048 0.0402-0.079 0.13409c-18.215 30.738-54.631 41.862-54.631 41.862l-0.36504 0.11025 0.222 0.73006 0.36503-0.11175s36.552-11.122 54.979-42.071c0.12744-0.0345 2.6317-0.71063 5.7034-1.7283 2.1337-0.70691 4.4548-1.5498 6.3232-2.4301-2.3084 2.002-5.3859 5.2956-8.8903 9.3179-4.5552 5.2284-9.7788 11.649-14.72 17.888-9.8655 12.456-18.588 24.161-18.619 24.202-2.2727 0.99988-4.3478 2.0007-6.2874 3.0007h1.7089c1.6014-0.79905 3.2673-1.5981 5.094-2.3973h0.002c10.034-4.4088 23.026-8.2825 38.067-8.4344 13.661-0.14011 31.083 2.7078 46.993 10.832h1.6687c-16.398-8.7238-34.518-11.74-48.67-11.595-7.0377 0.0711-13.622 0.95601-19.676 2.3213 0.78338-3.5357 6.2432-25.045 25.674-36.704l0.18475-0.11026v-9.7604l0.073-0.0507-0.43803-0.62427zm-0.3978 1.6791v8.3346c-20.395 12.364-25.494 35.351-25.919 37.424-6.1567 1.4445-11.74 3.3823-16.659 5.4724 1.1564-1.548 8.6518-11.568 17.799-23.116 4.9372-6.2335 10.155-12.648 14.696-17.861 4.2137-4.8365 7.8596-8.623 10.082-10.254zm-26.242 22.881v0.76283h2.3645v-0.76283zm-1.8311 2.1365v0.76284h2.366v-0.76284zm-2.211 2.2125v0.76283h2.2885v-0.76283zm-2.518 2.135v0.76284h2.2885v-0.76284zm-3.5847 2.2125v0.76284h3.3553v-0.76284zm-2.9754 2.2125v0.76284h4.653v-0.76284zm-2.6699 2.135v0.76284h5.3398v-0.76284zm-3.2048 2.2125v0.76284h6.2561v-0.76284zm-2.5165 2.1365v0.76283h6.4081v-0.76283zm-3.8902 2.2125v0.76283h7.8563v-0.76283zm-3.3568 2.135v0.76283h10.069v-0.76283zm49.732 0.53487c-16.544 0.15-30.585 4.7623-41.004 9.6874h1.8043c10.179-4.623 23.575-8.7831 39.209-8.9246 12.545-0.13785 28.292 2.2446 43.073 8.9246h1.8505c-15.343-7.2801-31.849-9.831-44.931-9.6874h-0.002zm-54.462 1.6776v0.76283h12.816v-0.76283zm54.234 0c-14.659 0.15191-27.279 3.7696-37.267 8.0098h1.989c9.6365-3.9001 21.563-7.1047 35.286-7.2469h0.002c11.452-0.13552 25.577 1.8568 39.17 7.2469h2.0308c-14.233-5.9743-29.17-8.1523-41.21-8.0098zm-58.049 2.2125v0.76283h15.944v-0.76283z"/>
   <path id="path5952" style="color-rendering:auto;text-decoration-color:#000000;color:#000000;isolation:auto;mix-blend-mode:normal;shape-rendering:auto;solid-color:#000000;text-decoration-line:none;image-rendering:auto;white-space:normal;text-indent:0;text-transform:none;text-decoration-style:solid" fill="#be1e2d" d="m571.84-597.34-0.0849 0.6049 0.30245 0.0417c2.2492 0.3185 4.4123 1.2468 6.1936 2.6565 1.7812 1.4097 3.1812 3.3015 4.0079 5.4173 0.83556 2.1385 1.0766 4.539 0.46038 6.7284-0.40631 1.4436-1.1828 2.7852-2.2408 3.8455-1.0579 1.0601-2.4004 1.8395-3.847 2.22-1.6186 0.42568-3.3705 0.34708-4.945-0.22051-1.5745-0.56758-2.9736-1.6252-3.9483-2.9858l-0.17879-0.24882-0.49465 0.35609 0.1773 0.24732c1.0482 1.4632 2.544 2.5959 4.2373 3.2063 1.6933 0.61042 3.5663 0.6932 5.3071 0.23541 1.5549-0.40892 2.9897-1.2427 4.1241-2.3794 1.1342-1.1365 1.9628-2.5684 2.3973-4.1122 0.65883-2.3409 0.39748-4.8692-0.47975-7.1144-0.86675-2.2183-2.3311-4.1956-4.1986-5.6736s-4.129-2.4477-6.4871-2.7817l-0.30246-0.0432zm-1.0519 1.1726c-0.33637-0.0115-0.67262-0.008-1.0087 0.009-0.89614 0.0464-1.7883 0.19722-2.652 0.4574-2.1997 0.66263-4.1824 2.0094-5.6095 3.8097l-0.18921 0.23839 0.47826 0.37992 0.18922-0.23987c1.348-1.7005 3.2308-2.9782 5.3086-3.6041 3.2587-0.98165 6.9668-0.29958 9.744 1.6806 3.0045 2.1422 4.9032 5.7816 4.942 9.4714l0.003 0.30543 0.61087-0.006-0.003-0.30544c-0.041-3.894-2.029-7.7022-5.1998-9.963-1.924-1.3718-4.2591-2.1529-6.6137-2.2334zm-0.15049 1.0891c-2.2674-0.0484-4.5466 0.6808-6.3381 2.0784-1.224 0.95493-2.1987 2.191-2.9486 3.5311-1.2734 2.2758-1.922 4.8805-1.9428 7.4823-0.038 4.7378 2.0704 9.4383 5.6334 12.561l0.22944 0.20113 0.40229-0.45889-0.22945-0.20113c-3.424-3.0014-5.4613-7.545-5.4248-12.098 0.0201-2.5035 0.64579-5.0091 1.8654-7.1888 0.71798-1.2832 1.643-2.4537 2.7891-3.3478 1.6744-1.3063 3.8233-1.9957 5.9507-1.9503 2.3332 0.0498 4.6448 0.98492 6.3575 2.5701l0.22497 0.20711 0.4142-0.44847-0.22349-0.2071c-1.8255-1.6896-4.2729-2.6779-6.7597-2.731zm10.117 1.034-0.40973 0.45293 0.22646 0.20412c2.8002 2.5332 4.2299 6.5262 3.6741 10.261-0.34758 2.3357-1.4362 4.561-3.0662 6.2696l-0.21156 0.22051 0.44249 0.42165 0.21008-0.22051c1.7189-1.8017 2.8621-4.1388 3.2286-6.6018 0.58738-3.9471-0.90995-8.1262-3.8693-10.803zm-17.475 3.8142-0.15943 0.25925c-1.4761 2.3827-2.2935 5.164-2.3392 7.9666-0.061 3.7519 1.2819 7.5025 3.7114 10.362 2.4294 2.8598 5.9139 4.7921 9.6263 5.3384l0.30096 0.0447 0.0894-0.60491-0.30245-0.0432c-3.5615-0.52408-6.9187-2.3862-9.2494-5.1298-2.3307-2.7435-3.6239-6.3577-3.5654-9.9571 0.0438-2.6904 0.82972-5.3692 2.2468-7.6567l0.16092-0.25925-0.51998-0.32033zm9.8632 2.3406c-0.90083-0.0359-1.8071 0.1759-2.5984 0.60789-0.75062 0.40975-1.3908 1.0123-1.8445 1.7372-0.45366 0.72492-0.71647 1.5654-0.75687 2.4196-0.0404 0.85424 0.14123 1.7147 0.52445 2.4792 0.38321 0.76451 0.96459 1.4253 1.6732 1.9041l0.25179 0.17134 0.34268-0.50657-0.25329-0.16985c-0.62046-0.41923-1.132-1.0038-1.4676-1.6732-0.33556-0.66943-0.49727-1.4288-0.46187-2.1768 0.0354-0.74798 0.26725-1.4884 0.6645-2.1231 0.39725-0.63476 0.96226-1.1684 1.6195-1.5272 0.6927-0.37815 1.4924-0.56487 2.281-0.53339 0.78857 0.0315 1.5716 0.28146 2.2319 0.71367l0.25478 0.16836 0.33523-0.51104-0.25627-0.16687c-0.75435-0.49374-1.6395-0.77751-2.5403-0.8135zm-13.896 0.25329-0.0909 0.29053c-0.72426 2.2877-0.99725 4.7156-0.7986 7.1069 0.18983 2.285 0.80842 4.5333 1.8162 6.5929l0.13409 0.27414 0.54829-0.26818-0.13409-0.27415c-0.97412-1.9908-1.5731-4.1666-1.7566-6.3753-0.19202-2.3114 0.0717-4.6603 0.77176-6.8715l0.0924-0.29053zm9.9124 0.009-0.22497 0.20561c-0.92723 0.85063-1.5823 1.9853-1.855 3.2137-0.27265 1.2284-0.15845 2.5349 0.32182 3.698 0.72261 1.7499 2.2369 3.0878 3.9766 3.7784 1.2804 0.50827 2.6876 0.68564 4.054 0.51104 1.3665-0.17459 2.6834-0.69988 3.7948-1.5138l0.24584-0.18029-0.36056-0.49315-0.24583 0.18028c-1.0268 0.75193-2.2493 1.2392-3.5117 1.4005-1.2624 0.16131-2.5687-0.003-3.7516-0.4723-1.6006-0.63541-2.9892-1.8713-3.6384-3.4432-0.4315-1.0449-0.53401-2.2293-0.28904-3.3329 0.24495-1.1036 0.83863-2.1322 1.6717-2.8964l0.22498-0.20711zm3.5669 0.7971c-0.14108 0.006-0.28173 0.022-0.42166 0.0462-1.1194 0.19362-2.1073 0.95319-2.5835 1.9846l-0.12813 0.27564 0.55424 0.25626 0.12814-0.27712c0.38793-0.84014 1.2217-1.4797 2.1336-1.6374 0.91185-0.15773 1.9106 0.1644 2.5582 0.82541 0.5337 0.54475 0.84208 1.3204 0.8269 2.0829-0.0152 0.76246-0.35391 1.524-0.90884 2.0472l-0.222 0.20858 0.41867 0.44399 0.222-0.20858c0.67842-0.63952 1.081-1.5471 1.0996-2.4792 0.0185-0.93216-0.34727-1.855-0.99974-2.5209-0.69562-0.71004-1.6898-1.0927-2.6774-1.0474zm-3.9766 16.568-0.28607 0.53786 0.26967 0.14303c2.2569 1.1964 4.7076 2.0255 7.2276 2.4435 1.2236 0.20292 2.4622 0.3096 3.7024 0.31883l0.30543 0.002 0.005-0.60938-0.30543-0.003c-1.2083-0.009-2.415-0.11221-3.6071-0.3099-2.4546-0.40707-4.843-1.2155-7.0413-2.3809l-0.26968-0.14154z"/>
  </g>
 </g>
{Diet}</svg>
