<?xml version="1.0" encoding="UTF-8" standalone="no"?>
<!-- Created with Inkscape (http://www.inkscape.org/) -->

<svg
   xmlns:dc="http://purl.org/dc/elements/1.1/"
   xmlns:cc="http://creativecommons.org/ns#"
   xmlns:rdf="http://www.w3.org/1999/02/22-rdf-syntax-ns#"
   xmlns:svg="http://www.w3.org/2000/svg"
   xmlns="http://www.w3.org/2000/svg"
   xmlns:sodipodi="http://sodipodi.sourceforge.net/DTD/sodipodi-0.dtd"
   xmlns:inkscape="http://www.inkscape.org/namespaces/inkscape"
   width="1280"
   height="720"
   viewBox="0 0 338.666 190.5"
   version="1.1"
   id="svg8"
   sodipodi:docname="template-close.svg"
   inkscape:version="0.92.1 r15371">
  <defs
     id="defs2">
    <symbol
       id="Restaurant">
      <title
         id="title7481">Restaurant</title>
      <g
         style="stroke:none"
         id="g7487">
        <path
           style="stroke-width:0.026458"
           inkscape:connector-curvature="0"
           d="m 0.79375,0.79375 v 0.87312 a 0.079375,0.079375 0 0 1 -0.15875,0 V 0.79375 A 0.105833,0.105833 0 0 1 0.529167,0.687917 v -0.47625 a 0.02646,0.02646 0 0 1 0.05292,0 V 0.582083 H 0.635 V 0.211667 a 0.02646,0.02646 0 0 1 0.05292,0 V 0.582083 H 0.74084 V 0.211667 a 0.02646,0.02646 0 0 1 0.05292,0 V 0.582083 H 0.84668 V 0.211667 a 0.02646,0.02646 0 0 1 0.05292,0 v 0.47625 A 0.105833,0.105833 0 0 1 0.79375,0.79375 Z"
           id="path7483" />
        <path
           style="stroke-width:0.026458"
           inkscape:connector-curvature="0"
           d="m 1.32292,1.66687 a 0.079375,0.079375 0 0 1 -0.15875,0 V 1.13771 H 1.08479 V 0.304271 a 0.119065,0.119065 0 0 1 0.23813,0 z"
           id="path7485" />
      </g>
    </symbol>
    <symbol
       id="restaurant"
       viewBox="0 0 400.72852 459.4336">
      <title
         id="title11337">restaurant</title>
      <path
         style="stroke-width:0.026458"
         inkscape:connector-curvature="0"
         d="M 2.4831,0 C 1.63607,0 0,2.14665 0,4.1076 0,5.68574 0.720281,7.02264 1.71623,7.48476 L 1.51004,12.1558 H 3.45612 L 3.24998,7.48476 C 4.24595,7.02264 4.96621,5.68574 4.96621,4.1076 4.96621,2.14665 3.33017,0 2.4831,0 Z m 5.38949,0.039946 c -0.10252,0 -0.18562,0.083096 -0.18562,0.185622 L 7.55117,5.64394 H 7.02639 l 0.0862,-5.365456 c 0,-0.102526 -0.0831,-0.185621 -0.18567,-0.185621 H 6.80511 c -0.10252,0 -0.18567,0.083095 -0.18567,0.185621 L 6.35026,5.64394 c 0,1.57814 0.36286,2.17245 1.35878,2.63457 L 7.5029,12.1558 H 9.44904 L 9.24295,8.27851 C 10.2389,7.81639 10.6026,7.22208 10.6026,5.64394 L 10.3439,0.277864 c 0,-0.102526 -0.083,-0.185673 -0.1858,-0.185673 h -0.1218 c -0.10249,0 -0.18569,0.083121 -0.18569,0.185673 L 9.93686,5.64394 H 9.40087 L 9.26507,0.225568 c 0,-0.102526 -0.0831,-0.185622 -0.18568,-0.185622 H 8.9208 c -0.1025,0 -0.18567,0.083096 -0.18567,0.185622 L 8.80856,5.64394 H 8.14348 l 0.0734,-5.418372 c 0,-0.102526 -0.0831,-0.185622 -0.18567,-0.185622 z"
         id="path11339" />
    </symbol>
    <symbol
       id="greengrocer"
       viewBox="0 0 367.41016 472.29608">
      <title
         id="title11686">greengrocer</title>
      <path
         style="stroke-width:0.026458"
         inkscape:connector-curvature="0"
         d="M 0.941493,2.37201e-4 C 0.840044,0.001262 0.734993,0.005492 0.626215,0.013105 c 0,0 0.594075,2.960845 3.171895,2.323785 C 3.79838,2.33865 3.7275,0.029296 1.04175,2.88874e-4 1.00872,-6.77839e-5 0.975309,-1.04296e-4 0.941493,2.35958e-4 Z M 4.50934,0.409049 c -0.0128,2.5e-5 -0.0254,6.2e-4 -0.0378,0.0018 -0.0331,0.0032 -0.0646,0.01066 -0.0941,0.02367 -0.0592,0.02602 -0.10532,0.08484 -0.11519,0.156786 -0.01,0.07194 0.007,0.155133 0.0488,0.259984 0.0737,0.185541 0.13576,0.523101 0.18247,0.917461 0.0467,0.39436 0.0798,0.84766 0.10299,1.27641 0.0464,0.85749 0.0536,1.61633 0.0536,1.61633 L 4.77698,4.67269 5.50107,0.79494 5.46187,0.77231 c 0,0 -0.34536,-0.2003 -0.65996,-0.302824 C 4.6986,0.435818 4.59904,0.408881 4.50934,0.409049 Z m 4.28661,0.58198 C 6.07406,1.01897 5.78249,3.44541 5.78295,3.44349 8.72109,4.4537 9.72106,1.06467 9.72106,1.06467 9.3851,1.01088 9.07752,0.988139 8.79595,0.991029 Z M 2.82251,4.45165 C 1.26384,4.45165 0,5.71005 0,7.266 0,7.32605 -2.43417e-5,7.37522 0.008165,7.43255 h 0.013642 c 0.043676,0.60327 0.237488,1.36481 0.696082,2.30384 0,0 0.794351,1.50961 1.422191,2.20291 l 0.0573,0.055 c 0.30845,0.3112 0.73429,0.5023 1.20654,0.5023 0.57324,0 1.08101,-0.2785 1.38947,-0.7098 h 0.008 c 0.30846,0.4313 0.81618,0.7098 1.38942,0.7098 0.46678,0 0.89808,-0.1939 1.2038,-0.5023 l 0.0573,-0.055 C 8.0854,11.246 8.87429,9.73639 8.87429,9.73639 9.33289,8.79736 9.52671,8.04128 9.57585,7.43255 h 0.005 c 0.003,-0.0601 0.003,-0.10923 0.003,-0.16655 0,-1.55595 -1.26388,-2.81435 -2.81709,-2.81435 -0.76978,0 -1.46316,0.303 -1.97089,0.80527 C 4.2829,4.75465 3.58957,4.45165 2.82251,4.45165 Z"
         id="path11688" />
    </symbol>
    <symbol
       id="icon-chat-alt-stroke"
       viewBox="0 0 1024 1024">
      <title
         id="title12777">chat-alt-stroke</title>
      <path
         style="stroke-width:0.026458"
         inkscape:connector-curvature="0"
         d="m 21.9939,10.3403 c -0.023,1.1744 -0.2845,2.2818 -0.7476,3.2927 2.4409,0.4064 2.4604,2.3944 2.4604,3.3003 0,0.8399 0,3.3867 -3.3833,3.3867 h -3.3901 c -2.2055,0 -4.1808,1.0651 -5.4169,2.7119 C 10.6959,22.4104 10.16,21.4249 10.16,20.32 v -3.3867 c 0,-0.668 0.1194,-1.1972 0.304,-1.6323 C 10.365,15.283 10.2658,15.24 10.16,15.24 H 6.94521 C 6.83599,15.7641 6.77672,16.3246 6.77672,16.9333 V 20.32 c 0,3.7406 3.02937,6.7733 6.76998,6.7733 0,-1.8719 1.5147,-3.3866 3.3866,-3.3866 h 3.3901 c 3.3833,0 6.7699,-1.905 6.7699,-6.7734 0,-4.1427 -2.3545,-6.0621 -5.0994,-6.593 z M 13.5467,3.38667 c 1.2632,0 3.3866,0.44026 3.3866,3.38666 V 10.16 c 0,1.1083 -0.5359,2.0921 -1.3563,2.7102 C 14.3408,11.2268 12.369,10.16 10.16,10.16 H 6.77672 c -3.39005,0 -3.39005,-2.54847 -3.39005,-3.38667 0,-1.01176 0,-3.38666 3.39005,-3.38666 z M 13.5467,0 H 6.77672 C 3.38667,0 0,1.79917 0,6.77333 0,11.6417 3.38667,13.5467 6.77672,13.5467 H 10.16 c 1.872,0 3.3867,1.518 3.3867,3.3866 3.7405,0 6.7767,-3.0327 6.7767,-6.7733 V 6.77333 C 20.3234,2.09889 16.9333,0 13.5467,0 Z"
         id="path12779" />
    </symbol>
    <symbol
       id="flame"
       viewBox="0 0 12 16">
      <title
         id="title18197">flame</title>
      <path
         style="stroke-width:0.026458"
         inkscape:connector-curvature="0"
         d="m 0.133615,0.008202 c 0.02143,0.057415 0.01085,0.089429 -0.01376,0.114035 -0.025929,0.02778 -0.067469,0.04842 -0.096044,0.0889 -0.038364,0.05424 -0.044979,0.172773 0.093398,0.20373 -0.058208,-0.03069 -0.070643,-0.119592 -0.0079,-0.17489 -0.01614,0.05371 0.01402,0.08811 0.05133,0.07567 0.03678,-0.01244 0.06085,0.01402 0.06006,0.04419 -5.29e-4,0.02064 -0.0082,0.0381 -0.0299,0.04789 0.09049,-0.01561 0.12647,-0.09049 0.12647,-0.147108 0,-0.07514 -0.06694,-0.0852 -0.03307,-0.148432 -0.04022,0.0034 -0.05371,0.0299 -0.05001,0.07276 0.0024,0.02857 -0.02699,0.04762 -0.04921,0.03519 -0.01773,-0.01085 -0.01746,-0.03148 -0.0016,-0.0471 0.03307,-0.03254 0.0463,-0.108214 -0.04974,-0.16457 l -5.3e-4,-5.3e-4 z"
         id="path18199" />
    </symbol>
    <symbol
       id="globe"
       viewBox="0 0 14 16">
      <title
         id="title18252">globe</title>
      <path
         style="stroke-width:0.026458"
         inkscape:connector-curvature="0"
         d="M 0.185208,0.026458 C 0.083079,0.026458 0,0.109537 0,0.211667 c 0,0.102129 0.083079,0.185208 0.185208,0.185208 0.0127,0 0.02487,-0.0013 0.03651,-0.0037 -0.0045,-0.0021 -0.0053,-0.01931 -5.29e-4,-0.02884 0.005,-0.01085 0.02143,-0.03836 0.0053,-0.04763 -0.01614,-0.0093 -0.01164,-0.01323 -0.02143,-0.02408 -0.0098,-0.01085 -0.0058,-0.01243 -0.0066,-0.01535 -0.0021,-0.009 0.0095,-0.02355 0.01032,-0.02487 5.29e-4,-0.0016 5.29e-4,-0.0071 0,-0.0087 0,-0.0021 -0.0071,-0.0058 -0.009,-0.0061 -0.0016,0 -0.0029,0.0029 -0.0053,0.0034 -0.0024,5.3e-4 -0.01323,-0.0066 -0.01561,-0.0087 -0.0024,-0.0021 -0.0037,-0.0061 -0.0071,-0.009 -0.0034,-0.0034 -0.0037,-7.93e-4 -0.0087,-0.0029 -0.005,-0.0021 -0.02117,-0.0082 -0.03387,-0.0127 -0.0127,-0.005 -0.01376,-0.01244 -0.01376,-0.01746 -5.29e-4,-0.0053 -0.0079,-0.01243 -0.01111,-0.01773 -0.0037,-0.0053 -0.0042,-0.01244 -0.00529,-0.01085 -0.00106,0.0016 0.00661,0.02064 0.00529,0.02143 -0.0013,5.29e-4 -0.0042,-0.0053 -0.00794,-0.01006 -0.0037,-0.005 0.0037,-0.0024 -0.00794,-0.02513 -0.011642,-0.02275 0.0037,-0.0344 0.0045,-0.0463 7.93e-4,-0.011906 0.010054,0.0045 0.00503,-0.00344 -0.00503,-0.00794 0,-0.023548 -0.0037,-0.029368 -0.00344,-0.00582 -0.023284,0.00661 -0.023284,0.00661 5.29e-4,-0.00582 0.018257,-0.015346 0.030692,-0.024341 0.01244,-0.009 0.02064,-0.00159 0.03069,0.00132 0.01032,0.00344 0.01085,0.00238 0.0074,-0.00132 -0.0034,-0.00344 0.0016,-0.0045 0.0095,-0.00344 0.0074,0.00132 0.01005,0.010848 0.02196,0.00952 0.01244,-7.94e-4 0.0013,0.00238 0.0029,0.00582 0.0016,0.00344 -0.0016,0.00291 -0.01005,0.00794 -0.0079,0.00529 5.29e-4,0.00582 0.01455,0.01614 0.01402,0.010319 0.01005,-0.00661 0.0082,-0.014552 -0.0019,-0.00794 0.01032,-0.00159 0.01032,-0.00159 0.0087,0.00582 0.0071,5.29e-4 0.01323,0.00212 0.0061,0.00159 0.02408,0.016933 0.02408,0.016933 -0.02196,0.011642 -0.0082,0.0127 -0.0045,0.015611 0.0037,0.0029 -0.0074,0.0079 -0.0074,0.0079 -0.0045,-0.0045 -0.005,5.29e-4 -0.0079,0.0021 -0.0029,0.0016 -5.29e-4,0.0058 -5.29e-4,0.0058 -0.01482,0.0024 -0.01164,0.01826 -0.01111,0.02196 0,0.0037 -0.01005,0.0095 -0.01244,0.01535 -0.0024,0.0053 0.0066,0.01693 0.0016,0.01746 -0.005,7.94e-4 -0.009,-0.01746 -0.03466,-0.01085 -0.0079,0.0021 -0.02487,0.01085 -0.01561,0.02857 0.0095,0.01826 0.02434,-0.005 0.02937,-0.0024 0.005,0.0026 -0.0016,0.01402 -5.29e-4,0.01455 0.0011,5.3e-4 0.01402,5.3e-4 0.01482,0.01614 7.94e-4,0.01561 0.02037,0.01402 0.02434,0.01455 0.0045,0 0.01852,-0.01164 0.02037,-0.01191 0.0016,-7.94e-4 0.01006,-0.0074 0.02725,0.0024 0.01746,0.0095 0.02593,0.0082 0.03175,0.01244 0.0058,0.0042 0.0021,0.01244 0.0074,0.01535 0.0053,0.0029 0.02805,-7.93e-4 0.03387,0.0082 0.0058,0.009 -0.02328,0.0553 -0.03228,0.06033 -0.009,0.005 -0.0127,0.01693 -0.02222,0.02434 -0.0095,0.0074 -0.02143,0.01693 -0.0336,0.02408 -0.01085,0.0061 -0.01244,0.01746 -0.01746,0.02117 0.08308,-0.01852 0.144991,-0.0926 0.144991,-0.180975 0,-0.102129 -0.08308,-0.185208 -0.185208,-0.185208 z M 0.2286,0.200025 c -0.0024,7.94e-4 -0.0074,0.0058 -0.02064,-0.0021 -0.0127,-0.0079 -0.02143,-0.0061 -0.02275,-0.0074 0,0 -0.0013,-0.0029 0.0045,-0.0037 0.01164,-0.0013 0.02593,0.01085 0.02937,0.01085 0.0034,0 0.005,-0.0034 0.01085,-0.0013 0.0058,0.0021 0.0013,0.0034 -0.0013,0.0037 z M 0.167746,0.044979 c -0.0013,-7.94e-4 7.94e-4,-0.00212 0.0024,-0.0037 7.94e-4,-7.94e-4 5.29e-4,-0.00291 0.0013,-0.0037 0.0029,-0.00291 0.01614,-0.00661 0.01376,7.94e-4 -0.0029,0.00714 -0.01535,0.00794 -0.01746,0.00661 z m 0.03254,0.023548 c -0.005,-5.29e-4 -0.01535,-0.00132 -0.01376,-0.0037 0.0079,-0.00741 -0.0024,-0.010054 -0.009,-0.010054 -0.0066,-5.29e-4 -0.009,-0.00423 -0.0058,-0.00503 0.0032,-7.94e-4 0.01614,5.29e-4 0.01852,0.00212 0.0021,0.00159 0.01376,0.00661 0.01455,0.010054 5.3e-4,0.00344 0,0.00662 -0.0045,0.00662 z m 0.03889,-0.00132 c -0.0037,0.00238 -0.02196,-0.010848 -0.02514,-0.013758 -0.01482,-0.0127 -0.02355,-0.0082 -0.02646,-0.010848 -0.0029,-0.00265 -0.0021,-0.00503 0.0029,-0.009 0.005,-0.00397 0.01826,0.00159 0.02646,0.00238 0.0079,7.94e-4 0.01746,0.00714 0.01746,0.014552 5.29e-4,0.00662 0.0087,0.01323 0.005,0.016669 z"
         id="path18254" />
    </symbol>
    <symbol
       id="heart"
       viewBox="0 0 12 16">
      <title
         id="title18267">heart</title>
      <path
         style="stroke-width:0.026458"
         inkscape:connector-curvature="0"
         d="M 0.296333,0.079375 C 0.282575,0.062706 0.26326,0.05424 0.238125,0.052917 c -0.02566,0 -0.04472,0.011112 -0.05821,0.026458 C 0.166423,0.094721 0.159279,0.103717 0.15875,0.105833 0.158221,0.103717 0.151342,0.094721 0.137583,0.079375 0.123825,0.064029 0.106627,0.052917 0.079375,0.052917 0.05424,0.05424 0.03466,0.062971 0.021167,0.079375 0.007408,0.095515 5.29167e-4,0.113242 0,0.132292 0,0.14605 0.002381,0.172508 0.017727,0.202935 0.033073,0.233362 0.07964,0.280723 0.15875,0.343958 0.237596,0.280723 0.284956,0.233627 0.300037,0.202935 0.315119,0.172244 0.3175,0.145521 0.3175,0.132292 0.316971,0.113242 0.310092,0.095515 0.296333,0.078846 Z"
         id="path18269" />
    </symbol>
    <symbol
       id="embassy2"
       viewBox="0 0 497.85098 473.64472">
      <title
         id="title24670">embassy2</title>
      <path
         style="stroke-width:0.026458"
         inkscape:connector-curvature="0"
         d="M 0.183645,4.04943e-6 A 0.055798,0.055798 0 0 0 0.154552,0.008634 c -0.009,0.005705 -0.01607,0.01836 -0.02088,0.031626 l -0.0023,-0.00181 c 0,0 -0.444661,1.34566 0.302307,2.34291 0.38253,0.57922 1.316121,1.1631 2.176591,1.44006 L 3.6208,4.92963 C 3.45432,4.84042 3.27268,4.75589 3.07194,4.68396 2.51004,4.48261 1.86091,4.50332 1.35401,4.5665 1.10056,4.59808 0.882552,4.64062 0.729607,4.67238 c -0.07647,0.0159 -0.136903,0.0291 -0.176062,0.0367 -0.01667,0.003 -0.02707,0.005 -0.03411,0.006 a 0.055798,0.055798 0 0 0 -0.06485,0.0308 c -0.0041,0.009 -0.0028,0.0259 0.0017,0.0417 l -0.0035,-1.6e-4 c 0,0 0.516137,1.50333 1.690025,1.92923 C 2.48402,6.86337 2.9997,6.90884 3.49466,6.81845 3.96422,6.7327 4.41508,6.52033 4.66523,6.14035 5.34582,6.93056 5.9704,7.45756 6.54936,7.82314 5.89119,7.75863 5.2271,7.74638 4.56834,7.81658 a 0.055798,0.055798 0 0 0 -0.003,3.6e-4 C 4.05667,7.89593 3.66521,8.11435 3.274,8.38047 2.88279,8.64659 2.49012,8.96048 1.97139,9.24104 a 0.055798,0.055798 0 0 0 -0.005,0.003 C 1.91759,9.27694 1.83725,9.35084 1.7508,9.42181 1.7076,9.45731 1.6641,9.49131 1.6274,9.51601 1.5907,9.54071 1.5565,9.55421 1.5549,9.55441 a 0.055798,0.055798 0 0 0 -0.021,0.1034 c 0.96581,0.56479 1.92684,1.46239 2.8868,1.57249 1.82971,0.2098 3.5408,-1.1141 3.54381,-2.74683 0.36177,0.11873 0.70545,0.20516 1.03095,0.29305 0.64204,0.17337 1.05484,0.36133 1.66114,0.87447 0.5988,0.50681 1.0788,1.34971 1.7933,2.84911 a 0.055798,0.055798 0 0 0 0.063,0.03 l 0.6163,-0.1433 a 0.055798,0.055798 0 0 0 0.038,-0.078 C 12.4376,10.7784 11.769,9.87843 11.1008,9.31292 10.4324,8.74728 9.77124,8.53004 9.11209,8.35205 8.95825,8.31051 8.88874,8.31066 8.83015,8.30994 8.79258,8.30947 8.74783,8.30389 8.68809,8.29118 9.39783,7.78486 9.67546,6.6252 9.4437,5.43042 9.20051,4.17673 8.39015,2.87556 6.89388,2.24095 a 0.055798,0.055798 0 0 0 -0.0744,0.0328 C 5.93821,4.76467 6.65494,6.61936 7.68882,7.91973 6.90796,7.54691 5.80678,6.83036 4.85514,5.68503 5.64165,4.86801 5.9257,3.98781 5.74589,3.10416 5.56325,2.20661 4.91193,1.3112 3.86063,0.458684 a 0.055798,0.055798 0 0 0 -0.0855,0.01943 C 3.28611,1.5084 3.16262,2.3359 3.25974,3.04741 c 0.0684,0.50075 0.24661,0.94192 0.4779,1.3562 L 3.01619,3.61115 C 3.0136,3.21093 2.94024,2.40234 2.42206,1.71654 2.06378,1.24237 1.50124,0.823652 1.0331,0.51775 0.799032,0.364799 0.588439,0.240345 0.439444,0.15276 0.364946,0.108967 0.30568,0.074253 0.26762,0.050544 0.25023,0.039711 0.238694,0.031828 0.232066,0.026927 A 0.055798,0.055798 0 0 0 0.183646,4.04943e-6 Z"
         id="path24672" />
    </symbol>
    <symbol
       id="icon-leaf"
       viewBox="0 0 28 28">
      <title
         id="title26232">leaf</title>
      <path
         style="stroke-width:0.026458"
         inkscape:connector-curvature="0"
         d="m 0.529167,0.291042 c 0,-0.01447 -0.01199,-0.02646 -0.02646,-0.02646 -0.146341,0 -0.240612,0.06117 -0.3361,0.166608 -0.0049,0.0054 -0.0079,0.01117 -0.0079,0.0186 0,0.01447 0.01199,0.02646 0.02646,0.02646 0.0074,0 0.01323,-0.0029 0.0186,-0.0079 0.02027,-0.0182 0.03844,-0.03802 0.05829,-0.05665 0.07482,-0.06739 0.138906,-0.09427 0.240612,-0.09427 0.01447,0 0.02646,-0.01199 0.02646,-0.02646 z M 0.740833,0.20918 c 0,0.02646 -0.0029,0.05334 -0.0083,0.0798 -0.02646,0.128561 -0.109141,0.21209 -0.224076,0.269134 -0.0558,0.0281 -0.118242,0.04463 -0.181081,0.04463 -0.03969,0 -0.08062,-0.0066 -0.118242,-0.01942 -0.01984,-0.0066 -0.05953,-0.03265 -0.07607,-0.03265 -0.02066,0 -0.045481,0.08432 -0.081438,0.08432 -0.026035,0 -0.033893,-0.01281 -0.045059,-0.03183 -0.00373,-0.007 -0.00661446,-0.0095 -0.00661446,-0.0182 0,-0.043 0.08186246,-0.07649 0.08186246,-0.100462 0,-0.0037 -0.010742,-0.02564 -0.012409,-0.03389 -0.00249,-0.01405 -0.00373,-0.02852 -0.00373,-0.043 0,-0.131471 0.10459,-0.225319 0.222012,-0.26416 0.08475,-0.0281 0.265007,0.0046 0.322448,-0.050033 0.02273,-0.021087 0.03389,-0.040507 0.06863,-0.040507 0.04673,0 0.06202,0.121126 0.06202,0.156263 z"
         id="path26234" />
    </symbol>
    <symbol
       id="icon-envira"
       viewBox="0 0 30 28">
      <title
         id="title28757">envira</title>
      <path
         style="stroke-width:0.026458"
         inkscape:connector-curvature="0"
         d="M 0.370417,0.337344 C 0.317923,0.238125 0.269531,0.141393 0.131868,0.076068 0.049609,0.0372 0.12319,0.091361 0.12319,0.091361 0.19801,0.143034 0.232331,0.21291 0.272441,0.289375 c 0.0521,0.09964 0.130625,0.231087 0.238549,0.277389 0.107474,0.0463 0.05665,0.02066 0.0099,-0.01405 C 0.474186,0.517578 0.40804,0.408861 0.370417,0.337317 Z M 0.22696,0.561816 C 0.077708,0.443574 0.08599,0.302207 0,0 0.790019,0 0.606478,0.524616 0.607298,0.605658 L 0.740833,0.740833 H 0.697839 L 0.58166,0.623014 c -0.0645,0.007 -0.205872,0.05705 -0.3547,-0.06117 z"
         id="path28759" />
    </symbol>
    <symbol
       id="icon-commenting-o"
       viewBox="0 0 28 28">
      <title
         id="title28617">commenting-o</title>
      <path
         style="stroke-width:0.026458"
         inkscape:connector-curvature="0"
         d="m 0.264583,0.370417 c 0,0.02934 -0.02357,0.05292 -0.05292,0.05292 -0.02934,0 -0.05292,-0.02357 -0.05292,-0.05292 0,-0.02934 0.02357,-0.05292 0.05292,-0.05292 0.02934,0 0.05292,0.02357 0.05292,0.05292 z m 0.15875,0 c 0,0.02934 -0.02357,0.05292 -0.05292,0.05292 -0.02934,0 -0.05292,-0.02357 -0.05292,-0.05292 0,-0.02934 0.02357,-0.05292 0.05292,-0.05292 0.02934,0 0.05292,0.02357 0.05292,0.05292 z m 0.15875,0 c 0,0.02934 -0.02357,0.05292 -0.05292,0.05292 -0.02934,0 -0.05292,-0.02357 -0.05292,-0.05292 0,-0.02934 0.02357,-0.05292 0.05292,-0.05292 0.02934,0 0.05292,0.02357 0.05292,0.05292 z M 0.370417,0.15875 c -0.17198,0 -0.3175,0.09673 -0.3175,0.211667 0,0.0616 0.041354,0.120306 0.112871,0.160813 l 0.03596,0.02066 -0.01117,0.03969 c -0.0079,0.02934 -0.0182,0.0521 -0.02894,0.07112 0.04175,-0.01736 0.0798,-0.04093 0.113691,-0.0707 l 0.01778,-0.01572 0.02358,0.0025 c 0.01778,0.0021 0.03596,0.0033 0.05374,0.0033 0.171979,0 0.3175,-0.09673 0.3175,-0.211666 0,-0.114935 -0.145521,-0.211667 -0.3175,-0.211667 z m 0.370416,0.211667 c 0,0.146341 -0.165788,0.264583 -0.370416,0.264583 -0.02027,0 -0.04051,-0.0012 -0.05995,-0.0033 -0.05416,0.04797 -0.118639,0.08186 -0.190156,0.100039 -0.01487,0.0041 -0.031009,0.007 -0.047122,0.0091 H 0.07112 c -0.00828,0 -0.015716,-0.0066 -0.01778,-0.01572 V 0.724694 C 0.051276,0.714349 0.058288,0.708157 0.064505,0.700722 0.09054,0.67138 0.120306,0.646562 0.139753,0.577532 0.054584,0.529167 2.64583e-5,0.454342 2.64583e-5,0.370417 2.64583e-5,0.224473 0.165814,0.105833 0.370443,0.105833 v 0 c 0.204629,0 0.370417,0.11864 0.370417,0.264584 z"
         id="path28619" />
    </symbol>
    <symbol
       viewBox="0 0 64 64"
       id="emoji-1f343">
      <title
         id="title40203">1f343</title>
      <path
         style="fill:#83bf4f;stroke-width:0.026458"
         inkscape:connector-curvature="0"
         d="M 0.756602,1.01574 C 0.348006,1.08873 0.574649,1.29405 0.58756,1.36541 0.600472,1.43682 0.45884,1.7009 0.86741,1.62785 1.29471,1.55152 1.41764,1.13694 1.41764,1.13694 c 0,0 -0.520279,-0.146393 -0.661038,-0.1212"
         id="path40205" />
      <path
         style="fill:#699635;stroke-width:0.026458"
         inkscape:connector-curvature="0"
         d="M 0.684477,1.33218 0.768615,1.3177 0.784569,1.05772 0.78195,1.31538 0.926042,1.28244 0.953294,1.07262 0.939959,1.28005 1.06415,1.25016 1.14591,1.12834 1.08244,1.24698 1.41764,1.13689 1.0845,1.25844 1.22502,1.34157 1.06654,1.2623 0.943134,1.29752 1.06019,1.48616 0.929481,1.30043 0.786209,1.33895 0.878681,1.57787 0.772848,1.34168 0.689504,1.35959 0.674687,1.53368 0.676487,1.3625 0.459528,1.40933 0.452967,1.37242 0.67138,1.33445 0.609865,1.17544 Z"
         id="path40207" />
      <path
         style="fill:#42ade2;stroke-width:0.026458"
         inkscape:connector-curvature="0"
         d="M 0.541999,1.31821 C 0.469794,1.29148 0.40386,1.24116 0.35724,1.17449 0.310832,1.10781 0.282919,1.0269 0.277336,0.944113 c -0.0032,-0.04138 -0.0015,-0.08327 0.0046,-0.124646 0.0067,-0.0413 0.0181,-0.08186 0.03355,-0.120967 0.03096,-0.07816 0.07861,-0.150654 0.140176,-0.209444 0.0076,-0.0075 0.01548,-0.01455 0.02344,-0.02162 l 0.01254,-0.01071 0.01135,-0.0092 c 0.01715,-0.01349 0.0336,-0.02537 0.0513,-0.03712 0.03514,-0.02307 0.07231,-0.04371 0.111734,-0.05995 0.0785,-0.03294 0.164491,-0.05112 0.251486,-0.04919 0.08684,0.0015 0.174998,0.02265 0.254078,0.06948 0.0391,0.02387 0.0759,0.05477 0.10528,0.09477 0.0294,0.0395 0.0499,0.09012 0.0524,0.142928 0.003,0.05278 -0.012,0.104273 -0.0359,0.145495 -0.0237,0.04164 -0.0548,0.07514 -0.0869,0.103505 -0.0658,0.05816 -0.14716,0.09813 -0.234973,0.110701 -0.04382,0.0061 -0.08935,0.0055 -0.134435,-0.0054 -0.04466,-0.01093 -0.09012,-0.033 -0.124486,-0.07091 -0.03482,-0.03749 -0.05186,-0.09038 -0.05088,-0.137636 4.5e-4,-0.04781 0.01429,-0.09075 0.03217,-0.128958 0.03686,-0.07636 0.08916,-0.13798 0.145256,-0.193172 C 0.895694,0.377216 0.956575,0.328639 1.01944,0.28366 1.1457,0.194363 1.27995,0.11938 1.41764,0.052917 1.29008,0.137186 1.16507,0.225002 1.0504,0.323374 0.992981,0.372295 0.938424,0.424206 0.889847,0.480086 c -0.04802,0.05578 -0.09216,0.11565 -0.117158,0.179361 -0.01246,0.03154 -0.01939,0.06395 -0.01746,0.09274 0.0018,0.02894 0.0127,0.05263 0.03093,0.07054 0.03662,0.03686 0.105146,0.04739 0.167296,0.03479 C 1.0166,0.845507 1.07651,0.812327 1.12276,0.767157 1.17086,0.720827 1.19856,0.664605 1.19266,0.617932 1.18766,0.571262 1.15096,0.525222 1.09746,0.495351 1.04476,0.464291 0.979437,0.449311 0.914085,0.447141 0.782428,0.443441 0.647914,0.496621 0.542874,0.584909 c -0.05143,0.04384 -0.09517,0.09755 -0.126629,0.158724 -0.01564,0.03059 -0.02799,0.06297 -0.03702,0.09639 -0.0096,0.03331 -0.01556,0.06784 -0.01749,0.102737 -0.0033,0.06967 0.0075,0.14156 0.03813,0.20685 0.02979,0.0657 0.07924,0.12396 0.141976,0.1686"
         id="path40209" />
    </symbol>
    <symbol
       viewBox="0 0 64 64"
       id="emoji-1f37d">
      <title
         id="title43166">1f37d</title>
      <circle
         style="fill:#dae3ea;stroke-width:0.026458"
         cx="0.820208"
         cy="0.846667"
         r="0.582083"
         id="circle43168" />
      <path
         style="fill:#acb8bf;stroke-width:0.026458"
         inkscape:connector-curvature="0"
         d="m 0.820208,0.451908 c 0.228782,0 0.414732,0.175498 0.422512,0.394759 1.9e-4,-0.0048 8.2e-4,-0.0095 8.2e-4,-0.01429 0,-0.225954 -0.18955,-0.409046 -0.423332,-0.409046 -0.233838,0 -0.423333,0.183118 -0.423333,0.409046 0,0.0048 5.56e-4,0.0095 6.88e-4,0.01429 0.0079,-0.219261 0.193834,-0.394759 0.422645,-0.394759"
         id="path43170" />
      <path
         style="fill:#ffffff;stroke-width:0.026458"
         inkscape:connector-curvature="0"
         d="m 0.820208,1.24142 c -0.228811,0 -0.414734,-0.17549 -0.422645,-0.394753 -1.32e-4,0.0048 -6.88e-4,0.0094 -6.88e-4,0.01429 C 0.396875,1.08691 0.58637,1.27 0.820208,1.27 1.05399,1.27 1.24354,1.08688 1.24354,0.860954 c 0,-0.0048 -6.3e-4,-0.0095 -8.2e-4,-0.01429 C 1.23494,1.06593 1.04899,1.24142 0.820208,1.24142"
         id="path43172" />
      <g
         style="fill:#acb8bf"
         id="g43178">
        <path
           style="stroke-width:0.026458"
           inkscape:connector-curvature="0"
           d="m 1.60126,0.196321 c -0.006,-0.02487 -0.0189,-2.65e-4 -0.0189,-2.65e-4 0,0 -0.004,0.257704 -0.033,0.260483 -0.0286,0.0028 -0.007,-0.265113 -0.0403,-0.270299 -0.0314,-0.005 -0.0135,0.274558 -0.0421,0.271727 -0.0285,-0.003 -0.0333,-0.260588 -0.0333,-0.260588 0,0 -0.0127,-0.02458 -0.019,1.32e-4 -0.0775,0.304509 -0.0148,0.429022 -0.0148,0.429022 0,0 0.0106,0.02617 0.0357,0.02633 0.002,0 5.6e-4,0.723237 7.1e-4,0.820467 0,0.0473 0.1455,0.0458 0.14539,-0.001 0,-0.0973 -0.003,-0.82047 -6.3e-4,-0.82047 0.0252,0 0.0358,-0.02617 0.0358,-0.02617 0,0 0.0625,-0.124434 -0.0155,-0.429128"
           id="path43174" />
        <path
           style="stroke-width:0.026458"
           inkscape:connector-curvature="0"
           d="m 0.069321,0.185208 c 0.032755,-7.9e-5 0.168619,0.0979 0.168804,0.462016 1.32e-4,0.116443 -0.06337,0.116416 -0.06326,0.189283 7.9e-5,0.07271 5.03e-4,0.651033 5.03e-4,0.651033 0,0 -0.06969,0.0478 -0.121497,-0.002 L 0.052917,0.195527 c 2.6e-5,2.7e-5 -1.33e-4,-0.01034 0.016404,-0.01032"
           id="path43176" />
      </g>
    </symbol>
  </defs>
  <sodipodi:namedview
     id="base"
     pagecolor="#ffffff"
     bordercolor="#666666"
     borderopacity="1.0"
     inkscape:pageopacity="0.0"
     inkscape:pageshadow="2"
     inkscape:zoom="0.5"
     inkscape:cx="921.732"
     inkscape:cy="483.72"
     inkscape:document-units="cm"
     inkscape:current-layer="layer1"
     showgrid="false"
     units="px"
     inkscape:window-width="1920"
     inkscape:window-height="1016"
     inkscape:window-x="0"
     inkscape:window-y="27"
     inkscape:window-maximized="1"
     inkscape:snap-global="false" />
  <metadata
     id="metadata5">
    <rdf:RDF>
      <cc:Work
         rdf:about="">
        <dc:format>image/svg+xml</dc:format>
        <dc:type
           rdf:resource="http://purl.org/dc/dcmitype/StillImage" />
        <dc:title></dc:title>
      </cc:Work>
    </rdf:RDF>
  </metadata>
  <g
     inkscape:label="Camada 1"
     inkscape:groupmode="layer"
     id="layer1"
     transform="translate(0,-106.5)">
    <rect
       y="-318.834"
       x="-12.2783"
       height="220.176"
       width="259.422"
       id="rect8900"
       style="opacity:1;vector-effect:none;fill:#1b75bc;fill-opacity:1;stroke:none;stroke-width:0.290528;stroke-linecap:square;stroke-linejoin:miter;stroke-miterlimit:10;stroke-dasharray:none;stroke-dashoffset:0;stroke-opacity:1;marker:none"
       transform="scale(1,-1)" />
    <text
       xml:space="preserve"
       style="font-style:oblique;font-variant:normal;font-weight:bold;font-stretch:normal;font-size:4.742745px;line-height:1.25;font-family:Cantarell;-inkscape-font-specification:'Cantarell, Bold Oblique';font-variant-ligatures:normal;font-variant-position:normal;font-variant-caps:normal;font-variant-numeric:normal;font-variant-alternates:normal;font-feature-settings:normal;text-indent:0;text-align:start;text-decoration:none;text-decoration-line:none;text-decoration-style:solid;text-decoration-color:#000000;letter-spacing:0px;word-spacing:0px;text-transform:none;writing-mode:lr-tb;direction:ltr;text-orientation:mixed;dominant-baseline:auto;baseline-shift:baseline;text-anchor:start;white-space:normal;shape-padding:0;opacity:1;vector-effect:none;fill:#000000;fill-opacity:1;stroke:none;stroke-width:0.118565;stroke-linecap:butt;stroke-linejoin:miter;stroke-miterlimit:4;stroke-dasharray:none;stroke-dashoffset:0;stroke-opacity:1"
       x="-63.0736"
       y="246.069"
       id="text4610"><tspan
         id="tspan4608"
         sodipodi:role="line"
         x="-63.0736"
         y="250.124" /></text>
    <g
       transform="matrix(0.26438,0,0,0.26438,185.881,105.593)"
       id="layer1-0"
       inkscape:label="Camada 1">
      <g
         id="g8794"
         transform="matrix(0.27455,0,0,0.27455,681.119,272.275)">
        <g
           id="g8830"
           transform="matrix(1.00714,0,0,1.00714,10.7609,-7.09212)">
          <g
             id="g8589"
             transform="matrix(1.06772,0,0,1.06772,-1645.31,465.252)">
            <g
               transform="matrix(1.68936,0,0,1.68936,126.48,319.748)"
               id="g827">
              <g
                 style="fill:#231f20"
                 id="g6">
                <path
                   inkscape:connector-curvature="0"
                   d="M 22.658,26.013 V 75.24 H 229.595 V 26.013 Z m -6.33,-6.505 h 219.6 V 81.57 H 16.328 V 19.508"
                   id="path2" />
                <path
                   inkscape:connector-curvature="0"
                   d="m 89.995,38.5 -3.867,15.471 h 8.086 l -4.219,-15.47 z m -4.748,-6.152 h 9.847 l 10.374,36.57 H 98.083 L 95.62,59.776 H 84.721 c 0,0 -1.89,7.357 -2.286,8.967 -2.199,0.168 -7.56,0 -7.56,0 L 85.246,32.348 m 113.049,0 h 15.298 v 4.748 h -9.845 v 5.273 h 8.965 v 4.747 h -8.965 v 5.45 h 9.845 v 4.748 H 198.299 V 32.348 m -43.775,0 h 7.389 l 7.032,27.251 6.854,-27.25 h 7.383 l -11.075,36.57 H 165.6 L 154.52,32.351 M 123.233,32.35 h 7.205 v 30.416 h 15.296 V 68.92 H 123.228 V 32.35 m -87.74,0 H 42.7 l 7.034,27.603 6.857,-27.603 h 7.56 L 53.073,68.92 H 46.395 L 35.493,32.35 m 205.09,-9.562 h 0.488 c 0.55,0 1.022,-0.203 1.022,-0.722 0,-0.37 -0.27,-0.738 -1.021,-0.738 -0.22,0 -0.37,0.017 -0.49,0.035 v 1.425 z m 0,2.328 H 239.91 V 20.91 c 0.353,-0.049 0.691,-0.1 1.191,-0.1 0.638,0 1.058,0.135 1.31,0.317 0.25,0.188 0.385,0.472 0.385,0.872 0,0.556 -0.37,0.89 -0.82,1.023 v 0.033 c 0.365,0.067 0.62,0.401 0.702,1.024 0.101,0.652 0.202,0.906 0.271,1.038 h -0.708 c -0.1,-0.132 -0.2,-0.52 -0.28,-1.07 -0.102,-0.538 -0.37,-0.74 -0.91,-0.74 h -0.468 v 1.81 z m 0.706,-5.38 c -1.66,0 -3.019,1.424 -3.019,3.187 0,1.792 1.359,3.198 3.034,3.198 1.675,0.017 3.017,-1.406 3.017,-3.183 0,-1.777 -1.342,-3.202 -3.017,-3.202 z m 0.02,-0.586 c 2.065,0 3.704,1.675 3.704,3.773 0,2.125 -1.639,3.786 -3.719,3.786 -2.061,0 -3.736,-1.661 -3.736,-3.786 0,-2.098 1.675,-3.773 3.736,-3.773 h 0.02"
                   id="path4" />
              </g>
              <path
                 style="fill:none"
                 inkscape:connector-curvature="0"
                 d="M 1.45,1.45 H 259.887 V 99.275 H 1.449 Z"
                 id="path8" />
            </g>
            <g
               id="g4505"
               transform="matrix(1.18735,0,0,1.18735,679.405,315.227)">
              <path
                 d="m 147.623,-0.005 c -23.208,0 -42.02,18.815 -42.02,42.018 0,23.209 18.812,42.022 42.02,42.022 23.206,0 42.016,-18.813 42.016,-42.022 0,-23.203 -18.81,-42.018 -42.016,-42.018 m 0,69.06 c -14.934,0 -27.041,-12.106 -27.041,-27.039 0,-14.932 12.107,-27.041 27.04,-27.041 14.932,0 27.042,12.109 27.042,27.041 0,14.933 -12.11,27.038 -27.041,27.038 M 81.231,20.478 70.616,31.095 82.456,42.253 70.709,53.323 81.32,63.938 103.004,42.254 81.23,20.478"
                 id="path2-3"
                 inkscape:connector-curvature="0"
                 style="fill:#5e398d" />
              <path
                 d="M 42.194,84.509 C 31.72,84.509 22.217,80.873 13.957,73.689 4.692,65.592 0,54.92 0,41.973 0,30.48 4.25,20.496 12.63,12.298 20.925,4.138 31.049,-0.004 42.707,-0.004 c 11.565,0 21.622,4.188 29.876,12.44 L 61.621,23.4 c -5.32,-5.315 -11.505,-7.901 -18.914,-7.901 -7.551,0 -13.838,2.575 -19.22,7.865 -5.373,5.261 -7.982,11.345 -7.982,18.61 0,8.392 2.829,14.942 8.638,20.018 5.423,4.713 11.328,7.014 18.051,7.014 7.677,0 14.04,-2.568 19.457,-7.847 L 72.475,72.265 C 64.137,80.39 53.95,84.509 42.195,84.509"
                 id="path4-6"
                 inkscape:connector-curvature="0"
                 style="fill:#d3d5d7" />
              <path
                 d="m 50.608,147.014 c 4.514,0 8.957,-3.199 8.957,-9.634 0,-6.439 -4.443,-9.636 -8.957,-9.636 -4.478,0 -8.918,3.197 -8.918,9.636 0,6.435 4.44,9.634 8.918,9.634 m 0,-23.521 c 7,0 13.584,5.15 13.584,13.887 0,8.766 -6.584,13.92 -13.584,13.92 -6.998,0 -13.548,-5.154 -13.548,-13.92 0,-8.736 6.55,-13.887 13.548,-13.887 m 24.699,27.246 v -26.685 h 4.515 v 22.393 h 12.232 v 4.292 H 75.307 m 27.217,0 v -26.685 h 4.516 v 22.393 h 12.232 v 4.292 h -16.748 m 34.927,-10.876 h 8.128 l -4.065,-10.913 z m 9.708,4.174 H 135.87 l -2.482,6.699 h -4.782 l 10.385,-26.68 h 5.233 l 10.386,26.68 h -4.929 l -2.522,-6.699 m 28.222,2.862 c 2.713,0 4.48,-1.465 4.48,-3.838 0,-2.295 -1.545,-3.913 -4.329,-3.913 h -4.74 v 7.75 h 4.59 z m -0.487,-11.553 c 2.633,0 4.216,-1.506 4.216,-3.726 0,-2.257 -1.583,-3.728 -4.329,-3.728 h -3.99 v 7.454 z m 0.602,-11.292 c 5.12,0 8.128,3.014 8.128,7.188 0,2.824 -1.658,4.931 -3.95,5.76 2.822,0.752 4.777,3.198 4.777,6.362 0,4.289 -3.31,7.375 -8.276,7.375 h -9.861 v -26.685 h 9.182 m 33.719,22.96 c 4.514,0 8.955,-3.199 8.955,-9.634 0,-6.439 -4.441,-9.636 -8.955,-9.636 -4.48,0 -8.919,3.197 -8.919,9.636 0,6.435 4.439,9.634 8.919,9.634 m 0,-23.521 c 6.999,0 13.586,5.15 13.586,13.887 0,8.766 -6.587,13.92 -13.586,13.92 -7.003,0 -13.55,-5.154 -13.55,-13.92 0,-8.736 6.548,-13.887 13.55,-13.887 m 63.339,16.37 h 8.127 l -4.062,-10.913 z m 9.71,4.174 h -11.292 l -2.482,6.699 h -4.784 l 10.386,-26.68 h 5.232 l 10.388,26.68 h -4.928 l -2.52,-6.699 M 23.132,141.351 c -1.407,3.778 -4.819,5.663 -8.277,5.663 -4.478,0 -8.92,-3.199 -8.92,-9.634 0,-6.439 4.442,-9.636 8.92,-9.636 3.47,0 6.89,1.896 8.29,5.697 h 4.806 c -1.647,-6.322 -7.224,-9.948 -13.096,-9.948 -6.999,0 -13.548,5.153 -13.548,13.887 0,8.766 6.55,13.92 13.548,13.92 5.864,0 11.434,-3.618 13.09,-9.949 h -4.813 m 221.766,-4.936 c 2.783,0 4.4,-1.621 4.4,-4.062 0,-2.488 -1.807,-4.104 -4.59,-4.104 h -5.237 v 8.166 h 5.426 z m -1.545,3.99 h -3.882 v 10.536 h -4.553 V 124.26 h 10.617 c 5.154,0 8.355,3.575 8.355,8.094 0,3.798 -2.107,6.697 -5.832,7.602 l 6.4,10.986 h -5.117 l -5.989,-10.536"
                 id="path6"
                 inkscape:connector-curvature="0"
                 style="fill:#5e398d" />
            </g>
          </g>
          <g
             id="g8637"
             transform="matrix(2.46877,0,0,2.46877,-1444.01,-397.788)">
            <path
               id="path8611"
               d="m 134.55,18.441 c -1.949,0 -4.233,-2.244 -8.04,-2.244 -3.387,0 -5.579,1.918 -5.579,4.479 0,2.163 1.261,4.016 6.597,4.733 7.445,1.045 10.237,2.967 10.237,6.812 0,4.973 -4.319,8.019 -11.595,8.019 -5.5,0 -9.902,-2.318 -9.902,-3.522 0,-0.886 1.018,-0.769 1.862,-0.769 1.78,0 3.692,2.077 8.349,2.077 3.895,0 5.305,-2.238 5.305,-4.641 0,-3.047 -0.705,-4.527 -5.445,-5.088 -6.854,-0.8 -10.07,-2.645 -10.07,-6.814 0,-4.646 3.895,-7.69 10.326,-7.69 4.23,0 9.396,2.082 9.396,3.526 -0.03,0.639 -0.88,1.122 -1.47,1.122 m 13.909,20.041 c 3.215,0 5.925,-2.25 5.925,-5.131 0,-1.849 -1.523,-3.369 -3.806,-3.369 -2.796,0 -6.183,2.24 -6.183,4.805 -0.01,2.088 1.86,3.695 4.06,3.695 m -7.45,-3.129 c 0,-3.289 3.134,-5.129 7.027,-5.613 3.978,-0.477 6.176,-2.002 6.176,-3.686 0,-2.404 -1.862,-4.172 -4.062,-4.172 h -0.676 c -2.455,0 -3.553,2.406 -5.418,2.406 -0.51,0 -1.014,0.08 -1.014,-0.559 0,-1.6 3.385,-2.648 6.432,-2.648 8.969,0 8.295,3.129 8.295,10.906 v 5.848 c 0,1.046 -0.513,1.604 -1.528,1.604 -0.847,0 -2.367,-0.558 -3.724,-0.558 -2.535,0 -3.213,1.118 -5.922,1.118 -3.05,10e-4 -5.59,-1.765 -5.59,-4.646 m 29.208,-3.207 c 1.182,0 2.191,-0.883 2.701,-2.563 l 1.777,-6.335 c 0.426,-1.363 1.355,-2.079 2.629,-2.079 0.25,0 1.438,0.076 1.521,1.119 0.08,0.562 -0.597,2.083 -0.597,2.165 L 173.39,37.76 c -0.513,1.439 -1.438,2.164 -2.875,2.164 -1.865,0 -3.049,-0.482 -3.811,-2.645 L 161.965,24.05 c -0.764,-2.077 -0.342,-2.806 1.014,-2.806 1.944,0 2.538,0.324 3.383,4.01 1.11,4.728 1.78,6.892 3.82,6.892 m 21.698,6.174 c 3.389,0 6.773,-2.647 6.773,-7.615 0,-5.609 -3.301,-7.855 -6.854,-7.855 -3.391,0 -6.854,2.646 -6.854,7.211 0,5.128 2.7,8.259 6.93,8.259 m -0.08,1.764 c -6.264,0 -10.158,-3.771 -10.158,-9.541 0,-5.449 3.979,-9.461 9.312,-9.461 7.104,0 11.082,3.287 11.082,9.54 0.01,5.772 -3.97,9.462 -10.23,9.462 M 208.85,16.197 c -1.27,0 -1.688,-0.398 -1.688,-1.043 0,-0.646 0.42,-1.047 1.354,-1.047 0.846,0 1.689,0.248 1.689,1.047 0,0.643 -0.84,1.043 -1.35,1.043 m 1.78,20.758 c 0,1.843 -0.59,2.807 -1.775,2.807 -1.857,0 -2.117,-0.479 -2.117,-4.168 V 24.211 c 0,-1.924 0.428,-2.885 1.863,-2.885 2.029,0 2.029,0.88 2.029,4.327 z M 225.73,21.568 c 0.68,0 1.439,0.078 1.439,1.279 0,0.963 -1.439,1.201 -2.793,1.924 -2.201,1.125 -2.031,1.205 -2.791,1.926 -0.762,1.041 -1.188,2.162 -1.188,3.525 v 6.893 c 0,1.843 -0.592,2.724 -1.691,2.724 -2.203,0 -2.539,-0.481 -2.539,-3.849 V 23.888 c 0,-1.845 0.682,-2.808 2.115,-2.808 1.188,0 3.639,0.646 4.061,0.646 1.36,0 2.21,-0.158 3.39,-0.158 m 14.187,8.91 c 0,1.553 -0.846,2.336 -2.283,2.336 h -2.795 c -1.436,0 -2.195,-1.103 -2.195,-2.336 0,-1.373 0.68,-2.221 1.943,-2.221 h 3.217 c 1.37,0 2.12,0.975 2.12,2.221 M 255.1,16.754 c -0.332,0.244 -0.932,1.521 -0.932,2.007 0,0.398 0.172,0.879 0.428,1.276 0.252,0.403 1.604,1.205 1.604,1.933 0,0.715 -0.51,0.635 -1.604,1.596 -0.682,0.567 -1.613,1.846 -1.613,3.451 v 8.254 c 0,3.687 -0.334,4.33 -2.025,4.33 -1.697,0 -2.031,-0.645 -2.031,-4.33 l -0.09,-8.096 c 0,-1.765 -0.506,-2.482 -1.188,-3.365 -0.506,-0.64 -1.523,-1.125 -1.523,-1.768 0,-0.801 0.6,-0.801 1.523,-1.919 0.426,-0.562 0.594,-0.927 1.865,-4.091 0.422,-1.041 1.438,-2.524 4.736,-2.524 1.857,0 2.451,0.522 2.451,1.397 -0.01,0.728 0.08,0.569 -1.61,1.849 m 11.765,21.728 c 3.221,0 5.928,-2.25 5.928,-5.131 0,-1.849 -1.527,-3.369 -3.811,-3.369 -2.793,0 -6.18,2.24 -6.18,4.805 0,2.088 1.86,3.695 4.06,3.695 m -7.45,-3.129 c 0,-3.289 3.133,-5.129 7.027,-5.613 3.977,-0.477 6.176,-2.002 6.176,-3.686 0,-2.404 -1.861,-4.172 -4.061,-4.172 h -0.682 c -2.451,0 -3.557,2.406 -5.414,2.406 -0.506,0 -1.018,0.08 -1.018,-0.559 0,-1.6 3.387,-2.648 6.432,-2.648 8.979,0 8.299,3.129 8.299,10.906 v 5.848 c 0,1.046 -0.506,1.604 -1.521,1.604 -0.846,0 -2.373,-0.558 -3.727,-0.558 -2.541,0 -3.217,1.118 -5.928,1.118 -3.05,10e-4 -5.59,-1.765 -5.59,-4.646 m 24.64,-19.156 c -1.27,0 -1.688,-0.398 -1.688,-1.043 0,-0.646 0.42,-1.047 1.354,-1.047 0.846,0 1.689,0.248 1.689,1.047 0,0.643 -0.84,1.043 -1.35,1.043 m 1.78,20.758 c 0,1.843 -0.59,2.807 -1.777,2.807 -1.854,0 -2.115,-0.479 -2.115,-4.168 V 24.211 c 0,-1.924 0.43,-2.885 1.861,-2.885 2.031,0 2.031,0.88 2.031,4.327 z M 300.08,21.568 c 0.676,0 1.438,0.078 1.438,1.279 0,0.963 -0.593,1.201 -1.941,1.924 -2.202,1.125 -2.034,1.205 -2.795,1.926 -0.76,1.041 -1.185,2.162 -1.185,3.525 v 6.893 c 0,1.843 -0.596,2.724 -1.692,2.724 -2.2,0 -2.539,-0.481 -2.539,-3.849 V 23.888 c 0,-1.845 0.677,-2.808 2.115,-2.808 1.185,0 3.642,0.646 4.062,0.646 1.35,0 1.35,-0.158 2.54,-0.158 m 12.857,8.095 h 1.439 c 2.031,0 3.977,-1.445 3.977,-3.048 0,-2.006 -1.693,-3.93 -4.734,-3.93 -3.217,0 -5.166,1.604 -5.166,3.688 0,1.925 1.94,3.29 4.48,3.29 m 7.54,0.559 -5.336,-0.078 c -5.248,0 -7.107,0.881 -7.107,3.604 0,2.407 2.791,4.733 5.666,4.733 1.359,0 2.377,-0.162 2.963,-0.562 l 2.199,-1.369 c 0.428,-0.239 0.51,-0.562 1.354,-0.562 2.287,0 -0.168,4.092 -6.768,4.092 -5.586,0 -9.309,-3.605 -9.309,-9.225 0,-5.924 3.217,-9.776 9.309,-9.776 7.279,0 8.885,5.614 8.885,7.698 0.01,0.963 -0.5,1.445 -1.84,1.445"
               inkscape:connector-curvature="0"
               style="fill:#a1a0a1" />
            <g
               id="g8617"
               style="fill:#56b0c9">
              <path
                 id="path8613"
                 d="m 128.33,73.492 c 1.818,1.832 8.021,2.262 19.568,2.262 2.885,0 4.859,0.758 4.859,2.266 0,1.836 -1.672,2.809 -4.859,2.809 h -25.953 c -2.885,0 -4.404,-0.973 -4.404,-3.668 V 50.593 c 0,-2.262 1.67,-3.338 4.555,-3.338 3.346,0 4.712,1.183 4.712,3.338 -0.15,22.858 -0.15,21.168 1.52,22.899 m 41.902,4.299 c 0,2.051 -1.404,3.033 -3.686,3.033 -2.018,0 -3.299,-0.432 -3.299,-5.393 V 50.865 c 0.04,-1.832 1.467,-2.906 3.493,-2.906 2.427,0 3.484,0.969 3.49,5.268 v 24.564 h 0.01 z m 22.27,-27.665 9.867,12.672 c 3.957,5.16 8.646,6.726 11.688,6.726 3.797,0 5.928,-2.688 5.928,-6.049 v -12.9 c 0,-1.566 0.604,-2.354 1.973,-2.354 1.219,0 1.822,1.12 1.822,3.254 V 78.72 c 0,1.688 -0.908,2.585 -2.887,2.585 h -1.213 c -1.826,0 -3.496,-0.787 -4.562,-2.021 L 200.243,63.923 c -1.675,-2.135 -4.103,-3.812 -6.384,-3.812 -4.104,0 -6.229,2.242 -6.229,6.168 v 11.998 c 0,1.57 -0.303,2.808 -1.975,2.808 -1.217,0 -1.818,-0.787 -1.818,-3.252 V 50.576 c 0,-1.68 0.762,-2.58 2.275,-2.58 h 1.977 c 1.82,0 3.18,0.447 4.4,2.13 m 51.051,1.153 V 69.07 c 0,5.822 5.021,9.812 12.615,9.812 7.596,0 12.605,-3.989 12.605,-9.812 V 51.279 c 0,-2.27 0.611,-3.561 3.496,-3.561 2.582,0 3.646,0.539 3.646,5.064 v 15.854 c 0,6.146 -4.254,13.581 -19.75,13.581 -14.586,0 -19.754,-6.254 -19.754,-13.581 V 51.277 c 0,-2.051 0.76,-3.451 2.433,-3.451 h 1.979 c 1.8,0 2.72,1.185 2.72,3.453 m 70.56,-1.727 c 1.066,-1.073 2.43,-2.051 6.234,-2.051 1.668,0 2.582,0.105 2.582,1.076 0,0.975 -0.771,1.836 -4.258,5.071 -6.535,6.037 -7.297,7.543 -7.297,9.483 0,2.05 1.521,3.562 2.436,4.533 11.852,11.967 12.154,11.854 12.154,12.821 0,0.867 -0.766,1.188 -2.893,1.188 -4.561,0 -5.475,-0.538 -10.641,-6.571 -3.643,-4.312 -5.768,-5.394 -7.746,-5.394 -3.646,0 -5.012,0.856 -10.178,6.901 -4.561,5.279 -6.229,5.062 -9.266,5.062 -1.975,0 -3.041,-0.43 -3.041,-1.189 0,-0.854 2.125,-2.477 4.713,-5.17 -2.588,2.586 7.74,-7.65 8.199,-8.195 1.221,-1.4 1.979,-2.803 1.979,-3.988 0,-1.293 -1.367,-3.445 -2.127,-4.205 l -8.355,-8.301 c -3.037,-2.91 -0.148,-3.129 0.908,-3.129 5.17,0 5.479,0.219 10.029,5.395 2.279,2.586 4.254,3.775 6.531,3.775 1.523,0 3.498,-0.436 5.014,-1.832 1.56,-1.398 3.37,-3.663 5.05,-5.28 m 19.863,-0.521 c -0.908,-0.977 -2.189,-1.515 -3.607,-1.515 -2.744,0 -4.893,2.149 -4.893,4.892 0,2.637 2.252,4.865 4.918,4.865 a 4.982,4.982 0 0 0 3.396,-1.352 c 0.965,-0.914 1.496,-2.172 1.496,-3.543 a 5.04,5.04 0 0 0 -1.32,-3.347 z m 0.56,3.461 c 0,2.383 -1.83,4.25 -4.166,4.25 -1.145,0 -2.188,-0.449 -2.941,-1.266 -0.756,-0.82 -1.172,-1.959 -1.172,-3.207 0,-2.406 1.807,-4.224 4.195,-4.224 1.129,0 2.168,0.46 2.924,1.294 0.75,0.827 1.16,1.946 1.16,3.153 z"
                 inkscape:connector-curvature="0" />
              <path
                 id="path8615"
                 d="m 331.09,50.044 h -1.516 c -0.881,0 -1.029,0.396 -1.029,1.281 v 2.723 c 0,0.166 0,0.668 0.361,0.668 0.268,0 0.303,-0.297 0.32,-0.493 0,-0.029 0.01,-0.058 0.01,-0.082 0.08,-0.526 0.342,-0.869 0.668,-0.869 0.453,0 0.727,0.403 1.061,0.974 0.252,0.422 0.377,0.502 0.521,0.502 0.144,0 0.223,-0.08 0.223,-0.226 0,-0.097 -0.06,-0.239 -0.127,-0.407 -0.08,-0.207 -0.178,-0.441 -0.178,-0.621 0,-0.441 0.146,-0.623 0.455,-0.961 0.428,-0.455 0.545,-0.664 0.545,-1.263 0.03,-0.618 -0.62,-1.226 -1.29,-1.226 z m 0.32,1.448 c 0,0.508 -0.434,0.861 -1.055,0.861 -0.613,0 -0.945,-0.459 -0.945,-0.893 0,-0.455 0.486,-0.887 1.002,-0.887 0.58,0 0.99,0.486 0.99,0.919 z"
                 inkscape:connector-curvature="0" />
            </g>
            <path
               id="path8619"
               d="M 51.563,0.176 C 25.424,-2.063 2.423,17.306 0.177,43.439 -2.064,69.576 17.3,92.58 43.44,94.822 69.579,97.068 92.581,77.703 94.823,51.564 97.065,25.429 77.702,2.425 51.563,0.176"
               inkscape:connector-curvature="0"
               style="fill:#56b0c9" />
            <path
               id="path8621"
               d="m 83.463,61.93 c -1.086,1.245 -6.658,-5.69 -9.956,-6.695 -4.03,-1.221 -8.682,-3.274 -12.113,-4.704 0.711,2.803 1.405,8.778 1.364,12.758 -0.091,9.313 -3.412,20.071 -13.647,20.071 -10.088,0 -15.695,-8.394 -14.162,-17.573 0.82,-4.902 2.438,-10.904 2.271,-11.054 -0.01,-0.01 -1.476,-0.213 -2.97,-0.151 -1.813,0.071 -2.916,0.586 -5.2,0.83 -2.351,0.258 -4.87,1.252 -7.964,2.771 -3.535,1.729 -6.994,7.274 -8.087,5.563 -1.594,-2.498 3.917,-13.021 10.551,-17.629 5.998,-4.154 9.582,-6.188 11.058,-7.432 1.481,-1.25 3.014,-2.595 3.412,-4.197 0.229,-0.907 -0.226,-2.611 -0.681,-3.971 -0.32,-0.953 -1.532,-2.914 -2.44,-5.462 -0.906,-2.55 -0.229,-5.925 2.141,-8.403 2.369,-2.481 7.976,-2.639 11.252,-2.571 3.277,0.063 1.801,-0.243 4.47,-0.716 2.673,-0.471 3.687,0.024 5.278,0.766 0,0 0.109,0.87 -0.559,1.279 -0.607,0.365 -1.543,1.14 -2.953,1.977 -1.41,0.836 -2.967,2.872 -4.418,4.419 -1.453,1.54 -1.685,3.735 -1.283,5.257 0.36,1.359 2.324,2.985 3.531,4.432 1.758,1.512 3.633,2.994 3.633,2.994 0,0 5.062,2.615 11.033,6.804 14.559,10.197 18.911,17.775 16.439,20.637"
               inkscape:connector-curvature="0"
               style="fill:#ffffff" />
          </g>
          <g
             id="g8665"
             transform="matrix(2.25686,0,0,2.25686,-1419.18,325.317)">
            <path
               id="path8651"
               d="M 4.8,4.8 V 37.743 H 119.491 V 4.8 Z M 112.323,30.576 H 11.97 V 11.968 h 100.354 v 18.608 z"
               inkscape:connector-curvature="0"
               style="fill:#00b388" />
            <path
               id="path8653"
               d="M 11.969,92.192 H 4.801 V 59.248 h 7.168 V 72.267 H 24.778 V 59.248 h 7.168 V 92.192 H 24.778 V 78.54 H 11.969 Z m 36.264,0.526 c -7.273,0 -12.229,-4.586 -12.229,-12.122 0,-7.328 4.85,-12.389 11.28,-12.389 7.01,0 10.488,4.692 10.488,11.703 v 2.636 h -14.97 c 0.844,3.636 3.69,4.583 6.537,4.583 2.477,0 4.269,-0.525 6.482,-1.896 h 0.264 v 5.429 c -1.896,1.371 -4.585,2.056 -7.852,2.056 z m -5.43,-14.969 h 8.539 c -0.157,-2.424 -1.159,-4.111 -3.953,-4.111 -2.108,0 -3.953,0.895 -4.586,4.111 z m 33.681,0.632 -3.689,13.811 H 66.523 L 59.354,68.999 v -0.263 h 6.852 l 3.901,13.862 3.689,-13.862 h 5.587 l 3.743,13.862 3.953,-13.862 h 6.589 v 0.263 L 86.5,92.192 h -6.273 z m 28.832,14.337 c -5.693,0 -8.012,-2.268 -8.012,-7.59 v -25.88 h 6.958 v 25.406 c 0,1.635 0.632,2.214 2.002,2.214 0.476,0 1.16,-0.157 1.582,-0.317 h 0.105 v 5.746 c -0.579,0.21 -1.581,0.421 -2.635,0.421 z m 16.814,0 c -7.273,0 -12.228,-4.586 -12.228,-12.122 0,-7.328 4.849,-12.389 11.279,-12.389 7.01,0 10.489,4.692 10.489,11.703 v 2.636 H 116.7 c 0.843,3.636 3.689,4.583 6.536,4.583 2.478,0 4.27,-0.525 6.484,-1.896 h 0.264 v 5.429 c -1.897,1.371 -4.586,2.056 -7.854,2.056 z m -5.429,-14.969 h 8.539 c -0.159,-2.424 -1.159,-4.111 -3.953,-4.111 -2.108,0 -3.954,0.895 -4.586,4.111 z m 43.537,-9.014 h 5.167 v 5.586 h -5.167 v 9.542 c 0,2.055 0.791,3.004 2.899,3.004 0.58,0 1.318,-0.053 2.109,-0.317 h 0.158 v 5.482 c -0.897,0.317 -2.267,0.686 -4.27,0.686 -5.642,0 -7.854,-2.583 -7.854,-8.539 v -9.857 h -8.908 v 9.542 c 0,2.055 0.791,3.004 2.899,3.004 0.58,0 1.318,-0.053 2.108,-0.317 h 0.159 v 5.482 c -0.896,0.317 -2.267,0.686 -4.27,0.686 -5.641,0 -7.854,-2.583 -7.854,-8.539 v -9.857 h -3.585 v -5.586 h 3.585 v -6.43 h 6.958 v 6.43 h 8.908 v -6.43 h 6.958 z m 41.261,1.687 c 0,7.169 -4.797,11.07 -12.073,11.07 h -5.111 v 10.7 h -7.166 V 59.248 h 12.277 c 7.277,0 12.073,3.9 12.073,11.174 z m -12.652,5.008 c 3.639,0 5.378,-2.056 5.378,-5.008 0,-3.057 -1.739,-5.112 -5.378,-5.112 h -4.532 v 10.12 z m 28.147,14.442 c -1.528,1.844 -3.793,2.74 -6.219,2.74 -4.585,0 -8.328,-2.791 -8.328,-7.747 0,-4.586 3.743,-7.644 9.118,-7.644 1.687,0 3.428,0.265 5.219,0.791 v -0.421 c 0,-2.531 -1.423,-3.637 -5.165,-3.637 -2.374,0 -4.639,0.685 -6.589,1.792 h -0.263 v -5.587 c 1.791,-1.054 4.954,-1.951 8.062,-1.951 7.064,0 10.911,3.374 10.911,9.278 v 14.706 h -6.747 v -2.32 z m -0.21,-5.061 v -2.003 c -1.055,-0.579 -2.423,-0.79 -3.848,-0.79 -2.267,0 -3.636,0.843 -3.636,2.74 0,1.952 1.369,2.795 3.425,2.795 1.95,0 3.426,-1.003 4.059,-2.742 z m 10.489,-4.321 c 0,-7.538 5.324,-12.282 12.281,-12.282 2.479,0 4.797,0.528 6.536,1.792 v 5.957 h -0.264 c -1.529,-1.16 -3.321,-1.846 -5.376,-1.846 -3.479,0 -6.114,2.373 -6.114,6.378 0,4.005 2.636,6.325 6.114,6.325 2.055,0 3.847,-0.686 5.376,-1.846 h 0.264 v 5.956 c -1.739,1.267 -4.058,1.793 -6.536,1.793 -6.957,0 -12.281,-4.689 -12.281,-12.227 z m 30.147,1.055 v 10.646 h -6.955 V 59.248 h 6.955 v 18.764 l 7.013,-9.277 h 7.905 v 0.263 l -8.433,10.647 8.433,12.282 v 0.264 h -7.958 z m 30.732,8.327 c -1.528,1.844 -3.796,2.74 -6.221,2.74 -4.586,0 -8.328,-2.791 -8.328,-7.747 0,-4.586 3.742,-7.644 9.12,-7.644 1.687,0 3.426,0.265 5.218,0.791 v -0.421 c 0,-2.531 -1.424,-3.637 -5.165,-3.637 -2.371,0 -4.641,0.685 -6.591,1.792 h -0.262 v -5.587 c 1.793,-1.054 4.954,-1.951 8.064,-1.951 7.063,0 10.911,3.374 10.911,9.278 v 14.706 h -6.747 v -2.32 z m -0.211,-5.061 v -2.003 c -1.054,-0.579 -2.425,-0.79 -3.849,-0.79 -2.266,0 -3.637,0.843 -3.637,2.74 0,1.952 1.371,2.795 3.426,2.795 1.952,0 3.428,-1.003 4.06,-2.742 z m 18.66,-12.281 c 1.263,-2.583 3.108,-4.059 5.693,-4.059 0.947,0 1.896,0.21 2.263,0.421 v 6.642 h -0.262 c -0.79,-0.317 -1.739,-0.528 -3.058,-0.528 -2.16,0 -3.847,1.266 -4.428,3.689 V 92.19 h -6.957 V 68.733 h 6.748 v 3.797 z m 26.614,17.237 c -1.474,1.897 -3.794,2.951 -6.955,2.951 -6.01,0 -9.857,-5.48 -9.857,-12.229 0,-6.747 3.848,-12.282 9.857,-12.282 3.057,0 5.27,0.95 6.745,2.689 V 59.248 h 6.959 v 32.944 h -6.749 z m -0.21,-5.535 v -7.538 c -1.159,-1.687 -2.686,-2.424 -4.427,-2.424 -3.056,0 -5.111,2.214 -5.111,6.22 0,4.006 2.056,6.167 5.111,6.167 1.742,0 3.268,-0.739 4.427,-2.425 z M 4.8,102.949 h 20.346 v 4.005 H 9.386 V 117.02 H 23.67 v 3.901 H 9.386 v 10.965 h 15.76 v 4.004 H 4.8 Z m 37.16,9.276 c 5.218,0 8.117,3.426 8.117,9.065 v 14.6 h -4.374 v -14.493 c 0,-3.006 -1.528,-5.167 -4.849,-5.167 -2.741,0 -5.062,1.739 -5.851,4.217 V 135.89 H 30.628 V 112.7 h 4.375 v 3.372 c 1.369,-2.16 3.689,-3.847 6.957,-3.847 z m 19.871,0.475 h 5.955 v 3.743 h -5.955 v 12.49 c 0,2.636 1.37,3.532 3.847,3.532 0.685,0 1.423,-0.104 1.95,-0.315 h 0.158 v 3.74 c -0.631,0.265 -1.528,0.476 -2.74,0.476 -5.429,0 -7.59,-2.479 -7.59,-7.011 V 116.443 H 53.451 V 112.7 h 4.005 v -6.165 h 4.375 z m 20.187,23.666 c -6.799,0 -11.438,-4.535 -11.438,-11.808 0,-7.274 4.322,-12.333 10.595,-12.333 6.378,0 9.699,4.586 9.699,11.384 v 2.003 H 74.956 c 0.475,4.692 3.479,6.958 7.643,6.958 2.583,0 4.427,-0.579 6.483,-2.108 h 0.159 v 3.85 c -1.898,1.475 -4.376,2.054 -7.223,2.054 z m -6.904,-14.339 h 11.543 c -0.157,-3.424 -1.845,-6.059 -5.429,-6.059 -3.321,0 -5.482,2.476 -6.114,6.059 z m 25.299,-5.744 c 1.003,-2.476 3.216,-3.951 5.745,-3.951 1.002,0 1.898,0.157 2.267,0.368 v 4.32 h -0.158 c -0.632,-0.315 -1.687,-0.473 -2.741,-0.473 -2.372,0 -4.374,1.581 -5.113,4.217 V 135.89 H 96.038 V 112.7 h 4.375 z m 22.876,-4.058 c 6.905,0 10.595,5.64 10.595,12.069 0,6.432 -3.689,12.071 -10.595,12.071 -2.846,0 -5.27,-1.476 -6.482,-3.058 v 11.492 h -4.375 v -32.101 h 4.375 v 2.634 c 1.212,-1.631 3.636,-3.107 6.482,-3.107 z m -0.738,20.187 c 4.323,0 6.853,-3.426 6.853,-8.117 0,-4.639 -2.53,-8.116 -6.853,-8.116 -2.372,0 -4.585,1.423 -5.745,3.688 v 8.91 c 1.16,2.263 3.374,3.635 5.745,3.635 z m 20.874,-16.129 c 1,-2.476 3.215,-3.951 5.745,-3.951 1.001,0 1.897,0.157 2.266,0.368 v 4.32 h -0.158 c -0.632,-0.315 -1.686,-0.473 -2.741,-0.473 -2.373,0 -4.375,1.581 -5.113,4.217 v 15.126 h -4.375 V 112.7 h 4.375 v 3.583 z m 14.336,-12.965 c 1.528,0 2.794,1.211 2.794,2.741 0,1.527 -1.266,2.74 -2.794,2.74 -1.476,0 -2.793,-1.213 -2.793,-2.74 0,-1.53 1.318,-2.741 2.793,-2.741 z M 155.6,112.7 h 4.375 v 23.19 H 155.6 Z m 19.977,9.646 c 3.32,1.052 7.01,2.423 7.01,6.851 0,4.744 -3.899,7.169 -8.906,7.169 -3.058,0 -6.115,-0.739 -7.854,-2.108 v -4.164 h 0.21 c 1.951,1.793 4.849,2.583 7.59,2.583 2.478,0 4.691,-0.95 4.691,-2.953 0,-2.055 -1.844,-2.529 -5.482,-3.741 -3.269,-1.054 -6.905,-2.267 -6.905,-6.642 0,-4.481 3.689,-7.115 8.381,-7.115 2.741,0 5.164,0.579 7.116,1.897 v 4.217 h -0.159 c -1.896,-1.528 -4.111,-2.425 -6.852,-2.425 -2.742,0 -4.27,1.212 -4.27,2.847 0,1.843 1.686,2.37 5.43,3.584 z m 22.243,14.02 c -6.8,0 -11.438,-4.535 -11.438,-11.808 0,-7.274 4.322,-12.333 10.594,-12.333 6.379,0 9.699,4.586 9.699,11.384 v 2.003 h -15.92 c 0.475,4.692 3.48,6.958 7.644,6.958 2.584,0 4.428,-0.579 6.484,-2.108 h 0.157 v 3.85 c -1.896,1.475 -4.375,2.054 -7.22,2.054 z m -6.905,-14.339 h 11.541 c -0.156,-3.424 -1.844,-6.059 -5.427,-6.059 -3.321,0 -5.482,2.476 -6.114,6.059 z"
               inkscape:connector-curvature="0" />
          </g>
          <g
             transform="matrix(0.917776,0,0,0.917776,-1413.77,-31.6301)"
             id="g8732">
            <path
               style="fill:#4285f4"
               inkscape:connector-curvature="0"
               id="path8706"
               d="M 110,128.67 V 100 h 96 c 0.98,5.05 1.55,11.07 1.55,17.58 0,21.5 -5.89,48.13 -24.83,67.07 -18.43,19.2 -41.99,29.44 -73.22,29.44 C 51.64,214.1 3,166.99 3,109.13 3,51.27 51.64,4.17 109.5,4.17 c 32,0 54.79,12.54 71.94,28.93 L 161.22,53.32 C 148.93,41.8 132.29,32.84 109.51,32.84 c -42.24,0 -75.27,34.05 -75.27,76.29 0,42.24 33.03,76.29 75.27,76.29 27.39,0 43.01,-11.01 52.99,-20.99 8.14,-8.13 13.49,-19.8 15.57,-35.76 H 110 Z" />
            <path
               style="fill:#ea4335"
               inkscape:connector-curvature="0"
               id="path8708"
               d="m 353.84,146.51 c 0,38.91 -30.46,67.59 -67.84,67.59 -37.38,0 -67.84,-28.67 -67.84,-67.59 0,-39.17 30.46,-67.59 67.84,-67.59 37.38,0 67.84,28.42 67.84,67.59 z m -29.69,0 c 0,-24.32 -17.66,-40.96 -38.14,-40.96 -20.48,0 -38.15,16.64 -38.15,40.96 0,24.06 17.66,40.96 38.15,40.96 20.47,0 38.14,-16.9 38.14,-40.96 z" />
            <path
               style="fill:#fbbc05"
               inkscape:connector-curvature="0"
               id="path8710"
               d="m 501.84,146.51 c 0,38.91 -30.46,67.59 -67.84,67.59 -37.38,0 -67.84,-28.67 -67.84,-67.59 0,-39.17 30.46,-67.59 67.84,-67.59 37.38,0 67.84,28.42 67.84,67.59 z m -29.69,0 c 0,-24.32 -17.66,-40.96 -38.14,-40.96 -20.48,0 -38.15,16.64 -38.15,40.96 0,24.06 17.66,40.96 38.15,40.96 20.47,0 38.14,-16.9 38.14,-40.96 z" />
            <path
               style="fill:#4285f4"
               inkscape:connector-curvature="0"
               id="path8712"
               d="m 643.7,83.02 v 121.35 c 0,49.92 -29.44,70.4 -64.26,70.4 -32.77,0 -52.48,-22.02 -59.91,-39.94 l 25.86,-10.75 c 4.61,11.01 15.87,24.07 34.05,24.07 22.27,0 36.1,-13.83 36.1,-39.68 v -9.73 h -1.02 c -6.66,8.19 -19.46,15.36 -35.59,15.36 -33.79,0 -64.77,-29.44 -64.77,-67.33 0,-38.15 30.98,-67.84 64.77,-67.84 16.13,0 28.93,7.17 35.59,15.11 h 1.02 V 83.02 Z m -26.11,63.75 c 0,-23.81 -15.87,-41.22 -36.1,-41.22 -20.48,0 -37.63,17.41 -37.63,41.22 0,23.55 17.15,40.71 37.63,40.71 20.22,-0.01 36.1,-17.16 36.1,-40.71 z" />
            <path
               style="fill:#34a853"
               inkscape:connector-curvature="0"
               id="path8714"
               d="M 694,12 V 210 H 664.3 V 12 Z" />
            <path
               style="fill:#ea4335"
               inkscape:connector-curvature="0"
               id="path8716"
               d="m 808.68,168.78 23.04,15.36 c -7.43,11.01 -25.35,29.95 -56.32,29.95 -38.4,0 -67.07,-29.7 -67.07,-67.59 0,-40.2 28.93,-67.59 63.75,-67.59 35.07,0 52.23,27.91 57.86,43.01 l 3.07,7.68 -90.37,37.38 c 6.91,13.57 17.67,20.48 32.77,20.48 15.09,0.01 25.59,-7.41 33.27,-18.68 z m -70.92,-24.32 60.42,-25.09 c -3.33,-8.45 -13.31,-14.34 -25.09,-14.34 -15.1,0.01 -36.09,13.32 -35.33,39.43 z" />
          </g>
        </g>
      </g>
    </g>
    <g
       transform="matrix(0.458906,0,0,0.458906,-28.6927,112.924)"
       id="layer1-9"
       inkscape:label="Camada 1"
       style="fill:#ffffff">
      <path
         id="path6152"
         d="m 376.81,90.0591 -0.795,0.5565 c -4.324,3.0365 -13.438,6.5221 -21.38,9.1531 -7.941,2.6313 -14.751,4.4663 -14.751,4.4663 l -0.379,0.103 -0.2,0.34 C 293.026,182.774 200.506,211.036 200.506,211.036 l -0.928,0.281 0.564,1.854 0.928,-0.284 c 0,0 92.867,-28.26 139.684,-106.891 0.324,-0.09 6.687,-1.802 14.491,-4.388 8,-2.6501 17.103,-6.0433 21.887,-9.4026 l 0.791,-0.5602 z m 1.162,4.0731 -0.791,0.5565 c -4.325,3.0365 -13.442,6.5183 -21.383,9.1493 -7.942,2.631 -14.748,4.467 -14.748,4.467 l -0.383,0.102 -0.2,0.341 C 294.188,186.843 201.668,215.106 201.668,215.106 l -0.928,0.28 0.564,1.855 0.928,-0.284 c 0,0 92.867,-28.259 139.684,-106.888 0.324,-0.09 6.687,-1.806 14.491,-4.391 5.421,-1.796 11.318,-3.938 16.065,-6.1744 -5.865,5.0864 -13.684,13.4544 -22.587,23.6734 -11.573,13.284 -24.845,29.597 -37.4,45.448 -25.065,31.646 -47.227,61.384 -47.306,61.49 -5.774,2.54 -11.046,5.083 -15.974,7.624 h 4.342 c 4.068,-2.031 8.301,-4.061 12.942,-6.091 v 0 c 25.492,-11.201 58.502,-21.043 96.717,-21.429 34.707,-0.356 78.972,6.879 119.395,27.52 h 4.239 c -41.661,-22.165 -87.699,-29.827 -123.653,-29.458 -17.881,0.18 -34.61,2.429 -49.99,5.897 1.99,-8.983 15.862,-63.632 65.23,-93.253 l 0.469,-0.28 V 95.847 l 0.185,-0.1287 -1.112,-1.5861 z m -1.01,4.2662 v 21.1756 c -51.819,31.412 -64.773,89.815 -65.851,95.081 -15.642,3.67 -29.828,8.594 -42.324,13.904 2.938,-3.933 21.981,-29.39 45.22,-58.73 12.544,-15.838 25.8,-32.135 37.339,-45.38 10.706,-12.288 19.969,-21.908 25.616,-26.0506 z M 310.29,156.531 v 1.938 h 6.007 v -1.938 z m -4.653,5.428 v 1.938 h 6.011 v -1.938 z m -5.617,5.621 v 1.938 h 5.814 v -1.938 z m -6.398,5.425 v 1.938 h 5.815 v -1.938 z m -9.107,5.621 v 1.938 h 8.525 v -1.938 z m -7.56,5.621 v 1.938 h 11.822 v -1.938 z m -6.783,5.425 v 1.938 h 13.567 v -1.938 z m -8.142,5.621 v 1.938 h 15.894 v -1.938 z m -6.394,5.428 v 1.938 h 16.281 v -1.938 z m -9.884,5.622 v 1.938 h 19.961 v -1.938 z m -8.528,5.424 v 1.938 h 25.582 v -1.938 z m 126.352,1.359 c -42.032,0.381 -77.707,12.1 -104.177,24.613 h 4.584 c 25.861,-11.746 59.895,-22.315 99.616,-22.675 31.874,-0.35 71.881,5.703 109.436,22.675 h 4.701 C 438.754,219.242 396.819,212.761 363.58,213.126 v 0 z m -138.371,4.262 v 1.938 h 32.562 v -1.938 z m 137.792,0 c -37.244,0.386 -69.307,9.578 -94.684,20.351 h 5.054 c 24.483,-9.909 54.785,-18.051 89.649,-18.413 v 0 c 29.096,-0.344 64.983,4.718 99.518,18.413 h 5.16 C 431.536,222.56 393.587,217.026 362.997,217.388 Z m -147.482,5.622 v 1.938 h 40.507 v -1.938 z"
         style="color:#000000;font-style:normal;font-variant:normal;font-weight:normal;font-stretch:normal;font-size:medium;line-height:normal;font-family:sans-serif;text-indent:0;text-align:start;text-decoration:none;text-decoration-line:none;text-decoration-style:solid;text-decoration-color:#000000;letter-spacing:normal;word-spacing:normal;text-transform:none;writing-mode:lr-tb;direction:ltr;baseline-shift:baseline;text-anchor:start;white-space:normal;clip-rule:nonzero;display:inline;overflow:visible;visibility:visible;opacity:1;isolation:auto;mix-blend-mode:normal;color-interpolation:sRGB;color-interpolation-filters:linearRGB;solid-color:#000000;solid-opacity:1;fill:#ffffff;fill-opacity:1;fill-rule:nonzero;stroke:none;stroke-width:1;stroke-linecap:square;stroke-linejoin:miter;stroke-miterlimit:10;stroke-dasharray:none;stroke-dashoffset:0;stroke-opacity:1;color-rendering:auto;image-rendering:auto;shape-rendering:auto;text-rendering:auto;enable-background:accumulate"
         inkscape:connector-curvature="0" />
      <path
         id="path6196-3"
         d="m 192.454,237.739 v 43.221 h 25.775 c 2.713,0 5.04,-0.389 7.559,-1.552 2.52,-1.163 4.846,-2.714 6.591,-4.652 1.938,-1.938 3.292,-4.263 4.455,-6.977 1.163,-2.519 1.745,-5.428 1.745,-8.335 0,-3.876 -0.776,-7.558 -2.714,-10.853 -1.938,-3.295 -4.455,-6.007 -7.556,-7.945 -3.101,-1.938 -6.398,-2.907 -10.08,-2.907 z m 2.131,1.355 h 23.644 c 2.326,0 4.651,0.583 6.976,1.552 2.132,1.163 4.07,2.518 5.815,4.262 1.55,1.938 2.907,3.878 3.876,6.397 0.969,2.52 1.552,5.04 1.552,7.753 0,2.713 -0.583,5.233 -1.552,7.752 -0.969,2.52 -2.132,4.653 -3.876,6.398 -1.551,1.744 -3.683,3.293 -5.815,4.262 -2.132,0.969 -4.457,1.552 -6.976,1.552 h -23.644 z m 1.938,2.521 v 35.662 h 21.706 c 2.907,0 5.623,-0.584 8.142,-2.328 2.52,-1.744 4.457,-3.873 6.008,-6.587 1.356,-2.713 2.131,-5.623 2.131,-8.918 0,-3.101 -0.581,-6.201 -2.131,-8.915 -1.551,-2.907 -3.488,-5.039 -6.008,-6.59 -2.519,-1.55 -5.235,-2.324 -8.142,-2.324 z m 46.515,1.745 v 37.6 h 1.938 v -37.6 z m 4.07,0 v 37.6 h 1.938 v -37.6 z m 4.069,0 v 37.6 h 1.938 v -37.6 z m 29.848,0 v 37.6 h 1.938 v -35.662 h 22.095 c 2.907,0 5.231,0.969 7.363,2.907 2.132,1.938 3.104,4.264 3.104,6.784 0,2.713 -0.972,5.038 -3.104,6.976 0.775,0.775 1.552,1.937 2.328,3.1 0.581,1.357 0.969,2.52 0.969,3.877 0,2.713 -0.969,5.038 -3.1,6.976 -2.132,1.938 -4.46,2.907 -7.367,2.907 h -12.598 v 1.938 h 12.598 c 2.326,0 4.263,-0.386 6.201,-1.355 1.744,-0.969 3.296,-2.131 4.459,-4.069 1.163,-1.938 1.745,-4.072 1.745,-6.397 0,-2.52 -0.778,-4.652 -2.328,-6.784 1.55,-1.938 2.328,-4.456 2.328,-7.169 0,-2.132 -0.582,-4.07 -1.745,-5.815 -1.163,-1.744 -2.714,-3.297 -4.652,-4.266 -1.939,-0.969 -4.069,-1.548 -6.201,-1.548 z m -82.37,0.193 h 19.767 c 2.519,0 4.848,0.774 6.98,2.131 2.132,1.357 3.875,3.295 5.232,5.814 1.356,2.326 1.938,5.039 1.938,7.946 0,2.907 -0.582,5.43 -1.938,7.949 -1.357,2.52 -3.1,4.458 -5.232,5.815 -2.326,1.356 -4.654,2.131 -7.173,2.131 h -19.574 z m 56.398,0 v 37.6 h 21.126 v -1.938 h -19.188 v -1.938 h 19.188 v -1.938 h -19.188 v -1.938 h 19.188 v -1.938 h -19.188 v -3.877 h 18.026 v -1.938 h -18.026 v -1.938 h 18.026 v -1.938 h -18.026 v -1.938 h 18.026 v -1.938 h -18.026 v -4.652 h 19.188 v -1.939 h -19.188 v -1.938 h 19.188 v -1.938 h -19.188 v -1.938 h 19.188 v -1.938 z m -54.46,1.552 v 28.296 0.193 h 17.636 c 2.132,0 4.069,-0.775 6.007,-1.938 1.938,-1.357 3.297,-3.1 4.459,-5.232 1.163,-2.326 1.746,-4.654 1.746,-7.173 0,-2.713 -0.583,-5.038 -1.746,-7.17 -1.162,-2.132 -2.521,-3.875 -4.459,-5.038 -1.744,-1.357 -3.875,-1.938 -6.007,-1.938 z m 1.938,1.741 h 15.698 c 1.744,0 3.488,0.389 5.038,1.552 1.551,1.163 2.714,2.521 3.683,4.459 0.969,1.939 1.359,4.069 1.359,6.201 0,3.488 -0.969,6.202 -2.907,8.721 -1.938,2.52 -4.46,3.684 -7.173,3.684 h -15.698 z m 82.563,0.39 v 33.917 h 1.938 v -31.979 h 18.026 c 1.744,0 3.293,0.582 4.456,1.745 1.356,1.163 1.938,2.519 1.938,4.07 0,1.744 -0.582,3.099 -1.938,4.262 -1.357,1.163 -2.712,1.745 -4.456,1.745 h -6.204 -6.587 v 1.938 h 6.587 6.204 c 1.744,0 3.293,0.582 4.456,1.938 1.356,1.163 1.938,2.712 1.938,4.263 0,1.744 -0.582,3.296 -1.938,4.459 -1.163,0.969 -2.712,1.552 -4.456,1.552 H 292.46 v 1.938 h 12.598 c 2.326,0 4.263,-0.778 6.008,-2.328 1.744,-1.551 2.521,-3.489 2.521,-5.814 0,-1.357 -0.391,-2.713 -1.166,-4.07 -0.776,-1.356 -1.937,-2.325 -3.294,-2.907 1.357,-0.581 2.518,-1.55 3.294,-2.907 0.775,-1.163 1.166,-2.519 1.166,-4.069 0,-2.132 -0.777,-3.878 -2.521,-5.429 -1.745,-1.55 -3.682,-2.324 -6.008,-2.324 z m -80.625,1.745 v 20.737 0.193 h 13.76 c 2.132,0 4.071,-1.163 5.621,-3.101 1.551,-2.132 2.324,-4.459 2.324,-7.366 0,-2.907 -0.773,-5.424 -2.324,-7.363 -1.55,-2.132 -3.489,-3.1 -5.621,-3.1 z m 2.131,1.741 h 11.629 c 1.744,0 3.103,0.971 4.266,2.522 1.163,1.744 1.741,3.681 1.741,6.007 0,2.326 -0.578,4.263 -1.741,6.007 -1.163,1.745 -2.522,2.521 -4.266,2.521 H 206.6 Z m 82.37,0.197 v 30.041 h 1.938 v -28.299 h 13.957 c 0.582,0 1.16,0.195 1.741,0.583 0.582,0.387 0.776,0.97 0.776,1.552 0,0.775 -0.194,1.354 -0.776,1.548 -0.193,0.581 -0.773,0.776 -1.548,0.776 H 292.46 v 1.938 h 12.598 c 1.163,0 2.325,-0.387 3.1,-1.162 0.776,-0.775 1.356,-1.745 1.356,-2.907 0,-0.969 -0.387,-1.939 -1.356,-2.908 -0.969,-0.775 -1.937,-1.162 -3.1,-1.162 z m 3.49,13.76 v 1.938 h 12.598 c 0.582,0 1.164,0.195 1.745,0.776 0.582,0.582 0.772,0.966 0.772,1.742 0,0.775 -0.19,1.357 -0.772,1.745 -0.581,0.387 -0.97,0.39 -1.745,0.39 H 292.46 v 1.938 h 12.598 c 1.163,0 2.325,-0.391 3.1,-1.166 0.776,-0.775 1.356,-1.744 1.356,-3.1 0,-1.163 -0.387,-2.132 -1.356,-2.908 -0.969,-0.775 -1.937,-1.355 -3.1,-1.355 z"
         style="fill:#ffffff"
         inkscape:connector-curvature="0" />
      <path
         id="path6202-6"
         d="m 345.952,235.414 c -3.313,0.04 -6.618,0.699 -9.691,1.938 -2.925,1.181 -5.641,2.885 -7.945,5.039 -2.281,2.132 -4.157,4.708 -5.429,7.559 -1.274,2.856 -1.938,5.981 -1.938,9.108 0,3.127 0.665,6.252 1.938,9.108 1.272,2.851 3.148,5.427 5.429,7.559 2.304,2.154 5.02,3.857 7.945,5.038 3.072,1.241 6.377,1.907 9.691,1.938 4.081,0.04 8.169,-0.888 11.821,-2.71 3.48,-1.735 6.554,-4.277 8.915,-7.366 l -1.548,-1.162 c -2.107,2.928 -4.926,5.342 -8.143,6.976 -3.342,1.699 -7.103,2.551 -10.852,2.521 -3.046,-0.02 -6.083,-0.624 -8.915,-1.745 -2.716,-1.075 -5.252,-2.636 -7.366,-4.652 -2.063,-1.967 -3.715,-4.36 -4.845,-6.977 -1.134,-2.623 -1.742,-5.477 -1.742,-8.335 0,-2.858 0.608,-5.708 1.742,-8.332 1.13,-2.617 2.782,-5.013 4.845,-6.98 2.114,-2.016 4.65,-3.573 7.366,-4.648 2.832,-1.121 5.869,-1.721 8.915,-1.745 3.749,-0.03 7.51,0.818 10.852,2.517 3.217,1.634 6.036,4.051 8.143,6.98 l 1.745,-0.969 c -2.315,-3.349 -5.479,-6.111 -9.112,-7.949 -3.642,-1.844 -7.739,-2.755 -11.821,-2.711 z m 0,3.877 c -3.641,0.02 -7.269,0.97 -10.467,2.71 -3.126,1.7 -5.853,4.164 -7.752,7.173 -1.858,2.943 -2.908,6.404 -2.908,9.884 0,3.48 1.05,6.941 2.908,9.884 1.899,3.009 4.627,5.472 7.752,7.173 3.198,1.74 6.826,2.693 10.467,2.71 3.416,0.02 6.829,-0.793 9.883,-2.324 2.938,-1.472 5.542,-3.607 7.56,-6.2 l -1.552,-1.166 c -1.758,2.439 -4.104,4.45 -6.784,5.814 -2.747,1.398 -5.831,2.114 -8.914,2.135 -2.512,0.02 -5.031,-0.426 -7.363,-1.359 -2.226,-0.891 -4.272,-2.225 -6.011,-3.876 -1.688,-1.603 -3.093,-3.509 -4.069,-5.622 -1.007,-2.179 -1.549,-4.575 -1.549,-6.976 0,-2.401 0.542,-4.797 1.549,-6.977 0.976,-2.112 2.381,-4.019 4.069,-5.621 1.739,-1.651 3.785,-2.985 6.011,-3.876 2.332,-0.934 4.851,-1.375 7.363,-1.355 3.082,0.02 6.16,0.746 8.914,2.131 2.646,1.33 4.985,3.269 6.784,5.621 l 1.745,-0.969 c -2.015,-2.767 -4.697,-5.047 -7.753,-6.59 -3.049,-1.54 -6.467,-2.344 -9.883,-2.324 z m 45.546,2.324 c -2.908,0 -5.816,0.389 -8.529,1.552 -2.713,1.163 -5.038,2.517 -6.976,4.455 -1.939,1.745 -3.49,4.071 -4.653,6.591 -1.163,2.519 -1.745,5.232 -1.745,7.945 0,2.714 0.582,5.426 1.745,7.946 1.163,2.713 2.714,4.846 4.653,6.59 1.938,1.938 4.263,3.296 6.976,4.459 2.713,0.969 5.621,1.548 8.529,1.548 2.907,0 5.815,-0.385 8.528,-1.548 2.713,-1.163 5.038,-2.521 6.976,-4.459 1.939,-1.744 3.49,-4.071 4.653,-6.59 1.163,-2.52 1.745,-5.232 1.745,-7.946 0,-2.713 -0.582,-5.426 -1.745,-7.945 -1.163,-2.52 -2.714,-4.653 -4.653,-6.591 -1.938,-1.938 -4.263,-3.486 -6.976,-4.455 -2.713,-0.969 -5.621,-1.552 -8.528,-1.552 z m 0.193,1.552 c 2.713,0 5.232,0.579 7.752,1.548 2.52,0.969 4.653,2.325 6.397,4.069 1.745,1.745 3.294,3.686 4.263,6.012 0.969,2.325 1.552,4.843 1.552,7.362 0,2.52 -0.583,5.041 -1.552,7.367 -0.969,2.325 -2.518,4.263 -4.263,6.007 -1.744,1.744 -3.877,3.1 -6.397,4.069 -2.52,0.969 -5.039,1.552 -7.752,1.552 -2.714,0 -5.233,-0.583 -7.753,-1.552 -2.519,-0.969 -4.649,-2.325 -6.393,-4.069 -1.745,-1.744 -3.298,-3.682 -4.267,-6.007 -0.969,-2.326 -1.548,-4.847 -1.548,-7.367 0,-2.519 0.579,-5.037 1.548,-7.362 0.969,-2.326 2.522,-4.267 4.267,-6.012 1.744,-1.744 3.874,-3.1 6.393,-4.069 2.52,-0.969 5.039,-1.548 7.753,-1.548 z m 26.554,0.193 v 37.6 h 1.938 v -34.307 l 21.123,34.307 h 2.328 l -23.065,-37.6 z m 4.649,0 23.257,37.6 h 2.328 l -23.257,-37.6 z m 4.652,0 23.257,37.6 h 2.328 l -23.257,-37.6 z m 4.845,0 23.064,37.6 h 2.325 v -37.6 h -1.938 v 34.303 L 434.719,243.36 Z m 15.505,0 v 18.991 l 1.938,3.49 V 243.36 Z m 4.069,0 v 25.775 l 1.938,3.104 V 243.36 Z m 11.243,0 v 37.6 h 1.938 v -37.6 z m 3.876,0 v 37.6 h 1.938 v -37.6 z m 4.069,0 v 37.6 h 1.939 v -37.6 z m 4.07,0 v 37.6 h 1.938 0.197 v -12.405 h 15.698 v -1.938 h -15.698 v -1.938 h 15.698 v -1.938 h -15.698 v -1.938 h 15.698 v -1.938 h -15.698 v -5.815 h 17.053 v -1.938 h -17.053 v -1.938 h 17.053 v -1.938 h -17.053 v -1.938 h 17.053 v -1.938 z m -129.078,0.193 c -2.962,-0.03 -5.929,0.711 -8.529,2.131 -2.514,1.374 -4.685,3.383 -6.2,5.814 -1.479,2.373 -2.325,5.15 -2.324,7.946 0,2.796 0.845,5.576 2.324,7.949 1.515,2.432 3.684,4.444 6.2,5.815 2.601,1.417 5.567,2.15 8.529,2.131 2.751,-0.02 5.496,-0.685 7.945,-1.938 2.347,-1.201 4.421,-2.937 6.011,-5.039 l -1.552,-1.166 c -1.459,1.854 -3.326,3.388 -5.428,4.46 -2.212,1.127 -4.686,1.743 -7.169,1.745 -2.628,10e-4 -5.249,-0.686 -7.56,-1.938 -2.195,-1.19 -4.126,-2.905 -5.424,-5.039 -1.303,-2.142 -1.938,-4.666 -1.938,-7.173 0,-2.507 0.635,-5.028 1.938,-7.17 1.298,-2.133 3.229,-3.848 5.424,-5.038 2.311,-1.252 4.932,-1.94 7.56,-1.938 2.483,0 4.957,0.614 7.169,1.741 2.102,1.072 3.969,2.606 5.428,4.459 l 1.746,-0.969 c -1.71,-2.013 -3.837,-3.673 -6.205,-4.845 -2.464,-1.22 -5.196,-1.91 -7.945,-1.938 z m 45.546,1.552 c -2.326,0 -4.651,0.386 -6.977,1.355 -2.326,0.969 -4.264,2.133 -5.814,3.683 -1.551,1.551 -2.907,3.293 -3.876,5.425 -0.97,2.132 -1.356,4.264 -1.356,6.59 0,2.326 0.386,4.459 1.356,6.59 0.969,2.132 2.325,3.878 3.876,5.429 1.744,1.55 3.682,2.71 5.814,3.679 2.132,0.969 4.651,1.359 6.977,1.359 2.325,0 4.65,-0.39 6.976,-1.359 2.326,-0.969 4.264,-2.129 5.814,-3.679 1.551,-1.551 2.908,-3.297 3.877,-5.429 0.969,-2.131 1.359,-4.264 1.359,-6.59 0,-2.326 -0.39,-4.458 -1.359,-6.59 -0.969,-2.132 -2.326,-3.874 -3.877,-5.425 -1.744,-1.55 -3.682,-2.714 -5.814,-3.683 -2.132,-0.969 -4.651,-1.355 -6.976,-1.355 z m 0,1.938 c 2.132,0 4.266,0.193 6.204,1.162 1.938,0.969 3.681,1.937 5.038,3.293 1.551,1.357 2.711,2.908 3.487,4.846 0.969,1.744 1.358,3.682 1.358,5.814 0,1.938 -0.583,3.876 -1.358,5.814 -0.97,1.939 -2.13,3.489 -3.487,4.846 -1.357,1.356 -3.1,2.522 -5.038,3.297 -1.938,0.775 -4.072,1.162 -6.204,1.162 -2.132,0 -4.263,-0.387 -6.201,-1.162 -1.938,-0.969 -3.682,-1.941 -5.038,-3.297 -1.551,-1.357 -2.521,-3.101 -3.49,-4.846 -0.969,-1.744 -1.356,-3.682 -1.356,-5.814 0,-1.938 0.58,-3.876 1.356,-5.814 0.775,-1.938 1.939,-3.489 3.49,-4.846 1.356,-1.356 3.1,-2.518 5.038,-3.293 1.938,-0.775 4.069,-1.162 6.201,-1.162 z m -45.739,0.557 c -1.722,0 -3.449,0.308 -5.039,0.969 -1.519,0.631 -2.897,1.581 -4.069,2.736 -1.13,1.114 -2.075,2.425 -2.714,3.877 -0.643,1.46 -0.973,3.057 -0.969,4.652 0,1.595 0.337,3.188 0.969,4.652 0.629,1.458 1.555,2.79 2.714,3.876 1.171,1.098 2.572,1.937 4.069,2.518 1.604,0.621 3.319,0.947 5.039,0.969 2.135,0.03 4.282,-0.417 6.2,-1.355 1.831,-0.896 3.441,-2.238 4.652,-3.877 l -1.548,-1.162 c -1.002,1.389 -2.344,2.528 -3.876,3.294 -1.614,0.806 -3.431,1.191 -5.235,1.162 -2.847,-0.05 -5.677,-1.151 -7.753,-3.101 -2.016,-1.893 -3.293,-4.6 -3.293,-7.366 0,-2.766 1.277,-5.469 3.293,-7.363 2.076,-1.949 4.906,-3.054 7.753,-3.1 1.804,-0.03 3.621,0.356 5.235,1.162 1.532,0.765 2.874,1.905 3.876,3.294 l 1.548,-0.969 c -1.283,-1.478 -2.879,-2.683 -4.652,-3.513 -1.932,-0.905 -4.067,-1.359 -6.2,-1.355 z m 45.546,1.381 c -2.52,0 -4.845,0.579 -6.977,1.741 -2.132,1.163 -3.875,2.908 -5.038,4.846 -1.357,1.938 -1.938,4.264 -1.938,6.59 0,2.326 0.775,4.652 1.938,6.59 1.356,1.939 2.906,3.683 5.038,4.846 2.132,1.163 4.457,1.745 6.977,1.745 2.519,0 4.844,-0.582 6.976,-1.745 2.132,-1.163 3.875,-2.907 5.038,-4.846 1.357,-1.938 1.938,-4.264 1.938,-6.59 0,-2.326 -0.775,-4.652 -1.938,-6.59 -1.163,-2.132 -2.906,-3.683 -5.038,-4.846 -2.132,-1.162 -4.457,-1.741 -6.976,-1.741 z m 0.193,1.938 c 3.294,0 6.202,1.162 8.528,3.294 2.326,2.132 3.49,4.844 3.49,7.945 0,3.101 -1.164,5.814 -3.49,7.946 -2.326,2.132 -5.234,3.297 -8.528,3.297 -3.295,0 -6.203,-1.165 -8.529,-3.297 -2.326,-2.132 -3.486,-4.845 -3.486,-7.946 0,-3.101 1.16,-5.813 3.486,-7.945 2.326,-2.326 5.234,-3.294 8.529,-3.294 z m 30.43,0.773 v 29.268 h 1.938 v -25.778 z m -30.43,1.165 c -2.908,0 -5.232,0.966 -7.17,2.711 -1.938,1.744 -2.907,4.071 -2.907,6.59 0,2.52 0.969,4.846 2.907,6.59 1.938,1.939 4.456,2.715 7.17,2.715 2.907,0 5.235,-0.97 7.173,-2.715 1.938,-1.744 2.907,-4.07 2.907,-6.59 0,-2.519 -0.969,-4.846 -2.907,-6.59 -2.132,-1.745 -4.46,-2.711 -7.173,-2.711 z m 0,1.939 c 2.131,0 4.07,0.58 5.621,2.131 1.55,1.356 2.324,3.293 2.324,5.231 0,1.938 -0.774,3.685 -2.324,5.235 -1.551,1.357 -3.49,2.132 -5.621,2.132 -2.132,0 -4.071,-0.581 -5.622,-2.132 -1.55,-1.356 -2.324,-3.297 -2.324,-5.235 0,-1.938 0.774,-3.681 2.324,-5.231 1.551,-1.551 3.296,-2.325 5.622,-2.131 z m 34.5,3.679 v 22.485 h 1.938 v -18.995 z"
         style="fill:#ffffff"
         inkscape:connector-curvature="0" />
      <path
         id="path6210-0"
         d="m 497.708,237.546 v 1.938 h 20.153 v -1.938 z m 24.42,0.193 v 1.938 h 16.86 l 0.39,-1.938 z m 18.605,0 -11.436,43.221 h 2.131 l 11.436,-43.221 z m 4.069,0 -11.436,43.221 h 2.135 l 11.432,-43.221 z m 4.266,0 -11.436,43.221 h 2.132 l 11.435,-43.221 z m 4.069,0 -11.435,43.221 h 2.131 l 11.436,-43.221 z m -55.429,3.683 v 1.938 h 20.153 v -1.938 z m 24.42,0 v 1.938 h 15.891 l 0.389,-1.938 z m -24.42,3.683 v 1.741 h 6.587 v 33.917 h 1.938 v -33.917 h 1.938 v 33.917 h 1.938 v -33.917 h 1.938 v 33.917 h 1.938 v -33.917 h 1.938 v 33.917 h 1.938 v -35.658 z m 24.42,0.193 v 1.938 h 14.922 l 0.389,-1.938 z"
         style="fill:#ffffff"
         inkscape:connector-curvature="0" />
      <path
         id="path6216"
         d="m 494.604,289.292 c -0.581,0 -1.16,0.196 -1.741,0.39 -0.582,0.194 -0.971,0.387 -1.552,0.969 -0.582,0.581 -0.969,1.16 -1.162,1.741 -0.194,0.775 -0.39,1.552 -0.39,2.521 0,0.775 0.196,1.549 0.39,2.324 0.193,0.776 0.581,1.358 0.969,1.745 0.387,0.388 0.966,0.776 1.548,0.969 0.581,0.194 1.357,0.39 1.938,0.39 0.581,0 0.971,-0.196 1.552,-0.196 0.388,0 0.774,-0.193 1.162,-0.387 l -0.579,-1.552 c -0.388,0.194 -0.582,0.39 -0.969,0.39 -0.194,0.194 -0.778,0.193 -1.166,0.193 -0.581,0 -1.161,0 -1.548,-0.193 -0.388,-0.194 -0.775,-0.388 -1.162,-0.776 -0.388,-0.387 -0.583,-0.773 -0.776,-1.355 -0.194,-0.581 -0.193,-1.163 -0.193,-1.938 0,-0.775 0.192,-1.357 0.386,-1.938 0.194,-0.582 0.388,-0.971 0.776,-1.359 0.387,-0.388 0.774,-0.582 1.162,-0.776 0.581,-0.194 0.967,-0.193 1.355,-0.193 0.969,0 1.554,0.196 2.135,0.39 l 0.386,-1.166 c -0.194,0 -0.581,-0.193 -0.969,-0.193 z m -75.78,0.39 c -1.356,0 -2.518,0.386 -3.293,1.355 -0.775,0.969 -1.162,2.325 -1.162,4.069 0,0.775 0,1.55 0.193,2.131 0.194,0.776 0.388,1.358 0.776,1.745 0.387,0.582 0.774,0.969 1.355,1.163 0.581,0.193 1.163,0.389 1.938,0.389 1.357,0 2.518,-0.389 3.293,-1.359 0.776,-0.969 1.166,-2.325 1.166,-4.069 0,-0.775 0,-1.55 -0.196,-2.131 -0.194,-0.775 -0.385,-1.357 -0.773,-1.745 -0.387,-0.581 -0.971,-0.968 -1.359,-1.162 -0.387,-0.194 -1.163,-0.386 -1.938,-0.386 z m -16.474,0.193 v 10.466 h 1.162 v -6.98 l -0.193,-1.548 0.583,1.355 3.1,4.652 h 0.583 l 2.908,-4.652 0.579,-1.355 -0.193,1.548 v 6.98 h 1.355 v -10.466 h -0.969 l -3.293,5.231 -0.583,1.162 -0.58,-1.162 -3.49,-5.231 z m 23.451,0 v 10.466 h 1.166 v -6.783 l -0.197,-1.552 0.776,1.552 5.235,6.976 h 0.772 v -10.466 h -1.162 v 6.783 l 0.193,1.355 -0.772,-1.355 -5.235,-6.976 z m 9.304,0 v 1.162 h 3.49 v 9.304 h 1.356 v -9.304 h 3.293 v -1.162 z m 11.243,0 c -0.582,0 -0.972,0.193 -1.359,0.193 h -0.193 v 10.466 h 1.355 v -4.652 l 1.552,0.193 3.1,4.459 h 1.552 l -2.714,-4.069 -0.776,-0.583 c 0.582,-0.194 1.358,-0.387 1.745,-0.969 0.582,-0.388 0.776,-1.163 0.776,-1.938 0,-0.581 -0.196,-0.968 -0.39,-1.355 -0.194,-0.388 -0.384,-0.775 -0.772,-0.969 -0.388,-0.388 -0.778,-0.389 -1.166,-0.583 -0.387,-0.194 -0.774,-0.193 -1.355,-0.193 z m 8.138,0 v 10.659 h 6.201 v -1.162 h -4.845 v -3.683 h 4.266 v -1.162 h -4.266 v -3.49 h 4.652 v -1.162 z m 11.436,0 -4.266,10.466 h 1.359 l 1.162,-2.907 h 4.069 l 1.162,2.907 h 1.359 l -4.266,-10.466 z m 6.201,0 v 10.466 h 6.59 v -1.166 h -5.232 v -9.3 z m 29.461,0 -4.266,10.466 h 1.359 l 1.162,-2.907 h 4.069 l 1.163,2.907 h 1.359 l -4.267,-10.466 z m 6.587,0 v 10.466 h 1.166 v -6.783 l -0.197,-1.552 0.776,1.552 5.235,6.976 h 0.772 v -10.466 h -1.162 v 6.783 l 0.193,1.355 -0.772,-1.355 -5.235,-6.976 z m 13.567,0 -4.263,10.466 h 1.162 l 1.163,-2.907 h 4.073 l 1.355,2.907 h 1.355 l -4.262,-10.466 z m 6.204,0 v 10.659 h 0.579 0.776 0.776 0.583 c 0.969,0 1.936,0 2.517,-0.389 0.582,-0.194 1.165,-0.581 1.552,-1.163 0.388,-0.581 0.776,-1.163 0.969,-1.745 0.194,-0.581 0.386,-1.163 0.386,-1.938 0,-0.775 -0.192,-1.55 -0.386,-2.131 -0.193,-0.775 -0.581,-1.357 -0.969,-1.745 -0.387,-0.581 -0.97,-0.968 -1.552,-1.162 -0.581,-0.194 -1.355,-0.386 -2.324,-0.386 h -0.776 -0.776 -0.776 z m 12.791,0 -4.263,10.466 h 1.356 l 1.162,-2.907 h 4.069 l 1.166,2.907 h 1.355 l -4.262,-10.466 z m -121.909,0.969 c 0.582,0 0.972,0.192 1.359,0.386 0.388,0.194 0.775,0.581 0.969,0.969 0.194,0.388 0.386,0.777 0.579,1.359 0.194,0.388 0.193,0.967 0.193,1.548 0,1.551 -0.19,2.522 -0.772,3.297 -0.581,0.582 -1.359,0.969 -2.328,0.969 -0.581,0 -0.967,-0.196 -1.355,-0.39 -0.388,-0.193 -0.775,-0.581 -0.969,-0.969 -0.194,-0.387 -0.389,-0.967 -0.583,-1.355 -0.194,-0.387 -0.193,-0.97 -0.193,-1.552 0,-1.55 0.388,-2.518 0.776,-3.293 0.581,-0.582 1.355,-0.969 2.324,-0.969 z m 27.524,0 h 0.386 0.386 0.39 0.386 c 0.775,0 1.358,0.192 1.552,0.386 0.388,0.388 0.579,0.777 0.579,1.359 0,0.775 -0.384,1.16 -0.772,1.548 -0.388,0.388 -0.97,0.583 -1.745,0.583 h -1.162 z m 82.949,0 h 0.39 0.386 0.386 0.39 c 0.775,0 1.357,0.193 1.938,0.193 0.582,0.194 0.969,0.581 1.162,0.969 0.194,0.388 0.389,0.774 0.583,1.355 0.194,0.582 0.193,1.164 0.193,1.552 0,0.582 10e-4,0.971 -0.193,1.552 0,0.582 -0.195,0.968 -0.583,1.355 -0.193,0.388 -0.58,0.776 -1.162,0.969 -0.581,0.194 -1.163,0.386 -1.938,0.386 h -0.39 -0.386 -0.386 -0.39 z m -62.989,0.776 0.39,1.548 1.162,3.1 h -3.297 l 1.359,-3.1 z m 35.855,0 0.39,1.548 1.162,3.1 h -3.297 l 1.359,-3.1 z m 19.771,0 0.387,1.548 1.162,3.1 h -3.294 l 1.356,-3.1 z m 19.185,0 0.39,1.548 1.162,3.1 h -3.293 l 1.355,-3.1 z m -57.175,3.293 c -0.194,0 -0.385,0 -0.579,0.193 -0.194,0.194 -0.193,0.389 -0.193,0.583 0,0.388 0.193,0.579 0.193,0.579 0,0.194 0.385,0.197 0.579,0.197 0.388,0 0.583,0 0.776,-0.197 0.194,-0.194 0.193,-0.385 0.193,-0.579 0,-0.194 10e-4,-0.389 -0.193,-0.583 -0.193,-0.194 -0.582,-0.193 -0.776,-0.193 z"
         style="fill:#ffffff"
         inkscape:connector-curvature="0" />
      <path
         id="path5952"
         d="m 455.228,86.588 -0.215,1.5368 0.768,0.106 c 5.714,0.8092 11.21,3.1677 15.736,6.7494 4.525,3.5816 8.082,8.3878 10.183,13.7638 2.122,5.433 2.735,11.532 1.169,17.095 -1.032,3.667 -3.005,7.076 -5.693,9.77 -2.688,2.693 -6.099,4.673 -9.774,5.64 -4.112,1.082 -8.563,0.882 -12.564,-0.56 -4,-1.442 -7.554,-4.129 -10.031,-7.586 l -0.454,-0.632 -1.257,0.904 0.451,0.629 c 2.663,3.717 6.463,6.595 10.765,8.146 4.302,1.551 9.061,1.761 13.484,0.598 3.95,-1.039 7.596,-3.157 10.478,-6.045 2.881,-2.888 4.987,-6.526 6.091,-10.448 1.673,-5.947 1.009,-12.371 -1.219,-18.075 -2.203,-5.636 -5.923,-10.6598 -10.668,-14.4149 -4.744,-3.7551 -10.49,-6.2189 -16.481,-7.0674 l -0.769,-0.1096 z m -2.672,2.9791 c -0.855,-0.029 -1.709,-0.022 -2.563,0.023 -2.277,0.1179 -4.543,0.5011 -6.738,1.1622 -5.589,1.6835 -10.626,5.1052 -14.252,9.6787 l -0.481,0.606 1.216,0.965 0.48,-0.609 c 3.425,-4.3204 8.209,-7.5667 13.488,-9.1569 8.279,-2.494 17.7,-0.7611 24.756,4.2699 7.633,5.442 12.458,14.689 12.556,24.063 v 0.776 l 1.552,-0.02 v -0.776 c -0.104,-9.894 -5.155,-19.569 -13.211,-25.3127 -4.888,-3.4853 -10.821,-5.4697 -16.803,-5.6742 z m -0.382,2.7671 c -5.761,-0.1231 -11.552,1.7297 -16.104,5.2806 -3.109,2.4262 -5.586,5.5662 -7.491,8.9712 -3.235,5.782 -4.883,12.4 -4.936,19.01 -0.1,12.038 5.26,23.98 14.313,31.915 l 0.583,0.511 1.022,-1.166 -0.583,-0.511 c -8.7,-7.625 -13.876,-19.169 -13.783,-30.737 0.05,-6.361 1.641,-12.727 4.739,-18.265 1.825,-3.26 4.175,-6.234 7.087,-8.5055 4.254,-3.3188 9.713,-5.0705 15.118,-4.9551 5.928,0.1266 11.801,2.5024 16.153,6.5296 l 0.571,0.526 1.053,-1.139 -0.568,-0.5262 C 464.71,94.9801 458.492,92.469 452.174,92.3342 Z m 25.702,2.627 -1.041,1.1508 0.576,0.5186 c 7.114,6.4364 10.747,16.5804 9.335,26.0704 -0.884,5.934 -3.649,11.588 -7.791,15.928 l -0.537,0.561 1.124,1.071 0.534,-0.56 c 4.367,-4.578 7.271,-10.516 8.203,-16.773 1.492,-10.029 -2.312,-20.646 -9.831,-27.4482 z m -44.398,9.6908 -0.406,0.658 c -3.75,6.054 -5.827,13.121 -5.943,20.241 -0.155,9.532 3.257,19.061 9.43,26.327 6.172,7.266 15.025,12.175 24.457,13.563 l 0.765,0.114 0.227,-1.537 -0.768,-0.11 c -9.049,-1.331 -17.579,-6.062 -23.5,-13.033 -5.922,-6.97 -9.207,-16.153 -9.059,-25.297 0.112,-6.836 2.108,-13.642 5.709,-19.454 l 0.409,-0.658 -1.322,-0.814 z m 25.059,5.947 c -2.289,-0.09 -4.591,0.447 -6.602,1.544 -1.907,1.041 -3.534,2.572 -4.686,4.414 -1.153,1.842 -1.821,3.977 -1.923,6.147 -0.103,2.171 0.359,4.357 1.332,6.299 0.974,1.943 2.451,3.622 4.251,4.838 l 0.64,0.435 0.871,-1.287 -0.644,-0.431 c -1.576,-1.065 -2.876,-2.55 -3.729,-4.251 -0.852,-1.701 -1.263,-3.63 -1.173,-5.531 0.09,-1.9 0.679,-3.781 1.688,-5.394 1.01,-1.613 2.445,-2.968 4.115,-3.88 1.76,-0.961 3.792,-1.435 5.795,-1.355 2.004,0.08 3.993,0.715 5.671,1.813 l 0.647,0.428 0.852,-1.299 -0.651,-0.423 c -1.917,-1.255 -4.165,-1.976 -6.454,-2.067 z m -35.307,0.643 -0.23,0.738 c -1.841,5.813 -2.534,11.981 -2.029,18.057 0.482,5.805 2.054,11.517 4.614,16.75 l 0.341,0.697 1.393,-0.682 -0.341,-0.696 c -2.475,-5.058 -3.997,-10.586 -4.463,-16.198 -0.488,-5.873 0.182,-11.84 1.961,-17.458 l 0.235,-0.738 z m 25.185,0.02 -0.572,0.522 c -2.356,2.161 -4.02,5.044 -4.713,8.165 -0.692,3.121 -0.402,6.441 0.818,9.396 1.836,4.446 5.683,7.845 10.103,9.599 3.253,1.292 6.828,1.742 10.3,1.299 3.472,-0.444 6.818,-1.778 9.642,-3.846 l 0.624,-0.458 -0.916,-1.253 -0.625,0.458 c -2.608,1.91 -5.714,3.148 -8.922,3.558 -3.207,0.41 -6.526,0 -9.531,-1.2 -4.067,-1.614 -7.595,-4.754 -9.244,-8.748 -1.097,-2.655 -1.357,-5.664 -0.735,-8.468 0.623,-2.804 2.131,-5.417 4.248,-7.359 l 0.571,-0.526 z m 9.062,2.025 c -0.359,0.02 -0.716,0.06 -1.071,0.117 -2.844,0.492 -5.354,2.422 -6.564,5.042 l -0.326,0.701 1.408,0.651 0.326,-0.704 c 0.986,-2.135 3.104,-3.76 5.421,-4.16 2.316,-0.401 4.854,0.417 6.499,2.097 1.356,1.384 2.14,3.355 2.101,5.292 -0.04,1.937 -0.899,3.872 -2.309,5.201 l -0.564,0.53 1.064,1.128 0.564,-0.53 c 1.723,-1.625 2.746,-3.931 2.793,-6.299 0.05,-2.368 -0.882,-4.713 -2.54,-6.405 -1.767,-1.804 -4.293,-2.776 -6.802,-2.661 z m -10.103,42.094 -0.727,1.366 0.685,0.364 c 5.734,3.039 11.961,5.146 18.363,6.208 3.109,0.515 6.256,0.786 9.407,0.81 h 0.776 l 0.01,-1.549 h -0.776 c -3.07,-0.02 -6.136,-0.285 -9.164,-0.787 -6.236,-1.034 -12.305,-3.088 -17.89,-6.049 l -0.685,-0.36 z"
         style="color:#000000;font-style:normal;font-variant:normal;font-weight:normal;font-stretch:normal;font-size:medium;line-height:normal;font-family:sans-serif;text-indent:0;text-align:start;text-decoration:none;text-decoration-line:none;text-decoration-style:solid;text-decoration-color:#000000;letter-spacing:normal;word-spacing:normal;text-transform:none;writing-mode:lr-tb;direction:ltr;baseline-shift:baseline;text-anchor:start;white-space:normal;clip-rule:nonzero;display:inline;overflow:visible;visibility:visible;opacity:1;isolation:auto;mix-blend-mode:normal;color-interpolation:sRGB;color-interpolation-filters:linearRGB;solid-color:#000000;solid-opacity:1;fill:#ffffff;fill-opacity:1;fill-rule:nonzero;stroke:none;stroke-width:0.8;stroke-linecap:square;stroke-linejoin:miter;stroke-miterlimit:10;stroke-dasharray:none;stroke-dashoffset:0;stroke-opacity:1;color-rendering:auto;image-rendering:auto;shape-rendering:auto;text-rendering:auto;enable-background:accumulate"
         inkscape:connector-curvature="0" />
    </g>
  </g>
</svg>
