<?xml version="1.0" encoding="UTF-8" standalone="no"?>
<!-- Created with Inkscape (http://www.inkscape.org/) -->
<svg id="svg3571" xmlns="http://www.w3.org/2000/svg" height="64.486mm" width="108.67mm" version="1.1" viewBox="0 0 385.05034 228.49314">
 <g id="layer1" transform="translate(-171.17 -72.041)">
  <path id="path6152" style="color-rendering:auto;text-decoration-color:#000000;color:#000000;isolation:auto;mix-blend-mode:normal;shape-rendering:auto;solid-color:#000000;text-decoration-line:none;text-decoration-style:solid;image-rendering:auto;white-space:normal;text-indent:0;text-transform:none" d="m366.64 82.786-0.79494 0.55645c-4.3248 3.0365-13.439 6.5221-21.38 9.1531-7.9412 2.631-14.752 4.4668-14.752 4.4668l-0.37853 0.10213-0.20064 0.34069c-46.28 78.095-138.8 106.36-138.8 106.36l-0.92742 0.28012 0.56403 1.8548 0.92741-0.28392s92.867-28.26 139.68-106.89c0.32382-0.0876 6.6864-1.8017 14.49-4.3873 7.9998-2.6504 17.103-6.0437 21.887-9.4029l0.79114-0.56025-1.1129-1.5861zm1.1621 4.0731-0.79114 0.55645c-4.3248 3.0365-13.442 6.5183-21.384 9.1493-7.9413 2.631-14.748 4.4668-14.748 4.4668l-0.38232 0.10214-0.20063 0.34068c-46.28 78.1-138.8 106.36-138.8 106.36l-0.92743 0.28012 0.56403 1.8548 0.92741-0.28391s92.867-28.259 139.68-106.89c0.3238-0.0876 6.6863-1.8055 14.49-4.391 5.421-1.796 11.318-3.9375 16.065-6.174-5.865 5.0863-13.684 13.454-22.587 23.674-11.573 13.284-24.845 29.596-37.4 45.447-25.065 31.646-47.227 61.384-47.306 61.49-5.7742 2.5404-11.046 5.0832-15.974 7.6238h4.3418c4.0686-2.0301 8.3012-4.0602 12.942-6.0907h0.004c25.493-11.201 58.503-21.043 96.717-21.429 34.708-0.35597 78.972 6.8796 119.39 27.52h4.2396c-41.662-22.164-87.699-29.827-123.65-29.458-17.881 0.18063-34.61 2.4289-49.99 5.8976 1.9903-8.983 15.862-63.632 65.23-93.253l0.46939-0.28014v-24.796l0.18548-0.12869-1.1129-1.5861zm-1.0107 4.2661v21.175c-51.818 31.413-64.773 89.815-65.851 95.081-15.642 3.67-29.828 8.5933-42.324 13.904 2.938-3.9329 21.981-29.39 45.22-58.73 12.544-15.837 25.8-32.135 37.339-45.379 10.706-12.288 19.969-21.908 25.616-26.051zm-66.672 58.132v1.9381h6.0074v-1.9381zm-4.6522 5.4282v1.9381h6.0112v-1.9381zm-5.6175 5.6213v1.9381h5.8144v-1.9381zm-6.3973 5.4245v1.9381h5.8144v-1.9381zm-9.1076 5.6213v1.9381h8.5247v-1.9381zm-7.5594 5.6213v1.9381h11.822v-1.9381zm-6.7834 5.4245v1.9381h13.567v-1.9381zm-8.1424 5.6213v1.9381h15.895v-1.9381zm-6.3935 5.4282v1.9381h16.281v-1.9381zm-9.8836 5.6213v1.9381h19.96v-1.9381zm-8.5285 5.4245v1.9381h25.582v-1.9381zm126.35 1.359c-42.032 0.38109-77.708 12.1-104.18 24.613h4.5841c25.862-11.746 59.896-22.315 99.616-22.674 31.873-0.35024 71.88 5.7027 109.44 22.674h4.7014c-38.982-18.496-80.918-24.977-114.16-24.613h-0.004zm-138.37 4.2624v1.9381h32.562v-1.9381zm137.79 0c-37.244 0.38596-69.307 9.5774-94.684 20.35h5.0535c24.483-9.9088 54.785-18.051 89.649-18.412h0.004c29.096-0.34433 64.983 4.7176 99.518 18.412h5.1595c-36.161-15.179-74.111-20.712-104.7-20.35zm-147.48 5.6213v1.9381h40.507v-1.9381z" fill="#fff"/>
  <path id="path6196" fill="#be1e2d" d="m182.29 230.47v43.222h25.775c2.7134 0 5.0399-0.38914 7.5594-1.552 2.5196-1.1629 4.8461-2.7141 6.5904-4.6522 1.9381-1.9381 3.2925-4.2631 4.4554-6.9765 1.1629-2.5196 1.7451-5.4282 1.7451-8.3354 0-3.8762-0.77601-7.5579-2.7141-10.853-1.9381-3.2948-4.4546-6.0074-7.5556-7.9455s-6.3981-2.9072-10.08-2.9072zm2.1312 1.3552h23.644c2.3257 0 4.6507 0.58295 6.9765 1.552 2.1319 1.1629 4.0701 2.518 5.8144 4.2624 1.5505 1.9381 2.9072 3.8778 3.8762 6.3973 0.96906 2.5196 1.552 5.0391 1.552 7.7525s-0.58295 5.2329-1.552 7.7525c-0.96906 2.5196-2.1319 4.653-3.8762 6.3973-1.5505 1.7443-3.6824 3.2933-5.8144 4.2624-2.1319 0.96906-4.4569 1.552-6.9765 1.552h-23.644zm1.9381 2.5211v35.662h21.705c2.9072 0 5.6228-0.5837 8.1424-2.328s4.4569-3.8732 6.0074-6.5866c1.3567-2.7134 2.1312-5.6236 2.1312-8.9184 0-3.101-0.58068-6.2012-2.1312-8.9146-1.5505-2.9072-3.4879-5.0399-6.0074-6.5904-2.5196-1.5505-5.2352-2.3242-8.1424-2.3242zm46.515 1.7451v37.6h1.9381v-37.6zm4.0693 0v37.6h1.9381v-37.6zm4.0693 0v37.6h1.9381v-37.6zm29.848 0v37.6h1.9381v-35.662h22.095c2.9072 0 5.2307 0.96906 7.3626 2.9072s3.104 4.2639 3.104 6.7834c0 2.7134-0.97209 5.0384-3.104 6.9765 0.77525 0.77525 1.5528 1.9374 2.328 3.1002 0.58144 1.3567 0.96906 2.5196 0.96906 3.8762 0 2.7134-0.9683 5.0384-3.1002 6.9765s-4.4592 2.9072-7.3664 2.9072h-12.598v1.9381h12.598c2.3257 0 4.2624-0.38611 6.2005-1.3552 1.7443-0.96906 3.2963-2.1312 4.4592-4.0693s1.7451-4.0716 1.7451-6.3973c0-2.5196-0.77751-4.6515-2.328-6.7834 1.5505-1.9381 2.328-4.4562 2.328-7.1695 0-2.1319-0.58219-4.07-1.7451-5.8144-1.1629-1.7443-2.7141-3.2971-4.6522-4.2661-1.9381-0.96906-4.0685-1.5482-6.2005-1.5482zm-82.37 0.19304h19.767c2.5196 0 4.8483 0.77449 6.9803 2.1312 2.1319 1.3567 3.8747 3.2948 5.2314 5.8144 1.3567 2.3257 1.9381 5.0384 1.9381 7.9455 0 2.9072-0.58144 5.4298-1.9381 7.9493-1.3567 2.5196-3.0995 4.4577-5.2314 5.8144-2.3257 1.3567-4.6538 2.1312-7.1733 2.1312h-19.574zm56.399 0v37.6h21.126v-1.9381h-19.188v-1.9381h19.188v-1.9381h-19.188v-1.9381h19.188v-1.9381h-19.188v-3.8762h18.026v-1.9381h-18.026v-1.9381h18.026v-1.9381h-18.026v-1.9381h18.026v-1.9381h-18.026v-4.6522h19.188v-1.9381h-19.188v-1.9381h19.188v-1.9381h-19.188v-1.9381h19.188v-1.9381zm-54.46 1.552v28.489h17.636c2.1319 0 4.0693-0.77525 6.0074-1.9381 1.9381-1.3567 3.2963-3.0995 4.4592-5.2314 1.1629-2.3257 1.7451-4.6538 1.7451-7.1733 0-2.7134-0.58219-5.0376-1.7451-7.1695s-2.5211-3.8755-4.4592-5.0384c-1.7443-1.3567-3.8755-1.9381-6.0074-1.9381h-17.636zm1.9381 1.7413h15.698c1.7443 0 3.4879 0.38913 5.0384 1.552s2.7141 2.5211 3.6832 4.4592c0.96906 1.9381 1.359 4.0685 1.359 6.2005 0 3.4886-0.96906 6.202-2.9072 8.7215-1.9381 2.5196-4.4599 3.6832-7.1733 3.6832h-15.698zm82.563 0.38989v33.917h1.9381v-31.979h18.026c1.7443 0 3.2925 0.58219 4.4554 1.7451 1.3567 1.1629 1.9381 2.5188 1.9381 4.0693 0 1.7443-0.58144 3.0995-1.9381 4.2624s-2.7111 1.7451-4.4554 1.7451h-12.791v1.9381h12.791c1.7443 0 3.2925 0.58144 4.4554 1.9381 1.3567 1.1629 1.9381 2.7119 1.9381 4.2624 0 1.7443-0.58144 3.2963-1.9381 4.4592-1.1629 0.96906-2.7111 1.552-4.4554 1.552h-12.598v1.9381h12.598c2.3258 0 4.2631-0.77752 6.0074-2.328s2.5211-3.4886 2.5211-5.8144c0-1.3567-0.39065-2.7126-1.1659-4.0693s-1.9366-2.3257-3.2933-2.9072c1.3567-0.58143 2.518-1.5505 3.2933-2.9072 0.77525-1.1629 1.1659-2.5188 1.1659-4.0693 0-2.1319-0.77676-3.8778-2.5211-5.4282-1.7443-1.5505-3.6817-2.3242-6.0074-2.3242zm-80.625 1.7451v20.929h13.76c2.1319 0 4.0708-1.1621 5.6213-3.1002 1.5505-2.1319 2.3242-4.4592 2.3242-7.3664s-0.77373-5.4245-2.3242-7.3626c-1.5505-2.1319-3.4894-3.1002-5.6213-3.1002h-13.76zm2.1312 1.7413h11.629c1.7443 0 3.1033 0.97057 4.2661 2.5211 1.1629 1.7443 1.7413 3.6817 1.7413 6.0074s-0.57841 4.2631-1.7413 6.0074-2.5218 2.5211-4.2661 2.5211h-11.629zm82.37 0.19683v30.041h1.9381v-28.3h13.957c0.58143 0 1.1598 0.19532 1.7413 0.58294 0.58144 0.38763 0.776 0.97058 0.776 1.552 0 0.77525-0.19456 1.3544-0.776 1.5482-0.19381 0.58144-0.77298 0.776-1.5482 0.776h-12.598v1.9381h12.598c1.1629 0 2.325-0.38687 3.1002-1.1621 0.77525-0.77525 1.3552-1.7443 1.3552-2.9072 0-0.96906-0.38611-1.9381-1.3552-2.9072-0.96906-0.77525-1.9374-1.1621-3.1002-1.1621zm3.4901 13.76v1.9381h12.598c0.58144 0 1.1636 0.19456 1.7451 0.776 0.58143 0.58144 0.77222 0.96604 0.77222 1.7413 0 0.77525-0.19071 1.3574-0.77222 1.7451-0.58144 0.38762-0.96982 0.38989-1.7451 0.38989h-12.598v1.9381h12.598c1.1629 0 2.325-0.39065 3.1002-1.1659 0.77525-0.77524 1.3552-1.7436 1.3552-3.1002 0-1.1629-0.38611-2.1319-1.3552-2.9072-0.96906-0.77525-1.9374-1.3552-3.1002-1.3552z"/>
  <path id="path6202" fill="#fff" d="m335.79 228.14c-3.3131 0.0362-6.6179 0.69852-9.6906 1.9381-2.9252 1.1801-5.6414 2.8842-7.9455 5.0384-2.2808 2.1324-4.1563 4.7078-5.4282 7.5594-1.2739 2.856-1.9381 5.9804-1.9381 9.1076 0.00002 3.1272 0.66431 6.2516 1.9381 9.1076 1.2718 2.8516 3.1472 5.4273 5.4282 7.5594 2.3043 2.1539 5.0208 3.8572 7.9455 5.0384 3.0724 1.2408 6.3773 1.9065 9.6906 1.9381 4.0809 0.0388 8.1698-0.88868 11.822-2.7103 3.4794-1.7355 6.5535-4.2772 8.9146-7.3664l-1.5482-1.1621c-2.107 2.9287-4.9259 5.3422-8.1424 6.9765-3.3429 1.6985-7.1032 2.5509-10.853 2.5211-3.0453-0.0242-6.0829-0.62439-8.9146-1.7451-2.7166-1.0751-5.252-2.636-7.3664-4.6522-2.063-1.9673-3.7147-4.3596-4.8453-6.9765-1.1335-2.6235-1.7413-5.4775-1.7413-8.3354s0.6078-5.7081 1.7413-8.3316c1.1306-2.6168 2.7823-5.0129 4.8453-6.9802 2.1143-2.0163 4.6498-3.5733 7.3664-4.6485 2.8317-1.1207 5.8693-1.7208 8.9146-1.7451 3.7495-0.0299 7.5098 0.81882 10.853 2.5173 3.2165 1.6342 6.0354 4.0516 8.1424 6.9802l1.7451-0.96906c-2.3147-3.3491-5.4791-6.1106-9.1114-7.9493-3.6422-1.8437-7.7397-2.7551-11.822-2.7104zm0 3.8762c-3.6406 0.0196-7.2684 0.97067-10.467 2.7104-3.126 1.7004-5.8529 4.1642-7.7525 7.1733-1.8577 2.9429-2.9071 6.4035-2.9072 9.8836-0.00006 3.4802 1.0493 6.9409 2.9072 9.8837 1.8998 3.009 4.6269 5.4722 7.7525 7.1733 3.1979 1.7405 6.8258 2.6929 10.467 2.7103 3.416 0.0155 6.8297-0.7937 9.8837-2.3242 2.9379-1.4724 5.5417-3.6067 7.5594-6.2005l-1.552-1.1659c-1.7573 2.4393-4.1041 4.4508-6.7834 5.8144-2.7478 1.3984-5.8315 2.1144-8.9146 2.135-2.5119 0.0174-5.0303-0.42604-7.3626-1.359-2.2262-0.89049-4.2724-2.2253-6.0112-3.8762-1.6875-1.6023-3.0932-3.5089-4.0693-5.6213-1.0072-2.1797-1.5482-4.5753-1.5482-6.9765 0.00002-2.4012 0.54113-4.7967 1.5482-6.9765 0.97602-2.1124 2.3816-4.0192 4.0693-5.6213 1.7389-1.6507 3.7853-2.985 6.0112-3.8762 2.3321-0.93371 4.8506-1.3749 7.3626-1.3552 3.0824 0.0242 6.1606 0.74668 8.9146 2.1312 2.6461 1.3302 4.9845 3.2686 6.7834 5.6213l1.7451-0.96906c-2.0152-2.7676-4.6964-5.0474-7.7525-6.5904-3.0498-1.5399-6.4672-2.3436-9.8837-2.3242zm45.546 2.3242c-2.9072 0-5.8151 0.38913-8.5285 1.552s-5.0384 2.5173-6.9765 4.4554c-1.9381 1.7443-3.4894 4.0708-4.6522 6.5904-1.1629 2.5196-1.7451 5.2322-1.7451 7.9455 0 2.7134 0.58219 5.426 1.7451 7.9455 1.1629 2.7134 2.7141 4.8461 4.6522 6.5904 1.9381 1.9381 4.2631 3.2963 6.9765 4.4592 2.7134 0.96906 5.6213 1.5482 8.5285 1.5482s5.8151-0.38535 8.5285-1.5482c2.7134-1.1629 5.0384-2.5211 6.9765-4.4592 1.9381-1.7443 3.4894-4.0708 4.6522-6.5904 1.1629-2.5196 1.7451-5.2322 1.7451-7.9455 0-2.7134-0.58219-5.426-1.7451-7.9455-1.1629-2.5196-2.7141-4.6522-4.6522-6.5904-1.9381-1.9381-4.2631-3.4864-6.9765-4.4554-2.7134-0.96906-5.6213-1.552-8.5285-1.552zm0.19303 1.552c2.7134 0 5.2329 0.57917 7.7525 1.5482 2.5196 0.96906 4.653 2.325 6.3973 4.0693s3.2933 3.6854 4.2624 6.0112c0.96906 2.3258 1.552 4.843 1.552 7.3626s-0.58295 5.0406-1.552 7.3664c-0.96906 2.3257-2.518 4.2631-4.2624 6.0074-1.7443 1.7443-3.8778 3.1002-6.3973 4.0693-2.5196 0.96906-5.0391 1.552-7.7525 1.552s-5.2329-0.58294-7.7525-1.552-4.6492-2.325-6.3935-4.0693-3.2971-3.6817-4.2661-6.0074c-0.96906-2.3258-1.5482-4.8468-1.5482-7.3664s0.57917-5.0368 1.5482-7.3626c0.96905-2.3257 2.5218-4.2669 4.2661-6.0112s3.874-3.1002 6.3935-4.0693c2.5196-0.96906 5.0391-1.5482 7.7525-1.5482zm26.555 0.19304v37.6h1.9381v-34.307l21.122 34.307h2.328l-23.064-37.6h-2.3242zm4.6485 0 23.257 37.6h2.328l-23.257-37.6zm4.6522 0 23.257 37.6h2.328l-23.257-37.6zm4.8453 0 23.064 37.6h2.3242v-37.6h-1.9381v34.303l-21.122-34.303zm15.505 0v18.991l1.9381 3.4901v-22.481zm4.0693 0v25.775l1.9381 3.104v-28.879zm11.243 0v37.6h1.9381v-37.6zm3.8762 0v37.6h1.9381v-37.6zm4.0693 0v37.6h1.9381v-37.6zm4.0693 0v37.6h2.1349v-12.405h15.698v-1.9381h-15.698v-1.9381h15.698v-1.9381h-15.698v-1.9381h15.698v-1.9381h-15.698v-5.8144h17.053v-1.9381h-17.053v-1.9381h17.053v-1.9381h-17.053v-1.9381h17.053v-1.9381zm-129.08 0.19304c-2.9619-0.0306-5.9289 0.71123-8.5285 2.1312-2.5145 1.3735-4.6848 3.383-6.2005 5.8144-1.4791 2.3727-2.3244 5.1496-2.3242 7.9455 0.00022 2.7959 0.84586 5.5762 2.3242 7.9493 1.5151 2.432 3.6845 4.4434 6.2005 5.8144 2.6005 1.417 5.567 2.1508 8.5285 2.1312 2.7512-0.0174 5.4962-0.6849 7.9455-1.9381 2.3467-1.2008 4.4202-2.9366 6.0112-5.0384l-1.552-1.1659c-1.4593 1.8538-3.3263 3.3877-5.4282 4.4592-2.2121 1.1276-4.6866 1.7437-7.1695 1.7451-2.628 0.001-5.2488-0.68595-7.5594-1.9381-2.1957-1.1899-4.1265-2.9047-5.4245-5.0384-1.3031-2.142-1.9381-4.6661-1.9381-7.1733s0.63505-5.0275 1.9381-7.1695c1.298-2.1336 3.2287-3.8484 5.4245-5.0384 2.3106-1.2522 4.9314-1.9396 7.5594-1.9381 2.4829 0.001 4.9574 0.61369 7.1695 1.7413 2.102 1.0715 3.969 2.6053 5.4282 4.4592l1.7451-0.96906c-1.7098-2.0136-3.8367-3.6735-6.2042-4.8453-2.4642-1.2197-5.1962-1.9096-7.9455-1.9381zm45.546 1.552c-2.3257 0-4.6507 0.38612-6.9765 1.3552-2.3258 0.96906-4.2639 2.1327-5.8144 3.6832s-2.9072 3.2925-3.8762 5.4245c-0.96906 2.1319-1.3552 4.2646-1.3552 6.5904 0 2.3257 0.38611 4.4584 1.3552 6.5904 0.96906 2.1319 2.3257 3.8778 3.8762 5.4282 1.7443 1.5505 3.6824 2.7103 5.8144 3.6794 2.1319 0.96906 4.6507 1.359 6.9765 1.359s4.6507-0.3899 6.9765-1.359c2.3257-0.96906 4.2639-2.1289 5.8144-3.6794s2.9072-3.2963 3.8762-5.4282c0.96906-2.1319 1.359-4.2646 1.359-6.5904 0-2.3257-0.38989-4.4584-1.359-6.5904-0.96906-2.1319-2.3258-3.874-3.8762-5.4245-1.7443-1.5505-3.6824-2.7141-5.8144-3.6832-2.1319-0.96906-4.6507-1.3552-6.9765-1.3552zm0 1.9381c2.1319 0 4.2661 0.19304 6.2042 1.1621s3.6817 1.9366 5.0384 3.2933c1.5505 1.3567 2.7111 2.9072 3.4864 4.8453 0.96906 1.7443 1.359 3.6824 1.359 5.8144 0 1.9381-0.58371 3.8762-1.359 5.8144-0.96906 1.9381-2.1297 3.4886-3.4864 4.8453s-3.1002 2.5218-5.0384 3.2971c-1.9381 0.77525-4.0723 1.1621-6.2042 1.1621s-4.2624-0.38687-6.2005-1.1621c-1.9381-0.96906-3.6817-1.9404-5.0384-3.2971-1.5505-1.3567-2.5211-3.101-3.4901-4.8453-0.96906-1.7443-1.3552-3.6824-1.3552-5.8144 0-1.9381 0.57992-3.8762 1.3552-5.8144 0.77525-1.9381 1.9396-3.4886 3.4901-4.8453 1.3567-1.3567 3.1002-2.518 5.0384-3.2933 1.9381-0.77525 4.0685-1.1621 6.2005-1.1621zm-45.739 0.5565c-1.7215 0.004-3.4488 0.30829-5.0384 0.96906-1.5192 0.63149-2.8976 1.5819-4.0693 2.7368-1.1299 1.1138-2.0749 2.4241-2.7141 3.8762-0.64274 1.4601-0.97294 3.057-0.96906 4.6522 0.004 1.5947 0.33719 3.1881 0.96906 4.6522 0.62933 1.4583 1.5553 2.79 2.7141 3.8762 1.1713 1.0979 2.5724 1.937 4.0693 2.5173 1.6034 0.62149 3.3189 0.94696 5.0384 0.96906 2.1355 0.0273 4.2822-0.41649 6.2005-1.3552 1.8304-0.89565 3.4412-2.2374 4.6522-3.8762l-1.5482-1.1621c-1.0019 1.3886-2.3443 2.5282-3.8762 3.2933-1.614 0.80608-3.4313 1.1912-5.2352 1.1621-2.847-0.0459-5.6771-1.1507-7.7525-3.1002-2.0158-1.8935-3.2933-4.6007-3.2933-7.3664s1.2775-5.469 3.2933-7.3626c2.0754-1.9495 4.9054-3.0543 7.7525-3.1002 1.8038-0.0291 3.6212 0.35603 5.2352 1.1621 1.5319 0.76509 2.8744 1.9046 3.8762 3.2933l1.5482-0.96906c-1.2833-1.4778-2.8798-2.6827-4.6522-3.5128-1.932-0.90485-4.0671-1.359-6.2005-1.3552zm45.546 1.3817c-2.5196 0-4.8446 0.57841-6.9765 1.7413s-3.8755 2.9072-5.0384 4.8453c-1.3567 1.9381-1.9381 4.2646-1.9381 6.5904 0 2.3257 0.77524 4.6522 1.9381 6.5904 1.3567 1.9381 2.9064 3.6824 5.0384 4.8453 2.1319 1.1629 4.4569 1.7451 6.9765 1.7451s4.8445-0.58219 6.9765-1.7451c2.1319-1.1629 3.8755-2.9072 5.0384-4.8453 1.3567-1.9381 1.9381-4.2646 1.9381-6.5904 0-2.3257-0.77525-4.6522-1.9381-6.5904-1.1629-2.1319-2.9064-3.6824-5.0384-4.8453-2.1319-1.1629-4.4569-1.7413-6.9765-1.7413zm0.19303 1.9381c3.2948 0 6.2027 1.1614 8.5285 3.2933s3.4901 4.8446 3.4901 7.9455c0 3.101-1.1644 5.8136-3.4901 7.9455s-5.2337 3.2971-8.5285 3.2971-6.2027-1.1651-8.5285-3.2971c-2.3257-2.1319-3.4864-4.8445-3.4864-7.9455s1.1606-5.8136 3.4864-7.9455c2.3257-2.3257 5.2337-3.2933 8.5285-3.2933zm30.431 0.77223v29.269h1.9381v-25.779zm-30.431 1.1659c-2.9072 0-5.2314 0.96604-7.1695 2.7104-1.9381 1.7443-2.9072 4.0708-2.9072 6.5904s0.96906 4.846 2.9072 6.5904c1.9381 1.9381 4.4562 2.7141 7.1695 2.7141 2.9072 0 5.2352-0.96981 7.1733-2.7141s2.9072-4.0708 2.9072-6.5904-0.96906-4.8461-2.9072-6.5904c-2.1319-1.7443-4.4599-2.7104-7.1733-2.7104zm0 1.9381c2.1319 0 4.0708 0.58068 5.6213 2.1312 1.5505 1.3567 2.3242 3.2933 2.3242 5.2314s-0.77374 3.6847-2.3242 5.2352c-1.5505 1.3567-3.4894 2.1312-5.6213 2.1312s-4.0708-0.58068-5.6213-2.1312c-1.5505-1.3567-2.3242-3.2971-2.3242-5.2352s0.77373-3.6809 2.3242-5.2314 3.2956-2.325 5.6213-2.1312zm34.5 3.6794v22.485h1.9381v-18.995z"/>
  <path id="path6210" fill="#be1e2d" d="m487.54 230.27v1.9381h20.153v-1.9381zm24.42 0.19304v1.9381h16.86l0.38989-1.9381zm18.605 0-11.436 43.222h2.1312l11.436-43.222h-2.1312zm4.0693 0-11.436 43.222h2.135l11.432-43.222zm4.2661 0-11.436 43.222h2.1312l11.436-43.222zm4.0693 0-11.436 43.222h2.1312l11.436-43.222h-2.1312zm-55.429 3.6832v1.9381h20.153v-1.9381zm24.42 0v1.9381h15.891l0.38989-1.9381zm-24.42 3.6832v1.7413h6.5866v33.917h1.9381v-33.917h1.9381v33.917h1.9381v-33.917h1.9381v33.917h1.9381v-33.917h1.9381v33.917h1.9381v-35.658zm24.42 0.19304v1.9381h14.922l0.38989-1.9381z"/>
  <path id="path6216" fill="#fff" d="m484.44 282.02c-0.58143 0-1.1598 0.19608-1.7413 0.3899-0.58144 0.19381-0.97057 0.38762-1.552 0.96906-0.58144 0.58143-0.9683 1.1598-1.1621 1.7413-0.19381 0.77525-0.38989 1.552-0.38989 2.5211 0 0.77525 0.19608 1.549 0.38989 2.3242 0.19382 0.77525 0.58144 1.3574 0.96906 1.7451 0.38763 0.38763 0.9668 0.77525 1.5482 0.96906 0.58144 0.19381 1.3567 0.38989 1.9381 0.38989 0.58144 0 0.97057-0.19683 1.552-0.19683 0.38762 0 0.77449-0.19226 1.1621-0.38611l-0.57917-1.552c-0.38763 0.19381-0.58144 0.38989-0.96906 0.38989-0.19381 0.19381-0.77827 0.19304-1.1659 0.19304-0.58143 0-1.1606 0.00075-1.5482-0.19304-0.38762-0.19381-0.77449-0.38838-1.1621-0.776-0.38763-0.38763-0.58219-0.77374-0.77601-1.3552-0.19381-0.58143-0.19303-1.1629-0.19303-1.9381 0-0.77525 0.19226-1.3567 0.38611-1.9381 0.19381-0.58144 0.38838-0.97133 0.776-1.359 0.38763-0.38762 0.7745-0.58219 1.1621-0.776 0.58143-0.19381 0.96755-0.19304 1.3552-0.19304 0.96906 0 1.5535 0.19608 2.135 0.3899l0.38609-1.1659c-0.19381 0-0.58144-0.19304-0.96906-0.19304h-1.552zm-75.78 0.3899c-1.3567 0-2.518 0.38611-3.2933 1.3552-0.77525 0.96906-1.1621 2.325-1.1621 4.0693 0 0.77525-0.00076 1.5497 0.19304 2.1312 0.19381 0.77525 0.38838 1.3574 0.776 1.7451 0.38762 0.58144 0.77374 0.96831 1.3552 1.1621 0.58144 0.19381 1.1629 0.38989 1.9381 0.38989 1.3567 0 2.518-0.38989 3.2933-1.359 0.77525-0.96906 1.1659-2.325 1.1659-4.0693 0-0.77524-0.004-1.5497-0.19684-2.1312-0.19381-0.77525-0.3846-1.3574-0.77222-1.7451-0.38762-0.58143-0.97133-0.9683-1.359-1.1621-0.38763-0.19381-1.1629-0.38611-1.9381-0.38611zm-16.474 0.19303v10.467h1.1621v-6.9802l-0.19304-1.5482 0.58295 1.3552 3.1002 4.6523h0.58295l2.9072-4.6522 0.57917-1.3552-0.19304 1.5482v6.9802h1.3552v-10.467h-0.96906l-3.2933 5.2314-0.58295 1.1621-0.57916-1.1621-3.4901-5.2314h-0.96906zm23.45 0v10.467h1.1659v-6.7834l-0.19684-1.552 0.77601 1.552 5.2352 6.9765h0.77222v-10.467h-1.1621v6.7834l0.19303 1.3552-0.77222-1.3552-5.2352-6.9765h-0.77601zm9.3045 0v1.1621h3.4901v9.3045h1.3552v-9.3045h3.2933v-1.1621zm11.243 0c-0.58143 0-0.97132 0.19304-1.359 0.19304h-0.19303v10.467h1.3552v-4.6522l1.552 0.19304 3.1002 4.4592h1.552l-2.7141-4.0692-0.77601-0.58294c0.58144-0.19381 1.3574-0.38763 1.7451-0.96906 0.58143-0.38763 0.776-1.1629 0.776-1.9381 0-0.58144-0.19608-0.96755-0.38989-1.3552-0.19381-0.38763-0.3846-0.77525-0.77223-0.96906-0.38762-0.38763-0.77827-0.38914-1.1659-0.58295s-0.77374-0.19304-1.3552-0.19304h-1.3552zm8.1386 0v10.66h6.2005v-1.1621h-4.8453v-3.6832h4.2661v-1.1621h-4.2661v-3.4901h4.6522v-1.1621zm11.436 0-4.2661 10.467h1.359l1.1621-2.9072h4.0693l1.1621 2.9072h1.359l-4.2661-10.467zm6.2005 0v10.467h6.5904v-1.1659h-5.2314v-9.3007zm29.462 0-4.2661 10.467h1.359l1.1621-2.9072h4.0693l1.1621 2.9072h1.359l-4.2661-10.467zm6.5866 0v10.467h1.1659v-6.7834l-0.19683-1.552 0.776 1.552 5.2352 6.9765h0.77223v-10.467h-1.1621v6.7834l0.19304 1.3552-0.77223-1.3552-5.2352-6.9765h-0.776zm13.567 0-4.2624 10.467h1.1621l1.1621-2.9072h4.0731l1.3552 2.9072h1.3552l-4.2624-10.467zm6.2042 0v10.66h2.7142c0.96906 0 1.9358-0.002 2.5173-0.38989 0.58144-0.19381 1.1644-0.58068 1.552-1.1621 0.38762-0.58143 0.77524-1.1636 0.96906-1.7451 0.19381-0.58144 0.38611-1.1629 0.38611-1.9381 0-0.77525-0.19226-1.5497-0.38611-2.1312-0.19382-0.77524-0.58144-1.3574-0.96906-1.7451-0.38763-0.58144-0.97057-0.9683-1.552-1.1621-0.58144-0.19381-1.3552-0.38611-2.3242-0.38611h-2.328zm12.791 0-4.2624 10.467h1.3552l1.1621-2.9072h4.0693l1.1659 2.9072h1.3552l-4.2624-10.467zm-121.91 0.96906c0.58143 0 0.97132 0.19226 1.359 0.38611 0.38762 0.19382 0.77525 0.58144 0.96906 0.96906 0.19381 0.38763 0.38535 0.77752 0.57917 1.359 0.19381 0.38762 0.19303 0.96679 0.19303 1.5482 0 1.5505-0.19071 2.5218-0.77222 3.2971-0.58144 0.58143-1.359 0.96906-2.328 0.96906-0.58144 0-0.96755-0.19608-1.3552-0.3899-0.38763-0.19381-0.77525-0.58143-0.96906-0.96906-0.19382-0.38762-0.38914-0.96754-0.58295-1.3552-0.19381-0.38762-0.19304-0.97057-0.19304-1.552 0-1.5505 0.38838-2.518 0.77601-3.2933 0.58143-0.58143 1.3552-0.96906 2.3242-0.96906zm27.524 0h1.5482c0.77525 0 1.3582 0.19226 1.552 0.38611 0.38762 0.38763 0.57917 0.77752 0.57917 1.359 0 0.77524-0.3846 1.1606-0.77223 1.5482-0.38762 0.38763-0.96981 0.58295-1.7451 0.58295h-1.1621zm82.949 0h1.552c0.77525 0 1.3567 0.19304 1.9381 0.19304 0.58143 0.19381 0.9683 0.58144 1.1621 0.96906 0.19382 0.38762 0.38914 0.77374 0.58295 1.3552 0.19381 0.58144 0.19304 1.1644 0.19304 1.552 0 0.58143 0.00075 0.97057-0.19304 1.552 0 0.58143-0.19532 0.96754-0.58295 1.3552-0.19381 0.38762-0.58068 0.77525-1.1621 0.96906-0.58144 0.19381-1.1629 0.38611-1.9381 0.38611h-1.552v-8.3316zm-62.989 0.77601 0.38989 1.5482 1.1621 3.1002h-3.2971l1.359-3.1002zm35.855 0 0.3899 1.5482 1.1621 3.1002h-3.2971l1.359-3.1002zm19.771 0 0.38612 1.5482 1.1621 3.1002h-3.2933l1.3552-3.1002zm19.184 0 0.3899 1.5482 1.1621 3.1002h-3.2933l1.3552-3.1002zm-57.175 3.2933c-0.19381 0-0.38535-0.00076-0.57916 0.19303-0.19382 0.19382-0.19304 0.38914-0.19304 0.58295 0 0.38763 0.19304 0.57917 0.19304 0.57917 0 0.19381 0.38535 0.19684 0.57916 0.19684 0.38763 0 0.5822-0.004 0.77601-0.19684 0.19381-0.19381 0.19303-0.38536 0.19303-0.57917s0.00076-0.38913-0.19303-0.58295c-0.19381-0.19381-0.58219-0.19303-0.77601-0.19303z"/>
  <path id="path5952" style="color-rendering:auto;text-decoration-color:#000000;color:#000000;isolation:auto;mix-blend-mode:normal;shape-rendering:auto;solid-color:#000000;text-decoration-line:none;text-decoration-style:solid;image-rendering:auto;white-space:normal;text-indent:0;text-transform:none" d="m445.06 79.315-0.21577 1.5369 0.76844 0.10602c5.7144 0.8092 11.21 3.1677 15.736 6.7493 4.5255 3.5816 8.0823 8.3881 10.183 13.764 2.1229 5.4332 2.7353 11.532 1.1697 17.095-1.0323 3.6678-3.0051 7.0764-5.6932 9.7701-2.6878 2.6933-6.0986 4.6737-9.7739 5.6402-4.1124 1.0815-8.5635 0.88182-12.564-0.56024-4.0002-1.442-7.5549-4.1292-10.031-7.5859l-0.45425-0.63216-1.2567 0.9047 0.45046 0.62837c2.6632 3.7176 6.4636 6.5953 10.766 8.1462 4.3021 1.5509 9.0609 1.7612 13.484 0.59809 3.9504-1.0389 7.596-3.1573 10.478-6.0453 2.8816-2.8876 4.9868-6.5254 6.0907-10.448 1.6739-5.9474 1.0099-12.371-1.2189-18.075-2.2021-5.6359-5.9225-10.66-10.667-14.415-4.7447-3.7551-10.49-6.2189-16.482-7.0673l-0.76844-0.1097zm-2.6725 2.9791c-0.85461-0.02927-1.7089-0.02151-2.5627 0.02268-2.2768 0.11784-4.5436 0.50106-6.738 1.1621-5.5887 1.6835-10.626 5.1053-14.252 9.6792l-0.48074 0.60567 1.2151 0.96526 0.48075-0.60944c3.4248-4.3204 8.2084-7.5667 13.487-9.1569 8.2794-2.494 17.7-0.76114 24.756 4.2699 7.6334 5.4427 12.458 14.689 12.556 24.064l0.008 0.776 1.552-0.0155-0.008-0.77601c-0.10408-9.8935-5.155-19.569-13.211-25.313-4.8882-3.4853-10.821-5.4697-16.803-5.6743zm-0.38233 2.7671c-5.7608-0.12307-11.551 1.7297-16.103 5.2806-3.1099 2.4262-5.5863 5.5666-7.4913 8.9714-3.2352 5.7821-4.8832 12.4-4.9361 19.01-0.0965 12.037 5.2603 23.98 14.313 31.915l0.58295 0.51103 1.0221-1.1659-0.58295-0.51102c-8.7-7.62-13.87-19.17-13.78-30.74 0.051-6.3606 1.6407-12.727 4.7393-18.265 1.8242-3.2603 4.1745-6.2341 7.0862-8.5058 4.254-3.3188 9.7138-5.0705 15.119-4.9551 5.9278 0.12656 11.801 2.5024 16.152 6.5298l0.57159 0.52618 1.0523-1.1394-0.56781-0.52616c-4.638-4.2927-10.856-6.8038-17.174-6.9386zm25.703 2.6271-1.041 1.1508 0.57537 0.5186c7.1145 6.4359 10.747 16.581 9.3348 26.07-0.88311 5.9343-3.6488 11.588-7.7903 15.929l-0.53752 0.56024 1.1242 1.0713 0.53374-0.56023c4.3673-4.5776 7.2717-10.515 8.203-16.773 1.4924-10.028-2.3119-20.646-9.8307-27.448zm-44.399 9.6906-0.40505 0.65867c-3.7503 6.0537-5.8272 13.12-5.943 20.24-0.15505 9.5325 3.257 19.062 9.4294 26.327 6.1724 7.2659 15.025 12.175 24.457 13.563l0.76465 0.11357 0.22713-1.5369-0.76843-0.10969c-9.0487-1.3315-17.578-6.0626-23.5-13.033-5.9215-6.9704-9.2072-16.153-9.0584-25.298 0.11125-6.8356 2.1081-13.641 5.7084-19.453l0.40883-0.65867-1.3211-0.81385zm25.059 5.9468c-2.2887-0.0913-4.5912 0.44689-6.6017 1.5444-1.9071 1.041-3.5337 2.572-4.6863 4.4138s-1.8203 3.9772-1.923 6.1475c-0.10272 2.1703 0.35882 4.3565 1.3324 6.2989 0.97362 1.9424 2.4507 3.6213 4.251 4.8377l0.63973 0.43532 0.87063-1.287-0.64352-0.43152c-1.5764-1.0651-2.8761-2.5502-3.7286-4.251-0.85254-1.7008-1.2634-3.6301-1.1735-5.5305s0.67899-3.7814 1.6883-5.3942c1.0093-1.6127 2.4448-2.9684 4.1147-3.88 1.7599-0.96075 3.7918-1.4351 5.7954-1.3552 2.0035 0.08 3.9928 0.71511 5.6705 1.8132l0.64731 0.42774 0.85171-1.2984-0.65109-0.42396c-1.9166-1.2544-4.1653-1.9754-6.4541-2.0668zm-35.306 0.64351-0.23091 0.73816c-1.8401 5.8122-2.5337 11.981-2.029 18.056 0.4823 5.8056 2.0539 11.518 4.6144 16.75l0.34068 0.6965 1.393-0.68136-0.34068-0.69653c-2.4749-5.058-3.9968-10.586-4.463-16.198-0.48785-5.8725 0.18218-11.84 1.9608-17.458l0.23471-0.73815zm25.184 0.0227-0.57159 0.52239c-2.3558 2.1612-4.0201 5.0441-4.7128 8.1651-0.69271 3.121-0.40257 6.4404 0.81765 9.3953 1.8359 4.4458 5.6833 7.8452 10.103 9.5997 3.253 1.2914 6.8284 1.742 10.3 1.2984 3.4717-0.44358 6.8176-1.7782 9.6414-3.846l0.6246-0.45804-0.91607-1.253-0.62458 0.45803c-2.6088 1.9104-5.7147 3.1484-8.9222 3.5583-3.2074 0.40983-6.5262-0.008-9.5316-1.2-4.0666-1.6144-7.5947-4.7543-9.2439-8.748-1.0963-2.6548-1.3567-5.664-0.73435-8.4679 0.62233-2.804 2.1307-5.4171 4.2472-7.3588l0.57159-0.52619zm9.0622 2.0252c-0.35844 0.0155-0.71577 0.0558-1.0713 0.11726-2.844 0.49193-5.3539 2.4218-6.5638 5.0421l-0.32555 0.70031 1.4082 0.65109 0.32555-0.70408c0.98561-2.1345 3.104-3.7594 5.4207-4.1602 2.3167-0.40074 4.8542 0.41769 6.4995 2.0971 1.356 1.384 2.1394 3.3548 2.1009 5.292-0.0386 1.9372-0.89918 3.8721-2.3091 5.2011l-0.56403 0.52994 1.0637 1.128 0.56403-0.52994c1.7236-1.6248 2.7465-3.9306 2.7936-6.2989s-0.88229-4.7128-2.54-6.4049c-1.7674-1.804-4.2934-2.7761-6.8023-2.6611zm-10.103 42.094-0.72679 1.3665 0.68514 0.36339c5.734 3.0397 11.961 5.1462 18.363 6.208 3.1087 0.51556 6.2556 0.78661 9.4067 0.81006l0.77601 0.004 0.0116-1.5482-0.776-0.008c-3.0698-0.0229-6.1359-0.2851-9.1644-0.78737-6.2362-1.0342-12.305-3.0882-17.89-6.049l-0.68515-0.35962z" fill="#be1e2d"/>
 </g>
</svg>
