<?xml version="1.0" encoding="UTF-8" standalone="no"?>
<!-- Created with Inkscape (http://www.inkscape.org/) -->

<svg
   xmlns:dc="http://purl.org/dc/elements/1.1/"
   xmlns:cc="http://creativecommons.org/ns#"
   xmlns:rdf="http://www.w3.org/1999/02/22-rdf-syntax-ns#"
   xmlns:svg="http://www.w3.org/2000/svg"
   xmlns="http://www.w3.org/2000/svg"
   xmlns:sodipodi="http://sodipodi.sourceforge.net/DTD/sodipodi-0.dtd"
   xmlns:inkscape="http://www.inkscape.org/namespaces/inkscape"
   width="11in"
   height="8.5in"
   viewBox="0 0 279.4 215.9"
   version="1.1"
   id="svg5758"
   inkscape:version="0.92.1 r15371"
   sodipodi:docname="foyer-accommodation.svg">
  <defs
     id="defs5752" />
  <sodipodi:namedview
     id="base"
     pagecolor="#ffffff"
     bordercolor="#666666"
     borderopacity="1.0"
     inkscape:pageopacity="0.0"
     inkscape:pageshadow="2"
     inkscape:zoom="0.54492188"
     inkscape:cx="486.51685"
     inkscape:cy="393.27893"
     inkscape:document-units="mm"
     inkscape:current-layer="layer1"
     showgrid="false"
     units="in"
     inkscape:window-width="1280"
     inkscape:window-height="773"
     inkscape:window-x="0"
     inkscape:window-y="27"
     inkscape:window-maximized="1"
     showguides="false" />
  <metadata
     id="metadata5755">
    <rdf:RDF>
      <cc:Work
         rdf:about="">
        <dc:format>image/svg+xml</dc:format>
        <dc:type
           rdf:resource="http://purl.org/dc/dcmitype/StillImage" />
        <dc:title></dc:title>
      </cc:Work>
    </rdf:RDF>
  </metadata>
  <g
     inkscape:label="Calque 1"
     inkscape:groupmode="layer"
     id="layer1"
     transform="translate(0,-81.1)">
    <text
       id="text1418"
       y="125.80907"
       x="211.11946"
       style="font-style:normal;font-variant:normal;font-weight:normal;font-stretch:normal;font-size:31.06246948px;line-height:1.25;font-family:Monoton;-inkscape-font-specification:'Monoton, Normal';font-variant-ligatures:normal;font-variant-caps:normal;font-variant-numeric:normal;font-feature-settings:normal;text-align:start;letter-spacing:0px;word-spacing:0px;writing-mode:lr-tb;text-anchor:start;opacity:1;vector-effect:none;fill:#bc312e;fill-opacity:1;stroke:none;stroke-width:0.18625814;stroke-linecap:butt;stroke-linejoin:miter;stroke-miterlimit:4;stroke-dasharray:none;stroke-dashoffset:0;stroke-opacity:1;marker:none"
       xml:space="preserve"><tspan
         style="font-style:normal;font-variant:normal;font-weight:normal;font-stretch:normal;font-size:31.06246948px;font-family:Monoton;-inkscape-font-specification:'Monoton, Normal';font-variant-ligatures:normal;font-variant-caps:normal;font-variant-numeric:normal;font-feature-settings:normal;text-align:start;writing-mode:lr-tb;text-anchor:start;vector-effect:none;fill:#bc312e;fill-opacity:1;stroke:none;stroke-width:0.18625814;stroke-linecap:butt;stroke-linejoin:miter;stroke-miterlimit:4;stroke-dasharray:none;stroke-dashoffset:0;stroke-opacity:1;marker:none"
         y="152.74513"
         x="211.11946"
         id="tspan1416"
         sodipodi:role="line" /></text>
    <g
       id="g4228"
       transform="matrix(0.08750229,0,0,0.08750229,3.3059868,263.38594)">
      <g
         id="g3454"
         transform="matrix(1.8506257,0,0,1.9083048,-50.499744,-402.48632)"
         style="color:#000000;clip-rule:nonzero;display:inline;overflow:visible;visibility:visible;opacity:1;isolation:auto;mix-blend-mode:normal;color-interpolation:sRGB;color-interpolation-filters:linearRGB;solid-color:#000000;solid-opacity:1;fill:#bc312e;fill-opacity:1;fill-rule:nonzero;stroke:none;stroke-width:0.52402526;stroke-linecap:butt;stroke-linejoin:miter;stroke-miterlimit:4;stroke-dasharray:none;stroke-dashoffset:0;stroke-opacity:1;marker:none;color-rendering:auto;image-rendering:auto;shape-rendering:auto;text-rendering:auto;enable-background:accumulate">
        <path
           d="m 140.49318,309.19511 v -29.85714 q 0,0 18.50992,0 4.48612,0 7.69047,4.41072 3.24207,4.37302 3.24207,10.51786 0,6.18253 -3.24207,10.55556 -3.20435,4.373 -7.69047,4.373 z m 2.71428,-2.71428 h 15.79564 q 3.35516,0 5.73016,-3.58134 2.41269,-3.58135 2.41269,-8.63294 0,-5.08929 -2.41269,-8.63294 -2.375,-3.58134 -5.73016,-3.58134 h -15.79564 z m -5.42855,5.42857 h 21.22419 q 5.61706,0 9.6508,-5.16469 4.07141,-5.20238 4.07141,-12.47816 0,-4.7877 -1.88492,-8.85913 -1.84721,-4.07141 -5.01388,-6.40873 -3.12896,-2.375 -6.82341,-2.375 h -21.22419 z m -2.71429,2.71428 v -40.71426 h 23.93848 q 4.41071,0 8.21825,2.71427 3.80754,2.71428 6.03175,7.42659 2.2619,4.6746 2.2619,10.21627 0,5.50396 -2.2619,10.21627 -2.22421,4.71229 -6.03175,7.42658 -3.80754,2.71428 -8.21825,2.71428 z m -2.71429,2.71429 h 26.65277 q 5.16468,0 9.57538,-3.09127 4.44842,-3.09128 7.08731,-8.40675 2.63889,-5.31547 2.63889,-11.5734 0,-6.22024 -2.63889,-11.53571 -2.63889,-5.35317 -7.08731,-8.44445 -4.4484,-3.09126 -9.57538,-3.09126 h -26.65277 z m -2.71428,2.71428 v -51.57141 h 29.36705 q 5.88096,0 10.97023,3.46825 5.08929,3.43055 8.10516,9.38692 3.01587,5.95633 3.01587,12.93054 0,6.97419 -3.01587,12.93055 -3.01587,5.95635 -8.10516,9.4246 -5.08927,3.43055 -10.97023,3.43055 z m -2.71429,2.71429 h 32.08134 q 4.93849,0 9.53768,-2.26191 4.59921,-2.26191 7.95437,-6.06944 3.35517,-3.80754 5.35317,-9.08532 2.03572,-5.31547 2.03572,-11.08332 0,-5.76786 -2.03572,-11.04563 -1.998,-5.27778 -5.35317,-9.08532 -3.35516,-3.84524 -7.95437,-6.10714 -4.59919,-2.2619 -9.53768,-2.2619 h -32.08134 z m 32.08134,2.71428 h -34.79562 v -62.42855 h 34.79562 q 7.35119,0 13.72221,4.18452 6.37103,4.18452 10.14088,11.38492 3.80752,7.20039 3.80752,15.64484 0,6.33333 -2.26189,12.13889 -2.22421,5.76784 -5.95635,9.95236 -3.73214,4.18453 -8.85912,6.67262 -5.08928,2.4504 -10.59325,2.4504 z"
           style="color:#000000;font-style:normal;font-variant:normal;font-weight:normal;font-stretch:normal;font-size:medium;line-height:120.00000477%;font-family:Monoton;-inkscape-font-specification:'Monoton, Normal';text-indent:0;text-align:center;text-decoration:none;text-decoration-line:none;text-decoration-style:solid;text-decoration-color:#000000;letter-spacing:0px;word-spacing:0px;text-transform:none;writing-mode:lr-tb;direction:ltr;baseline-shift:baseline;text-anchor:middle;white-space:normal;clip-rule:nonzero;display:inline;overflow:visible;visibility:visible;isolation:auto;mix-blend-mode:normal;color-interpolation:sRGB;color-interpolation-filters:linearRGB;solid-color:#000000;solid-opacity:1;fill:#bc312e;fill-opacity:1;fill-rule:nonzero;stroke:none;stroke-width:0.52402526;stroke-linecap:butt;stroke-linejoin:miter;stroke-miterlimit:4;stroke-dasharray:none;stroke-dashoffset:0;stroke-opacity:1;marker:none;color-rendering:auto;image-rendering:auto;shape-rendering:auto;text-rendering:auto;enable-background:accumulate"
           id="path3365"
           inkscape:connector-curvature="0" />
        <path
           d="m 206.23919,325.48082 h -2.71429 v -54.28569 h 2.71429 z m -5.42856,0 h -2.7143 v -54.28569 h 2.7143 z m -5.42858,0 h -2.71429 v -54.28569 h 2.71429 z m 16.28571,-13.57142 h 25.9742 v 2.71428 h -25.9742 v 2.71429 h 25.9742 v 2.71428 h -25.9742 v 2.71429 h 25.9742 v 2.71428 h -28.68849 v -54.28569 h 28.68849 v 2.71429 h -25.9742 v 2.71427 h 25.9742 v 2.71428 h -25.9742 v 2.7143 h 25.9742 v 2.71429 h -25.9742 v 6.748 h 24.46627 v 2.71429 h -24.46627 v 2.71429 h 24.46627 v 2.71427 h -24.46627 v 2.71429 h 24.46627 v 2.71428 h -24.46627 z"
           style="color:#000000;font-style:normal;font-variant:normal;font-weight:normal;font-stretch:normal;font-size:medium;line-height:120.00000477%;font-family:Monoton;-inkscape-font-specification:'Monoton, Normal';text-indent:0;text-align:center;text-decoration:none;text-decoration-line:none;text-decoration-style:solid;text-decoration-color:#000000;letter-spacing:0px;word-spacing:0px;text-transform:none;writing-mode:lr-tb;direction:ltr;baseline-shift:baseline;text-anchor:middle;white-space:normal;clip-rule:nonzero;display:inline;overflow:visible;visibility:visible;isolation:auto;mix-blend-mode:normal;color-interpolation:sRGB;color-interpolation-filters:linearRGB;solid-color:#000000;solid-opacity:1;fill:#bc312e;fill-opacity:1;fill-rule:nonzero;stroke:none;stroke-width:0.52402526;stroke-linecap:butt;stroke-linejoin:miter;stroke-miterlimit:4;stroke-dasharray:none;stroke-dashoffset:0;stroke-opacity:1;marker:none;color-rendering:auto;image-rendering:auto;shape-rendering:auto;text-rendering:auto;enable-background:accumulate"
           id="path3367"
           inkscape:connector-curvature="0" />
        <path
           d="m 286.76297,298.03639 -0.0754,-0.0377 q 4.25992,-4.14683 4.25992,-10.10317 0,-5.65476 -4.22222,-9.80159 -4.18453,-4.18451 -9.91469,-4.18451 h -29.85713 v 51.5714 h -2.71428 v -54.28569 h 32.57141 q 4.44841,0 8.33136,2.29959 3.92063,2.26191 6.22023,6.14484 2.29961,3.84524 2.29961,8.25596 0,6.03175 -3.24208,10.36705 3.24208,4.48612 3.24208,9.87699 0,5.16468 -2.33731,9.12301 -2.3373,3.92064 -6.14485,5.91864 -3.76983,1.99801 -8.36904,1.99801 h -17.15277 v -2.71427 h 17.15277 q 5.80557,0 9.95238,-4.10913 4.18453,-4.14683 4.18453,-10.21626 0,-2.78969 -1.20636,-5.50398 -1.20635,-2.71427 -3.01586,-4.5615 0,-0.0377 0.0377,-0.0377 z m -9.95239,13.57143 h -17.15276 v 2.71427 h 17.15276 q 2.48811,0 4.22223,-1.65873 1.77182,-1.69642 1.77182,-4.5238 0,-2.4504 -1.80952,-4.29762 -1.80952,-1.88492 -4.18453,-1.88492 h -17.19046 v 2.71429 h 17.19046 q 1.28176,0 2.26191,1.05555 1.01787,1.05555 1.01787,2.4127 0,1.65873 -0.94247,2.56348 -0.94245,0.90478 -2.33731,0.90478 z m 0,5.42856 h -17.15276 v 2.71428 h 17.15276 q 4.67462,0 8.02978,-3.31746 3.39285,-3.35515 3.39285,-8.29364 0,-3.12898 -1.69643,-5.88095 -1.65873,-2.78968 -4.41071,-4.29762 2.75198,-1.43254 4.41071,-4.07143 1.69643,-2.67658 1.69643,-5.99404 0,-4.52381 -3.43056,-7.87897 -3.39285,-3.39286 -7.99207,-3.39286 h -27.14283 v 48.85713 h 2.71428 v -46.14285 h 24.42855 q 3.46826,0 6.06945,2.6012 2.63889,2.5635 2.63889,5.95635 0,3.76984 -2.56349,6.22024 -2.56348,2.41269 -6.14485,2.41269 h -8.29364 -8.85912 v 2.71429 h 8.85912 8.29364 q 3.46826,0 6.06945,2.67658 2.63889,2.67659 2.63889,6.22024 0,3.92064 -2.56349,6.40872 -2.56348,2.4881 -6.14485,2.4881 z m 0,-25.9365 h -17.15276 v 2.71428 h 17.15276 q 2.5258,0 4.25993,-1.58334 1.73412,-1.62102 1.73412,-4.3353 0,-2.2996 -1.80952,-4.07143 -1.80952,-1.77182 -4.18453,-1.77182 h -21.71427 v 43.42855 h 2.71429 v -40.71426 h 18.99998 q 1.28176,0 2.26191,0.98015 1.01787,0.94247 1.01787,2.14881 0,1.54563 -0.94247,2.37499 -0.94245,0.82937 -2.33731,0.82937 z"
           style="color:#000000;font-style:normal;font-variant:normal;font-weight:normal;font-stretch:normal;font-size:medium;line-height:120.00000477%;font-family:Monoton;-inkscape-font-specification:'Monoton, Normal';text-indent:0;text-align:center;text-decoration:none;text-decoration-line:none;text-decoration-style:solid;text-decoration-color:#000000;letter-spacing:0px;word-spacing:0px;text-transform:none;writing-mode:lr-tb;direction:ltr;baseline-shift:baseline;text-anchor:middle;white-space:normal;clip-rule:nonzero;display:inline;overflow:visible;visibility:visible;isolation:auto;mix-blend-mode:normal;color-interpolation:sRGB;color-interpolation-filters:linearRGB;solid-color:#000000;solid-opacity:1;fill:#bc312e;fill-opacity:1;fill-rule:nonzero;stroke:none;stroke-width:0.52402526;stroke-linecap:butt;stroke-linejoin:miter;stroke-miterlimit:4;stroke-dasharray:none;stroke-dashoffset:0;stroke-opacity:1;marker:none;color-rendering:auto;image-rendering:auto;shape-rendering:auto;text-rendering:auto;enable-background:accumulate"
           id="path3369"
           inkscape:connector-curvature="0" />
      </g>
      <g
         id="g3424"
         style="color:#000000;clip-rule:nonzero;display:inline;overflow:visible;visibility:visible;opacity:1;isolation:auto;mix-blend-mode:normal;color-interpolation:sRGB;color-interpolation-filters:linearRGB;solid-color:#000000;solid-opacity:1;fill:#1b75bc;fill-opacity:1;fill-rule:nonzero;stroke:none;stroke-width:0.75200349;stroke-linecap:square;stroke-linejoin:miter;stroke-miterlimit:10;stroke-dasharray:none;stroke-dashoffset:0;stroke-opacity:1;marker:none;color-rendering:auto;image-rendering:auto;shape-rendering:auto;text-rendering:auto;enable-background:accumulate"
         transform="matrix(2.4989829,0,0,2.5768696,-300.30689,-508.95789)">
        <path
           d="m 356.93863,251.92332 -1.64714,1.08879 q -1.50755,-2.23341 -3.93638,-3.51762 -2.40091,-1.31213 -5.22059,-1.31213 -4.57849,0 -7.81693,3.23845 -3.23845,3.23844 -3.23845,7.81693 0,4.57848 3.23845,7.81693 3.23844,3.23844 7.81693,3.23844 2.81968,0 5.22059,-1.31213 2.42883,-1.31213 3.93638,-3.54554 l 1.61922,1.17254 q -1.78672,2.62426 -4.63432,4.15973 -2.8476,1.53547 -6.14187,1.53547 -2.65218,0 -5.08101,-1.03295 -2.40091,-1.03296 -4.15972,-2.79177 -1.75881,-1.75881 -2.79176,-4.15972 -1.03295,-2.42883 -1.03295,-5.081 0,-2.65218 1.03295,-5.05309 1.03295,-2.42883 2.79176,-4.18764 1.75881,-1.75881 4.15972,-2.79176 2.42883,-1.03296 5.08101,-1.03296 3.32219,0 6.16979,1.56339 2.84759,1.53547 4.63432,4.18764 z m 3.3222,-2.28924 -1.67506,1.08879 q -2.0659,-3.01511 -5.36018,-4.77392 -3.26636,-1.78672 -7.09107,-1.78672 -4.10389,0 -7.56567,2.03798 -3.46179,2.01007 -5.49977,5.47185 -2.01007,3.46179 -2.01007,7.56568 0,4.10388 2.01007,7.56567 2.03798,3.46178 5.49977,5.49977 3.46178,2.01006 7.56567,2.01006 3.82471,0 7.11899,-1.78672 3.29428,-1.78673 5.36018,-4.82975 l 1.64714,1.14462 q -2.34508,3.46179 -6.08604,5.47185 -3.71304,2.01007 -8.04027,2.01007 -4.63433,0 -8.57071,-2.28924 -3.93638,-2.28925 -6.22563,-6.22563 -2.28924,-3.93638 -2.28924,-8.5707 0,-4.63433 2.28924,-8.57071 2.28925,-3.93638 6.22563,-6.22563 3.93638,-2.28924 8.57071,-2.28924 4.32723,0 8.04027,2.01007 3.74096,2.01006 6.08604,5.47185 z m 3.35011,-2.23341 -1.67506,1.08879 q -2.62425,-3.85263 -6.81189,-6.08604 -4.15973,-2.26133 -8.98947,-2.26133 -3.88055,0 -7.42609,1.50755 -3.54553,1.50755 -6.11395,4.07597 -2.54051,2.54051 -4.04806,6.08604 -1.50755,3.54554 -1.50755,7.42609 0,3.88054 1.50755,7.42608 1.50755,3.54554 4.04806,6.11396 2.56842,2.5405 6.11395,4.04805 3.54554,1.50755 7.42609,1.50755 4.85766,0 9.01738,-2.26133 4.15973,-2.26132 6.78398,-6.11395 l 1.61922,1.20045 q -2.90343,4.24348 -7.50983,6.72815 -4.57849,2.45675 -9.91075,2.45675 -5.72311,0 -10.58078,-2.81968 -4.85766,-2.8476 -7.70526,-7.70526 -2.81967,-4.85766 -2.81967,-10.58077 0,-5.72311 2.81967,-10.58078 2.8476,-4.85766 7.70526,-7.67734 4.85767,-2.8476 10.58078,-2.8476 5.36018,0 9.96658,2.51259 4.60641,2.48467 7.50984,6.75606 z m 3.29428,-2.28924 -1.67506,1.08878 q -3.18261,-4.66224 -8.23569,-7.37025 -5.02517,-2.708 -10.85995,-2.708 -4.69016,0 -8.98947,1.84256 -4.2714,1.81464 -7.37025,4.9135 -3.09886,3.09885 -4.94142,7.39816 -1.81464,4.2714 -1.81464,8.96156 0,4.69015 1.81464,8.98947 1.84256,4.27139 4.94142,7.37024 3.09885,3.09886 7.37025,4.94142 4.29931,1.81465 8.98947,1.81465 5.83478,0 10.88786,-2.73593 5.05309,-2.73593 8.2357,-7.39817 l 1.61922,1.22838 q -3.46178,5.02517 -8.93363,7.98443 -5.47186,2.93135 -11.80915,2.93135 -5.10893,0 -9.77117,-2.01006 -4.63432,-1.98215 -8.01235,-5.33227 -3.35011,-3.37803 -5.36018,-8.01235 -1.98215,-4.66224 -1.98215,-9.77116 0,-5.10893 1.98215,-9.74325 2.01007,-4.66224 5.36018,-8.01235 3.37803,-3.37803 8.01235,-5.36018 4.66224,-2.01007 9.77117,-2.01007 6.36521,0 11.83706,2.95926 5.47185,2.95927 8.93364,8.04028 z"
           style="color:#000000;font-style:normal;font-variant:normal;font-weight:normal;font-stretch:normal;font-size:medium;line-height:120.00000477%;font-family:Monoton;-inkscape-font-specification:'Monoton, Normal';text-indent:0;text-align:center;text-decoration:none;text-decoration-line:none;text-decoration-style:solid;text-decoration-color:#000000;letter-spacing:0px;word-spacing:0px;text-transform:none;writing-mode:lr-tb;direction:ltr;baseline-shift:baseline;text-anchor:middle;white-space:normal;clip-rule:nonzero;display:inline;overflow:visible;visibility:visible;isolation:auto;mix-blend-mode:normal;color-interpolation:sRGB;color-interpolation-filters:linearRGB;solid-color:#000000;solid-opacity:1;fill:#1b75bc;fill-opacity:1;fill-rule:nonzero;stroke:none;stroke-width:0.75200349;stroke-linecap:square;stroke-linejoin:miter;stroke-miterlimit:10;stroke-dasharray:none;stroke-dashoffset:0;stroke-opacity:1;marker:none;color-rendering:auto;image-rendering:auto;shape-rendering:auto;text-rendering:auto;enable-background:accumulate"
           id="path3371"
           inkscape:connector-curvature="0" />
        <path
           d="m 386.08461,256.58556 q -2.34507,2.34508 -2.34507,5.66728 0,3.32219 2.34507,5.69519 2.373,2.34508 5.6952,2.34508 3.32219,0 5.66727,-2.34508 2.373,-2.373 2.373,-5.69519 0,-3.3222 -2.373,-5.66728 -2.34508,-2.37299 -5.66727,-2.37299 -3.3222,0 -5.6952,2.37299 z m -1.42379,12.78627 q -2.93135,-2.95927 -2.93135,-7.11899 0,-4.15973 2.93135,-7.09108 2.95926,-2.95926 7.11899,-2.95926 4.15972,0 7.09107,2.95926 2.95927,2.93135 2.95927,7.09108 0,4.15972 -2.95927,7.11899 -2.93135,2.93135 -7.09107,2.93135 -4.15973,0 -7.11899,-2.93135 z m -1.4238,-15.63386 q -3.51762,3.54553 -3.51762,8.51487 0,4.96933 3.51762,8.51487 3.54553,3.54553 8.54279,3.54553 4.99725,0 8.51487,-3.54553 3.54553,-3.54554 3.54553,-8.51487 0,-4.96934 -3.54553,-8.51487 -3.51762,-3.54554 -8.51487,-3.54554 -4.99726,0 -8.54279,3.54554 z m -3.65721,15.57802 q -1.87048,-3.23844 -1.87048,-7.06315 0,-3.82471 1.87048,-7.06316 1.8984,-3.23844 5.13684,-5.10892 3.23844,-1.8984 7.06316,-1.8984 3.82471,0 7.06315,1.8984 3.23844,1.87048 5.10892,5.10892 1.8984,3.23845 1.8984,7.06316 0,3.82471 -1.8984,7.06315 -1.87048,3.23844 -5.10892,5.13684 -3.23844,1.87048 -7.06315,1.87048 -3.82472,0 -7.06316,-1.87048 -3.23844,-1.8984 -5.13684,-5.13684 z m -2.62425,-13.28878 q -1.2563,2.95927 -1.2563,6.22563 0,3.26636 1.2563,6.25354 1.28421,2.95927 3.43386,5.13684 2.17758,2.14966 5.13684,3.43387 2.98719,1.25629 6.25355,1.25629 3.26636,0 6.22562,-1.25629 2.98719,-1.28421 5.13684,-3.43387 2.17758,-2.17757 3.43387,-5.13684 1.28421,-2.98718 1.28421,-6.25354 0,-3.26636 -1.28421,-6.22563 -1.25629,-2.98718 -3.43387,-5.13684 -2.14965,-2.17757 -5.13684,-3.43387 -2.95926,-1.28421 -6.22562,-1.28421 -3.26636,0 -6.25355,1.28421 -2.95926,1.2563 -5.13684,3.43387 -2.14965,2.14966 -3.43386,5.13684 z m -1.84257,13.26086 q -1.42379,-3.35011 -1.42379,-7.03523 0,-3.68513 1.42379,-7.03524 1.45172,-3.35011 3.85263,-5.75103 2.42884,-2.42883 5.77895,-3.85263 3.35011,-1.45171 7.03524,-1.45171 3.68512,0 7.03523,1.45171 3.35012,1.4238 5.75103,3.85263 2.42883,2.40092 3.85263,5.75103 1.45172,3.35011 1.45172,7.03524 0,3.68512 -1.45172,7.03523 -1.4238,3.35012 -3.85263,5.77895 -2.40091,2.40091 -5.75103,3.85263 -3.35011,1.4238 -7.03523,1.4238 -3.68513,0 -7.03524,-1.4238 -3.35011,-1.45172 -5.77895,-3.85263 -2.40091,-2.42883 -3.85263,-5.77895 z m -1.84256,-14.82425 q -1.5913,3.71305 -1.5913,7.78902 0,4.07597 1.5913,7.81693 1.59131,3.71304 4.2714,6.42105 2.708,2.68009 6.42105,4.27139 3.74096,1.59131 7.81693,1.59131 4.07597,0 7.78901,-1.59131 3.74096,-1.5913 6.42105,-4.27139 2.70801,-2.70801 4.29931,-6.42105 1.5913,-3.74096 1.5913,-7.81693 0,-4.07597 -1.5913,-7.78902 -1.5913,-3.74095 -4.29931,-6.42105 -2.68009,-2.708 -6.42105,-4.29931 -3.71304,-1.5913 -7.78901,-1.5913 -4.07597,0 -7.81693,1.5913 -3.71305,1.59131 -6.42105,4.29931 -2.68009,2.6801 -4.2714,6.42105 z m -1.84256,16.38764 q -1.75881,-4.10389 -1.75881,-8.59862 0,-4.49474 1.75881,-8.57071 1.75881,-4.10389 4.71808,-7.06315 2.95926,-2.95927 7.03523,-4.71808 4.10389,-1.75881 8.59863,-1.75881 4.49473,0 8.5707,1.75881 4.10389,1.75881 7.06316,4.71808 2.95926,2.95926 4.71807,7.06315 1.75881,4.07597 1.75881,8.57071 0,4.49473 -1.75881,8.59862 -1.75881,4.07597 -4.71807,7.03524 -2.95927,2.95926 -7.06316,4.71807 -4.07597,1.75881 -8.5707,1.75881 -4.49474,0 -8.59863,-1.75881 -4.07597,-1.75881 -7.03523,-4.71807 -2.95927,-2.95927 -4.71808,-7.03524 z"
           style="color:#000000;font-style:normal;font-variant:normal;font-weight:normal;font-stretch:normal;font-size:medium;line-height:120.00000477%;font-family:Monoton;-inkscape-font-specification:'Monoton, Normal';text-indent:0;text-align:center;text-decoration:none;text-decoration-line:none;text-decoration-style:solid;text-decoration-color:#000000;letter-spacing:0px;word-spacing:0px;text-transform:none;writing-mode:lr-tb;direction:ltr;baseline-shift:baseline;text-anchor:middle;white-space:normal;clip-rule:nonzero;display:inline;overflow:visible;visibility:visible;isolation:auto;mix-blend-mode:normal;color-interpolation:sRGB;color-interpolation-filters:linearRGB;solid-color:#000000;solid-opacity:1;fill:#1b75bc;fill-opacity:1;fill-rule:nonzero;stroke:none;stroke-width:0.75200349;stroke-linecap:square;stroke-linejoin:miter;stroke-miterlimit:10;stroke-dasharray:none;stroke-dashoffset:0;stroke-opacity:1;marker:none;color-rendering:auto;image-rendering:auto;shape-rendering:auto;text-rendering:auto;enable-background:accumulate"
           id="path3373"
           inkscape:connector-curvature="0" />
        <path
           d="m 450.12761,266.13339 -2.01007,-3.65721 v -20.32402 h 2.01007 z m 4.02013,6.95148 -2.01007,-3.40595 v -27.52676 h 2.01007 z m -27.69427,-14.71258 2.01007,3.65721 v 20.32402 h -2.01007 z m -4.02013,-7.23066 2.01007,3.68512 v 27.52677 h -2.01007 z m 0.69794,-8.98947 h 2.34508 l 23.28328,40.20136 h -2.34508 z m 4.74599,0 h 2.373 l 23.25537,40.20136 h -2.40092 z m 4.71808,0 h 2.34508 l 21.21738,36.71165 v -36.71165 h 2.01007 v 40.20136 h -2.373 z m -12.17208,3.46178 v 36.73958 h -2.01007 v -40.20136 h 2.40092 l 23.19953,40.20136 h -2.31716 z"
           style="color:#000000;font-style:normal;font-variant:normal;font-weight:normal;font-stretch:normal;font-size:medium;line-height:120.00000477%;font-family:Monoton;-inkscape-font-specification:'Monoton, Normal';text-indent:0;text-align:center;text-decoration:none;text-decoration-line:none;text-decoration-style:solid;text-decoration-color:#000000;letter-spacing:0px;word-spacing:0px;text-transform:none;writing-mode:lr-tb;direction:ltr;baseline-shift:baseline;text-anchor:middle;white-space:normal;clip-rule:nonzero;display:inline;overflow:visible;visibility:visible;isolation:auto;mix-blend-mode:normal;color-interpolation:sRGB;color-interpolation-filters:linearRGB;solid-color:#000000;solid-opacity:1;fill:#1b75bc;fill-opacity:1;fill-rule:nonzero;stroke:none;stroke-width:0.75200349;stroke-linecap:square;stroke-linejoin:miter;stroke-miterlimit:10;stroke-dasharray:none;stroke-dashoffset:0;stroke-opacity:1;marker:none;color-rendering:auto;image-rendering:auto;shape-rendering:auto;text-rendering:auto;enable-background:accumulate"
           id="path3375"
           inkscape:connector-curvature="0" />
        <path
           d="m 477.48687,282.35352 h -2.01007 v -40.20136 h 19.1794 v 2.01007 h -17.16933 v 2.01006 h 17.16933 v 2.01007 h -17.16933 v 2.01007 h 17.16933 v 2.01007 h -17.16933 v 6.14187 h 15.82928 v 2.01007 h -15.82928 v 2.01007 h 15.82928 v 2.01007 h -15.82928 v 2.01006 h 15.82928 v 2.01007 h -15.82928 z m -4.02014,0 h -2.01007 v -40.20136 h 2.01007 z m -4.02013,0 h -2.01007 v -40.20136 h 2.01007 z m -4.02014,0 h -2.01007 v -40.20136 h 2.01007 z"
           style="color:#000000;font-style:normal;font-variant:normal;font-weight:normal;font-stretch:normal;font-size:medium;line-height:120.00000477%;font-family:Monoton;-inkscape-font-specification:'Monoton, Normal';text-indent:0;text-align:center;text-decoration:none;text-decoration-line:none;text-decoration-style:solid;text-decoration-color:#000000;letter-spacing:0px;word-spacing:0px;text-transform:none;writing-mode:lr-tb;direction:ltr;baseline-shift:baseline;text-anchor:middle;white-space:normal;clip-rule:nonzero;display:inline;overflow:visible;visibility:visible;isolation:auto;mix-blend-mode:normal;color-interpolation:sRGB;color-interpolation-filters:linearRGB;solid-color:#000000;solid-opacity:1;fill:#1b75bc;fill-opacity:1;fill-rule:nonzero;stroke:none;stroke-width:0.75200349;stroke-linecap:square;stroke-linejoin:miter;stroke-miterlimit:10;stroke-dasharray:none;stroke-dashoffset:0;stroke-opacity:1;marker:none;color-rendering:auto;image-rendering:auto;shape-rendering:auto;text-rendering:auto;enable-background:accumulate"
           id="path3377"
           inkscape:connector-curvature="0" />
      </g>
      <g
         id="g3459"
         transform="matrix(1.8506257,0,0,1.9083048,-50.499744,-402.48632)"
         style="color:#000000;clip-rule:nonzero;display:inline;overflow:visible;visibility:visible;opacity:1;isolation:auto;mix-blend-mode:normal;color-interpolation:sRGB;color-interpolation-filters:linearRGB;solid-color:#000000;solid-opacity:1;fill:#bc312e;fill-opacity:1;fill-rule:nonzero;stroke:none;stroke-width:0.52402526;stroke-linecap:butt;stroke-linejoin:miter;stroke-miterlimit:4;stroke-dasharray:none;stroke-dashoffset:0;stroke-opacity:1;marker:none;color-rendering:auto;image-rendering:auto;shape-rendering:auto;text-rendering:auto;enable-background:accumulate">
        <path
           d="m 537.68351,276.62369 v -2.71427 h 27.36903 v 51.5714 h -2.71429 v -48.85713 h -2.71429 v 48.85713 h -2.71428 v -48.85713 h -2.71428 v 48.85713 h -2.71429 v -48.85713 h -2.71429 v 48.85713 h -2.71428 v -48.85713 z m 0,-5.42856 v -2.71429 h 27.36903 v 2.71429 z m 0,-5.42857 v -2.71429 h 27.36903 v 2.71429 z"
           style="color:#000000;font-style:normal;font-variant:normal;font-weight:normal;font-stretch:normal;font-size:medium;line-height:120.00000477%;font-family:Monoton;-inkscape-font-specification:'Monoton, Normal';text-indent:0;text-align:center;text-decoration:none;text-decoration-line:none;text-decoration-style:solid;text-decoration-color:#000000;letter-spacing:0px;word-spacing:0px;text-transform:none;writing-mode:lr-tb;direction:ltr;baseline-shift:baseline;text-anchor:middle;white-space:normal;clip-rule:nonzero;display:inline;overflow:visible;visibility:visible;isolation:auto;mix-blend-mode:normal;color-interpolation:sRGB;color-interpolation-filters:linearRGB;solid-color:#000000;solid-opacity:1;fill:#bc312e;fill-opacity:1;fill-rule:nonzero;stroke:none;stroke-width:0.52402526;stroke-linecap:butt;stroke-linejoin:miter;stroke-miterlimit:4;stroke-dasharray:none;stroke-dashoffset:0;stroke-opacity:1;marker:none;color-rendering:auto;image-rendering:auto;shape-rendering:auto;text-rendering:auto;enable-background:accumulate"
           id="path3379"
           inkscape:connector-curvature="0" />
        <path
           d="m 612.66564,263.05227 h 2.82738 l -15.38094,62.42855 h -2.82738 z m -21.18649,10.85715 -0.64087,2.71427 h -20.28175 v -2.71427 z m 1.28173,-5.42858 -0.64086,2.71429 h -21.56349 v -2.71429 z m 1.20636,-5.42857 -0.52778,2.71429 h -22.88293 v -2.71429 z m 1.92262,0 h 2.78967 l -15.38094,62.42855 h -2.78968 z m 5.57936,0 h 2.82737 l -15.38093,62.42855 h -2.82739 z m 5.61707,0 h 2.78967 l -15.38095,62.42855 h -2.78968 z"
           style="color:#000000;font-style:normal;font-variant:normal;font-weight:normal;font-stretch:normal;font-size:medium;line-height:120.00000477%;font-family:Monoton;-inkscape-font-specification:'Monoton, Normal';text-indent:0;text-align:center;text-decoration:none;text-decoration-line:none;text-decoration-style:solid;text-decoration-color:#000000;letter-spacing:0px;word-spacing:0px;text-transform:none;writing-mode:lr-tb;direction:ltr;baseline-shift:baseline;text-anchor:middle;white-space:normal;clip-rule:nonzero;display:inline;overflow:visible;visibility:visible;isolation:auto;mix-blend-mode:normal;color-interpolation:sRGB;color-interpolation-filters:linearRGB;solid-color:#000000;solid-opacity:1;fill:#bc312e;fill-opacity:1;fill-rule:nonzero;stroke:none;stroke-width:0.52402526;stroke-linecap:butt;stroke-linejoin:miter;stroke-miterlimit:4;stroke-dasharray:none;stroke-dashoffset:0;stroke-opacity:1;marker:none;color-rendering:auto;image-rendering:auto;shape-rendering:auto;text-rendering:auto;enable-background:accumulate"
           id="path3381"
           inkscape:connector-curvature="0" />
      </g>
      <path
         style="color:#000000;font-style:normal;font-variant:normal;font-weight:normal;font-stretch:normal;font-size:medium;line-height:normal;font-family:sans-serif;text-indent:0;text-align:start;text-decoration:none;text-decoration-line:none;text-decoration-style:solid;text-decoration-color:#000000;letter-spacing:normal;word-spacing:normal;text-transform:none;writing-mode:lr-tb;direction:ltr;baseline-shift:baseline;text-anchor:start;white-space:normal;clip-rule:nonzero;display:inline;overflow:visible;visibility:visible;opacity:1;isolation:auto;mix-blend-mode:normal;color-interpolation:sRGB;color-interpolation-filters:linearRGB;solid-color:#000000;solid-opacity:1;fill:#1b75bc;fill-opacity:1;fill-rule:nonzero;stroke:none;stroke-width:1;stroke-linecap:square;stroke-linejoin:miter;stroke-miterlimit:10;stroke-dasharray:none;stroke-dashoffset:0;stroke-opacity:1;color-rendering:auto;image-rendering:auto;shape-rendering:auto;text-rendering:auto;enable-background:accumulate"
         d="m 637.92557,-276.8869 -2.04995,1.43494 c -11.14433,7.8248 -34.62759,16.80573 -55.09111,23.58547 -20.46355,6.77973 -38.01328,11.50947 -38.01328,11.50947 l -0.97652,0.26462 -0.51808,0.87587 C 422.02258,-37.975297 183.61114,34.85628 183.61114,34.85628 l -2.38911,0.719334 1.45358,4.781945 2.3891,-0.730518 c 0,0 239.30791,-72.824764 359.95026,-275.448111 0.83445,-0.22574 17.22849,-4.64188 37.33865,-11.30448 20.61443,-6.82975 44.07057,-15.57393 56.39936,-24.23025 l 2.03877,-1.44615 z m 2.9929,10.49568 -2.03875,1.43494 c -11.14432,7.82474 -34.63878,16.79454 -55.1023,23.57429 -20.4636,6.77971 -38.00204,11.50946 -38.00212,11.50946 l -0.98396,0.26463 -0.51806,0.87961 C 425.0192,-27.487044 186.60404,45.340772 186.60404,45.340772 l -2.3891,0.723076 1.45359,4.778204 2.38911,-0.730517 c 0,0 239.30659,-72.818848 359.95024,-275.436935 0.83441,-0.22573 17.23216,-4.65299 37.34241,-11.31565 13.96914,-4.6281 29.16508,-10.14431 41.39753,-15.90753 -15.11338,13.10688 -35.26381,34.66827 -58.20703,61.00241 -29.82251,34.23027 -64.02111,76.26507 -96.37311,117.111012 C 409.9134,4.1639071 355.81981,76.585618 351.72085,82.07938 c -0.14714,0.06851 -0.29636,0.132621 -0.44354,0.201249 -0.9606,-0.05382 -1.309,0.238557 -1.34922,0.622451 -14.21331,6.668799 -28.16956,13.884733 -41.84854,21.59889 h 9.8099 c 26.277,-14.344317 53.57773,-26.791883 81.62473,-37.264145 L 435.90242,54.8972 c 7.60862,-2.331681 15.26165,-4.519476 22.95186,-6.56724 1.2316,-0.09389 2.34683,-0.311168 2.17665,-0.57772 62.98493,-16.535995 128.47927,-23.534588 193.5103,-20.245911 95.05262,4.806924 188.9257,31.423004 272.47013,76.995641 h 9.82852 C 850.78812,56.027432 753.43229,27.731986 654.77977,22.743028 c -11.35581,-0.574284 -22.72556,-0.839996 -34.09233,-0.797613 -3.78889,0.01337 -7.57598,0.06298 -11.36409,0.145412 -45.26403,0.984915 -90.41169,6.834784 -134.4684,17.282829 7.3349,-30.8717907 45.04243,-163.401476 167.24503,-236.722966 l 1.2113,-0.72306 v -63.90211 l -2.39281,-4.41669 z m -2.60155,10.99137 v 54.56933 C 511.88925,-124.18913 475.28457,14.608956 469.38722,40.69302 432.34604,49.817483 396.11287,62.210988 361.26983,77.733502 371.19897,64.452426 418.17385,1.7897091 476.08866,-71.33044 c 32.32392,-40.81051 66.48223,-82.80683 96.21656,-116.93583 27.58724,-31.66462 51.4604,-56.45809 66.0117,-67.13358 z m -173.09293,149.80193 c -1.70739,1.6707 -3.42075,3.33565 -5.13977,4.99439 h 12.89226 c 1.7965,-1.6731 3.60419,-3.33333 5.41182,-4.99439 z m -14.89373,14.275009 c -1.77113,1.664748 -3.52828,3.342244 -5.31119,4.994397 h 12.90714 c 1.73076,-1.673773 3.47634,-3.331995 5.21802,-4.994397 z m -15.49007,14.275018 c -1.85136,1.670015 -3.70493,3.337873 -5.56837,4.994377 h 14.17811 c 1.66388,-1.669481 3.33104,-3.335602 5.00558,-4.994377 z m -16.13113,14.278737 c -1.9432,1.680377 -3.91452,3.328637 -5.87027,4.994396 h 16.64175 c 1.60272,-1.667381 3.20232,-3.337129 4.81549,-4.994396 z m -16.91384,14.275015 c -2.01801,1.670493 -4.0371,3.339363 -6.06783,4.994377 h 20.27203 c 1.54832,-1.669156 3.10033,-3.334817 4.65892,-4.994377 z m -17.64064,14.275018 c -2.10921,1.66887 -4.21393,3.342128 -6.33618,4.994377 h 25.15832 c 1.49697,-1.671523 3.00645,-3.331996 4.51358,-4.994377 z m -18.41962,14.275016 c -2.22367,1.678792 -4.46411,3.333788 -6.70142,4.994376 h 31.38639 c 1.44348,-1.668736 2.88867,-3.334323 4.34213,-4.994376 z m -19.39612,14.2749967 c -2.3332,1.6769037 -4.67851,3.3371674 -7.02569,4.99439603 h 38.97115 c 1.39399,-1.66793393 2.78923,-3.33472393 4.19305,-4.99439603 z M 325.94754,8.605907 c -2.45426,1.675204 -4.91478,3.340545 -7.38349,4.994395 h 47.98342 c 1.3489,-1.670052 2.70773,-3.332243 4.06634,-4.994395 z m -21.49451,14.275015 c -2.59291,1.676046 -5.18928,3.345488 -7.7972,4.998118 h 58.56854 c 1.30232,-1.668087 2.60164,-3.337549 3.91352,-4.998118 z m 316.23441,9.388707 c -3.78889,0.01335 -7.57598,0.06297 -11.36409,0.145413 C 511.42378,34.545264 414.0615,59.374942 327.1477,104.502 h 10.45841 C 435.19994,55.656037 545.5288,32.317719 654.54123,37.830601 742.16781,42.261971 828.78794,65.237598 907.24251,104.502 h 10.51432 C 836.52061,62.333616 746.20882,37.69097 654.77977,33.067282 643.42396,32.493015 632.05421,32.227284 620.68744,32.269667 Z M 281.7211,37.15966 c -2.74775,1.67616 -5.49974,3.344094 -8.2631,4.994396 h 70.79362 c 1.26088,-1.67051 2.53508,-3.331079 3.80543,-4.994396 z m 338.96634,5.546011 c -3.78889,0.01335 -7.57598,0.06297 -11.36409,0.145412 -90.0773,1.960059 -179.70225,23.130601 -261.15075,61.650937 h 11.36037 c 92.03198,-41.702034 194.08229,-61.33931 295.00826,-56.235358 79.56123,4.023489 158.29699,23.327479 230.84153,56.235358 h 11.34917 C 821.07374,68.698231 738.39209,47.731725 654.77977,43.503342 643.42396,42.929076 632.05421,42.663345 620.68744,42.705728 Z m -363.09968,8.729005 c -2.92905,1.679022 -5.86555,3.344305 -8.811,4.994398 h 84.89347 c 1.21454,-1.664177 2.41759,-3.337036 3.64143,-4.994398 z m -25.73603,14.275017 c -3.14179,1.68343 -6.29664,3.34375 -9.45581,4.994396 H 323.4131 c 1.17874,-1.670396 2.37139,-3.330583 3.55941,-4.994396 z m -29.63836,15.266438 c -3.39765,1.680911 -6.80005,3.351268 -10.21613,4.994396 h 120.84563 c 1.13459,-1.666599 2.26666,-3.334038 3.41034,-4.994396 z"
         id="path4431"
         inkscape:connector-curvature="0" />
      <path
         inkscape:connector-curvature="0"
         style="color:#000000;font-style:normal;font-variant:normal;font-weight:normal;font-stretch:normal;font-size:medium;line-height:normal;font-family:sans-serif;text-indent:0;text-align:start;text-decoration:none;text-decoration-line:none;text-decoration-style:solid;text-decoration-color:#000000;letter-spacing:normal;word-spacing:normal;text-transform:none;writing-mode:lr-tb;direction:ltr;baseline-shift:baseline;text-anchor:start;white-space:normal;clip-rule:nonzero;display:inline;overflow:visible;visibility:visible;opacity:1;isolation:auto;mix-blend-mode:normal;color-interpolation:sRGB;color-interpolation-filters:linearRGB;solid-color:#000000;solid-opacity:1;fill:#bc312e;fill-opacity:1;fill-rule:nonzero;stroke:none;stroke-width:0.98477137;stroke-linecap:butt;stroke-linejoin:miter;stroke-miterlimit:4;stroke-dasharray:none;stroke-dashoffset:0;stroke-opacity:1;marker:none;color-rendering:auto;image-rendering:auto;shape-rendering:auto;text-rendering:auto;enable-background:accumulate"
         d="m 847.59146,-274.37604 -0.56645,4.03471 2.01738,0.27832 c 15.00175,2.12439 29.4302,8.31611 41.31103,17.71891 11.8808,9.40283 21.21831,22.02102 26.73245,36.13348 5.57313,14.26359 7.18095,30.27489 3.07071,44.87868 -2.71007,9.62901 -7.88922,18.57752 -14.94631,25.64926 -7.05612,7.07071 -16.01053,12.26965 -25.65917,14.80714 -10.79619,2.83923 -22.48145,2.31503 -32.9832,-1.47081 -10.50176,-3.78579 -19.83365,-10.84029 -26.33495,-19.91515 l -1.19253,-1.65957 -3.29929,2.3751 1.18259,1.64965 c 6.99177,9.75961 16.96868,17.31452 28.26286,21.38595 11.29409,4.07147 23.78729,4.62363 35.39808,1.57015 10.37091,-2.72746 19.94151,-8.28874 27.50756,-15.87051 7.56509,-7.58074 13.09165,-17.13097 15.98979,-27.42805 4.39438,-15.61356 2.6512,-32.47749 -3.19998,-47.45256 -5.78113,-14.79593 -15.54826,-27.98458 -28.00444,-37.8428 -12.45621,-9.85814 -27.54045,-16.32634 -43.26876,-18.55368 l -2.01737,-0.28798 z m -7.01601,7.82097 c -2.2436,-0.0768 -4.48637,-0.0565 -6.72784,0.0595 -5.97718,0.30936 -11.92811,1.31544 -17.6891,3.05089 -14.67186,4.41967 -27.89671,13.40278 -37.41547,25.41069 l -1.26206,1.59004 3.18999,2.53408 1.26211,-1.59995 c 8.99112,-11.3423 21.54939,-19.86457 35.40801,-24.03931 21.73563,-6.54759 46.46846,-1.99819 64.99261,11.20974 20.03975,14.28857 32.70441,38.56326 32.96334,63.17395 l 0.021,2.0372 4.07445,-0.0407 -0.021,-2.03725 c -0.27323,-25.97324 -13.5333,-51.37374 -34.68256,-66.45341 -12.83285,-9.14994 -28.40828,-14.35959 -44.11348,-14.89658 z m -1.00373,7.26444 c -15.12361,-0.32309 -30.32584,4.54093 -42.27498,13.86311 -8.16426,6.36934 -14.66553,14.61385 -19.66672,23.55238 -8.49322,15.17962 -12.8198,32.55275 -12.95877,49.9071 -0.25333,31.60141 13.80979,62.95334 37.57446,83.784846 l 1.53039,1.341594 2.68322,-3.060806 -1.53041,-1.341577 c -22.8381,-20.019347 -36.42656,-50.324937 -36.18318,-80.694227 0.13393,-16.69841 4.30737,-33.4107 12.44197,-47.94942 4.78892,-8.55916 10.95912,-16.36631 18.6034,-22.33001 11.16802,-8.71283 25.50142,-13.31141 39.69119,-13.00845 15.56213,0.33225 30.98055,6.5694 42.40421,17.14252 l 1.50059,1.38137 2.7627,-2.99129 -1.49066,-1.38132 c -12.17606,-11.26949 -28.50036,-17.86184 -45.08741,-18.21582 z m 67.47703,6.89677 -2.73286,3.02107 1.51052,1.36148 c 18.67752,16.89607 28.21359,43.52948 24.5064,68.44092 -2.31843,15.57929 -9.57911,30.42166 -20.4518,41.81788 l -1.41114,1.4708 2.95145,2.81236 1.40121,-1.47074 c 11.46534,-12.01743 19.09028,-27.60552 21.53505,-44.03399 3.91784,-26.32721 -6.06933,-54.20202 -25.80825,-72.05829 z m -116.55929,25.44052 -1.06339,1.72919 c -9.84549,15.89267 -15.29789,34.44413 -15.60216,53.13687 -0.40707,25.02538 8.5504,50.04176 24.7548,69.11678 16.20433,19.075075 39.44541,31.963059 64.20748,35.606814 l 2.00742,0.298173 0.59629,-4.034729 -2.01733,-0.287963 c -23.75531,-3.495595 -46.14788,-15.916121 -61.69328,-34.215545 -15.54559,-18.29938 -24.1716,-42.40579 -23.78093,-66.4137 0.29204,-17.94528 5.53427,-35.81266 14.98606,-51.06983 l 1.07327,-1.72921 -3.46823,-2.13657 z m 65.78756,15.61215 c -6.0085,-0.23971 -12.05312,1.17321 -17.33136,4.0546 -5.00662,2.73301 -9.2769,6.75216 -12.30291,11.58735 -3.02595,4.83521 -4.77883,10.44112 -5.04831,16.1388 -0.26964,5.69769 0.94202,11.43713 3.49808,16.53636 2.55601,5.0992 6.4338,9.50695 11.16004,12.70041 l 1.67948,1.14284 2.28564,-3.37889 -1.68943,-1.13283 c -4.13846,-2.79627 -7.55048,-6.69502 -9.78865,-11.16004 -2.23814,-4.46516 -3.31679,-9.53005 -3.08063,-14.51907 0.23602,-4.98899 1.78251,-9.92726 4.43218,-14.16117 2.64966,-4.23388 6.4183,-7.79298 10.80234,-10.18614 4.62032,-2.52224 9.95467,-3.76763 15.21459,-3.55771 5.25977,0.21004 10.48226,1.87737 14.88665,4.76017 l 1.69938,1.12295 2.23597,-3.40863 -1.70928,-1.11303 c -5.03148,-3.29318 -10.93514,-5.18592 -16.94378,-5.42597 z m -92.68896,1.68939 -0.60619,1.93785 c -4.83076,15.25877 -6.65163,31.45264 -5.32665,47.40287 1.26617,15.24123 5.39219,30.23699 12.11406,43.97435 l 0.89439,1.82853 3.65709,-1.78877 -0.89438,-1.82858 c -6.49741,-13.27851 -10.49272,-27.79114 -11.71656,-42.52342 -1.28071,-15.41704 0.47828,-31.08407 5.14768,-45.83269 l 0.61619,-1.93784 z m 66.11554,0.0595 -1.50059,1.37142 c -6.18456,5.67365 -10.55382,13.24218 -12.37245,21.43559 -1.81856,8.19343 -1.05687,16.90798 2.14654,24.66539 4.81982,11.67159 14.92025,20.59576 26.52373,25.20202 8.54002,3.3902 17.92632,4.57324 27.04046,3.4087 9.1143,-1.16455 17.89815,-4.66821 25.31138,-10.09678 l 1.63973,-1.20247 -2.40495,-3.28934 -1.63968,1.20246 c -6.84895,5.01535 -15.00267,8.26555 -23.4232,9.34141 -8.42044,1.07592 -17.13312,-0.021 -25.02317,-3.15027 -10.67608,-4.23812 -19.93822,-12.48138 -24.26785,-22.96601 -2.87807,-6.96949 -3.56183,-14.86945 -1.92788,-22.23065 1.63377,-7.3612 5.59366,-14.22146 11.15008,-19.31886 l 1.50058,-1.3814 z m 23.79087,5.31665 c -0.94098,0.0407 -1.87908,0.14654 -2.81239,0.30782 -7.46625,1.29146 -14.0555,6.35781 -17.23196,13.23701 l -0.85466,1.83851 3.69684,1.7093 0.85464,-1.84841 c 2.58752,-5.60375 8.14888,-9.86954 14.23078,-10.92159 6.08203,-1.05204 12.74353,1.09656 17.06306,5.50551 3.55975,3.63345 5.61662,8.80728 5.51542,13.89289 -0.10154,5.08562 -2.3606,10.16536 -6.062,13.65444 l -1.48074,1.39127 2.79253,2.96139 1.48072,-1.39121 c 4.52506,-4.26558 7.21037,-10.31892 7.334,-16.53636 0.12369,-6.21752 -2.31627,-12.37254 -6.66822,-16.81459 -4.63978,-4.73596 -11.27124,-7.28799 -17.85802,-6.98623 z m -26.52373,110.507305 -1.90801,3.587537 1.79866,0.953982 c 15.05324,7.980072 31.39981,13.510338 48.20782,16.297876 8.16126,1.353484 16.42273,2.065072 24.6952,2.126653 l 2.03725,0.0095 0.0303,-4.064537 -2.0372,-0.021 c -8.05918,-0.06011 -16.10837,-0.748476 -24.05921,-2.067076 -16.3718,-2.715155 -32.30303,-8.107452 -46.96559,-15.880416 l -1.7987,-0.944095 z"
         id="path5952" />
      <g
         id="g4231"
         transform="matrix(1.9083048,0,0,1.9083048,-57.663921,-402.48632)">
        <path
           d="m 519.6493,344.77946 q 0,-0.51695 0.28719,-0.80415 0.30634,-0.30634 0.80415,-0.30634 0.51696,0 0.8233,0.30634 0.30634,0.2872 0.30634,0.80415 0,0.49781 -0.30634,0.80415 -0.30634,0.30635 -0.8233,0.30635 -0.49781,0 -0.80415,-0.30635 -0.28719,-0.30634 -0.28719,-0.80415 z"
           style="color:#000000;font-style:normal;font-variant:normal;font-weight:normal;font-stretch:normal;font-size:medium;line-height:120.00000477%;font-family:'PT Sans';-inkscape-font-specification:'PT Sans, Normal';text-indent:0;text-align:center;text-decoration:none;text-decoration-line:none;text-decoration-style:solid;text-decoration-color:#000000;letter-spacing:0px;word-spacing:0px;text-transform:none;writing-mode:lr-tb;direction:ltr;baseline-shift:baseline;text-anchor:middle;white-space:normal;clip-rule:nonzero;display:inline;overflow:visible;visibility:visible;opacity:1;isolation:auto;mix-blend-mode:normal;color-interpolation:sRGB;color-interpolation-filters:linearRGB;solid-color:#000000;solid-opacity:1;fill:#bc312e;fill-opacity:1;fill-rule:nonzero;stroke:none;stroke-width:0.51604509;stroke-linecap:butt;stroke-linejoin:miter;stroke-miterlimit:4;stroke-dasharray:none;stroke-dashoffset:0;stroke-opacity:1;marker:none;color-rendering:auto;image-rendering:auto;shape-rendering:auto;text-rendering:auto;enable-background:accumulate"
           id="path4183"
           inkscape:connector-curvature="0" />
        <path
           d="m 594.21957,346.7324 h -4.93978 l -1.34025,3.71441 h -1.57001 l 5.07381,-13.61312 h 0.72756 l 5.09295,13.61312 h -1.66574 z m -4.42283,-1.37854 h 3.94417 l -1.49342,-4.07819 -0.47866,-2.02953 h -0.0191 l -0.47866,2.06782 -1.47428,4.0399 z M 575.8025,337.0443 q 0.36378,-0.0574 0.80415,-0.0766 0.45952,-0.0383 0.93818,-0.0383 0.4978,-0.0191 0.95732,-0.0191 0.47866,-0.0192 0.88073,-0.0192 1.60831,0 2.77624,0.49781 1.18708,0.49781 1.95293,1.39769 0.76586,0.88074 1.12964,2.12525 0.38293,1.24452 0.38293,2.73794 0,1.3594 -0.36378,2.62307 -0.34464,1.24451 -1.11049,2.22098 -0.76586,0.95732 -1.99123,1.55086 -1.22537,0.5744 -2.9677,0.5744 -0.30634,0 -0.80415,-0.0191 -0.47866,0 -0.99561,-0.0383 -0.51696,-0.0192 -0.95733,-0.0383 -0.44036,-0.0191 -0.63183,-0.0574 v -13.42165 z m 3.61868,1.26367 q -0.24891,0 -0.55525,0 -0.2872,0 -0.57439,0.0191 -0.2872,0.0191 -0.5361,0.0383 -0.22976,0.0191 -0.36378,0.0383 v 10.722 q 0.0957,0.0192 0.36378,0.0383 0.26805,0 0.55524,0.0191 0.2872,0 0.55525,0.0192 0.26805,0 0.36378,0 1.34025,0 2.24014,-0.45951 0.91902,-0.45952 1.45513,-1.22538 0.55524,-0.785 0.785,-1.78062 0.22976,-1.01476 0.22976,-2.08696 0,-0.93817 -0.21061,-1.87635 -0.21062,-0.95732 -0.72757,-1.72318 -0.51695,-0.76585 -1.39769,-1.24451 -0.86159,-0.49781 -2.18269,-0.49781 z m -8.46153,8.42443 h -4.93978 l -1.34025,3.71441 h -1.57001 l 5.07381,-13.61312 h 0.72756 l 5.09295,13.61312 h -1.66574 z m -4.42282,-1.37854 h 3.94416 l -1.49342,-4.07819 -0.47866,-2.02953 h -0.0191 l -0.47866,2.06782 -1.47427,4.0399 z m -12.4419,-3.67612 -1.03391,-1.93379 h -0.0766 l 0.19147,1.93379 v 8.76907 h -1.49342 v -13.61312 h 0.84244 l 6.41405,8.94139 0.99562,1.83806 h 0.0957 l -0.21061,-1.83806 v -8.73078 h 1.49342 v 13.61312 h -0.84244 l -6.37576,-8.97968 z m -7.2553,5.05466 h -4.93978 l -1.34025,3.71441 h -1.57001 l 5.0738,-13.61312 h 0.72757 l 5.09295,13.61312 h -1.66574 z m -4.42283,-1.37854 h 3.94416 l -1.49342,-4.07819 -0.47866,-2.02953 h -0.0191 l -0.47867,2.06782 -1.47427,4.0399 z m -3.77125,4.5377 q -0.5744,0.44037 -1.45513,0.61269 -0.88074,0.17232 -1.87635,0.17232 -1.20623,0 -2.25928,-0.40208 -1.05306,-0.42122 -1.83806,-1.26366 -0.785,-0.84245 -1.24452,-2.14441 -0.45951,-1.3211 -0.45951,-3.12086 0,-1.87635 0.4978,-3.17831 0.51696,-1.32111 1.34025,-2.1444 0.84245,-0.84245 1.87635,-1.22538 1.03391,-0.38292 2.10611,-0.38292 1.14879,0 1.87635,0.13402 0.72757,0.11488 1.24452,0.32549 l -0.38293,1.39769 q -0.91903,-0.44037 -2.62306,-0.44037 -0.785,0 -1.55086,0.2872 -0.76586,0.2872 -1.37854,0.93817 -0.59354,0.65098 -0.95732,1.70404 -0.36379,1.05305 -0.36379,2.58477 0,1.37854 0.34464,2.41245 0.34463,1.0339 0.93817,1.72318 0.61269,0.68927 1.41684,1.0339 0.8233,0.34464 1.78062,0.34464 0.86159,0 1.49342,-0.17232 0.65098,-0.17232 1.09135,-0.44037 z m -25.10756,0.55525 h -7.92662 V 337.0443 h 1.58915 v 11.98567 h 6.33747 z m -12.76947,-3.71441 h -4.93978 l -1.34025,3.71441 h -1.57001 l 5.07381,-13.61312 h 0.72756 l 5.09295,13.61312 h -1.66574 z m -4.42283,-1.37854 h 3.94417 l -1.49342,-4.07819 -0.47866,-2.02953 h -0.0192 l -0.47866,2.06782 -1.47428,4.0399 z m -12.19927,-8.30956 h 7.29479 v 1.41684 h -5.70564 v 4.38453 h 5.22698 v 1.41684 h -5.22698 v 4.76746 h 5.80137 v 1.41684 h -7.39052 z m 4.69088,-3.25489 h 2.18269 v 0.40207 l -3.12087,1.85721 h -1.3211 z m -16.09647,3.38892 q 0.72756,-0.13403 1.66574,-0.21061 0.95732,-0.0766 1.74232,-0.0766 0.88074,0 1.66574,0.19147 0.80415,0.19146 1.39769,0.63183 0.61269,0.44037 0.97647,1.14878 0.36378,0.70842 0.36378,1.72318 0,1.57001 -0.86159,2.54648 -0.86158,0.97647 -2.18269,1.30196 l 0.91903,0.70842 3.33148,5.30356 h -1.8572 l -3.69527,-5.78223 -1.87635,-0.28719 v 6.06942 h -1.58915 v -13.26848 z m 3.44636,1.09135 q -0.24891,0 -0.51696,0 -0.26805,0 -0.51695,0.0191 -0.2489,0.0192 -0.47866,0.0383 -0.21061,0.0191 -0.34464,0.0574 v 4.93978 h 1.49343 q 1.3211,0 2.18269,-0.65097 0.86159,-0.65098 0.86159,-2.02953 0,-1.0339 -0.70842,-1.70403 -0.70842,-0.67012 -1.97208,-0.67012 z m -5.41246,0.19146 h -4.17392 v 11.98567 h -1.58916 v -11.98567 h -4.17392 v -1.41684 h 9.937 z m -19.14314,3.2166 -1.03391,-1.93379 h -0.0766 l 0.19147,1.93379 v 8.76907 h -1.49343 v -13.61312 h 0.84245 l 6.41405,8.94139 0.99562,1.83806 h 0.0957 l -0.21061,-1.83806 v -8.73078 h 1.49342 v 13.61312 h -0.84244 l -6.37576,-8.97968 z m -16.05609,2.06782 q 0,-3.35063 1.41684,-5.13125 1.41684,-1.79976 4.0399,-1.79976 1.41683,0 2.45074,0.4978 1.03391,0.49781 1.70403,1.41684 0.68928,0.89988 1.01477,2.18269 0.32549,1.26367 0.32549,2.83368 0,3.35062 -1.43599,5.15039 -1.41683,1.78062 -4.05904,1.78062 -1.39769,0 -2.4316,-0.49781 -1.01476,-0.49781 -1.70403,-1.39769 -0.67013,-0.91903 -0.99562,-2.1827 -0.32549,-1.28281 -0.32549,-2.85281 z m 1.68489,0 q 0,1.11049 0.21061,2.1061 0.22976,0.99562 0.68927,1.76148 0.45952,0.74671 1.16794,1.20622 0.72756,0.44037 1.70403,0.44037 1.78062,0 2.79538,-1.34025 1.01476,-1.3594 1.01476,-4.17392 0,-1.09135 -0.22976,-2.08697 -0.21061,-1.01476 -0.68927,-1.76147 -0.45951,-0.76586 -1.18708,-1.20622 -0.70842,-0.45952 -1.70403,-0.45952 -1.76147,0 -2.77623,1.3594 -0.99562,1.34025 -0.99562,4.15478 z m -5.97399,-2.29758 0.19147,-2.01037 h -0.0957 l -0.72757,1.83806 -3.48465,6.05027 h -0.47866 l -3.69526,-6.06942 -0.68927,-1.81891 h -0.0957 l 0.26805,1.99123 v 9.01797 h -1.49342 V 337.0443 h 1.18708 l 4.19307,6.85443 0.63183,1.49342 h 0.0383 l 0.59353,-1.53172 4.00161,-6.81613 h 1.24452 v 13.40251 h -1.58916 v -8.99883 z"
           style="color:#000000;font-style:normal;font-variant:normal;font-weight:normal;font-stretch:normal;font-size:medium;line-height:120.00000477%;font-family:'PT Sans';-inkscape-font-specification:'PT Sans, Normal';text-indent:0;text-align:center;text-decoration:none;text-decoration-line:none;text-decoration-style:solid;text-decoration-color:#000000;letter-spacing:0px;word-spacing:0px;text-transform:none;writing-mode:lr-tb;direction:ltr;baseline-shift:baseline;text-anchor:middle;white-space:normal;clip-rule:nonzero;visibility:visible;isolation:auto;mix-blend-mode:normal;color-interpolation:sRGB;color-interpolation-filters:linearRGB;solid-color:#000000;solid-opacity:1;fill:#1b75bc;fill-opacity:1;fill-rule:nonzero;stroke:none;stroke-width:1;stroke-linecap:square;stroke-linejoin:miter;stroke-miterlimit:10;stroke-dasharray:none;stroke-dashoffset:0;stroke-opacity:1;marker:none;color-rendering:auto;image-rendering:auto;shape-rendering:auto;text-rendering:auto"
           id="path4195"
           inkscape:connector-curvature="0" />
      </g>
    </g>
    <path
       inkscape:connector-curvature="0"
       style="fill:#ba302e;fill-opacity:1;fill-rule:nonzero;stroke:none;stroke-width:0.1920951"
       d="m 229.70565,230.75117 v -19.88483 l -1.23287,-1.23061 V 230.406 c 0.38194,0.22062 0.8059,0.33542 1.23287,0.34517 z m 1.23136,-0.28214 c 0.23712,-0.12155 0.46222,-0.28063 0.66257,-0.48098 l 0.56728,-0.56803 v -16.09096 l -1.22985,-1.23061 z m -3.69558,-1.16457 v -20.90009 l -1.23061,-1.23137 v 20.90011 z m 6.1583,-1.11654 1.23135,-1.23212 v -11.16327 l -1.23135,-1.23211 z m -8.62103,-1.34618 v -20.9001 l -1.23135,-1.23135 v 20.89934 z m 11.08224,-1.11655 1.23211,-1.23211 v -6.23783 l -1.23211,-1.23137 z m -13.54346,-1.34616 v -20.89935 l -1.2321,-1.23212 v 20.90011 z m 16.00618,-1.11656 0.0488,-0.0518 c 1.02125,-1.01901 1.02125,-2.65181 0,-3.67307 l -0.0488,-0.0518 z m -18.47039,-1.34616 v -20.9001 l -1.22987,-1.23061 v 20.89935 z m -2.46198,-2.46272 v -20.9001 l -0.69184,-0.6911 0.69184,-0.69109 v -20.90085 l -1.23136,1.23211 v 40.71892 z m -2.46347,-2.46347 v -38.2562 l -1.22985,1.23061 v 35.79423 z m -2.46196,-2.46272 v -33.33076 l -1.23211,1.23136 v 30.86804 z m -2.46197,-2.46273 v -28.40531 l -1.23286,1.23136 v 25.9426 z m -2.46422,-2.46272 v -23.47988 l -1.23211,1.23212 v 21.01566 z m -2.46197,-2.46347 V 188.5848 l -1.23211,1.23061 v 16.09246 z m -2.46422,-2.46196 v -13.62899 l -1.22985,1.23134 v 11.16628 z m -2.46197,-2.46348 v -8.70205 l -1.23136,1.23061 v 6.24084 z m -2.46347,-2.46271 v -3.77662 l -0.0487,0.0488 c -1.022,1.019 -1.022,2.65256 0,3.67382 z m 20.93536,-3.81039 1.22987,-1.23136 v -20.90009 l -1.22987,1.23135 z m 2.46198,-2.46272 1.2321,-1.23211 v -20.9001 l -1.2321,1.23137 z m 2.46197,-2.46272 1.23135,-1.23211 v -20.89935 l -1.23135,1.23136 z m 2.46347,-2.46347 1.23061,-1.23061 v -20.90085 l -1.23061,1.23136 z m 2.46196,-2.46272 1.23287,-1.23136 v -19.88409 c -0.42697,0.0113 -0.85093,0.12531 -1.23287,0.34592 z m 2.46423,-2.46347 1.22985,-1.22985 v -16.09097 l -0.56728,-0.56729 c -0.20035,-0.2011 -0.42545,-0.36167 -0.66257,-0.48248 z m 2.46272,-2.46122 1.23135,-1.23211 v -11.16403 l -1.23135,-1.23136 z m 2.46121,-2.46347 1.23211,-1.23211 v -6.23709 l -1.23211,-1.2321 z m 2.46272,-2.46272 0.0488,-0.0487 c 1.02125,-1.019 1.02125,-2.65107 0,-3.67382 l -0.0488,-0.0488 z m 0,0"
       id="path464" />
    <path
       inkscape:connector-curvature="0"
       style="fill:#ba302e;fill-opacity:1;fill-rule:nonzero;stroke:none;stroke-width:0.1920951"
       d="m 154.78331,230.75121 v -19.88485 l -1.2321,-1.23061 v 20.77029 c 0.38193,0.2206 0.80513,0.33542 1.2321,0.34517 z m 1.23211,-0.28214 c 0.23712,-0.12156 0.46223,-0.28064 0.66258,-0.48099 l 0.56728,-0.56804 v -16.09096 l -1.22986,-1.23061 z m -3.69558,-1.16458 v -20.9001 l -1.23061,-1.23137 v 20.90012 z m 6.15756,-1.11656 1.2321,-1.2321 v -11.16328 l -1.2321,-1.23211 z m -8.62028,-1.34616 v -20.9001 l -1.2321,-1.23136 v 20.89935 z m 11.08298,-1.11656 1.23137,-1.23211 v -6.23783 l -1.23137,-1.23136 z m -13.54495,-1.34616 v -20.89936 l -1.23211,-1.2321 v 20.9001 z m 16.00693,-1.11655 0.0495,-0.0518 c 1.02126,-1.01901 1.02126,-2.65182 0,-3.67308 l -0.0495,-0.0518 z m -18.47115,-1.34617 v -20.90011 l -1.22986,-1.2306 v 20.89935 z m -2.46197,-2.46272 v -20.9001 l -0.69184,-0.69108 0.69184,-0.6911 v -20.90086 l -1.23211,1.23211 v 40.71892 z m -2.46347,-2.46347 v -38.25619 l -1.23061,1.2306 v 35.79423 z m -2.46272,-2.46272 v -33.33076 l -1.23136,1.23137 v 30.86804 z m -2.46197,-2.46273 v -28.4053 l -1.23211,1.23135 v 25.9426 z m -2.46347,-2.46271 v -23.47987 l -1.23211,1.23211 v 21.01566 z m -2.46195,-2.46348 v -18.55367 l -1.23211,1.2306 v 16.09247 z m -2.46423,-2.46196 v -13.62899 l -1.22986,1.23136 v 11.16628 z m -2.46196,-2.46347 v -8.70205 l -1.23211,1.2306 v 6.24085 z m -2.46348,-2.46271 v -3.77663 l -0.0488,0.0488 c -1.02201,1.01901 -1.02201,2.65256 0,3.67382 z m 20.93536,-3.81039 1.22986,-1.23136 V 173.8085 l -1.22986,1.23137 z m 2.46197,-2.46272 1.23211,-1.23211 v -20.9001 l -1.23211,1.23135 z m 2.46198,-2.46272 1.2321,-1.23211 v -20.89935 l -1.2321,1.23136 z m 2.46421,-2.46347 1.23061,-1.23061 v -20.90086 l -1.23061,1.23137 z m 2.46198,-2.46272 1.2321,-1.23136 v -19.88409 c -0.42697,0.0113 -0.85017,0.1253 -1.2321,0.34591 z m 2.46421,-2.46347 1.22986,-1.22986 v -16.09097 l -0.56728,-0.56728 c -0.20035,-0.20109 -0.42546,-0.36168 -0.66258,-0.48249 z m 2.46198,-2.46123 1.2321,-1.2321 v -11.16403 l -1.2321,-1.23135 z m 2.4627,-2.46346 1.23137,-1.23211 v -6.23709 l -1.23137,-1.2321 z m 2.46198,-2.46272 0.0495,-0.0488 c 1.02126,-1.019 1.02126,-2.65107 0,-3.67383 l -0.0495,-0.0488 z m 0,0"
       id="path492" />
    <path
       inkscape:connector-curvature="0"
       style="fill:#ba302e;fill-opacity:1;fill-rule:nonzero;stroke:none;stroke-width:0.1920951"
       d="m 79.863224,230.75121 v -19.88486 l -1.232111,-1.23059 v 20.77029 c 0.38194,0.2206 0.805911,0.3354 1.232111,0.34516 z m 1.23212,-0.28215 c 0.23711,-0.12155 0.46221,-0.28064 0.662569,-0.48098 l 0.567281,-0.56803 v -16.09097 l -1.22985,-1.23062 z m -3.69559,-1.16457 v -20.9001 l -1.230601,-1.23136 v 20.9001 z m 6.157549,-1.11655 1.23211,-1.23211 v -11.16329 l -1.23211,-1.23211 z m -8.62026,-1.34618 v -20.90009 l -1.23213,-1.23135 v 20.89933 z m 11.08297,-1.11655 1.23138,-1.23211 v -6.23783 l -1.23138,-1.23137 z m -13.54496,-1.34616 V 203.4797 l -1.23211,-1.23211 v 20.90009 z m 16.00694,-1.11656 0.0495,-0.0518 c 1.02125,-1.01901 1.02125,-2.65183 0,-3.67307 l -0.0495,-0.0518 z m -18.47114,-1.34617 v -20.9001 l -1.22987,-1.2306 v 20.89935 z m -2.46196,-2.46272 v -20.90009 l -0.69187,-0.69109 0.69187,-0.6911 v -20.90084 l -1.23213,1.23211 v 40.7189 z m -2.46348,-2.46347 v -38.25618 l -1.22987,1.2306 v 35.79423 z m -2.46273,-2.46271 v -33.33076 l -1.23136,1.23137 v 30.86804 z m -2.46121,-2.46273 v -28.40531 l -1.232869,1.23136 v 25.94261 z m -2.464229,-2.4627 V 186.1221 l -1.23211,1.23211 v 21.01567 z m -2.46196,-2.46348 v -18.55368 l -1.23211,1.23061 v 16.09246 z m -2.46347,-2.46197 v -13.62901 l -1.230611,1.23138 v 11.16627 z m -2.46272,-2.46347 v -8.70205 l -1.23136,1.23061 v 6.24084 z m -2.46347,-2.46272 v -3.77661 l -0.0487,0.0488 c -1.02201,1.01901 -1.02201,2.65256 0,3.67383 z m 20.93536,-3.8104 1.22987,-1.23134 v -20.9001 l -1.22987,1.23136 z m 2.46196,-2.4627 1.23211,-1.23212 v -20.9001 l -1.23211,1.23137 z m 2.46197,-2.46272 1.23213,-1.23211 v -20.89935 l -1.23213,1.23135 z m 2.46424,-2.46347 1.2306,-1.23061 v -20.90086 l -1.2306,1.23137 z m 2.46196,-2.46272 1.23211,-1.23136 v -19.88409 c -0.4262,0.0113 -0.85017,0.1253 -1.23211,0.34592 z m 2.46423,-2.46347 1.22985,-1.22987 v -16.09097 l -0.567281,-0.56727 c -0.200359,-0.20109 -0.425459,-0.36169 -0.662569,-0.48249 z m 2.46196,-2.46123 1.23211,-1.23209 v -11.16404 l -1.23211,-1.23137 z m 2.46271,-2.46346 1.23138,-1.23211 v -6.2371 l -1.23138,-1.23209 z m 2.46198,-2.46271 0.0495,-0.0488 c 1.02125,-1.01901 1.02125,-2.65109 0,-3.67383 l -0.0495,-0.0488 z m 0,0"
       id="path520" />
    <text
       xml:space="preserve"
       style="font-style:normal;font-variant:normal;font-weight:normal;font-stretch:normal;font-size:23.24058151px;line-height:1.25;font-family:Monoton;-inkscape-font-specification:'Monoton, Normal';font-variant-ligatures:normal;font-variant-caps:normal;font-variant-numeric:normal;font-feature-settings:normal;text-align:center;letter-spacing:0px;word-spacing:0px;writing-mode:lr-tb;text-anchor:middle;opacity:1;vector-effect:none;fill:#bc312e;fill-opacity:1;stroke:none;stroke-width:0.1393562;stroke-linecap:butt;stroke-linejoin:miter;stroke-miterlimit:4;stroke-dasharray:none;stroke-dashoffset:0;stroke-opacity:1;marker:none"
       x="140.34415"
       y="114.44685"
       id="text6941"><tspan
         sodipodi:role="line"
         id="tspan6939"
         x="140.34415"
         y="114.44685"
         style="font-style:normal;font-variant:normal;font-weight:normal;font-stretch:normal;font-size:23.24058151px;font-family:Monoton;-inkscape-font-specification:'Monoton, Normal';font-variant-ligatures:normal;font-variant-caps:normal;font-variant-numeric:normal;font-feature-settings:normal;text-align:center;writing-mode:lr-tb;text-anchor:middle;vector-effect:none;fill:#bc312e;fill-opacity:1;stroke:none;stroke-width:0.1393562;stroke-linecap:butt;stroke-linejoin:miter;stroke-miterlimit:4;stroke-dasharray:none;stroke-dashoffset:0;stroke-opacity:1;marker:none">ON-SITE</tspan><tspan
         sodipodi:role="line"
         x="140.34415"
         y="143.49757"
         style="font-style:normal;font-variant:normal;font-weight:normal;font-stretch:normal;font-size:23.24058151px;font-family:Monoton;-inkscape-font-specification:'Monoton, Normal';font-variant-ligatures:normal;font-variant-caps:normal;font-variant-numeric:normal;font-feature-settings:normal;text-align:center;writing-mode:lr-tb;text-anchor:middle;vector-effect:none;fill:#bc312e;fill-opacity:1;stroke:none;stroke-width:0.1393562;stroke-linecap:butt;stroke-linejoin:miter;stroke-miterlimit:4;stroke-dasharray:none;stroke-dashoffset:0;stroke-opacity:1;marker:none"
         id="tspan45"
         dy="-6">ACCOMMODATION</tspan></text>
    <text
       id="text7490"
       y="155.15642"
       x="90.320442"
       style="font-style:normal;font-variant:normal;font-weight:normal;font-stretch:normal;font-size:13.50912857px;line-height:1.25;font-family:Monoton;-inkscape-font-specification:'Monoton, Normal';font-variant-ligatures:normal;font-variant-caps:normal;font-variant-numeric:normal;font-feature-settings:normal;text-align:start;letter-spacing:0px;word-spacing:0px;writing-mode:lr-tb;text-anchor:start;opacity:1;vector-effect:none;fill:#1b75bc;fill-opacity:1;stroke:none;stroke-width:0.08100403;stroke-linecap:butt;stroke-linejoin:miter;stroke-miterlimit:4;stroke-dasharray:none;stroke-dashoffset:0;stroke-opacity:1;marker:none"
       xml:space="preserve"><tspan
         style="font-style:normal;font-variant:normal;font-weight:normal;font-stretch:normal;font-size:13.50912857px;font-family:Monoton;-inkscape-font-specification:'Monoton, Normal';font-variant-ligatures:normal;font-variant-caps:normal;font-variant-numeric:normal;font-feature-settings:normal;text-align:start;writing-mode:lr-tb;text-anchor:start;vector-effect:none;fill:#1b75bc;fill-opacity:1;stroke:none;stroke-width:0.08100403;stroke-linecap:butt;stroke-linejoin:miter;stroke-miterlimit:4;stroke-dasharray:none;stroke-dashoffset:0;stroke-opacity:1;marker:none"
         y="155.15642"
         x="90.320442"
         id="tspan7488"
         sodipodi:role="line">LEVELS    1,  3,  4</tspan></text>
    <flowRoot
       transform="matrix(0.13676243,0,0,0.13676243,153.39504,210.90718)"
       style="font-style:normal;font-variant:normal;font-weight:bold;font-stretch:normal;font-size:85.33333588px;line-height:1.25;font-family:'PT Sans';-inkscape-font-specification:'PT Sans Bold';font-variant-ligatures:normal;font-variant-caps:normal;font-variant-numeric:normal;font-feature-settings:normal;text-align:center;letter-spacing:0px;word-spacing:0px;writing-mode:lr-tb;text-anchor:middle;fill:#000000;fill-opacity:1;stroke:none"
       id="flowRoot152"
       xml:space="preserve"><flowRegion
         id="flowRegion154"
         style="font-style:normal;font-variant:normal;font-weight:bold;font-stretch:normal;font-size:85.33333588px;font-family:'PT Sans';-inkscape-font-specification:'PT Sans Bold';font-variant-ligatures:normal;font-variant-caps:normal;font-variant-numeric:normal;font-feature-settings:normal;text-align:center;writing-mode:lr-tb;text-anchor:middle"><rect
           y="331.57996"
           x="65.053825"
           height="96.741112"
           width="1094.1052"
           id="rect156"
           style="font-style:normal;font-variant:normal;font-weight:bold;font-stretch:normal;font-size:85.33333588px;font-family:'PT Sans';-inkscape-font-specification:'PT Sans Bold';font-variant-ligatures:normal;font-variant-caps:normal;font-variant-numeric:normal;font-feature-settings:normal;text-align:center;writing-mode:lr-tb;text-anchor:middle" /></flowRegion><flowPara
         id="flowPara158"
         style="font-style:normal;font-variant:normal;font-weight:bold;font-stretch:normal;font-size:85.33333588px;font-family:'PT Sans';-inkscape-font-specification:'PT Sans Bold'">Reminders </flowPara><flowPara
         style="font-style:normal;font-variant:normal;font-weight:bold;font-stretch:normal;font-family:'PT Sans';-inkscape-font-specification:'PT Sans Bold'"
         id="flowPara160" /></flowRoot>    <flowRoot
       transform="matrix(0.07796357,0,0,0.07796357,155.36336,245.48612)"
       style="font-style:normal;font-variant:normal;font-weight:normal;font-stretch:normal;font-size:85.33333588px;line-height:1.25;font-family:'PT Sans';-inkscape-font-specification:'PT Sans';font-variant-ligatures:normal;font-variant-caps:normal;font-variant-numeric:normal;font-feature-settings:normal;text-align:end;letter-spacing:0px;word-spacing:0px;writing-mode:lr-tb;text-anchor:end;fill:#000000;fill-opacity:1;stroke:none"
       id="flowRoot192"
       xml:space="preserve"><flowRegion
         id="flowRegion188"
         style="font-style:normal;font-variant:normal;font-weight:normal;font-stretch:normal;font-size:85.33333588px;font-family:'PT Sans';-inkscape-font-specification:'PT Sans';font-variant-ligatures:normal;font-variant-caps:normal;font-variant-numeric:normal;font-feature-settings:normal;text-align:end;writing-mode:lr-tb;text-anchor:end"><rect
           y="303.73392"
           x="-566.12317"
           height="365.91586"
           width="1975.9137"
           id="rect186"
           style="font-style:normal;font-variant:normal;font-weight:normal;font-stretch:normal;font-size:85.33333588px;font-family:'PT Sans';-inkscape-font-specification:'PT Sans';font-variant-ligatures:normal;font-variant-caps:normal;font-variant-numeric:normal;font-feature-settings:normal;text-align:end;writing-mode:lr-tb;text-anchor:end" /></flowRegion><flowPara
         style="font-style:normal;font-variant:normal;font-weight:normal;font-stretch:normal;font-family:'PT Sans';-inkscape-font-specification:'PT Sans';text-align:end;text-anchor:end"
         id="flowPara190">Lights must be turned off manually using the switch.</flowPara><flowPara
         style="font-style:normal;font-variant:normal;font-weight:normal;font-stretch:normal;font-family:'PT Sans';-inkscape-font-specification:'PT Sans';text-align:end;text-anchor:end"
         id="flowPara7571">Please use the lockers to store valuable items.</flowPara><flowPara
         style="font-style:normal;font-variant:normal;font-weight:normal;font-stretch:normal;font-family:'PT Sans';-inkscape-font-specification:'PT Sans';text-align:end;text-anchor:end"
         id="flowPara51" /><flowPara
         style="font-style:normal;font-variant:normal;font-weight:normal;font-stretch:normal;font-family:'PT Sans';-inkscape-font-specification:'PT Sans';text-align:end;text-anchor:end"
         id="flowPara49">.</flowPara><flowPara
         style="font-style:normal;font-variant:normal;font-weight:normal;font-stretch:normal;font-family:'PT Sans';-inkscape-font-specification:'PT Sans';text-align:end;text-anchor:end"
         id="flowPara47" /></flowRoot>  </g>
</svg>
