<?xml version="1.0" encoding="UTF-8" standalone="no"?>
<!-- Created with Inkscape (http://www.inkscape.org/) -->

<svg
   xmlns:dc="http://purl.org/dc/elements/1.1/"
   xmlns:cc="http://creativecommons.org/ns#"
   xmlns:rdf="http://www.w3.org/1999/02/22-rdf-syntax-ns#"
   xmlns:svg="http://www.w3.org/2000/svg"
   xmlns="http://www.w3.org/2000/svg"
   xmlns:sodipodi="http://sodipodi.sourceforge.net/DTD/sodipodi-0.dtd"
   xmlns:inkscape="http://www.inkscape.org/namespaces/inkscape"
   width="288.08148mm"
   height="159.45279mm"
   viewBox="0 0 1020.7612 564.99019"
   id="svg5239"
   version="1.1"
   inkscape:version="0.48.5 r10040"
   sodipodi:docname="DebConf17_lavamind_macaron.svg"
   inkscape:export-filename="/home/jerome/ownCloud/DebConf17 Shared/Artwork/LogoIdeas/DebConf17_lavamind_macaron.png"
   inkscape:export-xdpi="70.540001"
   inkscape:export-ydpi="70.540001">
  <defs
     id="defs5241" />
  <sodipodi:namedview
     id="base"
     pagecolor="#ffffff"
     bordercolor="#666666"
     borderopacity="1.0"
     inkscape:pageopacity="0.0"
     inkscape:pageshadow="2"
     inkscape:zoom="0.84956284"
     inkscape:cx="586.8479"
     inkscape:cy="295.01121"
     inkscape:document-units="px"
     inkscape:current-layer="layer1"
     showgrid="false"
     fit-margin-top="5"
     fit-margin-left="5"
     fit-margin-bottom="5"
     fit-margin-right="5"
     inkscape:window-width="1280"
     inkscape:window-height="773"
     inkscape:window-x="0"
     inkscape:window-y="27"
     inkscape:window-maximized="1"
     showguides="true" />
  <metadata
     id="metadata5244">
    <rdf:RDF>
      <cc:Work
         rdf:about="">
        <dc:format>image/svg+xml</dc:format>
        <dc:type
           rdf:resource="http://purl.org/dc/dcmitype/StillImage" />
        <dc:title></dc:title>
      </cc:Work>
    </rdf:RDF>
  </metadata>
  <g
     inkscape:label="Calque 1"
     inkscape:groupmode="layer"
     id="layer1"
     transform="translate(1881.6764,-308.2624)">
    <rect
       style="font-size:76.24946594px;font-style:normal;font-variant:normal;font-weight:normal;font-stretch:normal;text-indent:0;text-align:start;text-decoration:none;line-height:125%;letter-spacing:0px;word-spacing:0px;text-transform:none;direction:ltr;block-progression:tb;writing-mode:lr-tb;text-anchor:start;baseline-shift:baseline;color:#000000;fill:#ffffff;fill-opacity:1;fill-rule:nonzero;stroke:none;stroke-width:2.5;marker:none;visibility:visible;display:inline;overflow:visible;enable-background:accumulate;font-family:Smile Parade;-inkscape-font-specification:Smile Parade"
       id="rect3012"
       width="1022.8791"
       height="573.23596"
       x="-1881.0879"
       y="303.54782" />
    <g
       id="g4566-0-0"
       transform="matrix(2.0694599,0,0,2.0694599,-3179.8592,-315.20775)"
       style="opacity:0.3">
      <path
         style="color:#000000;display:inline;overflow:visible;visibility:visible;fill:#d70751;fill-opacity:1;fill-rule:nonzero;stroke-width:1.12880409;stroke-linecap:butt;stroke-linejoin:miter;stroke-miterlimit:4;stroke-dasharray:none;stroke-dashoffset:0;stroke-opacity:1;marker:none;enable-background:accumulate"
         d="m 875.3796,309.83285 c -3.88072,0.97037 -7.79602,1.80124 -11.5798,2.92341 l 1.76397,-0.0225 c 2.67038,-1.50124 6.90471,-1.72445 9.81583,-2.90087 z m -16.92592,4.59998 c -6.32827,1.42985 -14.61991,6.23732 -12.37583,2.75717 -9.66902,6.35415 -27.12822,15.88414 -35.93386,27.32411 l -0.67855,-2.11527 c -3.83057,6.49203 -17.98364,20.44096 -18.05086,28.05905 l -1.25575,0.50464 c -1.79021,4.59943 -2.62815,9.59728 -3.88956,14.23191 -1.75425,4.53939 -3.36436,3.94063 -3.80048,3.67215 0.0209,0.0186 -0.0149,0.0245 0.007,0.0541 -4.26893,13.96257 -5.63796,25.33991 -6.9189,34.69568 2.42208,2.59561 2.86723,17.52945 5.50897,29.11497 6.22417,58.34056 59.16564,107.3426 109.12783,112.50324 7.42294,1.3705 17.80997,-0.44665 26.72143,-1.64447 -10.95181,-1.28954 -12.07505,0.35273 -22.85344,-1.54 -7.91932,-2.26906 -10.18168,-5.97315 -16.13087,-9.64665 l 2.66867,3.33161 c -10.80564,-1.95184 -6.66124,-3.50015 -15.40367,-4.77699 l 1.76374,-3.22541 c -3.35386,0.28649 -9.69108,-4.17954 -11.66458,-6.89446 l -3.60075,0.71781 c -5.22512,-4.65532 -8.1781,-8.11113 -8.49591,-11.14208 l -0.84621,2.27045 c -1.69668,-2.06087 -19.31605,-17.52239 -11.01687,-14.60452 -1.62544,-1.05836 -3.62039,-1.60912 -6.2658,-4.98884 l 1.27059,-1.9977 c -4.43053,-4.12315 -8.54026,-9.67708 -8.63229,-11.73072 2.38643,2.32119 3.83594,2.63033 5.25484,2.86426 -13.00624,-21.46775 -9.96501,0.29742 -20.58077,-20.68442 l 1.44074,-0.36441 c -1.41426,-1.53485 -2.39555,-3.23629 -3.60501,-4.91428 l -0.40967,-6.57015 c -7.91926,-6.61431 -7.22331,-32.4678 -8.4984,-46.37355 -0.24938,-5.69722 3.70653,-12.4652 5.90893,-22.40739 l -2.32081,-0.011 c 3.10722,-8.27234 19.83552,-34.40203 29.49407,-34.77394 3.64639,-6.50534 -0.96493,0.0989 -2.09864,-1.20137 8.37474,-12.06315 12.0506,-9.51412 18.54176,-12.49889 6.61726,-5.54197 -6.01479,2.74838 -3.08908,-1.17514 12.14665,-5.29881 7.82225,-8.81915 24.0841,-13.15329 1.90612,0.70638 -3.82664,2.15877 -5.06943,3.68161 9.71213,-6.88701 32.77407,-9.39283 48.73943,-4.95921 18.52821,5.24684 41.76904,25.87266 46.18164,48.13108 l 0.8969,0.0971 c 1.01111,8.97073 4.47422,18.96422 2.88721,28.92457 l 1.377,-4.82869 c 1.36127,6.75837 -0.33783,10.42303 -1.40946,16.59553 l -3.31503,2.39027 c -2.0329,6.26555 0.85352,3.63398 -0.52811,8.57711 -3.97668,4.88636 -11.94809,15.21873 -14.83954,16.51618 -2.21752,0.31051 1.06689,-2.8687 1.38817,-3.94671 -5.52208,5.27974 -3.98003,7.20944 -13.06672,11.35675 l -0.35326,-0.5587 c -21.64639,14.85262 -57.80418,-1.72158 -62.23577,-31.61292 0.0604,1.93167 -0.43732,1.53455 -0.83125,2.37882 -3.71014,-15.14423 2.04867,-31.87005 15.01522,-40.45167 12.58325,-9.00169 29.06445,-8.86433 40.35165,-1.31665 -6.53041,-6.17611 -18.44281,-11.89834 -31.0259,-9.13727 -12.40962,2.23008 -22.74417,12.04364 -25.22891,21.26332 -5.71842,5.04882 -4.63652,16.64723 -7.06963,19.199 0.73552,28.07828 13.46042,38.16207 33.95326,49.15599 1.58702,0.7324 1.87528,1.27164 1.84832,1.78816 22.79814,4.52216 44.66464,-1.06553 60.82859,-18.99738 4.13309,-4.45826 8.30816,-11.57045 9.78899,-11.89839 -1.69761,3.74937 0.63823,1.56468 -0.60326,4.83235 3.4672,-8.36853 -2.5666,-2.74648 2.71971,-13.90478 l 3.13378,3.10176 c -1.98582,-6.15967 5.57281,-15.27139 3.0518,-25.10554 1.52083,-3.37965 2.80287,2.93028 1.80756,10.29801 1.70051,-8.27137 -0.72084,-9.15768 -1.00812,-15.70967 1.17114,2.02803 2.64874,4.10679 3.57511,6.29895 -3.16309,-7.21309 -0.0846,-12.99466 0.1763,-17.5298 -1.03138,-0.26532 -2.4707,3.83971 -4.38618,-4.97213 -0.55964,-3.87275 0.75943,-2.21498 0.99012,-3.22908 -0.82538,-0.31333 -3.28155,-2.9398 -5.4142,-8.41973 0.65215,-1.47862 2.89932,3.07577 4.12445,3.07548 -1.50353,-4.3863 -3.38804,-7.58804 -4.00898,-11.04342 -4.6778,-6.72072 -1.10473,1.13003 -4.59896,-2.51299 -5.60174,-10.97321 2.64787,-3.15124 2.25291,-8.48382 6.95082,7.23151 12.23784,19.33932 14.56794,24.33059 -2.16551,-6.19687 -4.99086,-12.08227 -8.18603,-17.70109 1.8317,0.44404 -4.91563,-12.65944 1.55998,-4.30175 -8.50129,-18.6799 -28.86519,-34.15355 -46.28922,-40.10898 2.24811,1.47407 5.05493,3.33554 4.22905,3.83415 -8.74888,-3.44264 -7.39998,-4.02678 -8.86919,-5.84447 -6.9178,-1.58571 -6.85355,1.33072 -11.17983,1.819 -13.30131,-4.50082 -15.57856,-3.41861 -27.50696,-5.64689 l 0.92505,2.30212 c -8.5486,-1.38066 -9.27574,2.53933 -18.20217,2.95376 -0.59935,-0.32704 2.56277,-1.92248 5.25068,-2.76783 -7.6722,2.31335 -7.70991,-0.33803 -15.08345,2.74427 1.67243,-1.63331 3.4806,-2.86846 5.31217,-4.32257 z m 9.77128,1.5783 1.43316,-0.41868 0.0868,-0.17755 -1.51917,0.5962 z m 1.51925,-0.59622 c 2.37681,-0.94491 2.82346,-1.51759 -4.70902,-0.5098 2.31092,0.0337 4.9956,-0.0887 4.70902,0.5098 z m -95.28306,67.04655 c 1.33668,5.70394 -3.15022,8.66276 1.79972,3.83809 1.82104,-6.9436 -1.12368,-2.36284 -1.79972,-3.83809 z m -1.5944,19.65828 c -2.88051,5.24802 -0.74909,5.91288 -0.61602,9.14147 0.66101,-4.25942 0.49432,-6.71499 0.61602,-9.14147 z m 154.416,3.70544 c -0.51821,0.0982 -0.97295,1.5226 -1.07438,3.01982 0.84952,0.28339 2.32263,5.08191 2.58267,1.90768 -0.36052,-3.82861 -0.99027,-5.02565 -1.50829,-4.9275 z m 48.10298,5.2343 -0.37924,1.65379 c 0.17921,8.22799 -0.95994,16.62288 -3.50571,24.61594 2.87392,-8.46257 4.15722,-17.45307 3.88495,-26.26973 z m -48.26454,10.80245 c -0.11167,2.87845 -1.20589,5.53653 -2.22108,8.31374 -7.05397,6.23142 -1.23356,-2.81529 -0.98568,-5.93841 -6.71415,12.02367 -0.12752,6.52157 0.0474,9.54692 1.94991,-3.86851 3.152,-7.90515 3.15908,-11.92221 z m -14.49552,19.00892 c -3.27764,1.39213 -6.73367,1.99536 -10.29237,2.24875 -4.1957,0.74142 1.10782,2.04464 6.7368,1.99707 1.32895,-1.43577 2.51847,-2.88071 3.55557,-4.24582 z m -52.96046,9.18639 c 1.48406,3.25695 3.85101,5.90518 6.10159,8.60096 l -1.93225,-3.5989 c -1.72765,-1.38263 -2.88018,-3.22438 -4.16934,-5.00206 z m -2.33534,6.28631 -0.0766,3.04778 c 3.37898,3.30643 6.23388,7.00315 10.23733,9.35555 -3.34545,-4.53691 -5.59558,-6.26526 -10.16082,-12.40333 z m 6.00977,3.53317 c 12.70629,16.00993 44.96571,24.39352 59.64456,15.2382 -7.2454,1.45793 -16.51004,2.84858 -25.18749,1.15668 -3.50252,-1.13297 -8.33732,-3.75999 -8.33256,-4.75885 -0.0758,0.46235 -0.28521,0.91864 -0.007,1.54724 -6.51233,-1.84538 -12.77542,-5.25456 -18.18836,-9.74925 2.99683,3.14335 6.17185,6.1889 9.98662,8.34091 -6.02456,-0.99742 -15.616,-11.65266 -17.91541,-11.77493 z"
         id="path3416-1-3-7-6"
         inkscape:connector-curvature="0" />
    </g>
    <g
       id="g4231"
       transform="translate(2.8329196e-6,-28.99119)">
      <g
         id="text8126-2"
         style="color:#000000;font-style:normal;font-variant:normal;font-weight:normal;font-stretch:normal;font-size:101.92539978px;line-height:125%;font-family:Lobster;-inkscape-font-specification:Lobster;text-indent:0;text-align:start;text-decoration:none;text-decoration-line:none;letter-spacing:0px;word-spacing:0px;text-transform:none;direction:ltr;block-progression:tb;writing-mode:lr-tb;baseline-shift:baseline;text-anchor:start;display:inline;overflow:visible;visibility:visible;fill:#0884e5;fill-opacity:1;fill-rule:evenodd;stroke:none;stroke-width:1.39516747;stroke-miterlimit:4;stroke-dasharray:none;stroke-opacity:1;marker:none;enable-background:accumulate"
         transform="matrix(2.3734949,0,0,2.3734949,-4042.0758,-1516.1136)">
        <path
           id="path4633-6"
           style="font-style:normal;font-variant:normal;font-weight:normal;font-stretch:normal;font-family:'Lobster 1.4';-inkscape-font-specification:'Lobster 1.4, ';letter-spacing:0px;word-spacing:0px;fill:#0884e5;fill-opacity:1;stroke:none;stroke-width:1.39516747;stroke-miterlimit:4;stroke-dasharray:none;stroke-opacity:1"
           d="m 940.51431,853.26865 -13.86185,64.82455 14.67726,0 0.8154,-4.07702 c 4.38279,3.77124 8.56173,5.40205 12.4349,5.40205 15.08496,0 28.23334,-24.97172 28.23334,-48.41456 0,-15.59459 -7.44056,-29.35452 -27.21409,-29.35452 -20.69085,0 -37.91625,12.94453 -37.91625,26.90831 0,6.93092 4.17895,9.47906 10.90602,9.47906 -0.10192,-0.91733 -1.42695,-1.73273 -1.42695,-6.93093 0,-15.49266 11.51757,-24.76787 26.70445,-24.76787 8.86751,0 14.88111,5.40205 14.88111,19.2639 0,20.58893 -7.44055,44.84718 -19.56968,44.84718 -1.93658,0 -3.87316,-0.61156 -5.80974,-2.03851 l 12.23104,-57.18015 -15.08496,2.03851 z"
           inkscape:connector-curvature="0" />
        <path
           id="path4635-3"
           style="font-style:normal;font-variant:normal;font-weight:normal;font-stretch:normal;font-family:'Lobster 1.4';-inkscape-font-specification:'Lobster 1.4, ';letter-spacing:0px;word-spacing:0px;fill:#0884e5;fill-opacity:1;stroke:none;stroke-width:1.39516747;stroke-miterlimit:4;stroke-dasharray:none;stroke-opacity:1"
           d="m 998.31716,901.58129 c 0,-1.22311 0.10193,-2.65006 0.20386,-4.07702 12.23108,-0.71348 23.44288,-9.78484 23.44288,-21.50626 0,-5.09627 -2.1405,-9.78484 -11.2118,-9.78484 -20.89474,0 -27.51989,24.56402 -27.51989,36.28544 0,11.51757 6.31937,16.20614 15.90036,16.20614 13.55603,0 22.21973,-9.47906 28.02953,-18.8562 l -3.4655,0 c -5.0963,5.80975 -9.9887,10.29447 -18.0408,10.29447 -4.8924,0 -7.33864,-1.63081 -7.33864,-8.56173 z m 15.79844,-25.78713 c 0,8.45981 -6.9309,16.30806 -14.77918,16.81769 2.03848,-10.09061 7.03288,-20.99663 12.23108,-20.99663 1.9365,0 2.5481,1.6308 2.5481,4.17894 z"
           inkscape:connector-curvature="0" />
        <path
           id="path4637-6"
           style="font-style:normal;font-variant:normal;font-weight:normal;font-stretch:normal;font-family:'Lobster 1.4';-inkscape-font-specification:'Lobster 1.4, ';letter-spacing:0px;word-spacing:0px;fill:#0884e5;fill-opacity:1;stroke:none;stroke-width:1.39516747;stroke-miterlimit:4;stroke-dasharray:none;stroke-opacity:1"
           d="m 1023.7746,899.84855 c -0.5096,2.14044 -0.7135,4.07702 -0.7135,5.80975 0,8.15403 4.8925,13.04645 14.2696,13.04645 21.6082,0 27.9276,-22.52551 27.9276,-34.45078 0,-12.94453 -4.8925,-17.42925 -12.0272,-17.42925 -2.0385,0 -4.179,0.30578 -8.3579,2.85392 l 4.8924,-22.93322 -15.085,2.03851 -10.906,51.06462 z m 31.1892,-16.00228 c 0,10.70216 -5.3001,24.97172 -11.9253,24.97172 -3.6693,0 -5.402,-1.73273 -5.402,-4.68857 0,-0.71348 0.1019,-1.52888 0.3058,-2.34428 l 5.6059,-25.88905 c 1.1211,-1.32504 4.5866,-1.83466 6.0136,-1.83466 3.6693,0 5.402,4.79049 5.402,9.78484 z"
           inkscape:connector-curvature="0" />
        <path
           id="path4639-6"
           style="font-style:normal;font-variant:normal;font-weight:normal;font-stretch:normal;font-family:'Lobster 1.4';-inkscape-font-specification:'Lobster 1.4, ';letter-spacing:0px;word-spacing:0px;fill:#0884e5;fill-opacity:1;stroke:none;stroke-width:1.39516747;stroke-miterlimit:4;stroke-dasharray:none;stroke-opacity:1"
           d="m 1119.9269,899.74663 c -4.6886,6.31937 -11.9253,10.19254 -19.8755,10.19254 -9.7848,0 -12.231,-6.52323 -12.231,-15.90036 0,-20.79279 9.9887,-47.59917 21.2005,-47.59917 4.5866,0 6.2174,2.95584 6.2174,6.21745 0,3.87317 -2.2423,8.15404 -4.6885,9.37714 1.9365,2.24236 4.1789,2.65006 5.8097,2.65006 5.1982,0 7.1348,-3.97509 7.1348,-9.37714 0,-9.88676 -7.4406,-13.658 -17.0215,-13.658 -26.7045,0 -35.572,34.55271 -35.572,53.00121 0,18.34657 7.2367,25.07365 22.3216,25.07365 9.2753,0 23.6467,-5.30012 29.0488,-18.95813 l -2.3443,-1.01925 z"
           inkscape:connector-curvature="0" />
        <path
           id="path4641-8"
           style="font-style:normal;font-variant:normal;font-weight:normal;font-stretch:normal;font-family:'Lobster 1.4';-inkscape-font-specification:'Lobster 1.4, ';letter-spacing:0px;word-spacing:0px;fill:#0884e5;fill-opacity:1;stroke:none;stroke-width:1.39516747;stroke-miterlimit:4;stroke-dasharray:none;stroke-opacity:1"
           d="m 1146.0294,866.21317 c -20.9967,0 -27.9276,24.4621 -27.9276,36.18352 0,11.61949 6.829,16.10421 16.3081,16.10421 12.5368,0 22.7293,-11.82334 24.3601,-30.67954 7.4406,-1.22311 14.1677,-4.28087 18.0408,-8.45981 l -0.9173,-2.75199 c -4.3828,3.05776 -11.0079,6.11553 -15.6965,6.11553 -0.3058,0 -0.7135,0 -1.1212,-0.20385 0,-10.70217 -4.2808,-16.30807 -13.0464,-16.30807 z m -7.5425,43.11445 c -3.8732,0 -5.1982,-1.52888 -5.1982,-8.25596 0,-9.98869 6.3194,-28.64104 13.5561,-28.64104 2.65,0 3.6693,1.63081 3.8731,5.91167 -1.8346,0.81541 -3.1597,2.65007 -3.1597,5.50398 0,2.0385 0.6116,3.77124 2.752,4.28086 -1.6308,12.0272 -6.829,21.20049 -11.8233,21.20049 z"
           inkscape:connector-curvature="0" />
        <path
           id="path4643-9"
           style="font-style:normal;font-variant:normal;font-weight:normal;font-stretch:normal;font-family:'Lobster 1.4';-inkscape-font-specification:'Lobster 1.4, ';letter-spacing:0px;word-spacing:0px;fill:#0884e5;fill-opacity:1;stroke:none;stroke-width:1.39516747;stroke-miterlimit:4;stroke-dasharray:none;stroke-opacity:1"
           d="m 1193.6747,881.19621 c 0,6.52322 -4.5866,19.06005 -4.5866,25.99097 0,5.80975 3.1596,11.51757 12.0272,11.51757 5.402,0 13.2503,-2.14043 18.9581,-18.8562 l -4.2809,0 c -2.2423,5.30012 -4.077,8.96944 -8.5617,8.96944 -3.0578,0 -4.077,-1.73273 -4.077,-4.28087 0,-5.70782 4.8924,-18.04079 4.8924,-26.29675 0,-8.15403 -4.7905,-11.51757 -11.3137,-11.51757 -3.1597,0 -7.6444,0.8154 -11.9253,5.70782 l 1.1212,-5.30012 -14.6773,0 -10.8041,50.9627 14.6773,0 6.9309,-32.71805 c 1.5289,-5.09627 4.2809,-9.37714 7.9502,-9.37714 2.4462,0 3.6693,1.83466 3.6693,5.1982 z"
           inkscape:connector-curvature="0" />
        <path
           id="path4645-03"
           style="font-style:normal;font-variant:normal;font-weight:normal;font-stretch:normal;font-family:'Lobster 1.4';-inkscape-font-specification:'Lobster 1.4, ';letter-spacing:0px;word-spacing:0px;fill:#0884e5;fill-opacity:1;stroke:none;stroke-width:1.39516747;stroke-miterlimit:4;stroke-dasharray:none;stroke-opacity:1"
           d="m 1254.8156,856.93796 c 0.2039,-1.2231 0.3058,-2.54813 0.3058,-4.17894 0,-6.62515 -5.8097,-11.00794 -12.0272,-11.00794 -6.7271,0 -15.4927,2.75198 -18.5504,17.32731 l -12.333,58.19941 c -9.6829,2.95583 -17.5312,5.91167 -17.5312,15.28881 0,6.62515 5.8098,11.00794 12.0272,11.00794 6.7271,0 15.1869,-2.75199 18.2447,-17.32732 l 11.7214,-55.03971 7.5425,0 0.7135,-4.07702 -7.4406,0 1.7327,-8.05211 c 1.427,-6.829 4.8925,-8.35788 7.1348,-8.35788 2.0385,0 3.8732,1.12118 3.8732,3.46547 0,0.91732 -0.1019,1.73273 -0.2039,2.75198 l 4.7905,0 z m -54.5301,74.20169 c 0,-5.50397 4.7905,-8.35788 11.2118,-10.49831 l -1.325,5.91167 c -1.325,6.0136 -3.6693,7.95018 -5.8097,7.95018 -2.2424,0 -4.0771,-1.93658 -4.0771,-3.36354 z"
           inkscape:connector-curvature="0" />
      </g>
      <g
         style="color:#000000;font-style:normal;font-variant:normal;font-weight:normal;font-stretch:normal;font-size:263.34698486px;line-height:125%;font-family:Lobster;-inkscape-font-specification:Lobster;text-indent:0;text-align:start;text-decoration:none;text-decoration-line:none;letter-spacing:0px;word-spacing:0px;text-transform:none;direction:ltr;block-progression:tb;writing-mode:lr-tb;baseline-shift:baseline;text-anchor:start;display:inline;overflow:visible;visibility:visible;fill:#d40000;fill-opacity:1;fill-rule:nonzero;stroke:none;stroke-width:1.20000017;stroke-miterlimit:4;stroke-dasharray:none;stroke-opacity:1;marker:none;enable-background:accumulate"
         id="text8126-7-6-1">
        <path
           d="m -1008.4869,520.43394 c -31.8649,18.96098 -52.406,20.54106 -66.8901,20.54106 l -3.1602,12.11396 25.018,0 -34.7618,164.32852 37.922,0 41.8721,-196.98354 z"
           style="fill:#d70151;fill-opacity:1"
           id="path4266"
           inkscape:connector-curvature="0" />
        <path
           d="m -878.63171,519.90724 -86.37781,0 c -25.80801,0 -35.81518,9.21715 -35.81518,26.3347 0,4.4769 0.79,9.74384 2.10676,15.27413 11.85062,-13.16735 31.60164,-18.69764 54.51283,-18.69764 7.11037,0 14.74743,0.52669 22.38449,1.58008 -44.24229,51.08932 -82.95428,97.17504 -82.95428,140.1006 0,26.86139 11.3239,32.91837 27.12472,32.91837 11.06057,0 21.06776,-1.84343 24.22792,-10.27053 -9.48049,-7.90041 -12.904,-15.01078 -12.904,-25.54466 0,-9.48049 2.63347,-20.80441 8.4271,-33.97176 7.37372,-17.11755 65.5734,-107.44557 79.26745,-127.72329 z"
           style="fill:#d70151;fill-opacity:1"
           id="path4268"
           inkscape:connector-curvature="0" />
      </g>
      <g
         transform="scale(1.0106009,0.98951031)"
         style="color:#000000;font-style:normal;font-variant:normal;font-weight:normal;font-stretch:normal;font-size:76.24946594px;line-height:125%;font-family:'Smile Parade';-inkscape-font-specification:'Smile Parade';text-indent:0;text-align:start;text-decoration:none;text-decoration-line:none;letter-spacing:0px;word-spacing:0px;text-transform:none;direction:ltr;block-progression:tb;writing-mode:lr-tb;baseline-shift:baseline;text-anchor:start;display:inline;overflow:visible;visibility:visible;fill:#d70751;fill-opacity:1;fill-rule:nonzero;stroke:none;stroke-width:2.5;stroke-miterlimit:4;stroke-dasharray:none;stroke-opacity:1;marker:none;enable-background:accumulate"
         id="text8283-0">
        <path
           d="m -1771.895,755.199 q -0.1489,1.11694 -0.7074,1.82433 -0.5585,0.70739 -1.3403,1.11693 -0.7819,0.40955 -1.6754,0.5957 -0.8936,0.14893 -1.7127,0.14893 -0.968,0 -1.8988,-0.18616 -0.8935,-0.22339 -1.6009,-0.63293 -0.7074,-0.44677 -1.1169,-1.04247 -0.4096,-0.63293 -0.4096,-1.41479 0,-1.52648 0.1489,-2.79234 0.149,-1.30309 0.4468,-2.60618 1.0425,-4.35605 1.8244,-8.07917 0.7818,-3.76035 1.3403,-7.11115 0.5584,-3.35081 0.968,-6.47823 0.4095,-3.16465 0.7074,-6.3293 0.3351,-3.20188 0.5957,-6.58992 0.2606,-3.38804 0.5584,-7.26008 0,-0.33508 0,-0.85632 0,-0.52123 -0.1116,-0.96801 -0.1117,-0.484 -0.4096,-0.81908 -0.2606,-0.33508 -0.8191,-0.33508 -0.8935,0 -2.1966,0.63293 -1.2659,0.59569 -2.6807,1.63817 -1.4147,1.04247 -2.8295,2.45726 -1.4148,1.37755 -2.6062,2.97849 -0.2234,0.55847 -0.7074,0.81909 -0.484,0.22338 -1.0797,0.22338 -0.1862,0 -0.3723,-0.29785 -0.2234,-0.33508 -0.3723,-0.78185 -0.1862,-0.44677 -0.2979,-0.93078 -0.1117,-0.52124 -0.1117,-0.93078 0,-0.22339 0.1489,-0.37231 1.3404,-4.39328 3.0158,-7.33455 1.7126,-2.97849 3.5742,-4.72836 1.8988,-1.78709 3.8348,-2.53172 1.9732,-0.74462 3.7603,-0.74462 2.3084,0 3.8348,0.89355 1.5265,0.85632 2.4201,2.45726 0.8935,1.56371 1.2286,3.79758 0.3723,2.23387 0.3723,4.95175 0,2.08494 -0.3351,4.87728 -0.3351,2.79234 -0.8563,5.88253 -0.484,3.05295 -1.0797,6.14314 -0.5957,3.09019 -1.1542,5.77084 1.1914,-4.95175 2.7924,-9.49396 1.6381,-4.57943 3.5369,-8.52594 1.9361,-3.98373 4.0955,-7.18562 2.1594,-3.23911 4.4305,-5.54744 2.3083,-2.30834 4.6539,-3.5742 2.3455,-1.26586 4.6539,-1.26586 1.7126,0 3.1646,0.74463 1.452,0.74462 2.4945,2.30833 1.0425,1.56371 1.601,3.94651 0.5957,2.38279 0.5957,5.65914 0,0.29785 -0.075,0.93078 -0.037,0.63293 -0.1489,1.45201 -0.074,0.81909 -0.2234,1.7871 -0.1117,0.93078 -0.2234,1.86156 -0.2979,2.23387 -0.6329,4.84005 l 0.7818,-0.0372 q 1.452,-5.51021 3.5742,-9.90349 2.1222,-4.39328 4.7656,-7.44624 2.6434,-3.09019 5.6964,-4.72836 3.0529,-1.63817 6.3293,-1.63817 2.2711,0 4.0209,1.34032 1.7871,1.34032 2.9785,3.64866 1.1914,2.2711 1.8244,5.36129 0.6329,3.05295 0.6329,6.47822 0,3.20188 -0.4468,6.58992 -0.4095,3.35081 -1.0424,6.66438 -0.633,3.27635 -1.3776,6.441 -0.7074,3.16465 -1.3403,5.99422 -0.633,2.82957 -1.0797,5.2496 -0.4096,2.38279 -0.4096,4.13266 0,2.19664 0.7819,3.20188 0.8191,0.96801 2.3455,0.96801 0.8564,0 1.7871,-0.44677 0.9681,-0.48401 1.8988,-1.22863 0.968,-0.78186 1.8988,-1.74987 0.9308,-1.00524 1.7871,-2.04771 1.9733,-2.3828 3.9093,-5.47299 0,0.0372 0.3351,0.78186 0.2606,0.63293 0.8563,2.15941 0.5957,1.52647 1.6754,4.39328 -1.8616,3.27634 -3.8348,5.54744 -1.9733,2.2711 -4.021,3.72312 -2.0477,1.41479 -4.1699,2.04772 -2.0849,0.63293 -4.1699,0.63293 -2.0105,0 -3.9465,-0.7074 -1.8988,-0.70739 -3.388,-2.08494 -1.4893,-1.41479 -2.3828,-3.4625 -0.8936,-2.08495 -0.8936,-4.76559 0,-0.29785 0,-0.63293 0.037,-0.33509 0.075,-0.67017 0.1489,-2.49449 0.6329,-5.28682 0.484,-2.82957 1.0797,-5.80807 0.633,-2.97849 1.3031,-6.06868 0.6702,-3.09019 1.2287,-6.14315 0.5584,-3.09019 0.9307,-6.06868 0.3724,-3.01573 0.3724,-5.77083 0,-1.67541 -0.1117,-3.01573 -0.1117,-1.37755 -0.4468,-2.30833 -0.3351,-0.96801 -0.968,-1.48925 -0.633,-0.52124 -1.6754,-0.52124 -1.9733,0 -3.7231,1.37756 -1.7499,1.37755 -3.3136,3.79758 -1.5637,2.42002 -2.9413,5.7336 -1.3403,3.31358 -2.5689,7.18562 -1.1914,3.83481 -2.2339,8.07917 -1.0425,4.20712 -1.936,8.48871 -0.8936,4.28158 -1.6754,8.45147 -0.7819,4.1699 -1.4521,7.89302 -0.2978,1.04247 -0.9307,1.78709 -0.5957,0.70739 -1.4148,1.15417 -0.7819,0.44677 -1.6754,0.67016 -0.8936,0.18616 -1.7871,0.18616 -0.7819,0 -1.5637,-0.29785 -0.7446,-0.29785 -1.3403,-0.93078 -0.5585,-0.67016 -0.9308,-1.67541 -0.3351,-1.00524 -0.3351,-2.45725 0,-0.96802 0.4468,-3.31358 0.4467,-2.3828 1.1169,-5.65914 0.7074,-3.31358 1.4892,-7.22285 0.8191,-3.94651 1.4893,-8.0047 0.7074,-4.09543 1.1542,-8.07917 0.4467,-3.98374 0.4467,-7.33454 0,-2.30834 -0.1117,-4.13267 -0.1116,-1.82432 -0.5212,-3.09018 -0.4095,-1.26586 -1.1914,-1.93603 -0.7446,-0.67016 -2.0105,-0.67016 -1.0424,0 -2.3828,1.41479 -1.3403,1.41478 -2.904,3.90927 -1.5265,2.49449 -3.1647,5.88253 -1.6381,3.35081 -3.2763,7.26008 -1.6009,3.90927 -3.1274,8.19086 -1.4893,4.24436 -2.7551,8.52594 -1.2659,4.24436 -2.2339,8.33979 -0.968,4.0582 -1.452,7.63239 z"
           style="font-style:normal;font-variant:normal;font-weight:normal;font-stretch:normal;font-family:Pacifico;-inkscape-font-specification:Pacifico;fill:#d70151;fill-opacity:1;stroke:none;stroke-width:2.5;stroke-miterlimit:4;stroke-dasharray:none;stroke-opacity:1"
           id="path4271"
           inkscape:connector-curvature="0" />
        <path
           d="m -1679.6361,730.9615 q 1.0797,2.15941 1.6009,4.57943 0.5585,2.3828 0.5585,4.57944 0,2.19664 -0.484,4.43051 -0.484,2.23387 -1.4148,4.31882 -0.8936,2.08495 -2.2339,3.90927 -1.3031,1.82433 -3.0157,3.16465 -1.6754,1.34033 -3.6859,2.12218 -2.0105,0.78186 -4.2816,0.78186 -3.2763,0 -5.6219,-1.41479 -2.3083,-1.45201 -3.7976,-3.76035 -1.4892,-2.30833 -2.1966,-5.21236 -0.6702,-2.90404 -0.6702,-5.88253 0,-4.09543 1.2287,-7.63239 1.2286,-3.5742 3.4997,-6.18038 2.3083,-2.64341 5.6219,-4.13266 3.3136,-1.52648 7.4462,-1.52648 3.537,0 6.6272,1.11693 3.0902,1.07971 5.7708,2.94127 2.7179,1.82433 5.0262,4.20712 2.3456,2.3828 4.3561,4.91452 l -0.7074,5.2496 q -1.0053,-1.34033 -2.7179,-2.90404 -1.7126,-1.56371 -3.6487,-3.05295 -1.8987,-1.48925 -3.7603,-2.79234 -1.8616,-1.34033 -3.2019,-2.23387 l -0.2978,0.40954 z m -11.5045,20.73777 q 1.2659,0 2.4573,-1.26586 1.1914,-1.30309 2.0849,-3.23911 0.8936,-1.97326 1.4148,-4.31882 0.5585,-2.3828 0.5585,-4.54221 0,-1.71263 -0.2606,-3.16465 -0.2606,-1.48924 -0.7819,-2.56895 -0.5212,-1.0797 -1.3403,-1.71263 -0.8191,-0.63293 -1.9733,-0.63293 -1.5264,0 -2.904,1.30309 -1.3775,1.30309 -2.42,3.3508 -1.0425,2.01049 -1.6382,4.46775 -0.5957,2.45725 -0.5957,4.72836 0,1.56371 0.2979,2.94126 0.2978,1.37755 0.9307,2.42003 0.633,1.00524 1.6754,1.63817 1.0425,0.5957 2.4945,0.5957 z"
           style="font-style:normal;font-variant:normal;font-weight:normal;font-stretch:normal;font-family:Pacifico;-inkscape-font-specification:Pacifico;fill:#d70151;fill-opacity:1;stroke:none;stroke-width:2.5;stroke-miterlimit:4;stroke-dasharray:none;stroke-opacity:1"
           id="path4273"
           inkscape:connector-curvature="0" />
        <path
           d="m -1670.0305,751.06634 q 0,-2.45726 0.2979,-5.65914 0.2978,-3.23911 0.7446,-6.55269 0.4468,-3.35081 1.0052,-6.44099 0.5585,-3.09019 1.0797,-5.28683 0.4096,-1.71264 1.5637,-2.8668 1.1914,-1.15417 3.2019,-1.15417 2.0105,0 2.7924,1.22863 0.7818,1.22863 0.7818,3.27634 0,0.55847 -0.1117,1.52648 -0.1117,0.93078 -0.2978,2.08495 -0.149,1.11693 -0.3351,2.34556 -0.1862,1.1914 -0.3723,2.23387 -0.1489,1.00525 -0.2606,1.7871 -0.1117,0.74462 -0.1117,1.00524 l 0.7446,0 q 0.2234,-0.40954 0.7074,-1.30309 0.484,-0.93078 1.1169,-2.12218 0.6329,-1.1914 1.3403,-2.49449 0.7447,-1.34032 1.3776,-2.53172 0.6329,-1.22863 1.1542,-2.15941 0.5212,-0.93078 0.7818,-1.37755 1.1914,-2.01048 2.7179,-2.75511 1.5265,-0.74462 3.388,-0.74462 1.8616,0 2.9413,1.56371 1.1169,1.56371 1.1169,4.31882 0,0.40954 -0.1861,1.37755 -0.1489,0.96801 -0.4096,2.30833 -0.2606,1.34033 -0.5957,2.94127 -0.2978,1.60094 -0.5584,3.27634 -0.2607,1.6754 -0.4468,3.31358 -0.1489,1.63817 -0.1489,3.01572 0,2.30834 0.5584,3.79758 0.5957,1.48925 1.8244,1.48925 0.5584,0 1.2658,-0.33508 0.7446,-0.33508 1.5637,-0.85632 0.8563,-0.55846 1.7127,-1.26586 0.8935,-0.70739 1.7498,-1.45201 1.9733,-1.74987 4.1327,-3.94651 l 0.6329,8.33979 -1.8615,1.41478 q -1.5265,1.15417 -3.1275,2.30833 -1.5637,1.15417 -3.2763,2.08495 -1.7126,0.89355 -3.5742,1.48925 -1.8616,0.55847 -3.9093,0.55847 -2.0477,0 -3.4625,-2.94127 -1.3775,-2.97849 -1.3775,-8.67486 0,-2.23387 0.2978,-4.80283 0.2979,-2.60618 0.7447,-5.58467 l -0.5957,0 -9.7546,19.36021 q -0.7446,1.52648 -1.6754,2.08495 -0.9308,0.55847 -2.1594,0.55847 -1.5265,0 -2.4573,-0.63293 -0.9308,-0.67017 -1.452,-1.74987 -0.484,-1.11694 -0.6702,-2.49449 -0.1489,-1.41478 -0.1489,-2.90403 z"
           style="font-style:normal;font-variant:normal;font-weight:normal;font-stretch:normal;font-family:Pacifico;-inkscape-font-specification:Pacifico;fill:#d70151;fill-opacity:1;stroke:none;stroke-width:2.5;stroke-miterlimit:4;stroke-dasharray:none;stroke-opacity:1"
           id="path4275"
           inkscape:connector-curvature="0" />
        <path
           d="m -1604.5036,750.50787 q -3.5742,2.08495 -6.3665,3.64866 -2.7924,1.56371 -4.989,2.60618 -2.1594,1.04247 -3.8721,1.56371 -1.6754,0.52124 -3.0529,0.52124 -2.8296,0 -4.989,-1.71264 -2.1594,-1.71263 -3.6114,-4.91451 -1.452,-3.23912 -2.1967,-7.81855 -0.7074,-4.57944 -0.7074,-10.31304 0,-2.23387 0.1862,-4.76559 0.1862,-2.53172 0.5212,-5.02621 -1.1169,-0.14893 -1.7498,-0.26062 -0.5957,-0.14893 -1.3031,-0.26062 -0.6702,-0.14892 -1.7499,-0.29785 -1.0425,-0.14892 -3.0529,-0.37231 -0.8936,-0.11169 -1.3776,-0.40954 -0.484,-0.33508 -0.7074,-0.74463 -0.2234,-0.44677 -0.2606,-0.89355 -0.037,-0.484 -0.037,-0.81908 0,-0.74463 0.7446,-1.11694 0.7074,-0.40954 1.8615,-0.5957 1.117,-0.18615 2.4573,-0.18615 1.3776,-0.0372 2.6062,0 1.2658,0.0372 2.2339,0.0745 1.0052,0 1.3775,-0.0745 1.0053,-5.02621 2.5317,-9.71734 1.5637,-4.72836 3.4625,-8.37702 1.9361,-3.68589 4.2072,-5.88253 2.2711,-2.23387 4.7655,-2.23387 1.601,0 2.9041,0.89355 1.3403,0.89355 2.2711,2.3828 0.9308,1.48925 1.4148,3.49973 0.5212,1.97325 0.5212,4.13266 0,1.82433 -0.5212,3.87204 -0.5213,2.01049 -1.4148,4.13267 -0.8936,2.08494 -2.1222,4.24435 -1.1914,2.15941 -2.5317,4.28159 0.3351,0.0372 1.1169,0.0745 0.7819,0 1.7871,0.0372 1.0425,0.0372 2.2339,0.11169 1.1914,0.0372 2.3083,0.0745 1.117,0.0372 2.085,0.0745 0.968,0.0372 1.6009,0.0745 0.7446,0.0372 1.0797,0.74462 0.3351,0.7074 0.3351,1.7871 0,1.30309 -0.7446,2.12218 -0.7447,0.81908 -1.6382,0.81908 l -14.2968,0 q -1.0797,1.48925 -2.1966,2.94127 -1.0797,1.41478 -2.0105,2.56895 -0.1489,2.30833 -0.2606,4.5422 -0.037,0.96802 -0.074,2.01049 -0.037,1.00524 -0.074,2.01048 -0.037,1.00524 -0.074,1.93602 0,0.93078 0,1.71264 0,2.01048 0.3723,3.38804 0.3723,1.37755 1.0797,2.2711 0.7074,0.85632 1.7126,1.26586 1.0425,0.37231 2.3084,0.37231 0.7818,0 1.936,-0.37231 1.1914,-0.37231 2.569,-1.00524 1.4147,-0.67016 2.9412,-1.56371 1.5637,-0.89355 3.053,-1.93602 1.5264,-1.07971 2.904,-2.23388 1.3776,-1.19139 2.4945,-2.42002 l 0,9.53118 z m -11.914,-47.13468 q 0,-0.40954 -0.074,-0.89355 -0.037,-0.52123 -0.2234,-0.96801 -0.1862,-0.44677 -0.5957,-0.74462 -0.3723,-0.29785 -1.0797,-0.29785 -0.968,0 -1.9733,1.71263 -0.968,1.71264 -1.8988,4.39328 -0.8935,2.64342 -1.7126,5.8453 -0.7819,3.20188 -1.452,6.21761 0.5584,0.0745 1.1169,0.14892 0.5585,0.0372 1.1542,0.1117 1.1169,-1.8988 2.3083,-4.09544 1.2286,-2.23387 2.1966,-4.35604 0.9681,-2.15941 1.601,-4.02097 0.6329,-1.86156 0.6329,-3.05296 z"
           style="font-style:normal;font-variant:normal;font-weight:normal;font-stretch:normal;font-family:Pacifico;-inkscape-font-specification:Pacifico;fill:#d70151;fill-opacity:1;stroke:none;stroke-width:2.5;stroke-miterlimit:4;stroke-dasharray:none;stroke-opacity:1"
           id="path4277"
           inkscape:connector-curvature="0" />
        <path
           d="m -1605.695,751.06634 q 0,-1.63817 0.1862,-3.79758 0.1861,-2.19664 0.484,-4.61667 0.335,-2.42003 0.7446,-4.91452 0.4468,-2.53172 0.9308,-4.80282 0.484,-2.2711 0.968,-4.16989 0.484,-1.89879 0.968,-3.12742 0.2978,-0.81909 0.5957,-1.30309 0.2978,-0.48401 0.6702,-0.74463 0.4095,-0.29784 0.968,-0.37231 0.5957,-0.11169 1.452,-0.11169 0.968,0 1.4892,0.11169 0.5585,0.0745 0.8191,0.44678 0.2606,0.33508 0.2979,1.00524 0.074,0.67016 0.074,1.82433 0,1.37755 0,3.3508 0,1.93603 0.074,3.83482 l 0.4095,0 q 0.7447,-1.48925 1.6754,-3.31358 0.9308,-1.86156 2.1594,-3.4625 1.2287,-1.60094 2.7924,-2.68065 1.5637,-1.11693 3.6114,-1.11693 0.7074,0 1.3776,0.26062 0.6701,0.22338 1.1541,0.67016 0.5213,0.44677 0.8191,1.11693 0.2979,0.63293 0.2979,1.45202 0,0.63293 -0.1862,1.7871 -0.1862,1.11693 -0.4095,2.38279 -0.2234,1.22863 -0.4096,2.42003 -0.1861,1.15417 -0.1861,1.93602 0,1.34032 0.2606,2.23387 0.2606,0.89355 0.6701,1.45202 0.4468,0.52124 0.9681,0.74462 0.5584,0.22339 1.1541,0.22339 1.6754,0 3.4625,-0.74462 1.7871,-0.74463 3.2764,-1.67541 1.7498,-1.0797 3.4252,-2.45726 l -0.5584,8.7121 q -0.968,0.63293 -2.1967,1.41479 -1.2286,0.78185 -2.6434,1.48924 -1.3775,0.67017 -2.904,1.15417 -1.4893,0.44678 -3.053,0.44678 -2.7923,0 -4.505,-1.11694 -1.7126,-1.15417 -2.7178,-2.9785 -1.0053,-1.86155 -1.4893,-4.13266 -0.484,-2.30833 -0.7818,-4.65389 l -0.5957,0 -6.6644,18.57836 q -0.5212,1.45201 -1.0053,2.42002 -0.4467,0.93078 -0.9307,1.52648 -0.484,0.5957 -1.0425,0.85632 -0.5585,0.22339 -1.2286,0.22339 -1.5265,0 -2.4573,-0.63293 -0.9308,-0.67017 -1.452,-1.74987 -0.484,-1.11694 -0.6702,-2.49449 -0.1489,-1.41478 -0.1489,-2.90403 z"
           style="font-style:normal;font-variant:normal;font-weight:normal;font-stretch:normal;font-family:Pacifico;-inkscape-font-specification:Pacifico;fill:#d70151;fill-opacity:1;stroke:none;stroke-width:2.5;stroke-miterlimit:4;stroke-dasharray:none;stroke-opacity:1"
           id="path4279"
           inkscape:connector-curvature="0" />
        <path
           d="m -1560.9431,758.84766 q -3.4997,0 -6.1432,-1.26586 -2.6061,-1.26586 -4.356,-3.38804 -1.7499,-2.15941 -2.6434,-4.95175 -0.8563,-2.82957 -0.8563,-5.91976 0,-2.08494 0.4095,-4.39328 0.4095,-2.34556 1.2286,-4.57943 0.8563,-2.23387 2.1222,-4.24436 1.2659,-2.04771 2.9413,-3.57419 1.7126,-1.56371 3.7976,-2.45726 2.1221,-0.93078 4.6911,-0.93078 2.0849,0 3.872,0.67016 1.7871,0.67016 3.0902,1.89879 1.3403,1.1914 2.085,2.90403 0.7446,1.71264 0.7446,3.83482 0,2.30833 -1.1542,4.61666 -1.1169,2.30834 -3.1274,4.35605 -2.0105,2.04772 -4.8028,3.64866 -2.7551,1.60094 -5.9942,2.49449 0.5584,1.00524 1.0797,1.6754 0.5584,0.67016 1.1169,1.04247 0.5585,0.37232 1.1542,0.52124 0.6329,0.14893 1.3403,0.14893 2.2339,0 4.6911,-0.89355 2.4945,-0.89355 4.8401,-2.23387 2.3455,-1.34033 4.4305,-2.90404 2.0849,-1.60094 3.5369,-3.01572 l 4.8029,4.98898 q -3.2764,3.38803 -6.9623,5.99422 -1.6009,1.11693 -3.4625,2.19664 -1.8243,1.0797 -3.872,1.93602 -2.0105,0.81908 -4.2071,1.34032 -2.1594,0.48401 -4.3933,0.48401 z m -4.9518,-17.49866 q 1.3404,0 2.9041,-0.67016 1.6009,-0.70739 2.9412,-1.7871 1.3776,-1.0797 2.3084,-2.34556 0.9307,-1.26586 0.9307,-2.45726 0,-1.6754 -0.6329,-2.75511 -0.5957,-1.0797 -1.4892,-1.0797 -1.601,0 -2.7551,0.5957 -1.117,0.59569 -1.8988,1.56371 -0.7447,0.93077 -1.2287,2.1594 -0.4467,1.1914 -0.7074,2.42003 -0.2233,1.22863 -0.2978,2.3828 -0.074,1.15416 -0.074,1.97325 z m 5.1752,-28.51909 q 0.2234,-0.484 0.6329,-1.45201 0.4095,-1.00525 0.9308,-2.23388 0.5584,-1.26586 1.1541,-2.71787 0.633,-1.45202 1.2659,-2.8668 1.452,-3.35081 3.1647,-7.22285 0.484,-1.26586 1.452,-1.82433 1.0052,-0.55847 2.0849,-0.55847 0.968,0 1.936,0.37231 0.9681,0.37232 1.7127,1.04248 0.7818,0.67016 1.2658,1.60094 0.484,0.93078 0.484,2.04771 0,1.74987 -1.3775,3.61143 -0.7074,0.96801 -1.6382,2.15941 -0.8935,1.15416 -1.8988,2.45725 -0.968,1.26586 -2.0105,2.53173 -1.0052,1.26586 -1.936,2.42002 -0.9308,1.11694 -1.7126,2.04772 -0.7446,0.93078 -1.1914,1.48924 -0.6329,0.74463 -1.2659,1.07971 -0.6329,0.29785 -1.2658,0.29785 -0.8936,0 -1.5265,-0.67016 -0.6329,-0.7074 -0.6329,-1.82433 0,-0.40954 0.074,-0.85632 0.1117,-0.44677 0.2979,-0.93078 z"
           style="font-style:normal;font-variant:normal;font-weight:normal;font-stretch:normal;font-family:Pacifico;-inkscape-font-specification:Pacifico;fill:#d70151;fill-opacity:1;stroke:none;stroke-width:2.5;stroke-miterlimit:4;stroke-dasharray:none;stroke-opacity:1"
           id="path4281"
           inkscape:connector-curvature="0" />
        <path
           d="m -1505.2453,749.72602 q -0.8563,1.19139 -2.3083,2.79233 -1.4148,1.60095 -3.2019,3.05296 -1.7871,1.45202 -3.8348,2.45726 -2.0477,1.00524 -4.0954,1.00524 -2.4573,0 -4.0955,-1.56371 -1.6381,-1.60094 -2.8295,-4.61666 -0.8936,1.04247 -2.1967,2.12217 -1.3031,1.07971 -2.8668,1.97326 -1.5264,0.85631 -3.2019,1.41478 -1.6754,0.55847 -3.3508,0.55847 -1.7871,0 -3.4997,-0.70739 -1.6754,-0.74463 -2.9785,-2.08495 -1.3031,-1.37755 -2.0849,-3.31358 -0.7819,-1.97325 -0.7819,-4.43051 0,-2.79234 0.7819,-5.7336 0.7818,-2.94126 2.1594,-5.7336 1.3775,-2.82957 3.2391,-5.32406 1.8988,-2.49449 4.1327,-4.35605 2.2338,-1.86156 4.6911,-2.94126 2.4945,-1.11694 5.0634,-1.11694 0.8563,0 1.3403,0.33508 0.4841,0.33508 0.7819,0.78186 0.3351,0.40954 0.6329,0.81908 0.2979,0.40955 0.7447,0.5957 0.4467,0.18616 0.8935,0.26062 0.484,0.0372 0.968,0.0372 0.4096,0 0.8191,0 0.4468,-0.0372 0.8563,-0.0372 0.5585,0 1.0425,0.11169 0.484,0.1117 0.8563,0.48401 0.3723,0.37231 0.5585,1.04247 0.2234,0.67016 0.2234,1.82433 0,1.7871 -0.3723,3.98374 -0.3724,2.15941 -0.8191,4.46774 -0.4468,2.2711 -0.8191,4.57944 -0.3723,2.2711 -0.3723,4.31881 0,1.74987 0.2978,2.75511 0.3351,0.96801 1.3776,0.96801 0.7818,0 1.6381,-0.37231 0.8564,-0.40954 1.7127,-1.04247 0.8935,-0.63293 1.7498,-1.41479 0.8936,-0.81909 1.6754,-1.6754 1.8244,-2.01049 3.6859,-4.54221 l 1.7871,8.26533 z m -31.7954,-2.94127 q 0,0.93078 0.1117,1.82433 0.1489,0.85632 0.484,1.56371 0.3351,0.67016 0.8935,1.11694 0.5585,0.40954 1.4148,0.40954 1.3776,0 2.4945,-1.1914 1.117,-1.1914 1.936,-2.8668 0.8191,-1.6754 1.3031,-3.4625 0.5213,-1.7871 0.6702,-2.9785 l 2.2711,-10.94596 q -1.5265,0 -2.9785,0.78185 -1.452,0.74463 -2.7551,2.04772 -1.2659,1.30309 -2.3456,2.97849 -1.0797,1.6754 -1.8615,3.53696 -0.7819,1.82433 -1.2287,3.68589 -0.4095,1.86156 -0.4095,3.49973 z"
           style="font-style:normal;font-variant:normal;font-weight:normal;font-stretch:normal;font-family:Pacifico;-inkscape-font-specification:Pacifico;fill:#d70151;fill-opacity:1;stroke:none;stroke-width:2.5;stroke-miterlimit:4;stroke-dasharray:none;stroke-opacity:1"
           id="path4283"
           inkscape:connector-curvature="0" />
        <path
           d="m -1501.336,758.84766 q -2.0105,0 -3.7603,-1.74987 -1.7127,-1.7871 -3.0158,-4.76559 -1.2658,-2.9785 -2.0105,-6.88777 -0.7074,-3.94651 -0.7074,-8.26532 0,-3.31358 0.4841,-7.18562 0.484,-3.90928 1.4147,-8.04194 0.9308,-4.13266 2.1967,-8.30255 1.3031,-4.16989 2.904,-8.00471 1.6382,-3.83481 3.537,-7.14838 1.8988,-3.35081 3.9837,-5.80807 2.085,-2.49449 4.3561,-3.90927 2.2711,-1.41479 4.6166,-1.41479 1.601,0 2.6434,0.74463 1.0425,0.70739 1.6382,1.89879 0.5957,1.19139 0.8191,2.71787 0.2606,1.48925 0.2606,3.05296 0,3.49973 -0.8191,7.14839 -0.7818,3.61142 -2.1594,7.29731 -1.3403,3.64866 -3.1274,7.33454 -1.7871,3.68589 -3.7231,7.33455 -1.936,3.61142 -3.9093,7.14838 -1.936,3.49973 -3.6486,6.85054 -0.1862,0.37231 -0.4096,0.96801 -0.1861,0.5957 -0.3723,1.30309 -0.1862,0.67016 -0.3723,1.45202 -0.1862,0.78185 -0.2979,1.52648 l 0,0.52123 q 0,0.96802 0.1862,1.8988 0.2234,0.89354 0.5212,1.63817 0.2979,0.70739 0.633,1.15416 0.335,0.40955 0.6329,0.40955 0.7074,0 1.6009,-0.29785 0.9308,-0.29785 1.9361,-0.78186 1.0424,-0.52123 2.1221,-1.15416 1.0797,-0.67017 2.085,-1.34033 2.3455,-1.56371 4.9145,-3.61142 l 3.053,7.81855 q -3.3136,2.38279 -6.5527,4.24435 -1.4148,0.78186 -2.9413,1.56371 -1.4892,0.74463 -3.0157,1.34032 -1.5265,0.5957 -2.9785,0.96802 -1.452,0.33508 -2.7179,0.33508 z m 0.037,-29.78495 q 1.6754,-2.9785 3.537,-6.70161 1.8988,-3.72312 3.5742,-7.66963 1.6754,-3.9465 2.904,-7.85578 1.2287,-3.9465 1.5637,-7.33454 0,-1.07971 -0.074,-1.82433 -0.037,-0.78185 -0.3351,-0.78185 -1.0797,0 -2.3456,1.41478 -1.2286,1.37755 -2.4945,3.76035 -1.2286,2.3828 -2.3828,5.54745 -1.1169,3.16465 -2.0104,6.73884 -0.8936,3.57419 -1.4148,7.37178 -0.5213,3.76034 -0.5213,7.33454 z"
           style="font-style:normal;font-variant:normal;font-weight:normal;font-stretch:normal;font-family:Pacifico;-inkscape-font-specification:Pacifico;fill:#d70151;fill-opacity:1;stroke:none;stroke-width:2.5;stroke-miterlimit:4;stroke-dasharray:none;stroke-opacity:1"
           id="path4285"
           inkscape:connector-curvature="0" />
        <path
           d="m -1482.0502,761.5283 q 0.1116,-0.484 0.2978,-1.26586 0.1862,-0.74462 0.4095,-1.63817 0.2607,-0.89355 0.5213,-1.86156 0.2978,-1.00524 0.5584,-1.97325 0.633,-2.23387 1.3404,-4.76559 0.2234,-0.78186 0.7074,-1.37756 0.5212,-0.5957 1.1914,-0.96801 0.7074,-0.40954 1.5264,-0.5957 0.8191,-0.18615 1.6754,-0.18615 1.0425,0 2.085,0.29785 1.0425,0.26061 1.8616,0.81908 0.8563,0.55847 1.3775,1.37756 0.5212,0.78185 0.5212,1.82432 0,0.74463 -0.2606,1.45202 -0.2606,0.70739 -0.7074,1.52648 -0.7074,1.11693 -1.5637,2.42003 -0.8191,1.26586 -1.6754,2.53172 -0.8191,1.30309 -1.6382,2.45725 -0.7818,1.1914 -1.3775,2.04772 -0.8936,1.22863 -1.9733,1.74986 -1.0797,0.55847 -2.0849,0.55847 -1.2286,0 -2.1222,-0.81908 -0.8935,-0.78186 -0.8935,-2.23387 0,-0.5957 0.2234,-1.37756 z"
           style="font-style:normal;font-variant:normal;font-weight:normal;font-stretch:normal;font-family:Pacifico;-inkscape-font-specification:Pacifico;fill:#d70151;fill-opacity:1;stroke:none;stroke-width:2.5;stroke-miterlimit:4;stroke-dasharray:none;stroke-opacity:1"
           id="path4287"
           inkscape:connector-curvature="0" />
        <path
           d="m -1384.3184,746.26352 q -1.8243,0.78185 -3.5369,2.08494 -1.7127,1.26586 -3.4625,2.79234 -1.7499,1.52648 -3.6487,3.23911 -1.8615,1.67541 -4.0582,3.35081 -2.1594,1.63817 -4.7283,3.12742 -2.569,1.52648 -5.6964,2.64341 -3.0902,1.15417 -6.8505,1.82433 -3.7232,0.67016 -8.2654,0.67016 -5.0262,0 -9.0844,-2.04771 -4.0209,-2.01049 -6.8878,-5.43575 -2.8668,-3.4625 -4.4305,-8.00471 -1.5264,-4.57943 -1.5264,-9.60564 0,-3.42527 0.7446,-7.33455 0.7446,-3.9465 2.1222,-8.0047 1.4147,-4.09543 3.4252,-8.15363 2.0105,-4.0582 4.5422,-7.78132 2.569,-3.72312 5.6219,-6.88777 3.053,-3.20188 6.5155,-5.54745 3.4625,-2.38279 7.2973,-3.72311 3.8348,-1.34033 7.9675,-1.34033 2.6806,0 5.4357,0.96801 2.7551,0.93078 4.9518,2.90404 2.1966,1.97325 3.5742,4.98898 1.4148,3.01572 1.4148,7.11115 0,2.75511 -0.8936,5.58468 -0.8563,2.79234 -2.3828,5.39852 -1.5265,2.56895 -3.6114,4.84006 -2.0477,2.2711 -4.4305,3.9465 -2.3828,1.63817 -4.9518,2.60618 -2.5689,0.96801 -5.1379,0.96801 -3.388,0 -5.0634,-0.89354 -1.6754,-0.93078 -1.6754,-2.64342 0,-0.29785 -0.037,-0.70739 0,-0.40954 0,-0.85632 0,-0.67016 0.074,-1.37755 0.074,-0.74463 0.2979,-1.34032 0.2234,-0.5957 0.6329,-0.96802 0.4468,-0.37231 1.1914,-0.37231 0.4468,0 0.7819,0.14893 0.335,0.11169 0.7446,0.26062 0.4095,0.14892 0.968,0.29785 0.5957,0.11169 1.4892,0.11169 2.3828,0 4.8029,-1.04247 2.4572,-1.04248 4.3932,-2.94127 1.9733,-1.89879 3.2019,-4.50497 1.2659,-2.64342 1.2659,-5.80807 0,-1.6754 -0.4468,-3.16465 -0.4468,-1.52648 -1.452,-2.64341 -1.0053,-1.15417 -2.6062,-1.82433 -1.5637,-0.70739 -3.8348,-0.70739 -2.6807,0 -5.2496,1.1914 -2.5317,1.15416 -4.8773,3.16465 -2.3456,2.01048 -4.4677,4.76559 -2.085,2.75511 -3.8721,5.91976 -1.7871,3.12742 -3.2391,6.55269 -1.4148,3.38803 -2.42,6.77607 -1.0053,3.38804 -1.5637,6.58992 -0.5213,3.16465 -0.5213,5.8453 0,3.83481 0.9308,6.70161 0.968,2.82957 2.7179,4.72836 1.7499,1.89879 4.2816,2.82957 2.5317,0.93078 5.6964,0.93078 3.9465,0 7.3345,-0.96801 3.4253,-1.00524 6.5155,-2.60618 3.0901,-1.60094 5.9569,-3.61143 2.9041,-2.01048 5.7709,-4.02097 2.904,-2.04771 5.8825,-3.87204 3.0157,-1.86156 6.3665,-3.12742 l 0,8.00471 z"
           style="font-style:normal;font-variant:normal;font-weight:normal;font-stretch:normal;font-family:Pacifico;-inkscape-font-specification:Pacifico;fill:#d70151;fill-opacity:1;stroke:none;stroke-width:2.5;stroke-miterlimit:4;stroke-dasharray:none;stroke-opacity:1"
           id="path4289"
           inkscape:connector-curvature="0" />
        <path
           d="m -1352.7463,749.72602 q -0.8564,1.19139 -2.3084,2.79233 -1.4148,1.60095 -3.2019,3.05296 -1.7871,1.45202 -3.8348,2.45726 -2.0477,1.00524 -4.0954,1.00524 -2.4573,0 -4.0954,-1.56371 -1.6382,-1.60094 -2.8296,-4.61666 -0.8935,1.04247 -2.1966,2.12217 -1.3031,1.07971 -2.8668,1.97326 -1.5265,0.85631 -3.2019,1.41478 -1.6754,0.55847 -3.3508,0.55847 -1.7871,0 -3.4998,-0.70739 -1.6754,-0.74463 -2.9785,-2.08495 -1.303,-1.37755 -2.0849,-3.31358 -0.7819,-1.97325 -0.7819,-4.43051 0,-2.79234 0.7819,-5.7336 0.7819,-2.94126 2.1594,-5.7336 1.3776,-2.82957 3.2391,-5.32406 1.8988,-2.49449 4.1327,-4.35605 2.2339,-1.86156 4.6911,-2.94126 2.4945,-1.11694 5.0635,-1.11694 0.8563,0 1.3403,0.33508 0.484,0.33508 0.7818,0.78186 0.3351,0.40954 0.633,0.81908 0.2978,0.40955 0.7446,0.5957 0.4468,0.18616 0.8935,0.26062 0.484,0.0372 0.968,0.0372 0.4096,0 0.8191,0 0.4468,-0.0372 0.8563,-0.0372 0.5585,0 1.0425,0.11169 0.484,0.1117 0.8563,0.48401 0.3724,0.37231 0.5585,1.04247 0.2234,0.67016 0.2234,1.82433 0,1.7871 -0.3723,3.98374 -0.3723,2.15941 -0.8191,4.46774 -0.4468,2.2711 -0.8191,4.57944 -0.3723,2.2711 -0.3723,4.31881 0,1.74987 0.2978,2.75511 0.3351,0.96801 1.3776,0.96801 0.7819,0 1.6382,-0.37231 0.8563,-0.40954 1.7126,-1.04247 0.8936,-0.63293 1.7499,-1.41479 0.8935,-0.81909 1.6754,-1.6754 1.8243,-2.01049 3.6859,-4.54221 l 1.7871,8.26533 z m -31.7955,-2.94127 q 0,0.93078 0.1117,1.82433 0.1489,0.85632 0.484,1.56371 0.3351,0.67016 0.8936,1.11694 0.5584,0.40954 1.4148,0.40954 1.3775,0 2.4945,-1.1914 1.1169,-1.1914 1.936,-2.8668 0.8191,-1.6754 1.3031,-3.4625 0.5212,-1.7871 0.6701,-2.9785 l 2.2711,-10.94596 q -1.5265,0 -2.9785,0.78185 -1.452,0.74463 -2.7551,2.04772 -1.2658,1.30309 -2.3455,2.97849 -1.0797,1.6754 -1.8616,3.53696 -0.7819,1.82433 -1.2286,3.68589 -0.4096,1.86156 -0.4096,3.49973 z"
           style="font-style:normal;font-variant:normal;font-weight:normal;font-stretch:normal;font-family:Pacifico;-inkscape-font-specification:Pacifico;fill:#d70151;fill-opacity:1;stroke:none;stroke-width:2.5;stroke-miterlimit:4;stroke-dasharray:none;stroke-opacity:1"
           id="path4291"
           inkscape:connector-curvature="0" />
        <path
           d="m -1357.1396,751.06634 q 0,-2.45726 0.2978,-5.65914 0.2979,-3.23911 0.7447,-6.55269 0.4467,-3.35081 1.0052,-6.44099 0.5585,-3.09019 1.0797,-5.28683 0.4095,-1.71264 1.5637,-2.8668 1.1914,-1.15417 3.2019,-1.15417 2.0105,0 2.7923,1.22863 0.7819,1.22863 0.7819,3.27634 0,0.55847 -0.1117,1.52648 -0.1117,0.93078 -0.2979,2.08495 -0.1489,1.11693 -0.335,2.34556 -0.1862,1.1914 -0.3724,2.23387 -0.1489,1.00525 -0.2606,1.7871 -0.1117,0.74462 -0.1117,1.00524 l 0.7447,0 q 0.2233,-0.40954 0.7074,-1.30309 0.484,-0.93078 1.1169,-2.12218 0.6329,-1.1914 1.3403,-2.49449 0.7446,-1.34032 1.3776,-2.53172 0.6329,-1.22863 1.1541,-2.15941 0.5213,-0.93078 0.7819,-1.37755 1.1914,-2.01048 2.7179,-2.75511 1.5264,-0.74462 3.388,-0.74462 1.8616,0 2.9413,1.56371 1.1169,1.56371 1.1169,4.31882 0,0.40954 -0.1862,1.37755 -0.1489,0.96801 -0.4095,2.30833 -0.2606,1.34033 -0.5957,2.94127 -0.2978,1.60094 -0.5585,3.27634 -0.2606,1.6754 -0.4467,3.31358 -0.149,1.63817 -0.149,3.01572 0,2.30834 0.5585,3.79758 0.5957,1.48925 1.8243,1.48925 0.5585,0 1.2659,-0.33508 0.7446,-0.33508 1.5637,-0.85632 0.8563,-0.55846 1.7126,-1.26586 0.8936,-0.70739 1.7499,-1.45201 1.9733,-1.74987 4.1327,-3.94651 l 0.6329,8.33979 -1.8616,1.41478 q -1.5264,1.15417 -3.1274,2.30833 -1.5637,1.15417 -3.2763,2.08495 -1.7127,0.89355 -3.5742,1.48925 -1.8616,0.55847 -3.9093,0.55847 -2.0477,0 -3.4625,-2.94127 -1.3776,-2.97849 -1.3776,-8.67486 0,-2.23387 0.2979,-4.80283 0.2978,-2.60618 0.7446,-5.58467 l -0.5957,0 -9.7545,19.36021 q -0.7447,1.52648 -1.6755,2.08495 -0.9307,0.55847 -2.1594,0.55847 -1.5264,0 -2.4572,-0.63293 -0.9308,-0.67017 -1.452,-1.74987 -0.484,-1.11694 -0.6702,-2.49449 -0.1489,-1.41478 -0.1489,-2.90403 z"
           style="font-style:normal;font-variant:normal;font-weight:normal;font-stretch:normal;font-family:Pacifico;-inkscape-font-specification:Pacifico;fill:#d70151;fill-opacity:1;stroke:none;stroke-width:2.5;stroke-miterlimit:4;stroke-dasharray:none;stroke-opacity:1"
           id="path4293"
           inkscape:connector-curvature="0" />
        <path
           d="m -1283.6452,749.72602 q -0.8564,1.19139 -2.3084,2.79233 -1.4148,1.60095 -3.2018,3.05296 -1.7871,1.45202 -3.8349,2.45726 -2.0477,1.00524 -4.0954,1.00524 -2.4572,0 -4.0954,-1.56371 -1.6382,-1.60094 -2.8296,-4.61666 -0.8935,1.04247 -2.1966,2.12217 -1.3031,1.07971 -2.8668,1.97326 -1.5265,0.85631 -3.2019,1.41478 -1.6754,0.55847 -3.3508,0.55847 -1.7871,0 -3.4998,-0.70739 -1.6754,-0.74463 -2.9784,-2.08495 -1.3031,-1.37755 -2.085,-3.31358 -0.7818,-1.97325 -0.7818,-4.43051 0,-2.79234 0.7818,-5.7336 0.7819,-2.94126 2.1594,-5.7336 1.3776,-2.82957 3.2391,-5.32406 1.8988,-2.49449 4.1327,-4.35605 2.2339,-1.86156 4.6911,-2.94126 2.4945,-1.11694 5.0635,-1.11694 0.8563,0 1.3403,0.33508 0.484,0.33508 0.7818,0.78186 0.3351,0.40954 0.633,0.81908 0.2978,0.40955 0.7446,0.5957 0.4468,0.18616 0.8935,0.26062 0.484,0.0372 0.9681,0.0372 0.4095,0 0.819,0 0.4468,-0.0372 0.8564,-0.0372 0.5584,0 1.0424,0.11169 0.484,0.1117 0.8563,0.48401 0.3724,0.37231 0.5585,1.04247 0.2234,0.67016 0.2234,1.82433 0,1.7871 -0.3723,3.98374 -0.3723,2.15941 -0.8191,4.46774 -0.4468,2.2711 -0.8191,4.57944 -0.3723,2.2711 -0.3723,4.31881 0,1.74987 0.2979,2.75511 0.335,0.96801 1.3775,0.96801 0.7819,0 1.6382,-0.37231 0.8563,-0.40954 1.7126,-1.04247 0.8936,-0.63293 1.7499,-1.41479 0.8935,-0.81909 1.6754,-1.6754 1.8243,-2.01049 3.6859,-4.54221 l 1.7871,8.26533 z m -31.7955,-2.94127 q 0,0.93078 0.1117,1.82433 0.149,0.85632 0.484,1.56371 0.3351,0.67016 0.8936,1.11694 0.5584,0.40954 1.4148,0.40954 1.3775,0 2.4945,-1.1914 1.1169,-1.1914 1.936,-2.8668 0.8191,-1.6754 1.3031,-3.4625 0.5212,-1.7871 0.6701,-2.9785 l 2.2711,-10.94596 q -1.5264,0 -2.9785,0.78185 -1.452,0.74463 -2.7551,2.04772 -1.2658,1.30309 -2.3455,2.97849 -1.0797,1.6754 -1.8616,3.53696 -0.7818,1.82433 -1.2286,3.68589 -0.4096,1.86156 -0.4096,3.49973 z"
           style="font-style:normal;font-variant:normal;font-weight:normal;font-stretch:normal;font-family:Pacifico;-inkscape-font-specification:Pacifico;fill:#d70151;fill-opacity:1;stroke:none;stroke-width:2.5;stroke-miterlimit:4;stroke-dasharray:none;stroke-opacity:1"
           id="path4295"
           inkscape:connector-curvature="0" />
        <path
           d="m -1271.6568,730.70088 q -2.4573,1.1914 -4.3933,3.16465 -1.8988,1.93602 -3.2019,4.20713 -1.2658,2.2711 -1.936,4.57943 -0.6701,2.30833 -0.6701,4.16989 0,0.74463 0.1489,1.48925 0.1861,0.74462 0.6329,1.34032 0.4468,0.5957 1.2659,0.96801 0.8191,0.37232 2.1222,0.37232 0.6701,0 1.303,-0.33508 0.6702,-0.33509 1.2659,-0.85632 0.5957,-0.55847 1.1169,-1.22863 0.5585,-0.70739 1.0053,-1.45202 1.0425,-1.71263 1.8988,-3.87204 -0.1117,-0.52124 -0.1862,-1.63817 -0.074,-1.15417 -0.1117,-2.53172 -0.037,-1.41479 -0.074,-2.90404 -0.037,-1.48924 -0.074,-2.71787 0,-1.22863 -0.037,-2.01049 -0.037,-0.78185 -0.074,-0.74462 z m 25.6151,20.84946 q -2.6435,2.04772 -5.2124,3.64866 -1.0797,0.67016 -2.2711,1.34032 -1.1914,0.63293 -2.3456,1.15417 -1.1541,0.484 -2.2711,0.81909 -1.0797,0.29785 -2.0105,0.29785 -0.5212,0 -1.5637,-0.22339 -1.0052,-0.22339 -2.2338,-0.89355 -1.1914,-0.70739 -2.4201,-2.01048 -1.1914,-1.3031 -2.0849,-3.4625 -1.3776,1.34032 -2.9413,2.56895 -1.5265,1.1914 -3.2019,2.08494 -1.6381,0.89355 -3.3508,1.45202 -1.6754,0.52124 -3.388,0.52124 -2.42,0 -4.2071,-1.04248 -1.7499,-1.04247 -2.9413,-2.7551 -1.1542,-1.74987 -1.7499,-3.94651 -0.5584,-2.19664 -0.5584,-4.5422 0,-2.3828 0.5957,-4.80283 0.6329,-2.45726 1.7871,-4.72836 1.1914,-2.30833 2.8668,-4.31882 1.6754,-2.04771 3.7976,-3.61142 2.1221,-1.60094 4.6166,-2.64341 2.4945,-1.04248 5.3241,-1.3031 0.1117,-4.76559 0.8563,-9.41949 0.7446,-4.65389 1.9733,-8.86102 1.2286,-4.20712 2.8668,-7.78131 1.6754,-3.5742 3.6486,-6.18038 1.9733,-2.60618 4.2071,-4.0582 2.2339,-1.48925 4.6167,-1.48925 1.7499,0 2.9785,0.93078 1.2286,0.89355 1.9732,2.42003 0.7819,1.48925 1.117,3.49973 0.3351,1.97325 0.3351,4.09543 0,1.30309 -0.1117,2.68065 -0.484,5.24959 -1.7871,9.94072 -1.3031,4.6539 -3.053,9.08441 -1.7499,4.43051 -3.7976,8.78656 -2.0477,4.35605 -3.9837,9.04718 -0.1862,0.52123 -0.3723,1.26586 -0.1862,0.74462 -0.3723,1.63817 -0.149,0.85632 -0.2606,1.7871 -0.1117,0.89355 -0.1117,1.74986 0,1.07971 0.1117,2.04772 0.1489,0.96801 0.4467,1.74986 0.2979,0.74463 0.7819,1.1914 0.5212,0.44678 1.2658,0.44678 0.7074,0 1.5265,-0.26062 0.8563,-0.29785 1.7871,-0.78186 0.9308,-0.484 1.8616,-1.0797 0.968,-0.63293 1.8615,-1.26586 2.0478,-1.48925 4.2816,-3.38804 l 1.117,8.6004 z m -8.1164,-47.84207 q 0.2233,-2.60618 0.2233,-4.13266 0,-2.01048 -0.3723,-2.79234 -0.335,-0.78185 -1.0052,-0.78185 -1.1914,0 -2.1594,1.52648 -0.968,1.48924 -1.7126,3.83481 -0.7447,2.34556 -1.3031,5.17513 -0.5585,2.82957 -0.9308,5.47299 -0.3723,2.64341 -0.5957,4.76559 -0.2234,2.12218 -0.2979,3.01572 -0.1489,1.82433 -0.2606,3.53697 -0.074,1.6754 -0.1117,3.09018 -0.037,1.37756 -0.037,2.42003 0,1.04247 0,1.60094 l 0,0.37231 q 2.1222,-4.84005 3.9093,-9.64287 0.7446,-2.04772 1.4892,-4.28159 0.7819,-2.2711 1.4148,-4.5422 0.6329,-2.27111 1.0797,-4.46775 0.484,-2.19664 0.6702,-4.16989 z"
           style="font-style:normal;font-variant:normal;font-weight:normal;font-stretch:normal;font-family:Pacifico;-inkscape-font-specification:Pacifico;fill:#d70151;fill-opacity:1;stroke:none;stroke-width:2.5;stroke-miterlimit:4;stroke-dasharray:none;stroke-opacity:1"
           id="path4297"
           inkscape:connector-curvature="0" />
        <path
           d="m -1209.1829,749.72602 q -0.8563,1.19139 -2.3083,2.79233 -1.4148,1.60095 -3.2019,3.05296 -1.7871,1.45202 -3.8348,2.45726 -2.0477,1.00524 -4.0954,1.00524 -2.4573,0 -4.0955,-1.56371 -1.6381,-1.60094 -2.8295,-4.61666 -0.8936,1.04247 -2.1967,2.12217 -1.3031,1.07971 -2.8668,1.97326 -1.5264,0.85631 -3.2018,1.41478 -1.6754,0.55847 -3.3508,0.55847 -1.7871,0 -3.4998,-0.70739 -1.6754,-0.74463 -2.9785,-2.08495 -1.3031,-1.37755 -2.0849,-3.31358 -0.7819,-1.97325 -0.7819,-4.43051 0,-2.79234 0.7819,-5.7336 0.7818,-2.94126 2.1594,-5.7336 1.3775,-2.82957 3.2391,-5.32406 1.8988,-2.49449 4.1327,-4.35605 2.2338,-1.86156 4.6911,-2.94126 2.4945,-1.11694 5.0634,-1.11694 0.8563,0 1.3404,0.33508 0.484,0.33508 0.7818,0.78186 0.3351,0.40954 0.6329,0.81908 0.2979,0.40955 0.7447,0.5957 0.4467,0.18616 0.8935,0.26062 0.484,0.0372 0.968,0.0372 0.4096,0 0.8191,0 0.4468,-0.0372 0.8563,-0.0372 0.5585,0 1.0425,0.11169 0.484,0.1117 0.8563,0.48401 0.3723,0.37231 0.5585,1.04247 0.2234,0.67016 0.2234,1.82433 0,1.7871 -0.3723,3.98374 -0.3724,2.15941 -0.8191,4.46774 -0.4468,2.2711 -0.8191,4.57944 -0.3723,2.2711 -0.3723,4.31881 0,1.74987 0.2978,2.75511 0.3351,0.96801 1.3776,0.96801 0.7818,0 1.6382,-0.37231 0.8563,-0.40954 1.7126,-1.04247 0.8935,-0.63293 1.7499,-1.41479 0.8935,-0.81909 1.6754,-1.6754 1.8243,-2.01049 3.6858,-4.54221 l 1.7871,8.26533 z m -31.7954,-2.94127 q 0,0.93078 0.1117,1.82433 0.1489,0.85632 0.484,1.56371 0.3351,0.67016 0.8936,1.11694 0.5584,0.40954 1.4147,0.40954 1.3776,0 2.4945,-1.1914 1.117,-1.1914 1.936,-2.8668 0.8191,-1.6754 1.3031,-3.4625 0.5213,-1.7871 0.6702,-2.9785 l 2.2711,-10.94596 q -1.5265,0 -2.9785,0.78185 -1.452,0.74463 -2.7551,2.04772 -1.2659,1.30309 -2.3456,2.97849 -1.0797,1.6754 -1.8615,3.53696 -0.7819,1.82433 -1.2287,3.68589 -0.4095,1.86156 -0.4095,3.49973 z"
           style="font-style:normal;font-variant:normal;font-weight:normal;font-stretch:normal;font-family:Pacifico;-inkscape-font-specification:Pacifico;fill:#d70151;fill-opacity:1;stroke:none;stroke-width:2.5;stroke-miterlimit:4;stroke-dasharray:none;stroke-opacity:1"
           id="path4299"
           inkscape:connector-curvature="0" />
      </g>
    </g>
  </g>
</svg>
