<?xml version="1.0" encoding="UTF-8" standalone="no"?>
<!-- Created with Inkscape (http://www.inkscape.org/) -->

<svg
   xmlns:dc="http://purl.org/dc/elements/1.1/"
   xmlns:cc="http://creativecommons.org/ns#"
   xmlns:rdf="http://www.w3.org/1999/02/22-rdf-syntax-ns#"
   xmlns:svg="http://www.w3.org/2000/svg"
   xmlns="http://www.w3.org/2000/svg"
   xmlns:sodipodi="http://sodipodi.sourceforge.net/DTD/sodipodi-0.dtd"
   xmlns:inkscape="http://www.inkscape.org/namespaces/inkscape"
   width="17in"
   height="11in"
   viewBox="0 0 431.801 279.4"
   version="1.1"
   id="svg8"
   inkscape:version="0.92.1 r15371"
   sodipodi:docname="room-woody.svg"
   inkscape:export-filename="/home/valessio/buzz.png"
   inkscape:export-xdpi="77.568352"
   inkscape:export-ydpi="77.568352">
  <defs
     id="defs2">
    <clipPath
       clipPathUnits="userSpaceOnUse"
       id="clipPath17949">
      <rect
         style="opacity:1;vector-effect:none;fill:#ffffff;fill-opacity:1;stroke:none;stroke-width:0.546695;stroke-linecap:square;stroke-linejoin:miter;stroke-miterlimit:10;stroke-dasharray:none;stroke-dashoffset:0;stroke-opacity:1;marker:none"
         id="rect17951"
         width="97.8198"
         height="68.4985"
         x="76.1331"
         y="156.557" />
    </clipPath>
    <clipPath
       clipPathUnits="userSpaceOnUse"
       id="clipPath17949-3">
      <rect
         style="opacity:1;vector-effect:none;fill:#ffffff;fill-opacity:1;stroke:none;stroke-width:0.546695;stroke-linecap:square;stroke-linejoin:miter;stroke-miterlimit:10;stroke-dasharray:none;stroke-dashoffset:0;stroke-opacity:1;marker:none"
         id="rect17951-6"
         width="97.8198"
         height="68.4985"
         x="76.1331"
         y="156.557" />
    </clipPath>
  </defs>
  <sodipodi:namedview
     id="base"
     pagecolor="#ffffff"
     bordercolor="#666666"
     borderopacity="1.0"
     inkscape:pageopacity="0.0"
     inkscape:pageshadow="2"
     inkscape:zoom="0.33589188"
     inkscape:cx="965.42983"
     inkscape:cy="473.35685"
     inkscape:document-units="mm"
     inkscape:current-layer="layer1"
     showgrid="false"
     inkscape:snap-global="false"
     inkscape:window-width="1280"
     inkscape:window-height="773"
     inkscape:window-x="0"
     inkscape:window-y="27"
     inkscape:window-maximized="1"
     units="in" />
  <metadata
     id="metadata5">
    <rdf:RDF>
      <cc:Work
         rdf:about="">
        <dc:format>image/svg+xml</dc:format>
        <dc:type
           rdf:resource="http://purl.org/dc/dcmitype/StillImage" />
        <dc:title></dc:title>
      </cc:Work>
    </rdf:RDF>
  </metadata>
  <g
     inkscape:label="Camada 1"
     inkscape:groupmode="layer"
     id="layer1"
     transform="translate(0,-17.5997)">
    <rect
       style="color:#000000;clip-rule:nonzero;display:inline;overflow:visible;visibility:visible;opacity:1;isolation:auto;mix-blend-mode:normal;color-interpolation:sRGB;color-interpolation-filters:linearRGB;solid-color:#000000;solid-opacity:1;fill:#bc312e;fill-opacity:1;fill-rule:nonzero;stroke:none;stroke-width:0.277924;stroke-linecap:butt;stroke-linejoin:miter;stroke-miterlimit:4;stroke-dasharray:none;stroke-dashoffset:0;stroke-opacity:1;marker:none;color-rendering:auto;image-rendering:auto;shape-rendering:auto;text-rendering:auto;enable-background:accumulate"
       id="rect4159"
       width="20.7795"
       height="20.7795"
       x="641.072"
       y="138.521"
       ry="2.82389" />
    <rect
       ry="2.82389"
       y="138.521"
       x="663.65"
       height="20.7795"
       width="20.7795"
       id="rect4166"
       style="color:#000000;clip-rule:nonzero;display:inline;overflow:visible;visibility:visible;opacity:1;isolation:auto;mix-blend-mode:normal;color-interpolation:sRGB;color-interpolation-filters:linearRGB;solid-color:#000000;solid-opacity:1;fill:#faa61a;fill-opacity:1;fill-rule:nonzero;stroke:none;stroke-width:0.530364;stroke-linecap:butt;stroke-linejoin:miter;stroke-miterlimit:4;stroke-dasharray:none;stroke-dashoffset:0;stroke-opacity:1;marker:none;color-rendering:auto;image-rendering:auto;shape-rendering:auto;text-rendering:auto;enable-background:accumulate" />
    <rect
       style="color:#000000;clip-rule:nonzero;display:inline;overflow:visible;visibility:visible;opacity:1;isolation:auto;mix-blend-mode:normal;color-interpolation:sRGB;color-interpolation-filters:linearRGB;solid-color:#000000;solid-opacity:1;fill:#1b75bc;fill-opacity:1;fill-rule:nonzero;stroke:none;stroke-width:0.282222;stroke-linecap:square;stroke-linejoin:miter;stroke-miterlimit:10;stroke-dasharray:none;stroke-dashoffset:0;stroke-opacity:1;marker:none;color-rendering:auto;image-rendering:auto;shape-rendering:auto;text-rendering:auto;enable-background:accumulate"
       id="rect4168"
       width="20.7795"
       height="20.7795"
       x="686.228"
       y="138.521"
       ry="2.82389" />
    <text
       xml:space="preserve"
       style="font-style:normal;font-variant:normal;font-weight:normal;font-stretch:normal;font-size:77.0198822px;line-height:1.25;font-family:Monoton;-inkscape-font-specification:'Monoton, Normal';font-variant-ligatures:normal;font-variant-caps:normal;font-variant-numeric:normal;font-feature-settings:normal;text-align:start;letter-spacing:0px;word-spacing:0px;writing-mode:lr-tb;text-anchor:start;opacity:1;vector-effect:none;fill:#faa61a;fill-opacity:1;stroke:none;stroke-width:0.43291578;stroke-linecap:butt;stroke-linejoin:miter;stroke-miterlimit:4;stroke-dasharray:none;stroke-dashoffset:0;stroke-opacity:1;marker:none"
       x="45.445126"
       y="267.7659"
       id="text1418"><tspan
         sodipodi:role="line"
         id="tspan1416"
         x="45.445126"
         y="267.7659"
         style="font-style:normal;font-variant:normal;font-weight:normal;font-stretch:normal;font-size:77.0198822px;font-family:Monoton;-inkscape-font-specification:'Monoton, Normal';font-variant-ligatures:normal;font-variant-caps:normal;font-variant-numeric:normal;font-feature-settings:normal;text-align:start;writing-mode:lr-tb;text-anchor:start;vector-effect:none;fill:#faa61a;fill-opacity:1;stroke:none;stroke-width:0.43291578;stroke-linecap:butt;stroke-linejoin:miter;stroke-miterlimit:4;stroke-dasharray:none;stroke-dashoffset:0;stroke-opacity:1;marker:none">Woody</tspan></text>
    <text
       xml:space="preserve"
       style="font-style:normal;font-variant:normal;font-weight:300;font-stretch:normal;font-size:41.81166458px;line-height:1.25;font-family:'Alegreya Sans';-inkscape-font-specification:'Alegreya Sans, Light';font-variant-ligatures:normal;font-variant-caps:normal;font-variant-numeric:normal;font-feature-settings:normal;text-align:start;letter-spacing:0px;word-spacing:0px;writing-mode:lr-tb;text-anchor:start;opacity:1;vector-effect:none;fill:#bc312e;fill-opacity:1;stroke:none;stroke-width:0.2856735;stroke-linecap:butt;stroke-linejoin:miter;stroke-miterlimit:4;stroke-dasharray:none;stroke-dashoffset:0;stroke-opacity:1;marker:none"
       x="119.45262"
       y="191.76404"
       id="text1626"><tspan
         sodipodi:role="line"
         id="tspan1624"
         x="119.45262"
         y="191.76404"
         style="font-style:normal;font-variant:normal;font-weight:300;font-stretch:normal;font-size:41.81166458px;font-family:'Alegreya Sans';-inkscape-font-specification:'Alegreya Sans, Light';font-variant-ligatures:normal;font-variant-caps:normal;font-variant-numeric:normal;font-feature-settings:normal;text-align:start;writing-mode:lr-tb;text-anchor:start;vector-effect:none;fill:#bc312e;fill-opacity:1;stroke:none;stroke-width:0.2856735;stroke-linecap:butt;stroke-linejoin:miter;stroke-miterlimit:4;stroke-dasharray:none;stroke-dashoffset:0;stroke-opacity:1;marker:none">ROOM</tspan></text>
    <g
       id="g1662"
       transform="matrix(0.633517,0,0,0.633517,-24.067791,-1.8756307)">
      <g
         style="color:#000000;clip-rule:nonzero;display:inline;overflow:visible;visibility:visible;opacity:1;isolation:auto;mix-blend-mode:normal;color-interpolation:sRGB;color-interpolation-filters:linearRGB;solid-color:#000000;solid-opacity:1;fill:#bc312e;fill-opacity:1;fill-rule:nonzero;stroke:none;stroke-width:0.52402502;stroke-linecap:butt;stroke-linejoin:miter;stroke-miterlimit:4;stroke-dasharray:none;stroke-dashoffset:0;stroke-opacity:1;marker:none;color-rendering:auto;image-rendering:auto;shape-rendering:auto;text-rendering:auto;enable-background:accumulate"
         transform="matrix(0.522288,0,0,0.538566,367.758,-85.0401)"
         id="g3454">
        <path
           inkscape:connector-curvature="0"
           id="path3365"
           style="color:#000000;font-style:normal;font-variant:normal;font-weight:normal;font-stretch:normal;font-size:medium;line-height:120.00000477%;font-family:Monoton;-inkscape-font-specification:'Monoton, Normal';text-indent:0;text-align:center;text-decoration:none;text-decoration-line:none;text-decoration-style:solid;text-decoration-color:#000000;letter-spacing:0px;word-spacing:0px;text-transform:none;writing-mode:lr-tb;direction:ltr;baseline-shift:baseline;text-anchor:middle;white-space:normal;clip-rule:nonzero;display:inline;overflow:visible;visibility:visible;isolation:auto;mix-blend-mode:normal;color-interpolation:sRGB;color-interpolation-filters:linearRGB;solid-color:#000000;solid-opacity:1;fill:#bc312e;fill-opacity:1;fill-rule:nonzero;stroke:none;stroke-width:0.52402502;stroke-linecap:butt;stroke-linejoin:miter;stroke-miterlimit:4;stroke-dasharray:none;stroke-dashoffset:0;stroke-opacity:1;marker:none;color-rendering:auto;image-rendering:auto;shape-rendering:auto;text-rendering:auto;enable-background:accumulate"
           d="m 140.493,309.195 v -29.857 q 0,0 18.51,0 4.486,0 7.691,4.411 3.242,4.373 3.242,10.518 0,6.182 -3.242,10.555 -3.205,4.373 -7.691,4.373 z m 2.714,-2.714 h 15.796 q 3.355,0 5.73,-3.582 2.413,-3.581 2.413,-8.632 0,-5.09 -2.413,-8.633 -2.375,-3.582 -5.73,-3.582 h -15.796 z m -5.428,5.428 h 21.224 q 5.617,0 9.651,-5.164 4.071,-5.203 4.071,-12.478 0,-4.788 -1.885,-8.86 -1.847,-4.071 -5.013,-6.408 -3.129,-2.375 -6.824,-2.375 h -21.224 z m -2.714,2.715 v -40.715 h 23.938 q 4.411,0 8.218,2.715 3.808,2.714 6.032,7.426 2.262,4.675 2.262,10.217 0,5.504 -2.262,10.216 -2.224,4.712 -6.032,7.426 -3.807,2.715 -8.218,2.715 z m -2.715,2.714 h 26.653 q 5.165,0 9.575,-3.091 4.449,-3.092 7.088,-8.407 2.639,-5.316 2.639,-11.573 0,-6.221 -2.639,-11.536 -2.639,-5.353 -7.088,-8.445 -4.448,-3.091 -9.575,-3.091 H 132.35 Z m -2.714,2.714 v -51.571 h 29.367 q 5.881,0 10.97,3.468 5.09,3.431 8.105,9.387 3.016,5.956 3.016,12.931 0,6.974 -3.016,12.93 -3.015,5.956 -8.105,9.425 -5.089,3.43 -10.97,3.43 z m -2.714,2.715 h 32.081 q 4.939,0 9.538,-2.262 4.599,-2.262 7.954,-6.07 3.355,-3.807 5.353,-9.085 2.036,-5.316 2.036,-11.083 0,-5.768 -2.036,-11.046 -1.998,-5.278 -5.353,-9.085 -3.355,-3.846 -7.954,-6.108 -4.599,-2.261 -9.538,-2.261 h -32.081 z m 32.081,2.714 h -34.796 v -62.429 h 34.796 q 7.351,0 13.722,4.185 6.371,4.184 10.141,11.385 3.808,7.2 3.808,15.645 0,6.333 -2.262,12.138 -2.224,5.768 -5.957,9.953 -3.732,4.184 -8.859,6.672 -5.089,2.451 -10.593,2.451 z" />
        <path
           inkscape:connector-curvature="0"
           id="path3367"
           style="color:#000000;font-style:normal;font-variant:normal;font-weight:normal;font-stretch:normal;font-size:medium;line-height:120.00000477%;font-family:Monoton;-inkscape-font-specification:'Monoton, Normal';text-indent:0;text-align:center;text-decoration:none;text-decoration-line:none;text-decoration-style:solid;text-decoration-color:#000000;letter-spacing:0px;word-spacing:0px;text-transform:none;writing-mode:lr-tb;direction:ltr;baseline-shift:baseline;text-anchor:middle;white-space:normal;clip-rule:nonzero;display:inline;overflow:visible;visibility:visible;isolation:auto;mix-blend-mode:normal;color-interpolation:sRGB;color-interpolation-filters:linearRGB;solid-color:#000000;solid-opacity:1;fill:#bc312e;fill-opacity:1;fill-rule:nonzero;stroke:none;stroke-width:0.52402502;stroke-linecap:butt;stroke-linejoin:miter;stroke-miterlimit:4;stroke-dasharray:none;stroke-dashoffset:0;stroke-opacity:1;marker:none;color-rendering:auto;image-rendering:auto;shape-rendering:auto;text-rendering:auto;enable-background:accumulate"
           d="m 206.239,325.481 h -2.714 v -54.286 h 2.714 z m -5.428,0 h -2.715 v -54.286 h 2.715 z m -5.429,0 h -2.714 v -54.286 h 2.714 z m 16.286,-13.572 h 25.974 v 2.715 h -25.974 v 2.714 h 25.974 v 2.714 h -25.974 v 2.715 h 25.974 v 2.714 h -28.689 v -54.286 h 28.689 v 2.714 h -25.974 v 2.715 h 25.974 v 2.714 h -25.974 v 2.714 h 25.974 v 2.715 h -25.974 v 6.748 h 24.466 v 2.714 h -24.466 v 2.714 h 24.466 v 2.714 h -24.466 v 2.715 h 24.466 v 2.714 h -24.466 z" />
        <path
           inkscape:connector-curvature="0"
           id="path3369"
           style="color:#000000;font-style:normal;font-variant:normal;font-weight:normal;font-stretch:normal;font-size:medium;line-height:120.00000477%;font-family:Monoton;-inkscape-font-specification:'Monoton, Normal';text-indent:0;text-align:center;text-decoration:none;text-decoration-line:none;text-decoration-style:solid;text-decoration-color:#000000;letter-spacing:0px;word-spacing:0px;text-transform:none;writing-mode:lr-tb;direction:ltr;baseline-shift:baseline;text-anchor:middle;white-space:normal;clip-rule:nonzero;display:inline;overflow:visible;visibility:visible;isolation:auto;mix-blend-mode:normal;color-interpolation:sRGB;color-interpolation-filters:linearRGB;solid-color:#000000;solid-opacity:1;fill:#bc312e;fill-opacity:1;fill-rule:nonzero;stroke:none;stroke-width:0.52402502;stroke-linecap:butt;stroke-linejoin:miter;stroke-miterlimit:4;stroke-dasharray:none;stroke-dashoffset:0;stroke-opacity:1;marker:none;color-rendering:auto;image-rendering:auto;shape-rendering:auto;text-rendering:auto;enable-background:accumulate"
           d="m 286.763,298.036 -0.07,-0.04 q 4.259,-4.147 4.259,-10.103 0,-5.655 -4.222,-9.802 -4.184,-4.185 -9.914,-4.185 h -29.858 v 51.572 h -2.714 v -54.286 h 32.572 q 4.448,0 8.331,2.3 3.921,2.262 6.22,6.145 2.3,3.845 2.3,8.256 0,6.031 -3.242,10.367 3.242,4.486 3.242,9.877 0,5.164 -2.338,9.123 -2.337,3.92 -6.144,5.918 -3.77,1.998 -8.369,1.998 h -17.153 v -2.714 h 17.153 q 5.805,0 9.952,-4.109 4.184,-4.147 4.184,-10.216 0,-2.79 -1.206,-5.504 -1.206,-2.715 -3.016,-4.562 0,-0.04 0.04,-0.04 z m -9.952,13.572 h -17.153 v 2.714 h 17.153 q 2.488,0 4.222,-1.659 1.772,-1.696 1.772,-4.523 0,-2.451 -1.81,-4.298 -1.809,-1.885 -4.184,-1.885 H 259.62 v 2.714 h 17.191 q 1.281,0 2.261,1.056 1.018,1.055 1.018,2.413 0,1.658 -0.942,2.563 -0.943,0.905 -2.337,0.905 z m 0,5.428 h -17.153 v 2.715 h 17.153 q 4.674,0 8.029,-3.318 3.393,-3.355 3.393,-8.293 0,-3.129 -1.696,-5.881 -1.659,-2.79 -4.411,-4.298 2.752,-1.433 4.411,-4.071 1.696,-2.677 1.696,-5.994 0,-4.524 -3.43,-7.879 -3.393,-3.393 -7.992,-3.393 h -27.143 v 48.857 h 2.714 v -46.143 h 24.429 q 3.468,0 6.069,2.601 2.639,2.564 2.639,5.957 0,3.769 -2.564,6.22 -2.563,2.412 -6.144,2.412 h -8.294 -8.859 v 2.715 h 8.859 8.294 q 3.468,0 6.069,2.676 2.639,2.677 2.639,6.221 0,3.92 -2.564,6.408 -2.563,2.488 -6.144,2.488 z m 0,-25.936 h -17.153 v 2.714 h 17.153 q 2.525,0 4.26,-1.583 1.734,-1.621 1.734,-4.335 0,-2.3 -1.81,-4.072 -1.809,-1.772 -4.184,-1.772 h -21.715 v 43.429 h 2.715 v -40.714 h 19 q 1.281,0 2.261,0.98 1.018,0.942 1.018,2.149 0,1.545 -0.942,2.375 -0.943,0.829 -2.337,0.829 z" />
      </g>
      <g
         transform="matrix(0.705269,0,0,0.72725,297.257,-115.089)"
         style="color:#000000;clip-rule:nonzero;display:inline;overflow:visible;visibility:visible;opacity:1;isolation:auto;mix-blend-mode:normal;color-interpolation:sRGB;color-interpolation-filters:linearRGB;solid-color:#000000;solid-opacity:1;fill:#1b75bc;fill-opacity:1;fill-rule:nonzero;stroke:none;stroke-width:0.75200301;stroke-linecap:square;stroke-linejoin:miter;stroke-miterlimit:10;stroke-dasharray:none;stroke-dashoffset:0;stroke-opacity:1;marker:none;color-rendering:auto;image-rendering:auto;shape-rendering:auto;text-rendering:auto;enable-background:accumulate"
         id="g3424">
        <path
           inkscape:connector-curvature="0"
           id="path3371"
           style="color:#000000;font-style:normal;font-variant:normal;font-weight:normal;font-stretch:normal;font-size:medium;line-height:120.00000477%;font-family:Monoton;-inkscape-font-specification:'Monoton, Normal';text-indent:0;text-align:center;text-decoration:none;text-decoration-line:none;text-decoration-style:solid;text-decoration-color:#000000;letter-spacing:0px;word-spacing:0px;text-transform:none;writing-mode:lr-tb;direction:ltr;baseline-shift:baseline;text-anchor:middle;white-space:normal;clip-rule:nonzero;display:inline;overflow:visible;visibility:visible;isolation:auto;mix-blend-mode:normal;color-interpolation:sRGB;color-interpolation-filters:linearRGB;solid-color:#000000;solid-opacity:1;fill:#1b75bc;fill-opacity:1;fill-rule:nonzero;stroke:none;stroke-width:0.75200301;stroke-linecap:square;stroke-linejoin:miter;stroke-miterlimit:10;stroke-dasharray:none;stroke-dashoffset:0;stroke-opacity:1;marker:none;color-rendering:auto;image-rendering:auto;shape-rendering:auto;text-rendering:auto;enable-background:accumulate"
           d="m 356.939,251.923 -1.648,1.089 q -1.507,-2.233 -3.936,-3.518 -2.401,-1.312 -5.22,-1.312 -4.579,0 -7.817,3.239 -3.239,3.238 -3.239,7.817 0,4.578 3.239,7.817 3.238,3.238 7.817,3.238 2.819,0 5.22,-1.312 2.429,-1.312 3.936,-3.546 l 1.62,1.173 q -1.787,2.624 -4.635,4.16 -2.847,1.535 -6.141,1.535 -2.653,0 -5.081,-1.033 -2.401,-1.033 -4.16,-2.792 -1.759,-1.758 -2.792,-4.159 -1.033,-2.429 -1.033,-5.081 0,-2.652 1.033,-5.053 1.033,-2.429 2.792,-4.188 1.759,-1.759 4.16,-2.792 2.428,-1.033 5.081,-1.033 3.322,0 6.169,1.564 2.848,1.535 4.635,4.187 z m 3.322,-2.289 -1.675,1.089 q -2.066,-3.015 -5.36,-4.774 -3.267,-1.787 -7.091,-1.787 -4.104,0 -7.566,2.038 -3.462,2.01 -5.5,5.472 -2.01,3.462 -2.01,7.566 0,4.104 2.01,7.565 2.038,3.462 5.5,5.5 3.462,2.01 7.566,2.01 3.824,0 7.119,-1.786 3.294,-1.787 5.36,-4.83 l 1.647,1.144 q -2.345,3.462 -6.086,5.472 -3.713,2.01 -8.04,2.01 -4.635,0 -8.571,-2.289 -3.937,-2.289 -6.226,-6.226 -2.289,-3.936 -2.289,-8.57 0,-4.635 2.289,-8.571 2.289,-3.936 6.226,-6.226 3.936,-2.289 8.571,-2.289 4.327,0 8.04,2.01 3.741,2.01 6.086,5.472 z m 3.35,-2.233 -1.675,1.088 q -2.624,-3.852 -6.812,-6.086 -4.16,-2.261 -8.989,-2.261 -3.881,0 -7.427,1.508 -3.545,1.507 -6.114,4.076 -2.54,2.54 -4.048,6.086 -1.507,3.545 -1.507,7.426 0,3.88 1.507,7.426 1.508,3.545 4.048,6.114 2.569,2.54 6.114,4.048 3.546,1.507 7.427,1.507 4.857,0 9.017,-2.261 4.16,-2.261 6.784,-6.114 l 1.619,1.201 q -2.903,4.243 -7.51,6.728 -4.578,2.456 -9.91,2.456 -5.724,0 -10.581,-2.819 -4.858,-2.848 -7.706,-7.705 -2.819,-4.858 -2.819,-10.581 0,-5.723 2.819,-10.581 2.848,-4.858 7.706,-7.677 4.857,-2.848 10.581,-2.848 5.36,0 9.966,2.513 4.607,2.484 7.51,6.756 z m 3.294,-2.29 -1.675,1.089 q -3.182,-4.662 -8.236,-7.37 -5.025,-2.708 -10.859,-2.708 -4.691,0 -8.99,1.843 -4.271,1.814 -7.37,4.913 -3.099,3.099 -4.942,7.398 -1.814,4.272 -1.814,8.962 0,4.69 1.814,8.989 1.843,4.272 4.942,7.37 3.099,3.099 7.37,4.942 4.299,1.815 8.99,1.815 5.834,0 10.887,-2.736 5.053,-2.736 8.236,-7.399 l 1.619,1.229 q -3.461,5.025 -8.933,7.984 -5.472,2.932 -11.809,2.932 -5.109,0 -9.772,-2.01 -4.634,-1.983 -8.012,-5.333 -3.35,-3.378 -5.36,-8.012 -1.982,-4.662 -1.982,-9.771 0,-5.109 1.982,-9.744 2.01,-4.662 5.36,-8.012 3.378,-3.378 8.012,-5.36 4.663,-2.01 9.772,-2.01 6.365,0 11.837,2.959 5.471,2.959 8.933,8.04 z" />
        <path
           inkscape:connector-curvature="0"
           id="path3373"
           style="color:#000000;font-style:normal;font-variant:normal;font-weight:normal;font-stretch:normal;font-size:medium;line-height:120.00000477%;font-family:Monoton;-inkscape-font-specification:'Monoton, Normal';text-indent:0;text-align:center;text-decoration:none;text-decoration-line:none;text-decoration-style:solid;text-decoration-color:#000000;letter-spacing:0px;word-spacing:0px;text-transform:none;writing-mode:lr-tb;direction:ltr;baseline-shift:baseline;text-anchor:middle;white-space:normal;clip-rule:nonzero;display:inline;overflow:visible;visibility:visible;isolation:auto;mix-blend-mode:normal;color-interpolation:sRGB;color-interpolation-filters:linearRGB;solid-color:#000000;solid-opacity:1;fill:#1b75bc;fill-opacity:1;fill-rule:nonzero;stroke:none;stroke-width:0.75200301;stroke-linecap:square;stroke-linejoin:miter;stroke-miterlimit:10;stroke-dasharray:none;stroke-dashoffset:0;stroke-opacity:1;marker:none;color-rendering:auto;image-rendering:auto;shape-rendering:auto;text-rendering:auto;enable-background:accumulate"
           d="m 386.085,256.586 q -2.345,2.345 -2.345,5.667 0,3.322 2.345,5.695 2.373,2.345 5.695,2.345 3.322,0 5.667,-2.345 2.373,-2.373 2.373,-5.695 0,-3.322 -2.373,-5.667 -2.345,-2.373 -5.667,-2.373 -3.322,0 -5.695,2.373 z m -1.424,12.786 q -2.932,-2.959 -2.932,-7.119 0,-4.16 2.932,-7.091 2.959,-2.96 7.119,-2.96 4.16,0 7.091,2.96 2.959,2.931 2.959,7.091 0,4.16 -2.959,7.119 -2.931,2.931 -7.091,2.931 -4.16,0 -7.119,-2.931 z m -1.424,-15.634 q -3.518,3.545 -3.518,8.515 0,4.969 3.518,8.515 3.546,3.545 8.543,3.545 4.997,0 8.515,-3.545 3.545,-3.546 3.545,-8.515 0,-4.97 -3.545,-8.515 -3.518,-3.546 -8.515,-3.546 -4.997,0 -8.543,3.546 z m -3.657,15.578 q -1.871,-3.238 -1.871,-7.063 0,-3.825 1.871,-7.063 1.898,-3.239 5.137,-5.109 3.238,-1.899 7.063,-1.899 3.825,0 7.063,1.899 3.238,1.87 5.109,5.109 1.898,3.238 1.898,7.063 0,3.825 -1.898,7.063 -1.871,3.238 -5.109,5.137 -3.238,1.87 -7.063,1.87 -3.825,0 -7.063,-1.87 -3.239,-1.899 -5.137,-5.137 z m -2.624,-13.289 q -1.257,2.959 -1.257,6.226 0,3.266 1.257,6.253 1.284,2.96 3.433,5.137 2.178,2.15 5.137,3.434 2.987,1.256 6.254,1.256 3.266,0 6.225,-1.256 2.988,-1.284 5.137,-3.434 2.178,-2.177 3.434,-5.137 1.284,-2.987 1.284,-6.253 0,-3.267 -1.284,-6.226 -1.256,-2.987 -3.434,-5.137 -2.149,-2.177 -5.137,-3.434 -2.959,-1.284 -6.225,-1.284 -3.267,0 -6.254,1.284 -2.959,1.257 -5.137,3.434 -2.149,2.15 -3.433,5.137 z m -1.843,13.261 q -1.424,-3.35 -1.424,-7.035 0,-3.685 1.424,-7.035 1.452,-3.351 3.853,-5.751 2.428,-2.429 5.779,-3.853 3.35,-1.452 7.035,-1.452 3.685,0 7.035,1.452 3.35,1.424 5.751,3.853 2.429,2.4 3.853,5.751 1.451,3.35 1.451,7.035 0,3.685 -1.451,7.035 -1.424,3.35 -3.853,5.779 -2.401,2.401 -5.751,3.853 -3.35,1.423 -7.035,1.423 -3.685,0 -7.035,-1.423 -3.351,-1.452 -5.779,-3.853 -2.401,-2.429 -3.853,-5.779 z m -1.843,-14.824 q -1.591,3.713 -1.591,7.789 0,4.076 1.591,7.817 1.592,3.713 4.272,6.421 2.708,2.68 6.421,4.271 3.741,1.592 7.817,1.592 4.076,0 7.789,-1.592 3.741,-1.591 6.421,-4.271 2.708,-2.708 4.299,-6.421 1.591,-3.741 1.591,-7.817 0,-4.076 -1.591,-7.789 -1.591,-3.741 -4.299,-6.421 -2.68,-2.708 -6.421,-4.3 -3.713,-1.591 -7.789,-1.591 -4.076,0 -7.817,1.591 -3.713,1.592 -6.421,4.3 -2.68,2.68 -4.272,6.421 z m -1.842,16.387 q -1.759,-4.103 -1.759,-8.598 0,-4.495 1.759,-8.571 1.759,-4.104 4.718,-7.063 2.959,-2.959 7.035,-4.718 4.104,-1.759 8.599,-1.759 4.495,0 8.571,1.759 4.103,1.759 7.063,4.718 2.959,2.959 4.718,7.063 1.759,4.076 1.759,8.571 0,4.495 -1.759,8.598 -1.759,4.076 -4.718,7.036 -2.96,2.959 -7.063,4.718 -4.076,1.759 -8.571,1.759 -4.495,0 -8.599,-1.759 -4.076,-1.759 -7.035,-4.718 -2.959,-2.96 -4.718,-7.036 z" />
        <path
           inkscape:connector-curvature="0"
           id="path3375"
           style="color:#000000;font-style:normal;font-variant:normal;font-weight:normal;font-stretch:normal;font-size:medium;line-height:120.00000477%;font-family:Monoton;-inkscape-font-specification:'Monoton, Normal';text-indent:0;text-align:center;text-decoration:none;text-decoration-line:none;text-decoration-style:solid;text-decoration-color:#000000;letter-spacing:0px;word-spacing:0px;text-transform:none;writing-mode:lr-tb;direction:ltr;baseline-shift:baseline;text-anchor:middle;white-space:normal;clip-rule:nonzero;display:inline;overflow:visible;visibility:visible;isolation:auto;mix-blend-mode:normal;color-interpolation:sRGB;color-interpolation-filters:linearRGB;solid-color:#000000;solid-opacity:1;fill:#1b75bc;fill-opacity:1;fill-rule:nonzero;stroke:none;stroke-width:0.75200301;stroke-linecap:square;stroke-linejoin:miter;stroke-miterlimit:10;stroke-dasharray:none;stroke-dashoffset:0;stroke-opacity:1;marker:none;color-rendering:auto;image-rendering:auto;shape-rendering:auto;text-rendering:auto;enable-background:accumulate"
           d="m 450.128,266.133 -2.01,-3.657 v -20.324 h 2.01 z m 4.02,6.952 -2.01,-3.406 v -27.527 h 2.01 z m -27.695,-14.713 2.011,3.658 v 20.324 h -2.011 z m -4.02,-7.23 2.01,3.685 v 27.527 h -2.01 z m 0.698,-8.99 h 2.345 l 23.284,40.202 h -2.345 z m 4.746,0 h 2.373 l 23.256,40.202 h -2.401 z m 4.718,0 h 2.345 l 21.218,36.712 v -36.712 h 2.01 v 40.202 h -2.373 z m -12.172,3.462 v 36.74 h -2.01 v -40.202 h 2.401 l 23.2,40.202 h -2.318 z" />
        <path
           inkscape:connector-curvature="0"
           id="path3377"
           style="color:#000000;font-style:normal;font-variant:normal;font-weight:normal;font-stretch:normal;font-size:medium;line-height:120.00000477%;font-family:Monoton;-inkscape-font-specification:'Monoton, Normal';text-indent:0;text-align:center;text-decoration:none;text-decoration-line:none;text-decoration-style:solid;text-decoration-color:#000000;letter-spacing:0px;word-spacing:0px;text-transform:none;writing-mode:lr-tb;direction:ltr;baseline-shift:baseline;text-anchor:middle;white-space:normal;clip-rule:nonzero;display:inline;overflow:visible;visibility:visible;isolation:auto;mix-blend-mode:normal;color-interpolation:sRGB;color-interpolation-filters:linearRGB;solid-color:#000000;solid-opacity:1;fill:#1b75bc;fill-opacity:1;fill-rule:nonzero;stroke:none;stroke-width:0.75200301;stroke-linecap:square;stroke-linejoin:miter;stroke-miterlimit:10;stroke-dasharray:none;stroke-dashoffset:0;stroke-opacity:1;marker:none;color-rendering:auto;image-rendering:auto;shape-rendering:auto;text-rendering:auto;enable-background:accumulate"
           d="m 477.487,282.354 h -2.01 v -40.202 h 19.179 v 2.01 h -17.169 v 2.01 h 17.169 v 2.01 h -17.169 v 2.01 h 17.169 v 2.011 h -17.169 v 6.141 h 15.829 v 2.01 h -15.829 v 2.011 h 15.829 v 2.01 h -15.829 v 2.01 h 15.829 v 2.01 h -15.829 z m -4.02,0 h -2.01 v -40.202 h 2.01 z m -4.02,0 h -2.01 v -40.202 h 2.01 z m -4.021,0 h -2.01 v -40.202 h 2.01 z" />
      </g>
      <g
         style="color:#000000;clip-rule:nonzero;display:inline;overflow:visible;visibility:visible;opacity:1;isolation:auto;mix-blend-mode:normal;color-interpolation:sRGB;color-interpolation-filters:linearRGB;solid-color:#000000;solid-opacity:1;fill:#bc312e;fill-opacity:1;fill-rule:nonzero;stroke:none;stroke-width:0.52402502;stroke-linecap:butt;stroke-linejoin:miter;stroke-miterlimit:4;stroke-dasharray:none;stroke-dashoffset:0;stroke-opacity:1;marker:none;color-rendering:auto;image-rendering:auto;shape-rendering:auto;text-rendering:auto;enable-background:accumulate"
         transform="matrix(0.522288,0,0,0.538566,367.758,-85.0401)"
         id="g3459">
        <path
           inkscape:connector-curvature="0"
           id="path3379"
           style="color:#000000;font-style:normal;font-variant:normal;font-weight:normal;font-stretch:normal;font-size:medium;line-height:120.00000477%;font-family:Monoton;-inkscape-font-specification:'Monoton, Normal';text-indent:0;text-align:center;text-decoration:none;text-decoration-line:none;text-decoration-style:solid;text-decoration-color:#000000;letter-spacing:0px;word-spacing:0px;text-transform:none;writing-mode:lr-tb;direction:ltr;baseline-shift:baseline;text-anchor:middle;white-space:normal;clip-rule:nonzero;display:inline;overflow:visible;visibility:visible;isolation:auto;mix-blend-mode:normal;color-interpolation:sRGB;color-interpolation-filters:linearRGB;solid-color:#000000;solid-opacity:1;fill:#bc312e;fill-opacity:1;fill-rule:nonzero;stroke:none;stroke-width:0.52402502;stroke-linecap:butt;stroke-linejoin:miter;stroke-miterlimit:4;stroke-dasharray:none;stroke-dashoffset:0;stroke-opacity:1;marker:none;color-rendering:auto;image-rendering:auto;shape-rendering:auto;text-rendering:auto;enable-background:accumulate"
           d="m 537.684,276.624 v -2.715 h 27.369 v 51.572 h -2.715 v -48.857 h -2.714 v 48.857 h -2.714 v -48.857 h -2.715 v 48.857 h -2.714 v -48.857 h -2.714 v 48.857 h -2.714 v -48.857 z m 0,-5.429 v -2.714 h 27.369 v 2.714 z m 0,-5.428 v -2.715 h 27.369 v 2.715 z" />
        <path
           inkscape:connector-curvature="0"
           id="path3381"
           style="color:#000000;font-style:normal;font-variant:normal;font-weight:normal;font-stretch:normal;font-size:medium;line-height:120.00000477%;font-family:Monoton;-inkscape-font-specification:'Monoton, Normal';text-indent:0;text-align:center;text-decoration:none;text-decoration-line:none;text-decoration-style:solid;text-decoration-color:#000000;letter-spacing:0px;word-spacing:0px;text-transform:none;writing-mode:lr-tb;direction:ltr;baseline-shift:baseline;text-anchor:middle;white-space:normal;clip-rule:nonzero;display:inline;overflow:visible;visibility:visible;isolation:auto;mix-blend-mode:normal;color-interpolation:sRGB;color-interpolation-filters:linearRGB;solid-color:#000000;solid-opacity:1;fill:#bc312e;fill-opacity:1;fill-rule:nonzero;stroke:none;stroke-width:0.52402502;stroke-linecap:butt;stroke-linejoin:miter;stroke-miterlimit:4;stroke-dasharray:none;stroke-dashoffset:0;stroke-opacity:1;marker:none;color-rendering:auto;image-rendering:auto;shape-rendering:auto;text-rendering:auto;enable-background:accumulate"
           d="m 612.666,263.052 h 2.827 l -15.381,62.429 h -2.827 z m -21.187,10.857 -0.641,2.715 h -20.281 v -2.715 z m 1.282,-5.428 -0.641,2.714 h -21.563 v -2.714 z m 1.206,-5.429 -0.528,2.715 h -22.882 v -2.715 z m 1.923,0 h 2.79 l -15.381,62.429 h -2.79 z m 5.579,0 h 2.828 l -15.381,62.429 h -2.828 z m 5.617,0 h 2.79 l -15.381,62.429 h -2.79 z" />
      </g>
      <g
         transform="matrix(0.538566,0,0,0.538566,365.736,-85.0401)"
         id="g4231">
        <path
           inkscape:connector-curvature="0"
           id="path4183"
           style="color:#000000;font-style:normal;font-variant:normal;font-weight:normal;font-stretch:normal;font-size:medium;line-height:120.00000477%;font-family:'PT Sans';-inkscape-font-specification:'PT Sans, Normal';text-indent:0;text-align:center;text-decoration:none;text-decoration-line:none;text-decoration-style:solid;text-decoration-color:#000000;letter-spacing:0px;word-spacing:0px;text-transform:none;writing-mode:lr-tb;direction:ltr;baseline-shift:baseline;text-anchor:middle;white-space:normal;clip-rule:nonzero;display:inline;overflow:visible;visibility:visible;opacity:1;isolation:auto;mix-blend-mode:normal;color-interpolation:sRGB;color-interpolation-filters:linearRGB;solid-color:#000000;solid-opacity:1;fill:#bc312e;fill-opacity:1;fill-rule:nonzero;stroke:none;stroke-width:0.51604497;stroke-linecap:butt;stroke-linejoin:miter;stroke-miterlimit:4;stroke-dasharray:none;stroke-dashoffset:0;stroke-opacity:1;marker:none;color-rendering:auto;image-rendering:auto;shape-rendering:auto;text-rendering:auto;enable-background:accumulate"
           d="m 519.649,344.779 q 0,-0.516 0.287,-0.804 0.307,-0.306 0.805,-0.306 0.517,0 0.823,0.306 0.306,0.288 0.306,0.804 0,0.498 -0.306,0.805 -0.306,0.306 -0.823,0.306 -0.498,0 -0.805,-0.306 -0.287,-0.307 -0.287,-0.805 z" />
        <path
           inkscape:connector-curvature="0"
           id="path4195"
           style="color:#000000;font-style:normal;font-variant:normal;font-weight:normal;font-stretch:normal;font-size:medium;line-height:120.00000477%;font-family:'PT Sans';-inkscape-font-specification:'PT Sans, Normal';text-indent:0;text-align:center;text-decoration:none;text-decoration-line:none;text-decoration-style:solid;text-decoration-color:#000000;letter-spacing:0px;word-spacing:0px;text-transform:none;writing-mode:lr-tb;direction:ltr;baseline-shift:baseline;text-anchor:middle;white-space:normal;clip-rule:nonzero;visibility:visible;isolation:auto;mix-blend-mode:normal;color-interpolation:sRGB;color-interpolation-filters:linearRGB;solid-color:#000000;solid-opacity:1;fill:#1b75bc;fill-opacity:1;fill-rule:nonzero;stroke:none;stroke-width:1;stroke-linecap:square;stroke-linejoin:miter;stroke-miterlimit:10;stroke-dasharray:none;stroke-dashoffset:0;stroke-opacity:1;marker:none;color-rendering:auto;image-rendering:auto;shape-rendering:auto;text-rendering:auto"
           d="m 594.22,346.732 h -4.94 l -1.34,3.715 h -1.57 l 5.073,-13.613 h 0.728 l 5.093,13.613 h -1.666 z m -4.423,-1.378 h 3.944 l -1.494,-4.078 -0.478,-2.03 h -0.02 l -0.479,2.068 -1.474,4.04 z m -13.995,-8.31 q 0.364,-0.06 0.805,-0.08 0.459,-0.04 0.938,-0.04 0.498,-0.02 0.957,-0.02 0.479,-0.02 0.881,-0.02 1.608,0 2.776,0.498 1.187,0.498 1.953,1.398 0.766,0.88 1.13,2.125 0.383,1.244 0.383,2.738 0,1.359 -0.364,2.623 -0.345,1.244 -1.111,2.221 -0.766,0.957 -1.991,1.551 -1.225,0.574 -2.968,0.574 -0.306,0 -0.804,-0.02 -0.478,0 -0.995,-0.04 -0.517,-0.02 -0.958,-0.04 -0.44,-0.02 -0.632,-0.06 V 337.03 Z m 3.619,1.264 q -0.249,0 -0.555,0 -0.287,0 -0.574,0.02 -0.288,0.02 -0.537,0.04 -0.229,0.02 -0.363,0.04 v 10.722 q 0.09,0.02 0.363,0.04 0.268,0 0.556,0.02 0.287,0 0.555,0.02 0.268,0 0.364,0 1.34,0 2.24,-0.459 0.919,-0.46 1.455,-1.226 0.555,-0.785 0.785,-1.78 0.23,-1.015 0.23,-2.087 0,-0.938 -0.211,-1.877 -0.21,-0.957 -0.727,-1.723 -0.517,-0.766 -1.398,-1.244 -0.862,-0.498 -2.183,-0.498 z m -8.461,8.424 h -4.94 l -1.34,3.715 h -1.57 l 5.073,-13.613 h 0.728 l 5.093,13.613 h -1.666 z m -4.423,-1.378 h 3.944 l -1.493,-4.078 -0.479,-2.03 h -0.02 l -0.479,2.068 -1.474,4.04 z m -12.442,-3.676 -1.034,-1.934 h -0.08 l 0.192,1.934 v 8.769 h -1.494 v -13.613 h 0.843 l 6.414,8.941 0.996,1.838 h 0.1 l -0.21,-1.838 v -8.731 h 1.493 v 13.613 h -0.842 l -6.376,-8.979 z m -7.255,5.054 h -4.94 l -1.34,3.715 h -1.57 l 5.073,-13.613 h 0.728 l 5.093,13.613 h -1.666 z m -4.423,-1.378 h 3.944 l -1.493,-4.078 -0.479,-2.03 h -0.02 l -0.479,2.068 -1.474,4.04 z m -3.771,4.538 q -0.575,0.44 -1.456,0.612 -0.88,0.173 -1.876,0.173 -1.206,0 -2.259,-0.403 -1.053,-0.421 -1.838,-1.263 -0.785,-0.843 -1.245,-2.145 -0.459,-1.321 -0.459,-3.12 0,-1.877 0.497,-3.179 0.517,-1.321 1.341,-2.144 0.842,-0.843 1.876,-1.226 1.034,-0.382 2.106,-0.382 1.149,0 1.877,0.134 0.727,0.114 1.244,0.325 l -0.383,1.398 q -0.919,-0.441 -2.623,-0.441 -0.785,0 -1.551,0.288 -0.766,0.287 -1.378,0.938 -0.594,0.651 -0.958,1.704 -0.363,1.053 -0.363,2.585 0,1.378 0.344,2.412 0.345,1.034 0.938,1.723 0.613,0.689 1.417,1.034 0.824,0.345 1.781,0.345 0.861,0 1.493,-0.173 0.651,-0.172 1.092,-0.44 z m -25.108,0.555 h -7.927 v -13.403 h 1.59 v 11.986 h 6.337 z m -12.769,-3.715 h -4.94 l -1.341,3.715 h -1.57 l 5.074,-13.613 h 0.728 l 5.093,13.613 h -1.666 z m -4.423,-1.378 h 3.944 l -1.494,-4.078 -0.478,-2.03 h -0.02 l -0.479,2.068 -1.474,4.04 z m -12.2,-8.31 h 7.295 v 1.417 h -5.705 v 4.385 h 5.227 v 1.417 h -5.227 v 4.767 h 5.801 v 1.417 h -7.391 z m 4.691,-3.255 h 2.183 v 0.402 l -3.121,1.858 h -1.321 z m -16.096,3.389 q 0.727,-0.134 1.666,-0.21 0.957,-0.08 1.742,-0.08 0.881,0 1.666,0.192 0.804,0.191 1.397,0.631 0.613,0.441 0.977,1.149 0.364,0.709 0.364,1.723 0,1.57 -0.862,2.547 -0.862,0.976 -2.183,1.302 l 0.919,0.708 3.332,5.304 h -1.857 l -3.696,-5.782 -1.876,-0.288 v 6.07 h -1.589 v -13.269 z m 3.446,1.092 q -0.249,0 -0.517,0 -0.268,0 -0.517,0.02 -0.249,0.02 -0.478,0.04 -0.211,0.02 -0.345,0.06 v 4.94 h 1.493 q 1.322,0 2.183,-0.651 0.862,-0.651 0.862,-2.029 0,-1.034 -0.709,-1.704 -0.708,-0.67 -1.972,-0.67 z m -5.412,0.191 h -4.174 v 11.986 h -1.589 v -11.986 h -4.174 v -1.417 h 9.937 z m -19.143,3.217 -1.034,-1.934 h -0.08 l 0.192,1.934 v 8.769 h -1.494 v -13.613 h 0.843 l 6.414,8.941 0.995,1.838 h 0.1 l -0.211,-1.838 v -8.731 h 1.494 v 13.613 h -0.843 l -6.375,-8.979 z m -16.057,2.068 q 0,-3.351 1.417,-5.132 1.417,-1.799 4.04,-1.799 1.417,0 2.451,0.497 1.034,0.498 1.704,1.417 0.689,0.9 1.015,2.183 0.325,1.264 0.325,2.834 0,3.35 -1.436,5.15 -1.417,1.781 -4.059,1.781 -1.397,0 -2.431,-0.498 -1.015,-0.498 -1.704,-1.398 -0.671,-0.919 -0.996,-2.183 -0.326,-1.282 -0.326,-2.852 z m 1.685,0 q 0,1.11 0.211,2.106 0.23,0.995 0.689,1.761 0.46,0.747 1.168,1.206 0.728,0.441 1.704,0.441 1.781,0 2.796,-1.341 1.014,-1.359 1.014,-4.173 0,-1.092 -0.229,-2.087 -0.211,-1.015 -0.69,-1.762 -0.459,-0.766 -1.187,-1.206 -0.708,-0.46 -1.704,-0.46 -1.761,0 -2.776,1.36 -0.996,1.34 -0.996,4.155 z m -5.974,-2.298 0.192,-2.01 h -0.1 l -0.727,1.838 -3.485,6.05 h -0.479 l -3.695,-6.069 -0.689,-1.819 h -0.1 l 0.268,1.991 v 9.018 h -1.493 v -13.403 h 1.187 l 4.193,6.855 0.632,1.493 h 0.04 l 0.593,-1.532 4.002,-6.816 h 1.245 v 13.403 h -1.59 v -8.999 z" />
      </g>
    </g>
    <g
       transform="matrix(0.93093483,0,0,0.93093483,28.215288,19.381107)"
       id="g4785">
      <path
         inkscape:connector-curvature="0"
         id="path1748"
         d="m 45.018,28.2469 c -0.8508,0.01 -1.9518,0.4127 -1.5766,0.4121 -0.3176,0.065 -0.7574,0.1322 -1.2084,0.1861 -0.9019,0.1079 -2.0491,0.1054 -2.0206,0.1101 -0.3855,-0.062 -0.8751,-0.135 -1.4446,0.056 -0.5693,0.1908 -0.8897,0.5127 -1.1864,0.7962 -0.1055,0.1014 -0.2084,0.1849 -0.284,0.2441 0,0 -0.019,0 -0.023,0 -0.1129,0.036 -0.2186,0.075 -0.3361,0.1201 -0.2352,0.09 -0.5113,0.2061 -0.8143,0.3381 -0.606,0.264 -1.3084,0.5906 -1.8807,0.8843 -0.1632,0.084 -0.8152,0.1901 -0.5141,0.1901 -0.9024,0 -1.6666,0.5345 -2.1727,1.1083 0.034,-0.038 -0.317,0.2981 -0.7143,0.6182 -0.3974,0.3202 -0.8937,0.6957 -1.3665,1.0324 -1.1797,0.8402 -1.8571,1.3099 -2.1928,1.5186 -0.3371,0 -0.6145,0.09 -0.8022,0.168 -0.3342,0.1381 -0.5827,0.3052 -0.8264,0.4942 -0.4873,0.3778 -0.9335,0.7714 -1.2524,1.5345 0.01,-0.021 -0.3507,0.4389 -0.2961,0.3961 -0.4625,0.3618 -1.1516,1.0122 -1.8466,1.6847 -0.2973,0.2876 -0.5879,0.5392 -0.7742,0.6822 -0.011,0 -0.039,-0.01 -0.05,-0.01 -0.2819,0.067 -0.4542,0.1586 -0.6062,0.2481 -0.3043,0.1787 -0.5205,0.3702 -0.7343,0.5821 -0.4277,0.4239 -0.8809,0.679 -1.0364,1.7867 0.052,-0.3753 0.083,-0.2815 0.042,-0.2082 -0.041,0.074 -0.1259,0.2112 -0.236,0.3702 -0.2203,0.3181 -0.5389,0.7329 -0.8644,1.1264 -0.3255,0.3935 -0.6657,0.7725 -0.9102,1.0183 -0.1224,0.123 -0.2252,0.2149 -0.2521,0.2362 -0.013,0.01 -0.011,0 0.058,-0.036 0.07,-0.039 0.1803,-0.1581 0.6442,-0.1581 -0.8763,0 -1.4971,0.5104 -1.8687,1.0044 -0.3715,0.4941 -0.5817,1.0539 -0.6783,1.6686 0.026,-0.162 -0.058,0.1889 -0.194,0.5262 -0.1357,0.3372 -0.3204,0.7579 -0.5142,1.1664 -0.1937,0.4085 -0.398,0.8084 -0.5622,1.1044 -0.1642,0.296 -0.4655,0.6008 -0.156,0.3101 -0.08,0.075 -0.389,0.3591 -0.6442,0.5922 -0.2604,0.2376 -0.6836,0.6956 -0.8283,1.2785 -0.1449,0.5827 -0.072,0.9607 -0.023,1.4545 0.033,0.3271 -0.034,1.1785 -0.176,1.8386 -0.071,0.33 -0.1587,0.6292 -0.2221,0.7903 -0.064,0.161 -0.3354,0.1386 0.3341,-0.2362 -0.9728,0.5445 -1.1098,1.3185 -1.1924,1.9748 -0.083,0.6562 -0.057,1.3434 0.4242,2.0787 -0.073,-0.111 0.124,0.3609 0.158,0.7602 0.034,0.3994 -0.1939,0.8775 0.056,0.4642 -0.1363,0.2255 -0.2342,0.4388 -0.3121,0.6722 -0.078,0.2336 -0.211,0.3865 -0.106,1.0184 0.01,0.04 0.038,0.2799 0.046,0.3781 0.047,0.565 0.1982,0.732 0.3321,0.9543 0.1341,0.2228 0.2851,0.4212 0.4862,0.6223 0.2499,0.2499 0.5339,0.7746 0.6801,1.6886 0.064,0.3964 0.1503,0.7572 0.2842,1.1064 0.1339,0.3491 0.1757,0.736 0.9003,1.1724 0.1982,0.1193 0.3887,0.2763 0.5342,0.4041 0.024,0.095 0.032,0.2182 0.058,0.2921 0.1199,0.3395 0.2755,0.5749 0.4521,0.7962 0.3532,0.443 0.6476,1.0004 1.8347,1.0004 -0.5771,0 -0.3493,-0.065 -0.2381,0 0.1112,0.06 0.2816,0.1722 0.4122,0.2781 2.3199,1.8808 5.4127,3.0457 8.6009,3.3011 2.3533,0.1886 5.2885,-0.4438 7.7407,-1.4964 0.1253,0.1741 0.2345,0.3154 0.3741,0.5241 0.1599,0.2392 0.3024,0.4311 0.4542,0.6442 -0.7033,0.092 -1.3376,0.3602 -1.9367,0.7383 -0.1767,0.1115 -0.8544,0.32 -0.6962,0.3022 -0.3344,0.038 -0.7295,0.074 -1.2064,0.4101 -0.4771,0.3368 -0.7511,0.9813 -0.8063,1.3605 -0.1894,1.3004 0.5172,2.1231 1.3684,2.7649 -0.029,0.1555 -0.1166,0.2422 -0.096,0.4121 0.1152,0.9507 0.5293,1.0818 0.7363,1.2886 0.2751,0.2748 0.7297,0.5818 1.1883,0.7102 0.1228,0.035 0.2323,0.015 0.3482,0.034 -0.331,0.1907 -0.6039,0.4429 -0.8703,0.7363 -0.2018,0.222 -0.027,0.088 -0.1041,0.114 -0.077,0.026 -0.5162,0.1138 -1.3745,0.22 -1.4982,0.1855 -4.0855,0.788 -5.5758,1.2905 -2.6378,0.8893 -5.1534,2.6639 -8.4729,5.7941 l -1.8707,1.7645 a 1.52291,1.52291 0 0 0 -0.4641,1.3125 l 0.1159,0.8582 c 0.3783,2.76 2.449,5.1795 5.8161,7.6565 0.9651,0.71 2.2206,1.716 2.6149,2.075 -0.1774,0.119 -0.3373,0.312 -0.4901,0.526 -0.3434,-0.06 -0.6924,-0.09 -1.0605,-0.03 -0.4353,0.08 -0.9107,0.285 -1.2844,0.685 -0.1607,0.172 -0.1542,0.426 -0.25,0.646 -0.3177,0.125 -0.6648,0.266 -0.9944,0.686 -0.3654,0.465 -0.4689,1.266 -0.3222,1.761 0.1505,0.506 0.3671,0.849 0.6323,1.148 0,0 0,0 0,0 -0.3707,0.298 -0.7545,0.75 -0.8543,1.415 -0.1004,0.664 0.215,1.381 0.6202,1.787 0.697,0.696 1.0264,0.582 1.4665,0.674 0.4402,0.09 0.9181,0.149 1.4145,0.184 0.6164,0.04 1.2054,-0.07 1.7947,-0.126 -0.066,0.598 -0.203,1.051 -0.2441,1.791 -0.088,1.58 -0.1045,3.349 -0.01,4.826 0.029,0.453 -0.024,1.342 -0.052,1.49 -0.036,0.19 -0.067,0.347 -0.088,0.54 -0.021,0.192 -0.087,0.426 0.088,0.912 0.1692,0.468 0.8377,0.931 1.2304,1.027 0.3789,0.845 0.8226,1.653 1.4785,2.196 0.7998,0.662 1.9776,1.209 3.2071,0.648 0.1337,-0.06 0.2579,-0.292 0.4122,-0.416 0.1812,0.837 0.3035,1.767 0.5141,2.521 0.5073,1.813 1.0339,3.289 1.7406,4.367 -0.1505,-0.229 -0.037,-0.07 0,0.117 0.039,0.187 0.074,0.452 0.084,0.698 0.064,1.54 0.6123,3.139 1.4905,4.42 -0.011,-0.02 0.037,-0.04 0.01,0.523 -0.058,1.224 0.1852,2.98 0.5361,4.608 0.057,0.266 0.1512,0.719 0.2061,0.986 0.086,0.423 0.2531,1.012 0.4182,1.551 0.1157,0.378 0.2231,0.729 0.314,1.028 -0.4316,0.513 -0.7858,1.062 -1.0623,1.673 -0.318,0.702 -0.5721,1.382 -0.6203,2.179 -0.046,0.759 0.1201,1.432 0.3862,2.056 0.2146,0.504 0.5228,0.975 1.0443,1.383 0.043,0.158 0.1274,0.619 0.2221,1.421 0.063,0.537 0.1846,1.392 0.2781,1.974 0.076,0.473 0.2058,1.552 0.2681,2.259 0.035,0.388 0.071,0.749 0.1041,1.034 0.016,0.142 0.033,0.264 0.05,0.375 0.01,0.05 0.016,0.104 0.03,0.172 0.013,0.06 -0.061,0.05 0.17,0.468 -0.15,-0.275 -0.1324,-0.32 -0.1421,-0.361 -0.01,-0.04 -0.011,-0.05 -0.012,-0.06 0,-0.01 0,0.01 0.01,0.05 0.01,0.07 0.024,0.205 0.038,0.365 0.03,0.318 0.067,0.761 0.1004,1.236 0.071,1.003 0.059,1.282 0.018,1.409 -0.041,0.126 -0.2804,0.511 -0.9844,1.448 -1.7592,2.342 -4.7155,4.941 -6.4302,5.812 -0.3874,0.197 -0.8445,0.356 -1.2504,0.985 -0.406,0.628 -0.3562,1.163 -0.3562,1.572 0,0.326 0.028,0.625 0.094,0.928 0.011,0.05 0.04,0.118 0.054,0.172 -0.013,0.06 -0.082,0.07 -0.088,0.141 -0.055,0.613 0.1953,1.039 0.3981,1.31 0.4058,0.54 0.8242,0.783 1.3605,1.088 0.8345,0.475 1.7893,0.682 2.885,0.618 1.7554,-0.102 5.4774,-0.847 7.4546,-1.433 0.596,-0.176 1.1704,-0.339 1.7106,-0.787 0.5402,-0.449 0.8144,-0.912 1.3025,-1.635 0.1541,-0.229 0.2749,-0.378 0.4081,-0.552 0.1355,0.03 0.256,0.06 0.4002,0.09 0.5001,0.103 0.9439,0.211 1.5265,0.128 0.5825,-0.08 0.9842,-0.316 1.4205,-0.554 0.5573,-0.305 1.0128,-0.592 1.4085,-0.933 0.3956,-0.34 0.8086,-0.74 0.9523,-1.486 0.039,-0.2 0.125,-0.691 0.212,-1.194 0.1955,-1.131 0.088,-0.746 0.5483,-1.91 0.2271,-0.573 0.1727,-0.76 0.188,-1.108 0.013,-0.313 0.01,-0.656 -0.016,-1 0.071,0.01 0.099,0.07 0.176,0.07 0.2962,0.02 0.5339,-0.169 0.8044,-0.292 a 1.52291,1.52291 0 0 0 2.2487,-1.459 l -0.054,-0.666 c 0.04,-0.04 0.057,-0.04 0.1061,-0.102 0.1686,-0.198 0.4125,-0.626 0.428,-1.081 0.03,-0.853 -0.2731,-1.033 -0.4441,-1.262 0.023,-0.102 0.049,-0.178 0.058,-0.34 0.014,-0.249 -0.01,-0.713 -0.3361,-1.144 -0.3236,-0.428 -0.7773,-0.581 -1.0304,-0.632 -0.1837,-0.351 -0.4458,-0.695 -1.1024,-0.885 -0.3684,-0.107 -0.7936,0.05 -1.1644,0.216 0,-1.07 0,-2.434 0.025,-3.961 0.037,-2.76 0.066,-4.258 0.1159,-5.008 0.026,-0.374 0.065,-0.556 0.058,-0.534 -0.01,0.02 -0.1631,0.287 -0.196,0.32 0.193,-0.193 0.6383,-0.594 0.6922,-1.342 0.054,-0.748 -0.2085,-1.043 -0.3522,-1.321 -0.1722,-0.332 -0.4547,-0.872 -1.0984,-1.183 -0.6436,-0.309 -1.0932,-0.23 -1.5225,-0.206 7e-4,0 -0.021,0 -0.021,0 0,-0.02 -0.01,-0.03 -0.012,-0.05 -0.1044,-0.483 -0.2435,-1.157 -0.3901,-1.895 -0.3017,-1.517 -0.6223,-3 -0.8443,-3.721 -0.1985,-0.645 -0.4929,-1.288 -0.8243,-1.881 -0.2929,-0.524 -0.603,-0.961 -1.0204,-1.384 0.034,0.07 0.1321,0.178 0.05,0.604 0.047,-0.245 -0.05,-0.399 -0.052,-0.606 -3e-4,0 4e-4,0 0,0 0,-0.484 0,-0.959 -0.12,-1.411 -0.1752,-0.647 -0.4174,-1.285 -0.7943,-1.874 -0.123,-0.193 -0.2881,-0.899 -0.2801,-0.647 -0.037,-1.144 -0.2798,-2.367 -0.8583,-4.607 -0.494,-1.914 -0.8183,-3.391 -1.1744,-5.352 -0.062,-0.341 -0.1775,-0.905 -0.2681,-1.323 -0.1424,-0.655 -0.1992,-0.995 -0.4522,-2.679 -0.058,-0.388 -0.139,-0.894 -0.1881,-1.174 0.014,0.08 -0.068,-0.829 -0.126,-1.6 0,0 0.053,0.04 0.056,0.05 0.8002,2.142 1.1411,3.035 1.3764,3.591 0.1348,0.318 1.893,4.776 3.2731,8.327 1.2317,3.168 1.6586,4.118 2.3649,4.975 0.3767,0.457 0.1964,-0.07 0.1681,0.391 -0.097,1.577 0.4977,3.11 1.6385,4.179 0.4356,0.408 0.3382,0.745 0.3382,0.108 0,0.725 0.1803,1.187 0.4041,1.853 0.2238,0.666 0.5241,1.423 0.8663,2.21 0.6843,1.576 1.5163,3.235 2.2988,4.408 0.6492,0.973 0.9368,1.456 1.0104,1.598 -0.093,0.291 -0.195,0.613 -0.1641,0.997 0.038,0.469 0.1991,0.836 0.3541,1.146 0.01,0.02 0.011,0.03 0.02,0.05 8e-4,0.04 -0.058,0.155 -0.063,0.206 -0.028,0.238 -0.038,0.479 -0.028,0.737 0.029,0.764 0.3012,1.319 0.6583,1.818 0.2341,0.328 0.578,0.645 1.0543,0.873 0.074,0.107 0.1815,0.275 0.2821,0.474 0.9221,1.822 2.1776,3.854 4.6237,7.523 2.1425,3.213 2.271,3.445 2.5729,4.081 -0.067,0.06 -0.1305,0.127 -0.1902,0.193 -0.084,0 -0.112,-0.03 -0.212,-0.01 -0.4471,0.08 -1.0789,0.562 -1.2704,1.054 -0.3022,0.779 -0.1488,1.138 0.01,1.475 -0.01,0.01 -0.01,0.01 -0.018,0.02 -0.1347,0.195 -0.4378,0.692 -0.2681,1.368 0.1696,0.676 0.6051,0.926 0.7943,1.041 0.01,0 0.01,0 0.016,0 0.01,0.331 0.076,0.7 0.5602,1.184 0.3623,0.363 1.0004,0.531 1.3964,0.492 0.018,0 0.02,-0.01 0.038,-0.01 0.3081,0.267 0.6858,0.497 1.3585,0.456 0.4973,-0.03 1.0409,-0.353 1.3105,-0.71 0.051,-0.07 0.036,-0.121 0.074,-0.187 0.05,0 0,0.02 0.1781,-0.03 0.3546,-0.103 0.381,-0.324 0.5501,-0.533 0.3377,0.259 0.6263,0.57 1.0704,0.756 0.068,0.03 0.7477,0.43 1.0184,0.648 1.2651,1.023 2.8503,1.475 4.3195,1.123 2.2237,-0.534 4.0218,-2.192 4.9558,-4.389 0.065,-0.154 0.1365,-0.308 0.202,-0.561 0.066,-0.254 0.1024,-0.659 0,-1.028 -0.092,-0.34 -0.2487,-0.401 -0.3821,-0.579 0.4997,-0.403 1.1461,-0.923 2.1407,-1.707 1.5088,-1.188 2.5804,-1.99 3.1391,-3.447 0.5586,-1.456 0.5423,-3.024 0.6543,-6.072 0.033,-0.901 0.07,-1.387 -0.02,-1.968 -0.09,-0.582 -0.5368,-1.235 -0.7862,-1.485 -0.013,-0.01 -0.011,-0.01 -0.024,-0.02 -0.034,-0.07 -0.072,-0.185 -0.1024,-0.24 -0.1113,-0.204 -0.2284,-0.379 -0.3621,-0.569 -0.2674,-0.38 -0.4382,-0.686 -0.9563,-1.108 -1.0286,-0.837 -1.8778,-0.65 -2.699,-0.512 -0.4106,0.07 -0.8098,0.178 -1.2125,0.38 -0.4025,0.202 -0.8978,0.481 -1.1803,1.218 -0.3025,0.789 -1.954,3.254 -3.1052,4.412 l -0.166,0.166 c -1.0327,-1.58 -2.9043,-4.809 -3.8513,-6.999 -0.1648,-0.381 -0.4288,-0.983 -0.5923,-1.352 -0.1851,-0.418 -0.1501,0.131 0,-0.398 0.1922,-0.687 0.3053,-1.328 0.1702,-2.041 -0.1351,-0.713 -0.6932,-1.479 -1.3705,-1.803 -0.5937,-0.283 -1.5799,-0.316 -2.1928,-0.08 -0.3897,0.147 -0.6015,0.368 -0.8543,0.571 -0.2743,-0.523 -0.4975,-0.95 -0.8903,-1.689 -0.6078,-1.144 -1.4679,-2.786 -1.8966,-3.621 -1.0629,-2.071 -1.9889,-3.442 -3.1472,-4.526 -0.259,-0.242 -0.3214,-0.333 -0.3241,-0.332 -0.011,-1.385 -0.4042,-2.622 -1.3904,-3.673 0.023,0.02 -0.093,-0.107 -0.1561,-0.607 -0.2881,-2.286 -1.5877,-6.49 -3.2551,-10.963 -0.5461,-1.465 -1.3118,-3.009 -2.0928,-4.318 -0.7047,-1.181 -1.2813,-2.077 -2.1768,-2.771 -0.033,-0.254 -0.076,-0.54 -0.136,-0.858 l -0.086,-0.454 0.5081,-0.598 c 0.5083,-0.601 1.3308,-1.514 1.7387,-1.933 0.7236,-0.743 1.241,-1.599 1.5445,-2.575 0.2684,-0.862 0.439,-1.735 0.5061,-2.525 0.043,-0.508 0.051,-0.968 -0.048,-1.467 0.2584,-0.219 0.5386,-0.418 0.7622,-0.665 0.3833,-0.423 0.7095,-0.805 0.9484,-1.433 0.11,-0.289 0.2777,-0.775 0.108,-1.3805 -0.09,-0.3204 -0.2625,-0.4072 -0.4181,-0.5902 0.02,-0.052 0.031,-0.064 0.072,-0.2481 0.014,-0.064 0.1257,-0.563 0.2521,-1.1404 0.031,-0.1414 0.051,-0.1837 0.078,-0.268 0.3453,-0.274 0.5959,-0.6205 0.7002,-0.9444 0.1926,-0.598 0.1751,-1.3222 -0.3581,-1.9647 0.3528,0.425 0.2392,0.5342 0.2361,0.4622 0,-0.072 0,-0.2891 0.044,-0.5842 0.039,-0.2923 0.077,-0.5679 0.1039,-0.7803 0,-0.028 0,-0.037 0.01,-0.058 0.05,-0.058 0.092,-0.1128 0.158,-0.18 0.103,-0.1043 0.2173,-0.2041 0.2662,-0.2421 0.024,-0.02 0.036,-0.024 -0.016,0.01 -0.031,0.017 -0.2429,0.051 -0.3701,0.09 2e-4,0 -2e-4,0 0,-0.01 0.6447,-0.088 1.1533,-0.4125 1.4565,-0.8403 0.3472,-0.49 0.562,-1.194 0.2701,-1.9547 -0.185,-0.482 -0.4702,-0.7047 -0.7623,-0.8923 0.2439,-0.2722 0.1872,-0.2165 0.5782,-0.6382 4.6186,-4.9823 6.0321,-6.6864 7.4046,-8.9871 0.1714,-0.2874 0.3534,-0.5822 0.5021,-0.8144 0.1488,-0.232 0.3261,-0.4695 0.2462,-0.372 0.3156,-0.3852 0.3926,-0.5907 0.5981,-0.9724 0.2056,-0.3817 0.4375,-0.8395 0.6683,-1.3105 0.4615,-0.942 0.881,-1.8068 1.1004,-2.4908 0.01,-0.023 0.3665,-0.5706 0.3441,-0.5523 v 0 l 0.5402,-0.4881 a 1.52291,1.52291 0 0 0 0.5002,-1.2184 l -0.1181,-2.0547 v 0 C 68.3913,64.6977 66.781,59.7039 64.1611,55.9629 63.8052,55.4546 63.692,55.2227 63.707,55.2667 c 0.015,0.044 0,0.1621 0.046,-0.1881 0.048,-0.3489 0.057,-0.682 0.038,-1.0103 -0.019,-0.3283 -0.01,-0.5956 -0.2441,-1.0903 -0.2003,-0.4239 -0.3862,-0.8425 -0.5141,-1.1505 -0.064,-0.1541 -0.1147,-0.2833 -0.1401,-0.3541 -0.012,-0.036 -0.018,-0.057 -0.014,-0.042 0,0.015 0.042,-0.01 0.042,0.3381 0,-0.4045 -0.049,-0.3978 -0.068,-0.4602 -0.018,-0.062 -0.033,-0.099 -0.046,-0.136 -0.027,-0.073 -0.053,-0.1357 -0.084,-0.2081 -0.06,-0.1447 -0.1375,-0.3198 -0.232,-0.5281 -0.1891,-0.4169 -0.4455,-0.9608 -0.7263,-1.5426 -0.4797,-0.9941 -0.8787,-1.6253 -1.4145,-2.2228 0.6847,-0.4554 1.3544,-0.9583 1.9527,-1.6106 0.5243,-0.5715 1.7895,-1.7381 2.6029,-2.3867 0.8705,-0.6942 1.4356,-1.096 1.8846,-1.8808 0.2247,-0.3923 0.3721,-0.9847 0.2802,-1.5025 -0.092,-0.5178 -0.3273,-0.8657 -0.5282,-1.1304 -0.4438,-0.5846 -1.1388,-0.9011 -1.7506,-0.9803 -0.6117,-0.079 -1.1796,0.015 -1.7286,0.1901 -0.9019,0.2865 -1.742,0.9356 -2.551,1.6465 -0.073,-0.093 -0.1132,-0.2073 -0.19,-0.3021 -0.4338,-0.5352 -0.836,-0.9939 -1.4545,-1.3904 -0.033,-0.087 -0.065,-0.189 -0.1003,-0.2641 -0.1239,-0.263 -0.2692,-0.5091 -0.4342,-0.7683 -0.3302,-0.5184 -0.6507,-1.0064 -1.1706,-1.4666 -0.5051,-0.4471 -1.4283,-0.7798 -2.1908,-0.6662 -0.7625,0.1136 -1.3523,0.4315 -2.1007,0.8642 -0.2376,0.1375 -0.4469,0.2616 -0.6623,0.3882 -0.1646,-0.2127 -0.4042,-0.5332 -0.6002,-0.8943 -0.1216,-0.2241 -0.2188,-0.4374 -0.26,-0.5462 -0.02,-0.054 -0.027,-0.086 -0.016,-0.034 0.01,0.051 0.1234,0.1708 -0.072,0.6803 0.2437,-0.6351 0.2031,-1.3117 -0.1004,-1.8947 -0.3032,-0.583 -0.9975,-1.1244 -1.8166,-1.1244 0.4651,0 0.4816,0.1122 0.4261,0.078 -0.055,-0.034 -0.2156,-0.147 -0.4282,-0.3262 -0.425,-0.3582 -1.0788,-0.9781 -1.9546,-1.8627 -0.4514,-0.4558 -0.9808,-0.8024 -1.6026,-1.0123 a 1.52291,1.52291 0 0 0 -0.7562,-0.218 z m 7.5207,29.0341 c 0,0.3141 -0.034,0.3162 -0.042,0.3461 0.01,-0.029 0.031,-0.084 0.061,-0.162 0.012,-0.03 0.036,-0.082 0.05,-0.1161 0.016,0.023 0.043,0.052 0.056,0.07 0,0.01 0,0.032 0.01,0.04 0.031,0.1122 0.066,0.2146 0.1041,0.3262 0.078,0.2232 0.1731,0.472 0.2821,0.7262 0.1702,0.3973 0.3362,0.8049 0.7742,1.2085 0.3897,0.359 0.8472,0.4738 1.2124,0.5541 -0.01,0.01 0.077,0.134 0.3042,0.6342 0.2743,0.6047 0.7756,1.9491 1.0264,2.7651 0.9156,2.9795 1.4786,4.4117 2.3088,5.4698 -0.216,0.5439 -0.285,1.0901 -0.1881,1.6506 -0.026,0.053 -0.1803,0.3362 -0.5162,0.8323 -0.2523,0.3725 -0.4916,0.7411 -0.6822,1.0464 -0.095,0.1526 -0.1795,0.2877 -0.2502,0.4101 -0.071,0.1224 -0.1086,0.153 -0.214,0.4322 0.1193,-0.3159 0.096,-0.1921 0.05,-0.1261 -0.047,0.066 -0.1341,0.1807 -0.2461,0.3221 -0.2238,0.283 -0.5518,0.6787 -0.9484,1.1424 -0.7929,0.9275 -1.8627,2.1311 -2.987,3.3552 -0.7314,0.7963 -1.157,1.2252 -1.3665,1.3925 -0.2094,0.1673 -0.1368,0.1263 -0.4341,0.2001 -0.3474,0.086 -0.6276,0.1623 -0.9103,0.238 -0.01,0 -0.012,-0.01 -0.018,-0.012 0.8551,-0.3822 1.6323,-0.8866 2.1867,-1.6165 0.9102,-1.1983 1.2929,-2.7547 1.1864,-4.4176 -0.043,-0.68 -0.1118,-1.4964 -0.18,-2.2088 -0.068,-0.7122 -0.1147,-1.2179 -0.1961,-1.6405 -0.01,-0.03 -0.105,-0.6848 -0.17,-1.1964 -0.069,-0.5436 -0.1277,-1.0145 -0.1901,-1.3445 -8e-4,0 -0.095,-0.6267 -0.1561,-1.1104 -0.067,-0.5261 -0.1501,-1.1097 -0.214,-1.4525 0.022,0.114 -0.035,-0.3135 -0.066,-0.7423 -0.032,-0.4287 -0.065,-0.9694 -0.09,-1.5065 -0.056,-1.1994 -0.137,-2.3086 -0.4501,-3.2532 -0.1385,-0.4175 -0.074,-0.3805 -0.1141,-0.13 -0.04,0.2506 -0.044,0.1387 0.2301,-0.2941 0.169,-0.2665 0.3201,-0.5223 0.4422,-0.7462 0.062,-0.1121 0.1139,-0.2145 0.1661,-0.3281 0.026,-0.057 0.053,-0.1139 0.084,-0.2021 0.032,-0.088 0.098,-0.1382 0.098,-0.5562 z m 6.5802,12.4963 c 0.2637,0.3096 0.038,0.185 0,0 z m -23.002,13.5768 c -0.047,0.03 -0.1514,0.093 -0.156,0.094 0.063,-0.05 0.08,-0.017 0.156,-0.094 z m 19.2268,9.9255 c 0,0 0,0.015 0,0.018 7e-4,-0.01 0,-0.01 0,-0.018 z m -0.014,0.06 c -6e-4,0 0,0 0,0.01 -0.089,0.026 -0.045,0.061 -0.2521,0.061 0.098,0 0.1625,-0.055 0.2541,-0.068 z m -24.2344,1.3025 c 0.1127,0.476 0.7702,1.795 0.4901,1.3824 l -0.352,0.2801 a 1.52291,1.52291 0 0 0 -0.5163,1.6066 c -0.1014,-0.085 -0.179,-0.1857 -0.2921,-0.2641 -0.7371,-0.5108 -1.6737,-0.7779 -2.813,-0.8363 -0.583,-0.03 -0.7127,-0.049 -0.8923,-0.116 -0.091,-0.034 -0.4482,-0.2588 -0.6642,-0.3822 0.035,-0.015 0.057,-0.027 0.092,-0.042 1.7008,-0.7601 3.5486,-1.3097 4.9478,-1.6285 z m 21.3674,7.7329 c 0.01,0.03 0.028,0.08 0.028,0.08 -0.018,-0.03 -0.01,-0.05 -0.028,-0.08 z m 30.1865,52.891 c 0,0.02 0.01,0.08 0,0.09 0,-0.05 0,-0.06 0,-0.09 z m -0.023,0.286 c -0.03,0.09 -0.3201,0.586 -0.4362,0.744 0.2487,-0.242 0.3841,-0.527 0.4362,-0.744 z m -0.4983,0.822 c -0.27,0.229 -1.3326,0.354 -0.9763,0.358 0.1556,-0.03 0.8065,-0.266 0.9763,-0.358 z m -36.0905,9.465 c 0,0.05 0.037,0.165 0.042,0.235 0,0 -0.015,-0.02 -0.016,-0.02 -0.032,-0.139 -0.026,-0.19 -0.026,-0.21 z m 4.8696,1.025 c -0.012,0.02 -0.039,0.07 -0.04,0.07 0.01,-0.02 0.034,-0.05 0.04,-0.07 z m -23.4221,9.421 c 0,0.269 -1.188,0.902 -0.4282,0.678 0.074,-0.161 0.1179,-0.397 0.1862,-0.472 0.1339,-0.147 0.2092,-0.186 0.242,-0.206 z m -0.3101,1.964 c 0.076,0.167 0.315,0.521 0.3162,0.376 -0.087,-0.07 -0.2982,-0.326 -0.3162,-0.376 z"
         style="fill:none;stroke:#faa61a;stroke-width:0.67756897;stroke-linecap:round;stroke-linejoin:round;stroke-miterlimit:4;stroke-dasharray:none;stroke-opacity:1" />
      <path
         inkscape:connector-curvature="0"
         id="path1752"
         d="m 45.042,26.6984 c -1.5075,0.043 -1.8496,0.5579 -1.9087,0.4421 -1.275,0.3223 -2.7042,0.11 -2.6768,0.2861 -0.4392,-0.071 -1.2207,-0.2079 -2.1809,0.114 -0.8492,0.2848 -1.2356,0.7009 -1.5605,1.0144 0.1698,-0.08 0.4787,-0.154 1.1604,-0.154 -1.0251,0 -0.9121,0.1287 -1.0724,0.18 -0.091,0.029 -0.1614,0.058 -0.2381,0.086 0.013,-0.017 0.032,-0.031 0.054,-0.05 -0.021,0.019 -0.083,0.048 -0.1024,0.066 -0.042,0.015 -0.091,0.032 -0.134,0.048 -0.2693,0.1037 -0.5592,0.224 -0.8763,0.3621 -0.6342,0.2763 -1.3512,0.6094 -1.9687,0.9263 0.062,-0.032 -0.7008,0.019 0.192,0.019 -1.4675,0 -2.675,0.8841 -3.3351,1.6326 0.2138,-0.2425 -0.1537,0.1397 -0.5241,0.4381 -0.3704,0.2984 -0.8471,0.6591 -1.2926,0.9763 -0.9977,0.7106 -1.4586,1.0248 -1.7885,1.2425 -0.3534,0.08 -0.6955,0.1895 -0.9004,0.2741 -0.5282,0.2182 -0.8583,0.4509 -1.1823,0.7022 -0.6162,0.4778 -1.1615,0.9331 -1.6547,2.0267 -0.6133,0.4908 -1.1888,1.039 -1.8705,1.6987 -0.2055,0.1987 -0.3678,0.3316 -0.5042,0.444 -0.2212,0.087 -0.4865,0.1724 -0.6323,0.2582 -0.4778,0.2809 -0.7589,0.5374 -1.0403,0.8163 -0.5628,0.5577 -1.2026,0.6927 -1.4805,2.6728 0.1166,-0.8309 0.2272,-0.7558 0.224,-0.7502 0,0.01 -0.067,0.1116 -0.158,0.2441 -0.1835,0.265 -0.482,0.6568 -0.7843,1.0224 -0.3024,0.3655 -0.6221,0.7192 -0.8142,0.9123 -0.018,0.017 -0.01,0.01 -0.021,0.02 -0.6614,0.3242 -1.2078,0.7463 -1.5386,1.1864 -0.5601,0.7448 -0.8389,1.5237 -0.9704,2.3608 0.079,-0.5006 0.019,-0.1092 -0.1004,0.1881 -0.1196,0.2973 -0.2958,0.6959 -0.4781,1.0804 -0.1825,0.3845 -0.3752,0.7642 -0.5162,1.0183 -0.1411,0.2543 -0.5861,0.6122 0.138,-0.068 -0.052,0.049 -0.3738,0.344 -0.6282,0.5762 -0.3089,0.282 -1.0444,1.0745 -1.2865,2.0487 -0.242,0.9743 -0.1141,1.4669 -0.062,1.9847 0,0.023 -0.032,0.8187 -0.148,1.3565 -0.028,0.1305 -0.044,0.1696 -0.072,0.2661 0.1069,-0.1621 0.2947,-0.3758 0.9423,-0.7383 -0.5524,0.3092 -0.7392,0.6627 -1.0163,1.0064 -6e-4,0 0,0.013 0,0.014 -3e-4,9e-4 0,-0.01 0,-0.01 -0.58561,0.73 -0.86961,1.4793 -0.95037,2.1207 -0.11664,0.9264 -0.10345,1.8844 0.64023,3.0571 -0.0773,0.1704 -0.30567,0.4896 0.20804,-0.3602 -0.084,0.1395 -0.1236,0.2755 -0.18803,0.4081 0.004,0.01 0.002,0.011 0.006,0.018 -0.009,-0.013 5e-5,0 -0.008,-0.014 -0.0898,0.1855 -0.19612,0.3664 -0.2641,0.5702 -0.11709,0.3508 -0.36714,0.5493 -0.16606,1.7605 -0.007,-0.045 0.0262,0.2068 0.03,0.2521 0.0891,1.0685 0.34939,1.2932 0.55019,1.6266 0.2008,0.3334 0.4097,0.6119 0.7162,0.9184 -0.062,-0.062 0.1353,0.1342 0.2481,0.8383 0.077,0.4796 0.1785,0.9248 0.3661,1.4144 0.1869,0.4874 0.188,1.1166 1.5366,1.9347 0.19,0.4894 0.4038,0.8409 0.6442,1.1424 0.5246,0.6579 0.8555,1.5846 3.0451,1.5846 -1.269,0 -0.9941,-0.2006 -0.9784,-0.1921 0.015,0.01 0.1249,0.079 0.1761,0.1201 2.6097,2.1156 5.9621,3.3615 9.4533,3.6412 0.9196,0.074 1.8881,-0.094 2.8449,-0.1981 -0.1497,0.3355 -0.2965,0.6843 -0.33,0.9144 -0.2558,1.7562 0.4195,2.7912 1.2784,3.6173 0.1026,0.7971 0.3131,1.2202 0.5262,1.5164 -1.6546,0.262 -3.6744,0.6937 -5.1478,1.1904 -2.9481,0.994 -5.6473,2.938 -9.0391,6.1362 l -1.8707,1.7646 A 3.0724,3.0724 0 0 0 12.625,95.369 l 0.116,0.8584 a 3.0724,3.0724 0 0 0 0,0.01 c 0.4708,3.4349 2.9111,6.1016 6.4322,8.6936 0.2012,0.148 0.3185,0.257 0.5403,0.428 -0.3333,0.18 -0.6793,0.209 -0.9724,0.522 -0.2283,0.244 -0.3734,0.559 -0.5262,0.864 -0.2783,0.185 -0.5104,0.194 -0.8062,0.571 -0.6512,0.829 -0.8386,2.314 -0.5882,3.157 0.073,0.246 0.1767,0.309 0.258,0.503 -0.2425,0.382 -0.448,0.833 -0.5321,1.392 -0.177,1.177 0.3986,2.455 1.0563,3.113 1.3032,1.303 1.7085,0.984 2.2487,1.096 0.5403,0.113 1.0718,0.172 1.6226,0.21 0.04,0 0.075,0 0.1141,0 -6e-4,0.01 0,0.02 0,0.03 -0.091,1.636 -0.1083,3.441 -0.01,5.011 0.02,0.301 -0.055,1.24 -0.03,1.104 -0.037,0.199 -0.073,0.375 -0.1041,0.655 -0.031,0.28 -0.1664,0.677 0.1701,1.608 0.2024,0.56 0.7744,1.076 1.3704,1.483 0.4581,0.924 1.0228,1.758 1.8066,2.406 0.8086,0.67 2.0406,1.34 3.4732,1.215 0.061,0.238 0.091,0.534 0.1561,0.764 0.5293,1.893 1.0401,3.429 1.9387,4.801 -0.3873,-0.593 -0.2394,-0.51 -0.2201,-0.417 0.019,0.09 0.045,0.285 0.052,0.444 0.08,1.941 0.674,3.645 1.7626,5.232 -0.2568,-0.374 -0.2418,-0.85 -0.262,-0.427 -0.076,1.587 0.195,3.27 0.5701,5.011 0.055,0.256 0.1507,0.707 0.2041,0.968 0.1173,0.572 0.2772,1.114 0.4542,1.693 0.042,0.137 0.07,0.227 0.114,0.374 -0.2539,0.406 -0.5986,0.808 -0.7922,1.236 -0.369,0.816 -0.6859,1.558 -0.7563,2.723 -0.066,1.091 0.1585,1.939 0.5082,2.758 0.2217,0.521 0.5471,1.05 1.0343,1.568 0.032,0.18 0.054,0.273 0.1181,0.81 0.068,0.576 0.1874,1.425 0.2861,2.039 0.063,0.393 0.1957,1.488 0.254,2.149 0.036,0.401 0.074,0.773 0.11,1.079 0.019,0.154 0.035,0.288 0.056,0.428 0.011,0.07 0.024,0.138 0.046,0.248 4e-4,0 0.01,0.01 0.01,0.02 0.01,0.06 0.015,0.148 0.028,0.279 0.028,0.303 0.063,0.737 0.096,1.201 0.071,1.004 0.014,1.058 0.092,0.821 0.078,-0.238 -0.046,0.06 -0.7502,0.998 -1.61,2.143 -4.5774,4.694 -5.8921,5.362 -0.4081,0.208 -1.1372,0.418 -1.8526,1.524 -0.7154,1.107 -0.6042,1.977 -0.6042,2.413 0,0.347 0.046,0.668 0.104,1.006 0,0.03 -0.033,0.06 -0.036,0.09 -0.1054,1.16 0.3645,1.936 0.7003,2.382 0.6714,0.894 1.2107,1.148 1.8346,1.503 0.9249,0.525 2.5716,0.886 3.7412,0.818 2.1639,-0.126 5.616,-0.846 7.8048,-1.494 0.602,-0.178 1.4524,-0.409 2.2608,-1.081 0.7143,-0.593 1.0087,-1.122 1.4104,-1.732 0.4207,0.08 0.8049,0.197 1.4546,0.103 0.9196,-0.131 1.4906,-0.481 1.9446,-0.73 0.614,-0.335 1.1478,-0.66 1.6766,-1.113 0.5289,-0.455 1.2113,-1.056 1.4645,-2.37 0.05,-0.259 0.1285,-0.716 0.2161,-1.222 0.1966,-1.138 -7e-4,-0.433 0.4622,-1.603 0.301,-0.76 0.224,-0.91 0.214,-1.168 a 3.0724,3.0724 0 0 0 3.2892,-3.311 l -0.03,-0.356 c 0.222,-0.407 0.497,-0.754 0.5161,-1.313 0.039,-1.124 -0.1864,-1.561 -0.41,-1.846 0,-0.479 -0.086,-1.18 -0.6243,-1.891 -0.3491,-0.461 -0.7608,-0.735 -1.1484,-0.924 -0.327,-0.445 -0.8376,-0.87 -1.7907,-1.145 -0.01,0 -0.023,0 -0.034,0 0,-0.748 5e-4,-1.371 0.012,-2.234 0.037,-2.709 0.069,-4.162 0.112,-4.838 0.2585,-0.384 0.5017,-0.907 0.5543,-1.637 0.036,-0.493 -0.048,-0.758 -0.1161,-1.05 0.215,0.34 0.3712,0.576 0.4281,0.664 -0.041,0.275 -0.1431,0.449 -0.118,0.763 0.039,0.485 0.1931,0.75 0.3221,1.075 -5e-4,0 -0.01,0.02 -0.01,0.02 -0.037,0.327 -0.047,0.628 -0.034,0.97 0.045,1.208 0.4371,1.949 0.9463,2.661 0.2883,0.403 0.6804,0.867 1.2725,1.241 0.9645,1.895 2.2293,3.95 4.6556,7.588 1.4849,2.227 1.4151,2.201 1.7086,2.693 -0.4146,0.352 -0.7921,0.769 -0.9603,1.203 -0.3963,1.02 -0.379,1.597 -0.2561,2.02 -0.1655,0.467 -0.2685,1.05 -0.084,1.784 0.2055,0.82 0.5756,1.251 0.9263,1.553 0.1246,0.402 0.2812,0.829 0.8503,1.398 0.4735,0.475 1.166,0.707 1.8126,0.825 0.4757,0.349 1.1015,0.628 2.1708,0.562 0.7898,-0.05 1.5942,-0.524 2.1388,-1.062 0.1535,0.07 0.1661,0.168 0.3521,0.246 -0.2266,-0.09 0.5084,0.313 0.6422,0.422 1.469,1.187 3.8134,1.866 5.654,1.425 2.7467,-0.66 4.9206,-2.698 6.0221,-5.29 0.07,-0.165 0.1686,-0.363 0.276,-0.779 0.089,-0.345 0.08,-0.948 0,-1.51 0.4936,-0.394 0.6484,-0.523 1.2225,-0.975 1.5025,-1.183 2.9037,-2.222 3.6272,-4.109 0.7235,-1.886 0.6425,-3.526 0.7543,-6.571 0.034,-0.908 0.097,-1.401 -0.036,-2.262 -0.084,-0.543 -0.4503,-0.98 -0.7682,-1.476 0,0 -5e-4,-0.03 0,-0.03 -0.1409,-0.483 -0.2329,-0.596 -0.3142,-0.745 -0.1625,-0.297 -0.2987,-0.495 -0.4541,-0.716 -0.3108,-0.441 -0.3654,-0.706 -1.2445,-1.421 -1.772,-1.442 -2.8595,-1.015 -3.9333,-0.836 -0.537,0.09 -1.0588,0.227 -1.6486,0.523 -0.5898,0.295 -1.4255,0.721 -1.9346,2.049 -0.069,0.179 -0.942,1.319 -1.6346,2.296 -1.0003,-1.737 -1.9876,-3.313 -2.6209,-4.777 -0.1382,-0.32 -0.3316,-0.765 -0.4922,-1.129 0.1749,-0.704 0.3441,-1.409 0.1681,-2.337 -0.207,-1.092 -1.1525,-2.402 -2.2248,-2.913 -0.7449,-0.356 -2.1444,-0.394 -3.0491,-0.18 -0.08,-0.151 -0.1045,-0.199 -0.1861,-0.352 -0.604,-1.137 -1.4658,-2.782 -1.8866,-3.601 -1.0808,-2.106 -2.1041,-3.637 -3.3972,-4.868 -0.1026,-1.5 -0.4543,-2.677 -1.7126,-4.018 0.3411,0.364 0.2904,0.58 0.25,0.261 -0.3378,-2.683 -1.6487,-6.776 -3.3391,-11.31 -0.5886,-1.579 -1.3857,-3.182 -2.2147,-4.572 -0.6291,-1.054 -1.1738,-1.895 -2.0588,-2.725 -0.023,-0.134 -0.035,-0.253 -0.062,-0.396 l 0.052,0.27 0.03,-0.03 c 0.4791,-0.565 1.3111,-1.487 1.6666,-1.853 0.8423,-0.865 1.5548,-2.045 1.9127,-3.196 0.3029,-0.973 0.4918,-1.931 0.5701,-2.853 0.03,-0.355 0.08,-0.686 0.1041,-1.037 0.063,-0.06 0.1542,-0.12 0.2161,-0.189 0.4597,-0.508 0.8671,-0.915 1.2484,-1.918 0.1495,-0.394 0.4619,-1.246 0.1521,-2.3514 -0.057,-0.2056 -0.1619,-0.3042 -0.2401,-0.4722 0.043,-0.1964 0.077,-0.354 0.154,-0.7043 0.3042,-0.3758 0.6362,-0.7619 0.7523,-1.1224 0.208,-0.646 0.1712,-1.3764 -0.04,-2.1146 0,-0.015 -8e-4,-0.055 0.025,-0.2402 0.01,-0.073 0.016,-0.1242 0.026,-0.1941 0.5454,-0.2914 0.9917,-0.6822 1.3064,-1.1264 0.5882,-0.8299 0.9756,-2.0464 0.4542,-3.4051 -0.047,-0.123 -0.1166,-0.1781 -0.1681,-0.2881 4.2863,-4.6365 5.8829,-6.5517 7.2726,-8.8811 0.1626,-0.2726 0.3381,-0.5568 0.4762,-0.7723 0.138,-0.2154 0.3638,-0.4991 0.14,-0.2261 0.5491,-0.67 0.5449,-0.8131 0.7643,-1.2204 0.2193,-0.4073 0.4586,-0.8773 0.6962,-1.3625 0.4634,-0.9458 0.8465,-1.7025 1.1524,-2.6329 l 0.4822,-0.4362 a 3.0724,3.0724 0 0 0 1.0063,-2.4547 l -0.127,-2.0557 v 0 c -0.3013,-5.3332 -1.9669,-10.5594 -4.7916,-14.5931 -0.1753,-0.2502 -0.094,-0.098 -0.1301,-0.1561 0.026,-0.3173 0.054,-0.6313 0.036,-0.9423 -0.026,-0.4339 0.028,-0.776 -0.3902,-1.6606 -0.1906,-0.4031 -0.3688,-0.8051 -0.4842,-1.0824 -0.057,-0.1387 -0.099,-0.2517 -0.11,-0.2821 -0.01,-0.015 0,-0.012 0.016,0.056 0.02,0.068 0.1024,0.045 0.1024,0.7622 0,-0.8115 -0.1014,-0.7903 -0.1361,-0.9043 -0.034,-0.1141 -0.055,-0.1749 -0.076,-0.2301 -0.041,-0.1104 -0.073,-0.1858 -0.108,-0.2701 -0.071,-0.1685 -0.1519,-0.3519 -0.2501,-0.5682 -0.1964,-0.4327 -0.4549,-0.9832 -0.7402,-1.5746 -0.2376,-0.4922 -0.4478,-0.9133 -0.6763,-1.3304 0.2826,-0.274 0.6735,-0.4696 0.9603,-0.7823 0.4159,-0.4534 1.6948,-1.6406 2.4249,-2.2227 0.9002,-0.7179 1.5628,-1.0927 2.2668,-2.3229 0.352,-0.615 0.6179,-1.6536 0.4601,-2.5428 -0.1577,-0.8894 -0.5478,-1.4377 -0.8203,-1.7967 -0.7227,-0.9521 -1.8683,-1.4616 -2.7869,-1.5805 -0.9186,-0.119 -1.6887,0.026 -2.3949,0.2501 -0.7149,0.227 -1.3807,0.5529 -2.0086,0.9623 -0.1128,-0.1153 -0.2394,-0.2395 -0.3781,-0.3561 -0.012,-0.026 -0.026,-0.075 -0.038,-0.1004 -0.1693,-0.3593 -0.3403,-0.642 -0.5301,-0.9403 -0.3798,-0.5965 -0.659,-1.0957 -1.4486,-1.7946 -0.7281,-0.6445 -2.3017,-1.209 -3.4472,-1.0384 -0.7941,0.1183 -1.2877,0.442 -1.8366,0.7322 -0.051,-0.4613 -0.1489,-0.9211 -0.3722,-1.3504 -0.516,-0.9922 -1.7473,-1.9607 -3.1911,-1.9607 1.0277,0 1.1836,0.2756 1.2364,0.3081 0.053,0.033 -0.062,-0.04 -0.2401,-0.19 -0.3629,-0.2998 -0.9996,-0.8997 -1.86,-1.7687 -0.4883,-0.4933 -1.1563,-0.9561 -1.9766,-1.2904 A 3.0724,3.0724 0 0 0 45.041,26.6979 Z m 14.5811,9.2512 c 0.037,0.033 0.1254,0.1153 0.1321,0.124 -0.065,-0.043 -0.062,-0.081 -0.1321,-0.124 z M 21.902,39.1767 c 0.042,0 0.1252,0.052 0.17,0.054 -0.2396,-0.014 -0.4105,0.023 -0.6001,0.048 0.14,-0.043 0.2223,-0.095 0.4301,-0.1024 z m 40.5301,0.042 c 0.2785,0.3454 0.4062,0.6305 0.4341,0.7042 -0.1283,-0.3387 -0.2964,-0.456 -0.4341,-0.7042 z m -6.7784,2.1127 c 0.031,0.097 0.032,0.1344 0.016,0.1781 -0.01,-0.053 -0.01,-0.116 -0.016,-0.1781 z m -38.1132,2.901 c -0.5919,0 -1.0427,0.2078 -1.4845,0.4122 0.036,-0.022 0.027,-0.023 0.086,-0.056 0.1811,-0.1014 0.4373,-0.3562 1.3985,-0.3562 z m 35.8664,16.922 c 0.178,0.1004 0.3077,0.1603 0.4782,0.228 0.047,0.082 -0.067,-0.095 0.052,0.1661 0.2213,0.4879 0.7321,1.8491 0.9564,2.5789 0.7681,2.4995 1.3264,3.9946 2.0827,5.2559 -0.063,0.3312 0.015,0.6024 0.012,0.9303 -0.02,0.024 -0.041,0.074 -0.2921,0.4441 -0.2627,0.388 -0.5107,0.7684 -0.7143,1.0944 -0.1014,0.1629 -0.1914,0.3096 -0.276,0.4561 -0.025,0.043 -0.072,0.1592 -0.094,0.1921 -0.023,0.033 -0.091,0.1236 -0.1901,0.2481 -0.127,0.1606 -0.3638,0.4397 -0.5701,0.6863 -0.043,-0.5932 -0.089,-1.2195 -0.1441,-1.7987 -0.07,-0.7274 -0.093,-1.149 -0.2161,-1.7846 0.024,0.1222 -0.093,-0.606 -0.156,-1.0984 -0.071,-0.5565 -0.1089,-0.9354 -0.2041,-1.4385 0.029,0.1537 -0.083,-0.5496 -0.142,-1.0163 -0.07,-0.5524 -0.1447,-1.1055 -0.2261,-1.5426 0.067,0.3572 -0.015,-0.1599 -0.046,-0.5722 -0.031,-0.4123 -0.062,-0.943 -0.086,-1.4665 -0.027,-0.5538 -0.1807,-1.0743 -0.2241,-1.5625 z M 9.75775,61.9107 C 9.79043,62.016 9.8918,62.1641 9.90979,62.1328 9.80733,61.9755 9.74121,61.8696 9.75775,61.9107 Z m 48.15875,5.3598 c -0.2259,0.2497 -0.2828,0.6559 -0.4382,0.9864 0.1862,-0.7567 0.48,-1.0326 0.4382,-0.9864 z M 13.179,68.4589 c -0.338,0.5467 -0.4037,1.0196 -0.4362,1.4626 0.011,-0.434 0.1086,-0.9326 0.4362,-1.4626 z m 44.6695,2.1307 c 0.1644,0.168 0.2112,0.4005 0.4062,0.5622 0.7947,1.0523 -0.4827,-0.3854 -0.4062,-0.5622 z m -19.3307,5.638 c 0.2899,0.2218 0.5083,0.477 0.6501,0.7422 -0.2882,-0.5387 -0.4497,-0.563 -0.6501,-0.7422 z m -6.0941,5.53 c -0.053,0.1983 -0.01,0.3349 -0.042,0.4961 0,-0.02 -0.01,-0.075 -0.01,-0.092 0.01,-0.3285 0.048,-0.3956 0.05,-0.4041 z m 4.7896,2.6929 c -0.1766,0.191 -0.9197,0.46 -0.6622,0.4061 0.2093,-0.1045 0.3132,-0.057 0.6622,-0.4061 z m 17.8142,3.2692 c 0.566,0 0.7629,0.033 0.9503,0.166 -0.3226,-0.047 -0.6565,-0.166 -0.9503,-0.166 z m 1.0704,5.92 c 0.3144,0.3788 0.3989,0.6083 0.4742,0.8202 -0.01,0.01 -0.02,0.073 -0.026,0.082 -0.01,0.012 0,0 -0.01,0.016 -0.01,0 -0.01,0.01 -0.014,0.01 -0.1324,-0.3113 -0.1725,-0.6251 -0.4241,-0.9283 z m 0.5262,0.9123 c 0.062,0.2067 0.076,0.3166 0.064,0.3821 -0.033,-0.1111 -0.1043,-0.2209 -0.1501,-0.3321 0.011,-0.012 0.01,-0.012 0.023,-0.024 0.01,-0.01 0.01,-0.01 0.014,-0.014 0.014,-0.01 0.036,-0.01 0.05,-0.012 z m -0.132,0.034 c 1.5892,-0.1858 -9.7496,2.8204 -1.4166,0.3722 1.299,-0.2226 0.1819,0.1645 1.4166,-0.3722 z m -23.3522,4.1294 c 0.4194,0.6816 0.2009,0.3067 0,0 z m 22.2317,0.07 c -0.3376,0.3349 -0.8488,0.7222 -1.9066,0.7222 0.7924,0 1.3877,-0.3381 1.9066,-0.7222 z M 28.7543,99.127 c -0.015,0.033 -0.039,0.046 -0.054,0.08 -0.01,0.014 -0.027,0.039 0.034,-0.054 0,0 0.017,-0.022 0.02,-0.026 z m 25.0367,2.449 c 0.055,0.126 0.1661,0.436 0.1661,0.464 -0.085,-0.177 -0.043,-0.259 -0.1661,-0.464 z m -0.3801,3.159 c -0.1146,0.103 -0.1146,0.103 0,0 z M 19.179,106.06 c -0.2051,0.08 -0.5081,0.395 -0.7622,0.538 0.055,-0.04 0.1311,-0.138 0.1701,-0.172 0.2345,-0.212 0.3797,-0.286 0.5921,-0.366 z m -1.0703,0.852 c -0.01,0.02 -0.032,0.04 -0.042,0.06 0.015,-0.02 0.026,-0.04 0.042,-0.06 z m 3.017,1.818 c 1.6972,-0.06 -2.9236,0.704 -0.3321,0.189 0.083,-0.03 0.2698,-0.183 0.3321,-0.189 z m 28.1978,3.397 c 0.04,0.03 0.1427,0.129 0.1541,0.143 -0.068,-0.05 -0.081,-0.09 -0.1541,-0.143 z m -6.2862,20.235 c 0.5092,1.174 1.0605,2.596 1.5586,3.226 0.039,1.775 0.7743,3.729 2.0427,4.918 0.3247,0.304 -0.152,0.566 -0.152,-1.022 0,1.182 0.242,1.618 0.4861,2.344 0.2441,0.727 0.5585,1.517 0.9144,2.337 0.4501,1.036 1.0081,1.969 1.5384,2.941 -0.269,-0.292 -0.5663,-0.593 -1.0344,-0.819 -0.3801,-0.183 -0.6447,-0.208 -0.9322,-0.264 -0.057,-0.281 -0.1035,-0.491 -0.1661,-0.806 -0.3073,-1.546 -0.5808,-2.902 -0.8803,-3.875 -0.2446,-0.794 -0.576,-1.504 -0.9543,-2.181 -0.1907,-0.341 -0.5167,-0.67 -0.7403,-0.989 -0.036,-0.536 -0.1346,-0.996 -0.2601,-1.46 -0.2094,-0.773 -0.4745,-1.508 -0.9843,-2.305 0.034,0.05 -0.064,-0.727 -0.036,0.14 -0.019,-0.588 -0.2835,-1.513 -0.4002,-2.185 z m 8.3089,19.78 c 0.03,0.06 0.047,0.189 0.074,0.243 -0.023,-0.04 -0.034,-0.05 -0.068,-0.199 0,0 0,-0.03 -0.01,-0.04 z m 32.4073,1.504 c 0.051,0.08 0.1634,0.297 0.1681,0.322 -0.062,-0.08 -0.1177,-0.263 -0.1681,-0.322 z m 0.3962,1.489 c 0.018,0.09 0.035,0.441 0.024,0.516 0.042,-0.287 -0.01,-0.346 -0.024,-0.516 z m -0.01,0.726 c -0.6756,1.614 -0.4943,0.941 -0.9484,1.612 0.5652,-0.516 0.8471,-1.156 0.9484,-1.612 z m -30.5768,0.83 c 0.4434,0.25 0.9036,0.499 1.7567,0.499 -1.2368,0 -1.5737,-0.266 -1.7567,-0.499 z m 29.5564,0.866 c -1.7171,0.97 -0.7315,0.61 -1.9708,0.725 0.034,0.648 5.0637,-2.675 1.9708,-0.725 z m -49.2172,6.262 c 0.01,0.09 -0.1544,0.02 0.3241,0.881 -0.3309,-0.596 -0.2783,-0.67 -0.3001,-0.762 -0.016,-0.07 -0.02,-0.09 -0.024,-0.119 z m 10.5817,2.019 c 0,0.136 0.087,0.425 0.116,0.632 0,-0.02 -0.044,-0.06 -0.048,-0.07 -0.073,-0.315 -0.068,-0.462 -0.068,-0.557 z m 5.782,0.739 c 0,-0.09 0.077,0 0.01,0.235 2e-4,-0.04 -0.011,-0.208 -0.01,-0.235 z m 2.1388,0.678 c -0.047,0.116 -0.2601,0.485 -0.3201,0.554 0.077,-0.185 0.2752,-0.383 0.3201,-0.554 z m -25.737,7.712 c -0.1979,0.123 -0.4152,0.393 -0.6303,0.625 0.024,-0.03 0.035,-0.121 0.056,-0.144 0.2898,-0.319 0.4698,-0.416 0.5743,-0.481 z m -0.6203,4.42 c 0.1723,0.179 0.2908,0.347 0.6262,0.555 -0.1137,-0.07 -0.3098,-0.176 -0.6142,-0.523 0,0 -0.01,-0.03 -0.012,-0.03 z"
         style="fill:none;stroke:#faa61a;stroke-width:0.67756897;stroke-linecap:round;stroke-linejoin:round;stroke-miterlimit:4;stroke-dasharray:none;stroke-opacity:1" />
      <path
         inkscape:connector-curvature="0"
         id="path1754"
         d="m 45.0701,24.9858 c -1.1481,-0.018 -2.3556,0.39 -3.1952,0.9483 1.5138,-1.0074 1.1023,-0.5081 0.9164,-0.4702 -0.19,0.039 -0.563,0.098 -0.9444,0.1441 -0.7628,0.091 -2.1768,-0.041 -1.1184,0.128 -0.4983,-0.08 -1.605,-0.2847 -2.997,0.182 -1.1482,0.3851 -1.7228,0.9003 -2.1168,1.2785 -0.2573,0.1014 -0.5137,0.2069 -0.7922,0.3281 -0.6654,0.2899 -1.3993,0.6297 -2.0667,0.9724 0.3111,-0.1597 -0.5722,-0.1701 0.9742,-0.1701 -2.0918,0 -3.7874,1.2696 -4.6176,2.2108 0.4129,-0.468 0.025,-0.036 -0.3161,0.238 -0.3405,0.2745 -0.7952,0.6188 -1.2104,0.9144 -0.9104,0.6483 -1.2555,0.879 -1.5665,1.0884 -0.2525,0.096 -0.611,0.1713 -0.7823,0.242 -0.7426,0.3069 -1.1655,0.6102 -1.5785,0.9303 -0.692,0.5367 -1.3029,1.1115 -1.9107,2.2569 -0.6314,0.5256 -1.1364,0.9925 -1.7565,1.5925 -0.1157,0.1118 -0.1636,0.1477 -0.2561,0.2281 -0.1579,0.078 -0.4347,0.1534 -0.5583,0.2261 -0.6696,0.3936 -1.0205,0.7235 -1.3764,1.0764 -0.6856,0.6794 -1.4787,0.8238 -1.9067,3.4532 0.3328,-0.1405 0.8033,-0.2622 1.6466,-0.2622 -0.9439,0 -1.6723,0.3064 -2.3449,0.6443 0.051,-0.031 0.042,-0.034 0.11,-0.072 0.1341,-0.075 0.3249,-0.1974 0.5863,-0.3082 0.1599,-0.8213 0.3312,-1.0913 0.3641,-1.1503 0.039,-0.069 -6e-4,8e-4 -0.072,0.1041 -0.1429,0.2063 -0.4194,0.5697 -0.6962,0.9043 -0.2033,0.2456 -0.3677,0.4217 -0.5202,0.5861 -0.8314,0.4608 -1.4862,1.0453 -1.9007,1.5966 -0.7685,1.0219 -1.1243,2.0403 -1.2945,3.1231 0.1375,-0.8748 0.1039,-0.4372 0,-0.1841 -0.1014,0.2532 -0.2662,0.6262 -0.436,0.9843 -0.1493,0.3146 -0.2958,0.5962 -0.4102,0.8084 -0.088,0.081 -0.1192,0.1105 -0.204,0.188 -0.3626,0.331 -1.44322,1.4942 -1.79272,2.901 -0.3495,1.4068 -0.15881,2.0226 -0.10403,2.5668 -0.0211,-0.2092 -0.0499,0.2372 -0.0781,0.5523 0.003,-0.01 0.0268,-0.019 0.03,-0.024 -0.014,0.016 -0.0204,0.032 -0.034,0.048 -0.0136,0.1446 -0.0103,0.1282 -0.036,0.2501 -0.0434,0.2014 -0.10441,0.3673 -0.0701,0.2801 0.0144,-0.037 -0.037,-0.1975 0.018,-0.4062 -0.82139,1.0342 -0.96947,2.0859 -1.07638,2.9351 -0.12407,0.9854 -0.006,2.0443 0.51218,3.2532 0.14682,0.3421 0.17076,0.6376 0.42015,1.0183 -0.68292,-1.0423 -0.36812,-0.7973 -0.36413,-0.7503 0.002,0.022 -0.12394,0.078 -0.15405,-0.028 -0.17485,0.4118 -0.45493,0.7611 -0.17606,2.4408 -0.0235,-0.1406 0.0131,0.127 0.012,0.1141 0.13547,1.6195 0.51599,1.9093 0.79028,2.3649 0.19079,0.3168 0.43524,0.5866 0.67624,0.8663 -0.0167,-0.034 0.0262,0.042 0.064,0.2781 0.0915,0.5714 0.21093,1.1137 0.45815,1.7585 0.21527,0.5615 0.43057,1.3641 1.79457,2.3769 0.2088,0.4119 0.4101,0.8563 0.6463,1.1524 0.5671,0.711 0.9852,1.6703 2.7569,2.0467 -0.1762,-0.092 -0.1215,-0.192 -0.166,-0.2161 -0.09,-0.049 -0.051,-0.027 -0.088,-0.056 0.1587,0.1285 0.3634,0.1796 0.5262,0.3021 0.4099,0.07 0.7891,0.152 1.3545,0.152 -0.8439,0 -1.1198,-0.076 -1.3485,-0.15 2.8414,2.1378 6.2467,3.4234 9.8635,3.7133 0.3321,0.027 0.6483,-0.07 0.9783,-0.062 0.017,1.2561 0.2665,2.3117 0.7963,3.0791 -1.0355,0.2438 -2.0938,0.3863 -3.0131,0.6963 -3.2908,1.1095 -6.1957,3.2388 -9.6673,6.5123 l -1.8707,1.7645 a 4.78428,4.78428 0 0 0 -1.4585,4.1195 l 0.1161,0.8583 a 4.78428,4.78428 0 0 0 0,0.01 c 0.508,3.7062 2.9554,6.3812 6.042,8.8462 -0.3328,0.25 -0.6664,0.487 -1.0243,0.942 -0.9669,1.233 -1.2469,3.473 -0.8823,4.701 0.02,0.06 0.044,0.06 0.064,0.128 -0.1316,0.344 -0.3276,0.611 -0.3901,1.027 -0.262,1.742 0.6019,3.64 1.5385,4.578 1.9729,1.972 2.4602,1.425 3.1111,1.56 0.1295,0.03 0.243,0.03 0.3682,0.05 -0.031,1.228 -0.079,2.477 0,3.644 0.01,0.138 -0.088,1.125 0,0.678 -0.039,0.207 -0.082,0.404 -0.1241,0.782 -0.042,0.377 -0.2502,0.956 0.2641,2.379 0.247,0.683 0.8988,1.386 1.6085,1.965 0.5379,0.997 1.1793,1.911 2.0848,2.66 0.7513,0.623 1.8707,1.254 3.193,1.503 0.4138,1.456 0.8929,2.74 1.5826,4.005 0,0.02 0.01,0.03 0.01,0.05 0.082,1.982 0.6477,3.565 1.5586,5.152 -0.023,1.746 0.1853,3.259 0.5501,4.952 0.053,0.246 0.1485,0.7 0.2001,0.952 0.1207,0.589 0.2533,1.011 0.3942,1.477 -0.1265,0.249 -0.3856,0.518 -0.5022,0.775 -0.4253,0.941 -0.8094,1.757 -0.9044,3.328 -0.088,1.458 0.2004,2.495 0.6423,3.531 0.2407,0.565 0.5283,1.161 1.0084,1.764 0.014,0.103 0,0.02 0.018,0.145 0.073,0.618 0.1918,1.458 0.2961,2.107 0.049,0.305 0.1862,1.418 0.2401,2.028 0.037,0.417 0.077,0.802 0.116,1.133 0.02,0.165 0.037,0.31 0.064,0.484 0.011,0.07 0.028,0.166 0.05,0.28 0.01,0.05 0.01,0.08 0.016,0.166 0.027,0.282 0.062,0.707 0.094,1.161 0.016,0.234 0.012,0.214 0.016,0.328 0.018,-0.08 0.1442,-0.297 -0.3361,0.342 -1.445,1.924 -4.4271,4.42 -5.2999,4.863 -0.431,0.22 -1.4556,0.487 -2.5128,2.123 -1.0572,1.636 -0.8783,2.875 -0.8783,3.341 0,0.304 0.061,0.604 0.094,0.895 0,0.02 -0.018,0.03 -0.02,0.05 -0.1603,1.764 0.5537,2.922 1.0363,3.565 0.9646,1.284 1.6369,1.556 2.3568,1.964 1.0248,0.583 3.4363,1.112 4.6877,1.039 2.6151,-0.152 5.7682,-0.843 8.1909,-1.561 0.6087,-0.18 1.7643,-0.488 2.869,-1.407 0.6234,-0.517 0.7876,-0.892 1.0844,-1.308 0.3447,0.01 0.4755,0.123 0.9282,0.06 1.2919,-0.185 2.0513,-0.664 2.525,-0.923 0.6766,-0.37 1.2926,-0.738 1.9686,-1.318 0.6761,-0.58 1.6566,-1.404 2.0308,-3.345 0.062,-0.327 0.1338,-0.747 0.2221,-1.257 0.1979,-1.145 -0.099,-0.08 0.3661,-1.262 0.068,-0.17 0,-0.09 0.044,-0.234 a 4.78428,4.78428 0 0 0 3.5853,-4.602 c 0.2523,-0.553 0.4568,-1.204 0.4802,-1.885 0.028,-0.805 -0.1341,-1.092 -0.2441,-1.53 0.4644,0.715 0.5515,0.974 1.1303,1.843 0.988,1.481 0.741,1.178 1.0804,1.694 -0.1485,0.222 -0.4178,0.407 -0.5061,0.634 -0.6366,1.639 -0.5723,2.468 -0.3682,3.056 -0.081,0.552 -0.2129,1.078 -0.036,1.784 0.1701,0.678 0.4815,1.029 0.7643,1.447 0.1569,0.612 0.518,1.352 1.4625,2.296 0.575,0.576 1.3843,0.946 2.1947,1.178 0.6739,0.454 1.5968,0.802 3.1052,0.709 0.7116,-0.04 1.4623,-0.308 2.1307,-0.684 1.7248,1.308 4.76,2.196 6.9504,1.67 3.3245,-0.797 5.912,-3.259 7.1986,-6.286 0.076,-0.177 0.2021,-0.422 0.356,-1.018 0.061,-0.237 -0.03,-0.713 0,-1.073 0.2972,-0.236 0.3276,-0.262 0.6243,-0.495 1.4956,-1.178 3.2597,-2.481 4.1654,-4.843 0.9058,-2.361 0.7567,-4.078 0.8684,-7.118 0.034,-0.916 0.1254,-1.418 -0.056,-2.588 -0.1227,-0.792 -0.641,-1.708 -1.1084,-2.424 -0.048,-0.09 -0.1245,-0.32 -0.164,-0.392 -0.2191,-0.401 -0.3768,-0.623 -0.5563,-0.878 -0.3588,-0.51 -0.2867,-0.726 -1.5645,-1.765 -2.5935,-2.11 -3.9408,-1.422 -5.2938,-1.197 -0.6765,0.114 -1.3402,0.282 -2.1367,0.68 -0.7482,0.375 -1.8354,1.011 -2.597,2.716 -0.5348,-0.995 -0.9556,-1.61 -1.2524,-2.297 -0.069,-0.158 -0.1559,-0.357 -0.2421,-0.554 0.1413,-0.724 0.2244,-1.514 0.028,-2.549 -0.2864,-1.51 -1.6624,-3.42 -3.1711,-4.14 -0.6422,-0.306 -1.7234,-0.412 -2.781,-0.405 -0.5544,-1.05 -1.2131,-2.3 -1.5546,-2.966 -0.9942,-1.937 -2.0399,-3.468 -3.2811,-4.784 -0.1229,-1.236 -0.5851,-2.401 -1.4645,-3.541 -0.4287,-3.082 -1.7008,-6.939 -3.3731,-11.426 -0.6354,-1.704 -1.4646,-3.371 -2.3468,-4.849 -0.4439,-0.744 -0.7264,-1.384 -1.1905,-2.031 0.2059,-0.226 0.4666,-0.528 0.5742,-0.638 0.9737,-1 1.9029,-2.537 2.3208,-3.881 0.3411,-1.096 0.5515,-2.151 0.6423,-3.218 0.014,-0.168 0.034,-0.346 0.063,-0.504 0.4729,-0.513 0.9219,-0.924 1.3985,-2.177 0.193,-0.508 0.6648,-1.763 0.2,-3.4212 -0.024,-0.084 -0.07,-0.1109 -0.096,-0.1901 0,-0.011 0,-0.013 0,-0.023 0.237,-0.3798 0.6279,-0.7495 0.7402,-1.0984 0.2407,-0.7474 0.35,-1.5731 0.2341,-2.4229 0.2823,-0.2678 0.6396,-0.4908 0.8503,-0.7882 0.7286,-1.0282 1.0783,-2.5248 0.7363,-4.1815 3.7548,-4.0879 5.5212,-6.2065 6.8924,-8.505 0.1528,-0.2562 0.3219,-0.5271 0.4482,-0.7242 0.1263,-0.1971 0.4047,-0.531 0.023,-0.064 0.8072,-0.9849 0.7138,-1.0591 0.9482,-1.4945 0.2346,-0.4356 0.481,-0.9217 0.7263,-1.4225 0.3933,-0.8026 0.7006,-1.4948 1.0224,-2.3489 l 0.224,-0.202 a 4.78428,4.78428 0 0 0 1.5621,-3.8248 l -0.118,-2.0529 v 0 C 71.6161,64.058 69.9403,58.7184 67.0213,54.412 c 1e-4,-0.1766 0.031,-0.3626 0.02,-0.5442 -0.033,-0.5504 0.072,-0.9754 -0.5502,-2.2907 -0.1796,-0.3802 -0.3509,-0.7649 -0.4521,-1.0084 -0.039,-0.092 -0.05,-0.127 -0.061,-0.1521 0,-0.01 -0.01,-0.042 -0.01,-0.048 -0.051,-0.1712 -0.084,-0.2582 -0.1121,-0.3341 -0.056,-0.1517 -0.093,-0.2427 -0.1339,-0.3401 -0.082,-0.1948 -0.168,-0.3871 -0.2702,-0.6123 -0.2043,-0.4502 -0.4678,-1.0087 -0.7582,-1.6106 -0.024,-0.048 -0.045,-0.09 -0.068,-0.1379 0.025,-0.028 0.046,-0.046 0.072,-0.074 0.296,-0.3228 1.5948,-1.534 2.2328,-2.0427 0.9329,-0.744 1.6972,-1.0867 2.6829,-2.809 0.4928,-0.8611 0.8908,-2.3915 0.6602,-3.6912 -0.2306,-1.2997 -0.7889,-2.0719 -1.1403,-2.5349 -1.0309,-1.3581 -2.6739,-2.0801 -3.9314,-2.2428 -1.2576,-0.1628 -2.2534,0.039 -3.1331,0.3181 -0.3319,0.1054 -0.598,0.2943 -0.9064,0.4281 -0.029,-0.046 -0.056,-0.1061 -0.086,-0.152 -0.4326,-0.6868 -0.669,-1.1962 -1.7566,-2.1588 -0.9744,-0.8628 -3.2652,-1.6843 -4.8336,-1.4505 -0.2312,0.035 -0.3554,0.1098 -0.5562,0.156 -0.7587,-1.3351 -2.3997,-2.5672 -4.3496,-2.677 a 4.78428,4.78428 0 0 0 -0.01,-0.042 c 1.3589,0.056 1.7404,0.4277 1.9007,0.5262 0.1726,0.1062 0.1074,0.078 -0.032,-0.04 C 51.1601,28.612 50.5417,28.0343 49.6984,27.1825 49.1505,26.629 48.3326,26.036 47.2937,25.578 a 4.78428,4.78428 0 0 0 -2.219,-0.5923 z m -7.1946,1.7045 c -2.0967,0.2089 -0.1166,-0.3099 -2.0987,0.4382 0.1495,-0.1841 0.4021,-0.4381 2.0987,-0.4382 z m 22.6479,7.8027 c 0.069,0.042 0.1491,0.088 0.3802,0.3082 -0.011,0 -0.021,0.011 -0.032,0.016 -0.1674,-0.119 -0.1376,-0.1943 -0.3484,-0.3246 z M 21.88,37.4261 c 0.078,0 0.23,0.096 0.3141,0.1004 -0.4412,-0.028 -0.7756,0.029 -1.0984,0.084 0.2382,-0.079 0.4078,-0.1712 0.7843,-0.1841 z m 41.8865,0.7403 c 0.4406,0.5505 0.6469,1.0094 0.7003,1.1503 -0.2365,-0.6242 -0.4726,-0.7845 -0.7003,-1.1503 z m -1.5764,0.4441 c -0.072,0.6197 -0.253,1.2945 -0.6524,1.9407 0.5621,-0.9094 0.5734,-1.4025 0.6524,-1.9407 z m -4.8798,2.0908 c 0.023,0.074 0.022,0.096 0.021,0.146 0,-0.048 -0.016,-0.098 -0.021,-0.146 z m 8.6651,9.7333 c 0.1563,0.046 0.6102,3.5184 0.196,1.3245 -0.091,-1.0729 0.1886,-0.5194 -0.196,-1.3245 z m -9.3273,15.6875 c -0.3689,0.4076 -0.4921,1.0772 -0.7242,1.6526 -0.01,-0.041 -0.014,-0.096 -0.021,-0.1381 0.3105,-1.071 0.7537,-1.5249 0.7443,-1.5145 z m -44.9257,1.4365 c -0.5333,0.863 -0.6462,1.6092 -0.6862,2.2928 0.02,-0.6819 0.175,-1.4656 0.6862,-2.2928 z m 19.0487,13.7528 c -0.013,0.05 0,0.071 -0.01,0.118 0,0 0,0 -0.01,0.01 0.01,-0.018 0.012,-0.1105 0.016,-0.124 z m 24.2564,4.6976 c 0.936,0 1.3473,0.069 1.7207,0.2961 -0.5901,-0.1228 -1.198,-0.2961 -1.7207,-0.2961 z m 2.3868,6.5383 c 0.6744,0.8126 0.8893,1.3493 0.9603,1.7366 -0.025,0.077 -0.041,0.154 -0.066,0.2141 -0.1859,-0.6522 -0.3621,-1.3094 -0.8944,-1.9507 z m 1.1784,1.0123 c -6e-4,0.01 0,0.034 0,0.036 0,-0.034 5e-4,0 0,-0.036 z m -1.2683,2.525 c -0.3408,0.1978 -1.4783,0.5163 -1.0965,0.424 -0.038,-0.033 -0.078,-0.081 -0.112,-0.11 0.418,-0.088 0.8562,-0.1445 1.2085,-0.314 z m -1.2905,0.3341 c 0.017,0.015 0.051,0.087 0.072,0.106 -0.2948,0.062 -0.5034,0.144 -1.0304,0.144 0.3777,0 0.6232,-0.1852 0.9584,-0.25 z m -28.602,1.6346 c -0.059,0.1294 -0.1639,0.225 -0.2341,0.3501 0.02,-0.042 0.021,-0.058 0.1024,-0.1821 0.02,-0.031 0.1038,-0.1261 0.1321,-0.168 z m 28.796,2.2507 c -0.1577,0.129 -0.3012,0.199 -0.5122,0.318 0.1823,-0.09 0.3476,-0.205 0.5122,-0.318 z m -0.9703,0.39 c 7e-4,0 0.019,0.04 0.021,0.04 0,0 0,0 0,0 -0.012,-0.02 0,-0.02 -0.016,-0.04 z m 0.074,0.164 c 0.082,0.182 0.2794,0.735 0.2961,0.831 -0.125,-0.296 -0.094,-0.456 -0.3061,-0.825 0,0 0.01,0 0.01,-0.01 z m -38.4851,4.906 c -0.1051,0.189 -0.2508,0.349 -0.3342,0.548 0.1224,-0.228 0.1998,-0.405 0.3342,-0.548 z m 37.8431,0.109 c -0.3992,0.447 -0.7165,0.618 -0.6822,0.596 0.2932,-0.193 0.4453,-0.402 0.6822,-0.596 z m -4.4295,4.823 c 0.1193,0.09 0.4328,0.381 0.4702,0.426 -0.2003,-0.149 -0.2278,-0.267 -0.4702,-0.426 z m -5.1558,30.493 c 0.01,0 0.01,0.02 0.016,0.02 0.04,0.123 0.048,0.357 0.092,0.472 -0.053,-0.06 -0.053,-0.376 -0.108,-0.497 z m 39.7658,11.065 c 0.033,0.04 0.2115,0.303 0.2681,0.395 -0.081,-0.107 -0.2168,-0.344 -0.2681,-0.395 z m 0.7203,1.175 c 0.078,0.129 0.1344,0.29 0.204,0.54 -0.014,-0.04 -0.031,-0.115 -0.042,-0.152 -0.077,-0.262 -0.1038,-0.245 -0.162,-0.388 z m 0.3121,1.988 c 0,0.04 -0.01,0.27 -0.019,0.341 0.017,-0.136 0.012,-0.225 0.019,-0.341 z m -0.098,0.861 c -0.3203,0.989 -0.1593,0.672 -0.336,0.924 0.1519,-0.331 0.2722,-0.651 0.336,-0.924 z m -34.0498,1.339 c 0.1743,0.182 0.3147,0.343 0.5542,0.504 0.019,0.03 0.064,0.102 0.084,0.138 -0.1793,-0.133 -0.4099,-0.248 -0.6382,-0.369 9e-4,-0.102 -10e-4,-0.172 0,-0.273 z m 0.9904,0.724 c 0.028,0.01 0.053,0.03 0.082,0.04 -0.027,-0.02 -0.057,-0.02 -0.082,-0.04 z m 31.4389,0.552 c -0.6117,0.582 -2.5237,1.249 -1.6686,0.901 -0.5448,0.161 -1.001,0.199 -1.3645,0.199 0.803,0 2.0463,-0.298 3.0331,-1.1 z m -51.9502,5.286 c 0.01,0.127 -0.2596,0 0.5042,1.358 -0.5293,-0.949 -0.4387,-1.056 -0.4741,-1.207 -0.02,-0.09 -0.022,-0.108 -0.03,-0.151 z m 10.5417,1.66 c 0,0.283 0.117,0.829 0.2501,1.369 -0.037,-0.137 -0.1162,-0.325 -0.14,-0.428 -0.117,-0.509 -0.1101,-0.765 -0.1101,-0.941 z m 9.2032,0.813 c 0,-0.02 0.1254,0.168 0.026,0.586 -0.01,-0.19 -0.027,-0.566 -0.026,-0.586 z m 2.0828,1.036 c 0,0.239 -0.3886,0.863 -0.2561,0.664 0.087,-0.223 0.2023,-0.459 0.2561,-0.664 z m -9.8675,0.444 c 0.1225,0.321 0.4588,0.69 0.6783,1.055 -0.3927,-0.489 -0.6251,-0.915 -0.6783,-1.055 z m 24.8747,5.354 c -0.015,0.107 -0.096,0.287 -0.13,0.422 -0.036,0.05 -0.073,0.116 -0.1061,0.158 0.037,-0.173 0.2145,-0.428 0.2361,-0.58 z m -43.3091,0.03 c -0.3735,0.232 -0.8045,0.696 -1.2044,1.194 0.093,-0.127 0.1915,-0.328 0.2741,-0.418 0.4558,-0.502 0.7461,-0.662 0.9303,-0.776 z m -1.6006,1.797 c -0.077,0.125 -0.092,0.284 -0.16,0.418 0.061,-0.149 0.092,-0.287 0.16,-0.418 z m 0.5682,5.151 c 0.268,0.294 0.4829,0.579 1.0484,0.928 -0.1975,-0.122 -0.5165,-0.298 -1.0003,-0.85 -0.015,-0.02 -0.033,-0.06 -0.048,-0.08 z"
         style="fill:none;stroke:#faa61a;stroke-width:0.67756897;stroke-linecap:round;stroke-linejoin:round;stroke-miterlimit:4;stroke-dasharray:none;stroke-opacity:1" />
      <path
         inkscape:connector-curvature="0"
         id="path939"
         d="m 44.9935,29.7704 c -0.1674,0 -0.3235,0.046 -0.4713,0.1457 -0.4581,0.3078 -3.6451,0.6892 -4.5501,0.5444 -0.6657,-0.1064 -0.8081,-0.058 -1.3373,0.4472 -0.3258,0.3113 -0.6672,0.5661 -0.7589,0.5661 -0.1883,0 -1.8801,0.7367 -2.9355,1.2783 -0.3847,0.1975 -0.929,0.3594 -1.2094,0.3594 -0.3469,0 -0.6765,0.189 -1.0314,0.5913 -0.2868,0.3253 -1.3393,1.1737 -2.3389,1.8855 -2.404,1.712 -2.7729,1.9394 -2.9594,1.8242 -0.2981,-0.1843 -1.337,0.6213 -1.5939,1.236 -0.1415,0.3389 -0.4846,0.7936 -0.7623,1.0108 -0.2777,0.2172 -1.0552,0.9274 -1.7276,1.578 -0.6723,0.6505 -1.3029,1.1329 -1.4013,1.0722 -0.2675,-0.1653 -1.2782,0.8362 -1.3483,1.3363 -0.082,0.5816 -2.6271,3.6588 -3.0266,3.6588 -0.4707,0 -0.9183,0.5953 -1.0427,1.3875 -0.1073,0.6831 -1.4981,3.6123 -1.89,3.9804 -0.1066,0.1004 -0.4033,0.3734 -0.6596,0.6073 -0.4252,0.3883 -0.4568,0.5155 -0.3621,1.4558 0.126,1.2525 -0.3838,3.6233 -0.8331,3.8748 -0.459,0.2568 -0.5959,1.3429 -0.2381,1.8889 0.4244,0.6478 0.5659,2.3117 0.242,2.8475 -0.1414,0.2338 -0.2401,0.5278 -0.2193,0.6528 0.021,0.1251 0.048,0.3503 0.061,0.5004 0.012,0.1501 0.1822,0.4321 0.377,0.6269 0.5566,0.5567 0.929,1.4052 1.1085,2.5255 0.1004,0.6294 0.2831,1.1038 0.4673,1.2148 0.6951,0.4185 1.3392,1.0457 1.2393,1.2072 -0.176,0.2849 0.4493,1.0673 0.853,1.0673 0.206,0 0.7158,0.2766 1.133,0.6148 2.035,1.6498 4.8735,2.7338 7.7639,2.9654 2.0506,0.1643 5.1438,-0.4617 7.3972,-1.4972 0.3154,-0.145 0.6442,-0.2634 0.7307,-0.2634 0.086,0 0.5959,0.6566 1.1323,1.4592 0.5364,0.8027 1.0774,1.5192 1.2027,1.5922 0.3244,0.1893 1.3989,2.387 1.2695,2.5965 -0.1817,0.2939 -0.609,0.1949 -0.8143,-0.1887 -0.1069,-0.1998 -0.5326,-0.5357 -0.9461,-0.7466 -0.9014,-0.4599 -1.616,-0.389 -2.6498,0.2637 -0.3978,0.2511 -1.0003,0.4881 -1.3387,0.5263 -0.4726,0.053 -0.6292,0.1645 -0.675,0.4783 -0.08,0.547 0.401,1.2429 1.1725,1.6981 0.6059,0.3575 0.6187,0.3862 0.3166,0.72 -0.2996,0.3312 -0.2955,0.3673 0.088,0.751 0.3214,0.321 0.6058,0.4007 1.3992,0.393 0.5478,-0.01 1.0939,-0.1076 1.2138,-0.2274 0.3578,-0.3579 0.492,-0.2487 0.3483,0.283 -0.075,0.2751 -0.1134,0.7387 -0.087,1.0302 0.067,0.7236 -0.4973,1.4707 -1.1458,1.5193 -0.3084,0.024 -0.717,0.2586 -1.0118,0.5833 -0.4918,0.5414 -0.6775,0.6044 -2.4171,0.8199 -1.2705,0.1572 -3.9764,0.784 -5.2769,1.2225 -2.3328,0.7865 -4.667,2.3964 -7.9157,5.4595 l -1.8712,1.7646 0.1177,0.8593 c 0.2873,2.0966 1.9925,4.2685 5.2084,6.6355 1.0088,0.742 2.2479,1.727 2.7531,2.188 0.5053,0.462 1.5261,1.158 2.2682,1.547 0.8742,0.459 1.3174,0.793 1.2588,0.951 -0.05,0.133 -0.09,0.604 -0.09,1.045 0,0.757 -0.03,0.806 -0.5004,0.802 -0.6887,0 -0.8477,-0.143 -1.2751,-1.117 -0.3974,-0.905 -0.8467,-1.176 -1.6255,-0.98 -0.4261,0.107 -0.4543,0.175 -0.3487,0.835 0.064,0.396 0.075,0.72 0.027,0.72 -0.049,0 -0.3568,-0.164 -0.6845,-0.364 -0.9667,-0.59 -1.9607,-0.408 -1.9607,0.359 0,0.159 -0.2456,0.382 -0.5459,0.494 -0.8386,0.317 -0.6956,0.8 0.5773,1.952 0.981,0.888 1.0671,1.016 0.6823,1.017 -1.4166,0 -2.3807,0.775 -1.7525,1.403 0.4044,0.405 3.2896,0.606 4.2008,0.293 0.8818,-0.302 1.2166,-0.306 1.1138,-0.01 -0.3947,1.122 -0.6263,5.277 -0.4489,8.051 0.038,0.602 0,1.441 -0.075,1.867 -0.1365,0.729 -0.1215,0.771 0.2608,0.727 0.3074,-0.03 0.45,0.08 0.5904,0.5 0.5609,1.654 2.0085,2.852 2.9359,2.43 0.452,-0.206 0.6015,-0.502 1.3629,-2.695 l 0.3448,-0.993 0.1229,0.902 c 0.5653,4.147 1.7061,8.228 2.7426,9.81 0.1644,0.251 0.3053,0.923 0.3326,1.586 0.047,1.147 0.5535,2.643 1.2248,3.622 0.2299,0.335 0.308,0.75 0.2743,1.456 -0.041,0.868 0.1782,2.698 0.5054,4.216 0.059,0.276 0.154,0.726 0.2104,1.001 0.056,0.276 0.2278,0.91 0.381,1.411 0.1532,0.5 0.3399,1.114 0.4154,1.364 0.1057,0.351 0.038,0.559 -0.2967,0.91 -0.6501,0.681 -1.3701,2.272 -1.4226,3.143 -0.052,0.864 0.4369,2.013 0.9815,2.304 0.3433,0.185 0.4627,0.597 0.6624,2.287 0.059,0.5 0.1799,1.36 0.2684,1.91 0.088,0.55 0.2152,1.615 0.2815,2.365 0.067,0.751 0.1436,1.406 0.172,1.456 0.029,0.05 0.1073,0.884 0.1752,1.854 0.1406,2.006 0.1411,2.004 -1.2666,3.878 -1.9061,2.538 -4.8515,5.186 -6.9594,6.256 -0.7339,0.373 -0.7733,0.434 -0.7733,1.198 0,0.442 0.091,0.86 0.2015,0.928 0.1461,0.09 0.1445,0.16 -0.01,0.253 -0.3521,0.218 -0.047,0.623 0.853,1.135 0.7458,0.424 1.0219,0.481 2.0449,0.422 1.3539,-0.08 5.3408,-0.849 7.1101,-1.373 1.1799,-0.349 1.2094,-0.374 2.1818,-1.814 0.5422,-0.803 1.0706,-1.428 1.1742,-1.388 0.1035,0.04 0.6473,0.167 1.2083,0.284 0.9646,0.2 1.0683,0.185 1.9061,-0.273 1.0031,-0.548 1.5236,-0.995 1.5956,-1.368 0.027,-0.142 0.1204,-0.666 0.207,-1.166 0.1941,-1.124 0.1737,-1.053 0.6317,-2.21 0.085,-0.215 0.1156,-0.91 0.069,-1.546 -0.1228,-1.655 -0.09,-2.393 0.1148,-2.598 0.1175,-0.117 0.1788,-0.06 0.1788,0.151 0,0.257 0.1042,0.311 0.468,0.241 0.369,-0.07 0.5032,0 0.6326,0.343 0.2025,0.533 0.6422,0.564 0.7753,0.05 0.095,-0.364 0.1145,-0.366 0.58,-0.06 l 0.4812,0.317 -0.058,-0.712 c -0.043,-0.526 0.032,-0.787 0.2858,-0.998 0.3296,-0.275 0.3305,-0.306 0.026,-0.772 -0.2042,-0.312 -0.2771,-0.65 -0.2036,-0.943 0.099,-0.397 0.054,-0.456 -0.3486,-0.456 -0.3264,0 -0.5139,-0.134 -0.6358,-0.455 -0.1924,-0.506 -0.5033,-0.595 -0.659,-0.189 -0.073,0.188 -0.2613,0.232 -0.6577,0.154 -0.5318,-0.107 -0.5509,-0.09 -0.4315,0.386 0.1142,0.455 0.089,0.486 -0.2918,0.368 -0.2291,-0.07 -0.4631,-0.203 -0.52,-0.291 -0.056,-0.09 -0.068,-2.83 -0.024,-6.093 0.074,-5.523 0.1035,-5.957 0.4247,-6.279 0.3199,-0.319 0.325,-0.384 0.065,-0.888 -0.2888,-0.558 -0.4026,-0.612 -1.1812,-0.567 -0.3718,0.02 -0.7573,-0.103 -1.4157,-0.445 -0.028,-0.01 -0.2935,-1.245 -0.5896,-2.735 -0.2961,-1.49 -0.6577,-3.096 -0.8035,-3.57 -0.3064,-0.994 -1.0417,-2.311 -1.5464,-2.767 -0.1917,-0.174 -0.3217,-0.457 -0.2885,-0.629 0.1179,-0.612 -0.2626,-2.017 -0.7549,-2.787 -0.2774,-0.433 -0.5086,-1.063 -0.52,-1.417 -0.031,-0.961 -0.2407,-2.068 -0.8109,-4.276 -0.5013,-1.941 -0.8364,-3.47 -1.1977,-5.459 -0.054,-0.3 -0.1704,-0.874 -0.2573,-1.274 -0.1483,-0.683 -0.2166,-1.087 -0.4702,-2.775 -0.056,-0.375 -0.1386,-0.887 -0.1823,-1.137 -0.044,-0.25 -0.1239,-1.232 -0.1785,-2.183 -0.08,-1.387 -0.044,-1.798 0.1793,-2.079 0.2263,-0.283 0.3548,-0.312 0.6904,-0.155 1.015,0.475 1.878,1.3 2.1661,2.072 0.799,2.139 1.1394,3.027 1.3512,3.528 0.2192,0.517 1.9081,4.814 3.29,8.37 1.2261,3.155 1.5649,3.883 2.1213,4.558 0.4603,0.559 0.5526,0.819 0.5136,1.453 -0.078,1.27 0.2564,2.13 1.1589,2.976 0.5445,0.51 0.82,0.92 0.82,1.219 0,1.098 1.9465,5.578 3.313,7.626 1.3879,2.08 1.4261,2.17 1.2034,2.76 -0.167,0.442 -0.1493,0.66 0.092,1.145 0.1642,0.329 0.2461,0.682 0.182,0.786 -0.063,0.104 -0.1055,0.476 -0.092,0.826 0.025,0.656 0.619,1.489 1.0625,1.489 0.1314,0 0.4771,0.471 0.7681,1.046 0.8763,1.733 2.096,3.716 4.5312,7.368 2.3624,3.543 2.572,3.877 2.9516,4.709 0.2811,0.616 0.1668,1.177 -0.2264,1.11 -0.167,-0.03 -0.4435,0.162 -0.6144,0.422 -0.2049,0.313 -0.4249,0.445 -0.645,0.387 -0.4603,-0.12 -0.5422,0.09 -0.2922,0.753 0.1815,0.481 0.164,0.617 -0.1191,0.93 -0.3237,0.358 -0.3202,0.372 0.1454,0.584 0.3418,0.156 0.4772,0.356 0.4772,0.704 0,0.616 0.1462,0.761 0.547,0.547 0.2335,-0.125 0.4026,-0.07 0.6412,0.187 0.4292,0.476 0.7748,0.454 0.8465,-0.05 0.039,-0.277 0.1901,-0.417 0.4673,-0.432 0.2254,-0.01 0.4463,-0.03 0.4912,-0.05 0.045,-0.01 0,-0.267 -0.1077,-0.565 -0.1478,-0.424 -0.1309,-0.601 0.078,-0.809 0.2345,-0.235 0.3716,-0.167 1.1312,0.56 0.4753,0.456 1.1568,0.951 1.5146,1.1 0.3578,0.15 0.9822,0.54 1.3874,0.868 1.0647,0.861 1.9031,1.09 3.0075,0.826 1.7096,-0.411 3.1428,-1.695 3.9122,-3.505 0.2411,-0.566 0.2276,-0.615 -0.3274,-1.195 l -0.5785,-0.604 0.4687,-0.397 c 0.2579,-0.218 1.5434,-1.242 2.8571,-2.277 3.0295,-2.387 2.9886,-2.279 3.2127,-8.379 0.066,-1.791 0.047,-1.914 -0.3604,-2.32 -0.2364,-0.237 -0.387,-0.431 -0.3348,-0.431 0.1394,0 -0.6665,-1.144 -0.9933,-1.409 -0.5957,-0.486 -2.4687,-0.172 -2.7082,0.452 -0.4856,1.266 -2.1113,3.595 -3.4473,4.939 l -1.5161,1.525 -0.3565,-0.452 c -1.0724,-1.364 -3.4706,-5.708 -4.624,-8.376 -0.1623,-0.374 -0.4261,-0.977 -0.5861,-1.338 -0.2427,-0.548 -0.2554,-0.785 -0.076,-1.425 0.314,-1.122 0.1889,-1.783 -0.3895,-2.059 -0.3599,-0.171 -0.616,-0.181 -1.0007,-0.03 -0.495,0.186 -1.2445,0.899 -1.3832,1.315 -0.107,0.321 -0.5754,0.03 -0.8632,-0.528 -0.1471,-0.287 -0.7675,-1.464 -1.379,-2.615 -0.6115,-1.151 -1.4691,-2.789 -1.9057,-3.639 -1.0244,-1.996 -1.8442,-3.186 -2.8339,-4.111 -0.6493,-0.607 -0.7958,-0.863 -0.7958,-1.388 0,-0.866 -0.4643,-2.128 -0.9891,-2.688 -0.2905,-0.309 -0.4702,-0.78 -0.5555,-1.457 -0.2391,-1.899 -1.5259,-6.21 -3.1708,-10.623 -1.0089,-2.706 -2.9417,-5.943 -3.9385,-6.597 -0.2505,-0.164 -0.425,-0.329 -0.3877,-0.366 0.038,-0.04 -0.031,-0.593 -0.151,-1.234 l -0.2193,-1.166 0.9766,-1.152 c 0.537,-0.634 1.3521,-1.538 1.8114,-2.011 0.6069,-0.624 0.9295,-1.16 1.1796,-1.964 0.4688,-1.506 0.6091,-3.15 0.311,-3.647 -0.208,-0.345 -0.1834,-0.423 0.2203,-0.689 0.6747,-0.443 1.472,-1.322 1.6696,-1.842 0.1425,-0.375 0.1035,-0.515 -0.2157,-0.7735 -0.2953,-0.2392 -0.3555,-0.416 -0.2484,-0.7301 0.078,-0.2279 0.1506,-0.4552 0.1617,-0.5053 0.011,-0.05 0.1232,-0.5619 0.2492,-1.1372 0.138,-0.6307 0.3249,-1.0463 0.4698,-1.0463 0.3346,0 0.5093,-0.5421 0.2683,-0.8324 -0.1319,-0.1589 -0.1515,-0.5976 -0.057,-1.2961 0.078,-0.5807 0.1459,-1.1016 0.1507,-1.1576 0.024,-0.2599 1.0162,-1.263 1.2493,-1.263 0.3776,0 0.6961,-0.4499 0.5633,-0.7958 -0.067,-0.1736 -0.3194,-0.2961 -0.6116,-0.2961 -0.274,0 -0.6474,-0.1648 -0.8295,-0.366 -0.3756,-0.4149 -0.4936,-0.2296 1.5645,-2.4497 4.6066,-4.9696 5.9017,-6.5381 7.2111,-8.7332 0.3602,-0.6036 0.7557,-1.2203 0.8787,-1.3703 0.3441,-0.4199 1.833,-3.4586 2.0954,-4.2761 0.1284,-0.4004 0.477,-0.9485 0.7745,-1.218 l 0.5405,-0.4901 -0.1162,-2.0574 c -0.2674,-4.7876 -1.8217,-9.5525 -4.24,-13.0057 -0.7306,-1.0434 -0.778,-1.1819 -0.6705,-1.9653 0.065,-0.4695 0.032,-1.0201 -0.074,-1.2432 -0.4202,-0.8886 -0.7725,-1.7364 -0.7725,-1.8594 0,-0.072 -0.4519,-1.0672 -1.0044,-2.212 -1.0891,-2.2568 -1.5241,-2.6551 -2.7127,-2.4846 l -0.5591,0.08 0.5459,-0.4651 c 0.3002,-0.2559 0.9553,-0.6764 1.4557,-0.9348 0.517,-0.2669 1.4051,-1.01 2.0567,-1.7205 0.6308,-0.6876 1.8795,-1.8344 2.7749,-2.5485 1.6828,-1.3419 1.8966,-1.7159 1.3743,-2.4038 -0.6786,-0.8941 -2.7065,-0.2502 -4.2832,1.36 -0.8061,0.8232 -0.9255,0.8897 -1.0424,0.5811 -0.2667,-0.7041 -1.3756,-2.0724 -1.9845,-2.4487 -0.3446,-0.213 -0.5877,-0.4501 -0.5402,-0.527 0.1096,-0.1775 -0.8146,-1.6298 -1.3242,-2.0809 -0.5718,-0.5062 -1.1421,-0.4209 -2.5219,0.377 -1.3387,0.7744 -1.434,0.9962 -0.8043,1.8748 0.4385,0.6117 1.2016,0.6803 1.8915,0.1703 l 0.5473,-0.4049 -0.1347,0.4357 c -0.074,0.2396 -0.2301,0.8128 -0.3465,1.2738 -0.1365,0.5401 -0.5266,1.2066 -1.0975,1.874 -0.4872,0.5696 -0.9212,1.0004 -0.9642,0.9574 -0.043,-0.043 -0.1135,-0.6535 -0.1567,-1.3568 -0.052,-0.8557 -0.2043,-1.4917 -0.4581,-1.922 -0.2088,-0.3538 -0.4009,-0.9862 -0.4272,-1.4057 -0.03,-0.4734 -0.1909,-0.9112 -0.4251,-1.1546 -0.6239,-0.6482 -1.5321,-2.319 -1.4198,-2.6118 0.1743,-0.4541 -0.084,-0.9503 -0.494,-0.9503 -0.3503,0 -1.256,-0.7648 -3.0379,-2.5646 -0.5105,-0.5157 -0.9336,-0.7708 -1.3019,-0.7766 z m 7.534,23.8961 c 0.1422,-0.024 0.2615,0.3524 0.3938,1.1476 0.062,0.3774 0.3557,0.9616 0.651,1.2979 0.2954,0.3363 0.5367,0.6963 0.5367,0.8 0,0.1036 0.1565,0.5529 0.3476,0.9987 0.2982,0.6956 0.4421,0.8284 1.016,0.936 0.6185,0.1161 0.7137,0.224 1.2624,1.4337 0.3264,0.7195 0.8196,2.0448 1.0964,2.9455 1.1161,3.6316 1.6991,4.9904 2.3862,5.5606 0.2369,0.1966 0.2342,0.2623 -0.022,0.5455 -0.3645,0.4028 -0.4414,0.8667 -0.2356,1.4195 0.1318,0.3538 0.01,0.6557 -0.7204,1.7286 -0.4841,0.715 -0.9266,1.4225 -0.9834,1.5726 -0.1249,0.3309 -2.161,2.7131 -4.4321,5.1859 -1.4803,1.6118 -1.7724,1.8451 -2.5581,2.04 -0.4879,0.1211 -1.0509,0.268 -1.251,0.3267 -0.2103,0.061 -0.4793,-0.01 -0.6376,-0.1693 C 49.2268,81.2844 48.6525,80.9738 48.1012,80.7455 47.55,80.5173 47.11,80.228 47.1238,80.1029 c 0.014,-0.125 0.036,-0.3799 0.048,-0.5664 0.017,-0.2602 0.2182,-0.3661 0.861,-0.4542 2.5342,-0.3474 3.9672,-2.2344 3.7908,-4.9912 -0.084,-1.3132 -0.2673,-3.2336 -0.3494,-3.6598 -0.035,-0.1795 -0.1181,-0.7608 -0.1855,-1.2915 -0.068,-0.5309 -0.1471,-1.0958 -0.1774,-1.2557 -0.031,-0.1599 -0.1068,-0.7004 -0.1699,-1.2008 -0.063,-0.5004 -0.1527,-1.1145 -0.1993,-1.3648 -0.046,-0.2501 -0.1274,-1.3556 -0.1795,-2.4565 -0.052,-1.1009 -0.2209,-2.3815 -0.3749,-2.8464 -0.2785,-0.8402 -0.277,-0.8502 0.274,-1.719 0.3047,-0.4806 0.5541,-0.9371 0.5541,-1.0147 0,-0.078 0.1983,-0.5743 0.4406,-1.1041 0.2424,-0.5299 0.549,-1.3102 0.6813,-1.7341 0.1549,-0.4965 0.2793,-0.7582 0.3899,-0.7772 z m -20.3016,39.1209 0.1155,0.8682 c 0.063,0.4775 0.2794,1.1362 0.4791,1.4639 0.5124,0.8408 0.4669,1.4908 -0.1376,1.9746 l -0.5004,0.4005 0.3184,0.9045 c 0.4067,1.1552 0.4135,1.1145 -0.2185,1.3348 -0.3136,0.1094 -0.635,0.4081 -0.7723,0.7181 -0.1293,0.292 -0.2842,0.531 -0.3443,0.531 -0.2146,0 -0.665,-0.644 -0.7752,-1.1098 -0.063,-0.2677 -0.4256,-0.6907 -0.8344,-0.974 -0.5868,-0.4067 -0.9669,-0.5132 -2.0219,-0.5673 -1.216,-0.062 -1.4038,-0.1326 -2.9323,-1.0971 -0.9713,-0.6129 -1.5666,-1.0972 -1.4689,-1.1948 0.09,-0.09 1.1668,-0.6124 2.3921,-1.16 2.059,-0.9203 4.4414,-1.7002 6.0421,-1.9781 z"
         style="fill:#ffffff;stroke:#faa61a;stroke-width:0.67756897;stroke-linecap:round;stroke-linejoin:round;stroke-miterlimit:4;stroke-dasharray:none;stroke-opacity:1" />
    </g>
  </g>
</svg>
