<?xml version="1.0" encoding="UTF-8" standalone="no"?>
<!-- Created with Inkscape (http://www.inkscape.org/) -->

<svg
   xmlns:dc="http://purl.org/dc/elements/1.1/"
   xmlns:cc="http://creativecommons.org/ns#"
   xmlns:rdf="http://www.w3.org/1999/02/22-rdf-syntax-ns#"
   xmlns:svg="http://www.w3.org/2000/svg"
   xmlns="http://www.w3.org/2000/svg"
   xmlns:xlink="http://www.w3.org/1999/xlink"
   xmlns:sodipodi="http://sodipodi.sourceforge.net/DTD/sodipodi-0.dtd"
   xmlns:inkscape="http://www.inkscape.org/namespaces/inkscape"
   width="612pt"
   height="792pt"
   id="svg2836"
   version="1.1"
   inkscape:version="0.47 r22583"
   sodipodi:docname="page-what-is-debian.svg">
  <defs
     id="defs2838">
    <linearGradient
       id="linearGradient4318">
      <stop
         style="stop-color:#37528a;stop-opacity:1;"
         offset="0"
         id="stop4320" />
      <stop
         id="stop4328"
         offset="0.32394367"
         style="stop-color:#546a92;stop-opacity:0.48360655;" />
      <stop
         style="stop-color:#000000;stop-opacity:0;"
         offset="1"
         id="stop4322" />
    </linearGradient>
    <linearGradient
       id="linearGradient4272">
      <stop
         style="stop-color:#3d5a7a;stop-opacity:1;"
         offset="0"
         id="stop4274" />
      <stop
         id="stop4280"
         offset="0.28169015"
         style="stop-color:#3d5a7a;stop-opacity:0.95833325;" />
      <stop
         style="stop-color:#3d5a7a;stop-opacity:0;"
         offset="1"
         id="stop4276" />
    </linearGradient>
    <inkscape:perspective
       sodipodi:type="inkscape:persp3d"
       inkscape:vp_x="0 : 495 : 1"
       inkscape:vp_y="0 : 1000 : 0"
       inkscape:vp_z="765 : 495 : 1"
       inkscape:persp3d-origin="382.5 : 330 : 1"
       id="perspective2845" />
    <inkscape:perspective
       id="perspective2855"
       inkscape:persp3d-origin="0.5 : 0.33333333 : 1"
       inkscape:vp_z="1 : 0.5 : 1"
       inkscape:vp_y="0 : 1000 : 0"
       inkscape:vp_x="0 : 0.5 : 1"
       sodipodi:type="inkscape:persp3d" />
    <inkscape:perspective
       id="perspective2955"
       inkscape:persp3d-origin="0.5 : 0.33333333 : 1"
       inkscape:vp_z="1 : 0.5 : 1"
       inkscape:vp_y="0 : 1000 : 0"
       inkscape:vp_x="0 : 0.5 : 1"
       sodipodi:type="inkscape:persp3d" />
    <linearGradient
       inkscape:collect="always"
       xlink:href="#linearGradient4272"
       id="linearGradient4278"
       x1="2.9958073e-08"
       y1="601.07483"
       x2="767.763"
       y2="601.07483"
       gradientUnits="userSpaceOnUse"
       gradientTransform="matrix(1,0,0,1.6035339,-983.12161,-586.932)" />
    <inkscape:perspective
       id="perspective4290"
       inkscape:persp3d-origin="0.5 : 0.33333333 : 1"
       inkscape:vp_z="1 : 0.5 : 1"
       inkscape:vp_y="0 : 1000 : 0"
       inkscape:vp_x="0 : 0.5 : 1"
       sodipodi:type="inkscape:persp3d" />
    <inkscape:perspective
       id="perspective4304"
       inkscape:persp3d-origin="0.5 : 0.33333333 : 1"
       inkscape:vp_z="1 : 0.5 : 1"
       inkscape:vp_y="0 : 1000 : 0"
       inkscape:vp_x="0 : 0.5 : 1"
       sodipodi:type="inkscape:persp3d" />
    <linearGradient
       inkscape:collect="always"
       xlink:href="#linearGradient4318"
       id="linearGradient4324"
       x1="15.216037"
       y1="650.14096"
       x2="762.78396"
       y2="650.14096"
       gradientUnits="userSpaceOnUse"
       gradientTransform="matrix(0.1050252,0,0,1.086508,-967.68042,-324.38336)" />
    <inkscape:perspective
       id="perspective4746"
       inkscape:persp3d-origin="0.5 : 0.33333333 : 1"
       inkscape:vp_z="1 : 0.5 : 1"
       inkscape:vp_y="0 : 1000 : 0"
       inkscape:vp_x="0 : 0.5 : 1"
       sodipodi:type="inkscape:persp3d" />
  </defs>
  <sodipodi:namedview
     inkscape:document-units="in"
     pagecolor="#ffffff"
     bordercolor="#666666"
     borderopacity="1.0"
     inkscape:pageopacity="0.0"
     inkscape:pageshadow="2"
     inkscape:zoom="1"
     inkscape:cx="197"
     inkscape:cy="7"
     inkscape:current-layer="layer1"
     id="namedview2840"
     showgrid="false"
     inkscape:window-width="1024"
     inkscape:window-height="551"
     inkscape:window-x="-6"
     inkscape:window-y="0"
     inkscape:window-maximized="1"
     showguides="true"
     inkscape:guide-bbox="true">
    <sodipodi:guide
       orientation="1,0"
       position="16,391"
       id="guide4314" />
    <sodipodi:guide
       orientation="1,0"
       position="748,312"
       id="guide4316" />
    <sodipodi:guide
       orientation="0,1"
       position="151,24"
       id="guide4326" />
    <sodipodi:guide
       orientation="0,1"
       position="363.84701,83.25313"
       id="guide4484" />
    <sodipodi:guide
       orientation="0,1"
       position="695.75196,860.69316"
       id="guide4496" />
    <sodipodi:guide
       orientation="0,1"
       position="839.06557,874.77049"
       id="guide4498" />
    <sodipodi:guide
       orientation="0,1"
       position="258.04918,751.42623"
       id="guide4500" />
    <sodipodi:guide
       orientation="1,0"
       position="73.032787,634.57377"
       id="guide4510" />
    <sodipodi:guide
       orientation="1,0"
       position="705.98361,295.37705"
       id="guide4577" />
    <sodipodi:guide
       orientation="1,0"
       position="45.070142,940.67826"
       id="guide4587" />
  </sodipodi:namedview>
  <metadata
     id="metadata2842">
    <rdf:RDF>
      <cc:Work
         rdf:about="">
        <dc:format>image/svg+xml</dc:format>
        <dc:type
           rdf:resource="http://purl.org/dc/dcmitype/StillImage" />
        <dc:title />
      </cc:Work>
    </rdf:RDF>
  </metadata>
  <g
     inkscape:label="Layer 1"
     inkscape:groupmode="layer"
     id="layer1">
    <rect
       style="fill:url(#linearGradient4324);fill-opacity:1;stroke:none"
       id="rect4312"
       width="78.348816"
       height="732.00006"
       x="-966"
       y="15.999939"
       transform="matrix(0,-1,1,0,0,0)" />
    <g
       id="g2902"
       transform="matrix(0.13300279,0,0,0.13300279,615.28424,3.1794244)">
      <path
         id="path2919"
         d="m -858.18942,634.94075 c -2.6983,0 -6.4511,0.8287 -5.3327,1.49983 1.4914,0.89473 -0.9069,2.40322 1.7776,2.99965 2.6843,0.59657 5.6659,2.08313 5.6659,2.08313 l -5.8602,1.02764 c -3.2971,-0.90364 -10.6191,-2.88111 -12.9156,-3.11077 -2.9823,-0.29816 -6.8601,2.38863 -6.8601,2.38863 0,0 -3.5929,-4.49355 -6.277,-5.38828 -0.3369,-0.11189 -0.6385,-0.16274 -0.9445,-0.16678 -2.1409,-0.027 -3.5274,2.24973 -3.5274,2.24973 0,0 -2.1063,4.194 -4.1939,4.194 -2.0878,0 -8.61,1.49983 -8.61,1.49983 0,0 -3.6061,-3.57702 -5.6939,-4.47172 -2.0877,-0.89484 -4.4717,0 -4.4717,0 0,0 -0.5879,0.89732 1.4999,2.3886 2.0876,1.49131 0,3.58295 0,3.58295 0,0 -0.5991,-0.0353 -2.3887,-0.33321 -1.7897,-0.29817 -4.1662,0.61103 -4.1662,0.61103 0,0 -0.034,-1.1678 -1.8056,-2.36085 -1.7893,-1.19299 -3.857,-1.20759 -7.1377,-0.61101 -3.281,0.59656 5.055,5.66604 5.055,5.66604 0,0 -2.6691,-1.51314 -5.055,-0.91658 -2.3865,0.59644 4.7602,1.2199 8.6376,5.69381 3.8775,4.47387 2.0892,8.63574 1.1944,13.10963 -0.8948,4.47391 -5.0708,12.2162 -6.8603,14.30397 -1.5122,1.76424 -0.3133,3.25432 0.1119,3.69399 24.8129,-2.2624 50.0014,-3.17882 75.3247,-3.13852 25.593,0.0404 51.3516,1.05278 77.0468,2.58303 0.4323,-0.71662 0.7739,-1.87917 -0.3066,-3.1385 -1.7893,-2.08777 -5.9653,-9.83006 -6.8601,-14.30397 -0.8948,-4.47389 -2.7108,-8.63576 1.1664,-13.10963 3.8774,-4.47391 11.0521,-5.09737 8.6656,-5.69381 -2.3859,-0.59656 -5.0826,0.91658 -5.0826,0.91658 0,0 8.3635,-5.06948 5.0826,-5.66604 -3.2804,-0.59658 -5.3761,-0.58198 -7.1657,0.61101 -1.7897,1.19305 -1.7776,2.36085 -1.7776,2.36085 0,0 -2.4045,-0.90923 -4.1939,-0.61103 -1.7896,0.29817 -2.3887,0.33321 -2.3887,0.33321 0,0 -2.0878,-2.09164 0,-3.58295 2.0879,-1.49128 1.5,-2.3886 1.5,-2.3886 0,0 -2.3841,-0.89484 -4.4718,0 -2.0878,0.8947 -5.6662,4.47172 -5.6662,4.47172 0,0 -6.5498,-1.49983 -8.6377,-1.49983 -2.0878,0 -4.1663,-4.194 -4.1663,-4.194 0,0 -1.3864,-2.27826 -3.5275,-2.24973 -0.3066,0.01 -0.6087,0.0547 -0.9444,0.16678 -2.684,0.89473 -6.2769,5.38828 -6.2769,5.38828 0,0 -3.8775,-2.68679 -6.8601,-2.38863 -1.6338,0.16339 -5.7839,1.2184 -9.2769,2.13864 -2.1681,-1.15968 -5.3634,-2.30353 -9.86,-2.44416 -6.1888,-0.19337 -7.3843,0.62876 -7.4439,1.22209 -0.5679,-1.20689 -2.1564,-4.35572 -3.6106,-5.08275 -0.4474,-0.22371 -1.2112,-0.3332 -2.1108,-0.3332 l 4e-4,-10e-5 z m 8.8045,14.22062 c 3.3756,8.7e-4 6.6395,1.02516 9.1101,3.58291 -5.6247,6.09073 -6.4295,12.15728 -7.6101,18.24799 -2.3746,-6.84051 -2.9275,-14.19376 -11.36,-19.30339 2.9881,-1.5281 6.4842,-2.52883 9.86,-2.52751 l 0,0 z m -29.1909,0.44442 c 3.3755,-9.1e-4 6.8719,1.02718 9.8597,2.55526 -8.4323,5.10963 -9.0127,12.4629 -11.3876,19.30338 -1.1806,-6.09073 -1.9578,-12.18505 -7.5823,-18.27572 2.4707,-2.55766 5.7343,-3.58161 9.1102,-3.58292 z m 57.2988,0.58326 c 3.6952,-0.027 7.2551,1.16803 9.7492,4.22173 -5.7928,5.71601 -6.9542,11.74326 -8.4713,17.74799 -1.8564,-6.98442 -1.9281,-14.37557 -9.7212,-20.02551 2.5988,-1.16511 5.5693,-1.92237 8.4433,-1.94421 z m -80.6576,1.6109 c 1.9635,0.0203 3.8432,0.77247 5.4439,1.94422 -6.1973,5.68187 -7.3555,13.08493 -9.6933,20.10889 -0.1215,-6.03863 0.037,-12.08308 -3.0552,-17.83133 2.1738,-3.07095 4.7797,-4.25004 7.3046,-4.22178 l 0,0 z m 103.4608,0.74993 c 2.5244,-0.027 5.1587,1.1508 7.3324,4.22175 -3.091,5.74824 -2.9623,11.79263 -3.083,17.83132 -2.3379,-7.02392 -3.524,-14.42698 -9.7213,-20.10885 1.601,-1.17167 3.5079,-1.92225 5.4719,-1.94422 l 0,0 z m -66.2981,2.97189 c 6.7752,3.16142 17.1987,23.09616 1.4444,22.77521 -14.8997,0.6643 -10.1845,-16.17594 -1.4444,-22.77521 z m 30.0242,0.1944 c 6.7756,3.16155 17.1985,23.09619 1.4444,22.77524 -14.8994,0.66437 -10.1842,-16.17588 -1.4444,-22.77524 l 0,0 z m -56.91,1.63872 c 5.7578,3.16615 12.6765,23.15224 -1.6113,22.83075 -13.6361,0.66537 -7.1829,-16.22163 1.6113,-22.83075 z m 82.935,0.61104 c 8.794,6.60913 15.2193,23.49603 1.5832,22.83077 -14.2878,0.32141 -7.341,-19.66464 -1.5832,-22.83077 z m -103.2108,3.08298 c 2.2139,2.54587 3.4454,18.58977 -2.7218,18.33129 -5.9728,0.53503 -1.683,-13.01701 2.7218,-18.33129 z m 123.0141,1.36096 c 4.4051,5.31426 8.6947,18.83846 2.7219,18.30352 -6.1672,0.2584 -4.9354,-15.75766 -2.7219,-18.30352 z m -62.1042,20.44215 c -25.7347,-0.0425 -51.3052,0.93035 -76.4913,3.27742 -0.403,0.60118 -0.6944,1.34743 -0.4444,2.22199 0.3912,1.36884 1.9247,2.3482 2.9438,2.86078 24.3831,-2.17445 49.121,-3.06704 73.9919,-3.02745 25.298,0.0401 50.7576,1.02678 76.1581,2.52752 0.8719,-0.55517 1.7941,-1.34961 2.0832,-2.36085 0.3554,-1.24375 -0.3724,-2.25495 -0.9999,-2.88858 -25.7773,-1.53898 -51.5856,-2.5685 -77.2414,-2.61083 l 0,0 z m 0,6.77701 c -24.4753,-0.0404 -48.8086,0.81495 -72.7974,2.91634 0.4663,1.5811 1.4733,4.75116 2.1387,5.63828 0.8948,1.193 -2.405,0.32983 8.3324,3.61071 10.7374,3.28077 22.0906,-0.31635 24.7749,2.66634 1.5197,1.68827 3.0251,4.69385 4.0553,6.9992 l 0.1119,1.83318 c 11.0905,-1.05929 22.2212,-1.52078 33.3849,-1.47211 11.2942,0.0489 22.6313,0.6527 33.9683,1.63875 0.8713,-2.13549 2.8648,-6.75036 4.8886,-8.99902 2.6842,-2.98257 14.0098,0.61443 24.7472,-2.66634 10.737,-3.28088 7.4652,-2.41771 8.3602,-3.61071 0.7872,-1.04965 1.9887,-5.12375 2.2774,-6.13823 -24.7816,-1.43928 -49.5796,-2.3757 -74.2417,-2.41639 l -7e-4,0 z m 0.3066,26.10821 c -1.7445,-0.01 -3.4783,0.0128 -5.2215,0.027 -10.9179,0.097 -21.7991,0.70334 -32.6353,1.88869 -1.7579,1.60141 -2.8886,3.89453 -2.8886,6.4715 0,3.55087 2.0912,6.58994 5.1106,7.97131 10.102,-1.02767 20.2473,-1.57404 30.4133,-1.66646 1.6391,-0.0128 3.2754,-0.01 4.9159,0 11.5746,0.0505 23.1828,0.63956 34.8016,1.66646 3.0288,-1.37759 5.1385,-4.41377 5.1385,-7.97131 0,-2.58773 -1.1177,-4.89715 -2.8886,-6.49929 -12.266,-1.1418 -24.5338,-1.82044 -36.7459,-1.88866 l 0,7.6e-4 z m -0.6943,18.60899 c -1.507,-0.006 -3.0212,0.0168 -4.5272,0.027 -8.9905,0.0799 -17.9768,0.49853 -26.9137,1.3054 l 9.3044,133.15171 c 6.1027,-0.18605 12.2352,-0.29986 18.3589,-0.30562 4.9105,0 9.8284,0.0639 14.7486,0.1664 3.8071,0.0799 7.6309,0.19453 11.4433,0.33327 l 9.3045,-133.29054 c -10.5945,-0.8571 -21.1691,-1.35159 -31.7188,-1.38875 l 0,10e-4 z m -3.8052,136.2348 c -6.2019,0 -12.403,0.11349 -18.5813,0.30546 -1.6259,0.52716 -2.8051,2.02728 -2.8051,3.83285 0,1.78527 1.1533,3.29242 2.7495,3.83301 6.1516,-0.19133 12.3249,-0.29987 18.4981,-0.30562 4.9102,0 9.8001,0.0368 14.7207,0.13906 3.7295,0.0767 7.4582,0.19773 11.1932,0.33311 1.9716,-0.27557 3.4996,-1.94895 3.4996,-3.9994 0,-1.58579 -0.929,-2.94301 -2.25,-3.61083 -9.0235,-0.33966 -18.0365,-0.53435 -27.0247,-0.52764 z m -0.1954,9.7211 -17.3035,0.61092 c -2.6104,0.54154 -4.5553,2.86293 -4.5553,5.63826 0,2.32218 1.3585,4.29063 3.333,5.1939 2.9518,-0.0448 5.9041,-0.0799 8.8602,-0.0831 4.9102,0 9.828,0.0368 14.7483,0.13906 6.5465,0.13587 13.1041,0.38474 19.6645,0.69436 l 0.034,-0.25 c 3.0017,-0.19436 5.3606,-2.64138 5.3606,-5.69372 0,-2.77533 -1.9446,-5.09688 -4.555,-5.63826 l 0,-0.16656 c -8.5373,-0.30481 -17.0753,-0.45075 -25.5803,-0.44436 l -0.01,-5e-4 z m -9.6932,13.41505 c -2.2324,0 -4.4641,0 -6.6937,0.0272 l 1.6107,23.46964 c 0,1.74115 1.0879,3.20478 2.611,3.80518 9.7449,-0.4909 19.521,-0.741 29.3299,-0.75 1.4914,0 2.9789,0.021 4.4718,0.027 0.8678,-0.7534 1.4167,-1.8671 1.4167,-3.11083 l 1.5831,-22.6642 c -11.4627,-0.53739 -22.9204,-0.81423 -34.3295,-0.80544 l 0,10e-4 z m 26.8302,28.63572 c -9.4196,0.016 -18.8024,0.215 -28.1633,0.6667 0.2762,0.198 0.604,0.3331 0.9718,0.3331 l 0.3067,0 c -0.6246,1.623 -0.972,3.3821 -0.972,5.2217 0,8.1118 7.1152,14.2768 14.8594,18.7479 6.6982,-3.8674 14.8596,-10.6361 14.8596,-18.7479 0,-1.8396 -0.3474,-3.5987 -0.9724,-5.2217 l 0.3066,0 c 0.6853,0 1.2628,-0.4159 1.5276,-0.9998 l -2.7219,0 0,0 z"
         style="fill:#3f6c74;fill-opacity:1;fill-rule:nonzero;stroke:none;stroke-width:3;marker:none;visibility:visible;display:inline;overflow:visible;enable-background:accumulate" />
      <path
         id="path3820"
         d="m -821.52247,699.33779 -1.03125,0.125 -0.15625,0 c -0.03,-3.9e-4 -0.0637,0 -0.0937,0 -0.2296,0 -0.25755,0.0362 -0.46875,0.0625 l -1,0.125 c 0,0 -3.9434,0.39689 -6.625,0.84375 -1.3807,0.23003 -2.74515,0.69421 -4.65625,1.3125 -1.9557,0.63272 -4.2702,1.41944 -6.5,2.1875 -4.2588,1.4669 -7.82885,2.76628 -8.21875,2.90625 l -0.15625,0 -0.4375,0.1875 c 0,0 -2.8461,1.10911 -5.9375,2.5 -1.5576,0.701 -3.1389,1.47545 -4.5625,2.25 -1.2263,0.66717 -2.6728,1.40634 -3.9375,2.90625 l -0.0312,-0.0312 c -0.01,0.008 -0.0213,-0.009 -0.0312,0 -0.09,0.0806 -0.23935,0.20229 -0.40625,0.34375 -0.3339,0.28292 -0.77875,0.67054 -1.28125,1.03125 -1.078,0.7738 -2.51205,1.69203 -4.03125,2.65625 -3.0214,1.91811 -6.38095,3.89585 -8.03125,4.8125 l 0,0.0312 c -2.354,1.30802 -3.70275,3.22036 -5.34375,5.3125 -1.7238,2.19754 -3.5707,4.82751 -5.3125,7.375 -3.3481,4.89684 -5.9948,9.1246 -6.25,9.53125 -0.01,0.008 -0.122,0.18261 -0.125,0.1875 -1.2279,1.24924 -6.68785,7.14799 -10.53125,19.0625 -3.8982,12.08411 -10.2186,29.07958 -14.5625,40.53125 -2.2357,5.89399 -8.2504,22.66379 -14.1875,39.1875 -5.9369,16.52436 -11.8334,32.8964 -13.5,37.15625 -1.5142,3.86916 -8.6766,19.20952 -15.25,33 -6.5751,13.79385 -12.6875,26.46875 -12.6875,26.46875 -1.2434,2.6101 -0.013,5.5526 2.71875,6.5 l 0.0312,0 c 0.7317,0.2439 1.3648,0.31625 1.125,0.28125 0.3099,0.048 0.57765,0.083 0.90625,0.125 l 0.0312,0 c 0.7591,0.093 1.7327,0.188 2.9375,0.3125 2.4361,0.2515 5.8548,0.5711 9.9375,0.875 8.1455,0.6062 18.8906,1.17025 29.8125,1.09375 10.9221,-0.076 21.9723,-0.77775 30.9375,-2.84375 4.4718,-1.0305 8.4871,-2.3555 11.8125,-4.4375 3.3583,-2.1025 6.16935,-5.2189 6.90625,-9.3125 3.4792,-19.3292 8.42175,-59.32411 8.84375,-62.71875 1.4746,-0.98473 3.8191,-2.64699 5.8125,-5.4375 1.4181,-1.98569 2.7386,-4.70335 4,-7.28125 1.2724,-2.59919 2.4616,-5.17331 2.6875,-5.625 -0.1785,0.35656 0.017,-0.0301 0.125,-0.21875 0.1082,-0.18865 0.2476,-0.4531 0.4375,-0.78125 0.3797,-0.6563 0.914,-1.55835 1.5,-2.5625 1.1792,-2.02113 2.70785,-4.64548 4.34375,-7.46875 3.2777,-5.65554 6.953,-12.06169 9.0625,-16.28125 0.7889,-1.5778 1.3623,-2.21347 1.625,-2.40625 0.2626,-0.19278 0.3327,-0.22018 1.0625,-0.25 0.9124,-0.0377 3.7086,0.73962 7.0625,1.21875 1.8527,0.26477 2.3621,0.76514 2.75,1.15625 0.2291,0.2311 0.29585,0.33586 0.28125,0.3125 0.8423,2.10813 2.9222,3.28711 5.1875,2.875 l 0,0.0312 c 0,0 0.0917,-0.0311 0.0937,-0.0312 0.1591,-0.0221 6.58525,-0.9225 11.28125,-5.03125 3.0323,-2.65351 3.686,-6.38781 3.75,-9.15625 0.065,-2.78077 -0.4556,-5.2647 -0.625,-6.28125 -0.2377,-1.42591 -0.8567,-2.54232 -1.5625,-3.46875 1.1543,-0.86225 2.2884,-1.87106 3.125,-3.3125 1.0291,-1.77327 1.42675,-3.68441 1.65625,-5.75 0.4399,-3.96024 0.59755,-9.32463 -2.15625,-14.28125 -0.9826,-1.76868 -2.16575,-3.14585 -3.34375,-4.3125 0.4164,-0.46424 0.80875,-0.88346 1.28125,-1.4375 0.7661,-0.8985 1.54255,-1.8646 2.21875,-2.78125 0.5066,-0.68628 1.4377,-1.75075 1.875,-3.5 0.3818,-1.51915 0.18715,-2.767 0.0937,-3.625 l 0,-0.0312 c -0.1245,-1.05523 -0.32395,-2.13153 -0.53125,-3.21875 -0.4177,-2.19504 -0.926,-4.49263 -1.0625,-5.3125 -0.3882,-2.33674 -1.8791,-3.84004 -2.8125,-4.75 -1.0968,-1.06882 -2.332,-2.01557 -3.625,-2.875 -1.3004,-0.86431 -2.64635,-1.64166 -3.96875,-2.25 -1.2054,-0.55458 -2.6927,-1.1875 -4.5625,-1.1875 -0.5869,0 -4.759,-0.19504 -9.125,-0.25 -4.3559,-0.0548 -9.19755,-0.0437 -13.09375,0.6875 -3.5944,0.67392 -8.01355,2.02859 -12.09375,3.375 0.4515,-0.96108 0.8897,-1.98859 1.3125,-2.96875 0.657,-1.52387 0.96265,-2.30802 1.21875,-2.9375 0.998,-0.73571 4.20305,-3.08038 6.03125,-4.125 1.8283,-1.04476 5.59605,-3.55618 9.21875,-5.9375 3.481,-2.28819 6.38855,-4.23803 6.59375,-4.375 0.2625,-0.11744 2.72665,-1.19515 5.84375,-2.65625 3.2952,-1.5443 6.8335,-3.20846 9,-4.5625 5.686,-3.55371 7.09725,-11.21222 4.09375,-17.21875 -1.6243,-3.24855 -4.24745,-4.89878 -6.71875,-5.34375 l 0,-0.3125 z"
         style="font-size:medium;font-style:normal;font-variant:normal;font-weight:normal;font-stretch:normal;text-indent:0;text-align:start;text-decoration:none;line-height:normal;letter-spacing:normal;word-spacing:normal;text-transform:none;direction:ltr;block-progression:tb;writing-mode:lr-tb;text-anchor:start;fill:#ffffff;fill-opacity:1;fill-rule:nonzero;stroke:none;stroke-width:5;marker:none;visibility:visible;display:inline;overflow:visible;enable-background:accumulate;font-family:Bitstream Vera Sans;-inkscape-font-specification:Bitstream Vera Sans" />
      <path
         sodipodi:nodetypes="cccccccccccccccccccccccccccccccccccccccccccccccccccccccccccccccccccccccccccccccccccccccccccccccccccccccccccccccccccccccccccccccccccccccccccccccccccccccccccccccccccccccccccccccccccccccccccccccccccccc"
         style="fill:#c18a00;fill-opacity:1;stroke:none"
         d="m -754.00292,140.52057 c -8.0808,10.04047 -19.6516,18.07236 -21.5405,31.7422 -0.9149,4.87999 -0.3392,10.77496 -1.8884,15.0384 0.5365,-1.49581 0.8087,-6.23992 -0.8102,-3.72498 -2.8637,5.60044 -4.4084,12.45086 -6.3686,18.08809 3.4112,0.55967 4.0718,4.63994 1.9453,5.78628 -2.3935,5.22857 0.8574,13.08975 -3.7289,16.82599 -2.2439,4.01107 0.04,9.47285 0.8335,14.18127 0.3891,1.55522 2.0025,3.90898 1.5411,4.97147 -2.5775,-0.34379 -0.8187,3.72482 -0.6955,5.59536 0.6384,6.0306 -0.1007,13.36658 4.5811,18.52502 2.5234,-1.20351 0.3874,2.23835 0.7007,3.08436 -0.094,2.84713 2.7506,5.25569 4.5684,7.47906 1.5064,4.48038 1.0475,9.63149 5.4708,13.38832 0.8433,-1.47133 1.8412,-5.58812 4.4321,-4.05217 2.8679,5.02992 5.46,12.0027 1.4285,15.29204 -2.0356,3.68446 1.1648,9.26472 4.6766,12.64249 3.9582,2.21886 3.4884,6.97913 8.0613,8.88577 3.6818,2.34106 6.0045,5.63588 7.5276,9.04279 8.853,12.039 24.5629,19.38832 33.8803,31.14301 34.7173,39.87855 44.9301,91.33383 34.8213,136.54285 -6.3944,24.27711 -19.695,47.22779 -40.0398,63.68226 -14.0641,13.76695 -28.6077,27.39544 -45.9499,36.98282 -30.4326,17.80563 -66.1277,26.59211 -101.3544,24.32791 -12.086,-0.16915 -24.2378,-0.24832 -36.2824,-0.15121 -14.3939,-4.09972 -28.4975,-9.28883 -41.9578,-15.84872 0,-5.69703 -6.8155,-6.97484 -10.9749,-8.73376 -8.7833,-3.33589 -16.4805,-9.03606 -23.7429,-14.87102 -7.3817,-6.88317 -14.1385,-15.28897 -20.7331,-22.35717 2.8246,-2.52175 -1.8743,-4.86691 -2.971,-7.00684 -10.35148,-14.75302 -15.77618,-32.6335 -22.32398,-49.8624 4.3118,-2.64655 0.051,-8.25305 0.539,-12.11082 -0.256,-1.67244 -0.4397,-4.54403 0.2628,-5.67457 1.0657,1.64161 1.3726,5.28001 3.2122,5.35157 -0.7171,-6.0737 1.7175,-14.6165 1.9702,-19.54257 0.034,1.81063 0.054,5.60121 2.1623,5.01728 1.1469,-8.98805 -1.2924,-17.54426 1.2473,-26.73887 -3.579,1.13426 -1.9047,-4.15651 -0.5021,-6.08687 4.465,-13.31314 11.613,-26.32476 16.05448,-39.6327 -0.7129,-4.99697 -2.048,-12.18156 3.923,-16.36687 3.6369,-3.18678 7.8652,-7.96294 8.2453,-12.12878 -1.9403,0.51736 -3.2462,4.40273 -4.6477,4.17917 16.9894,-28.74687 41.8407,-53.6481 70.1952,-65.78061 -2.4778,1.14051 -1.6725,3.73752 0.9075,2.49991 11.2216,-1.2946 21.2592,-7.02615 31.8378,-8.66433 -12.1793,3.63441 -24.9318,7.98825 -36.2251,16.22499 4.1653,-0.25908 0.8214,8.23061 6.0147,6.06394 2.7935,-0.44829 7.0273,-1.96235 6.3917,-5.45591 2.7806,-3.59807 7.7602,-2.70203 11.4551,-4.28103 2.3378,-0.52777 5.3191,-1.72397 7.354,-1.03216 -0.7239,1.26244 -5.0954,2.16855 -2.9125,3.65956 5.1369,-0.23112 9.7114,-6.10268 14.7995,-3.22734 2.7293,0.18059 6.7557,0.31232 8.1839,-2.38108 0.482,-3.05138 3.238,-0.42973 4.8007,0.0897 4.7231,2.40704 10.674,4.46633 15.129,4.45873 -1.5805,0.73493 -4.7895,0.29884 -5.0836,2.27451 2.2063,0.40272 5.5024,0.47532 7.0605,0.94646 -1.8789,-0.48811 -3.3525,1.82717 -0.653,1.99347 4.1179,0.74558 8.1328,2.19477 11.5878,5.21939 4.919,3.68288 10.4773,8.40325 15.2327,10.75542 -2.8431,-0.0304 -3.2284,5.22021 -0.2391,6.24783 2.8345,3.00241 7.4467,2.75526 9.7326,5.73402 -0.8027,0.24629 -3.3191,-1.82077 -1.8981,0.52448 7.8912,14.3238 16.5494,29.05842 19.244,46.54982 4.6364,24.17362 2.7018,50.65465 -7.4042,71.72097 -11.929,15.73631 -25.3424,32.71732 -43.5912,37.96334 -13.1756,3.8869 -27.6463,3.66151 -39.438,-3.63109 -5.7982,-3.06641 -11.7298,-6.0778 -16.0339,-11.69515 -5.6964,-5.82243 -11.3283,-12.09168 -14.1041,-20.84625 -6.9084,-18.85926 -2.5255,-44.32749 10.1522,-62.91064 2.9601,-4.58153 8.1997,-10.30672 11.0844,-12.33978 -21.996,26.72366 -21.9781,72.2951 -0.3798,90.60924 8.8693,8.43085 20.4964,13.02598 32.3331,11.96529 -1.35,-0.32545 -1.4117,-3.02603 0.2729,-1.81464 30.6309,0.81843 59.9189,-31.88602 60.3227,-69.50951 -0.9191,-11.99101 -0.8205,-25.20047 -6.9691,-35.28193 -0.7844,-1.43806 -2.2512,-4.84158 -2.2957,-5.3016 0.4012,1.81473 3.456,4.34528 2.6643,0.89241 -3.3227,-10.3767 -8.9056,-19.24478 -13.9414,-28.20891 -3.2087,-3.18819 -9.034,-1.71224 -10.451,-7.73158 -2.415,-6.46148 -8.543,-7.93591 -13.2079,-10.83426 -1.8353,-0.73749 -4.7137,-1.81503 -6.1184,-0.91188 0.7597,0.68962 3.7822,2.60133 1.1034,1.64861 -11.3502,-4.07889 -23.677,-3.89423 -35.967,-2.87432 -4.6574,1.53739 -9.6288,1.04789 -14.2492,3.52873 -29.1051,11.21946 -57.0078,37.8338 -71.9276,70.56718 -10.2057,23.63107 -13.9808,48.95899 -10.3249,71.25708 -0.6874,-1.84252 -0.2427,-6.0179 -2.0936,-6.33237 -2.187,14.52711 6.1152,25.34799 9.1108,37.79532 0.7452,2.28243 2.51,-0.0304 1.4231,-1.45664 -0.9131,-1.09722 -0.4566,-5.24703 0.6505,-2.45332 2.8233,8.07636 0.1279,18.8777 6.7314,24.76426 1.1247,1.9771 3.2557,5.24082 5.3287,4.62944 -1.5545,-0.8689 -0.3517,-4.45125 0.7965,-1.86469 2.4403,5.35912 2.5133,11.94095 6.7125,16.21592 8.8585,12.66501 20.5149,23.11983 33.0561,31.78391 1.5647,-1.10787 3.3497,-2.2344 5.3098,-0.88263 11.1662,6.53695 23.4133,13.04085 36.7711,12.40837 15.911,1.6099 32.523,4.9687 48.1289,-0.16678 4.9444,-3.55071 11.5257,0.17588 16.5673,-3.12356 3.0648,-1.273 6.3743,-0.0825 9.3064,-1.81865 4.8993,-1.34422 9.8981,-4.56286 10.5254,-10.02595 2.4629,-5.93368 9.1563,-8.58777 14.9397,-9.98672 1.5639,1.50791 -2.2843,2.82474 -2.5855,4.36724 0.905,1.62567 3.7852,-0.4899 5.2758,-1.02885 4.0675,-1.97534 7.8183,-6.01683 12.5367,-5.77473 3.6781,1.20031 5.5719,-3.74962 8.0953,-4.74189 3.3084,2.78744 6.8694,-2.95414 10.0239,-4.00806 3.8686,-2.76706 8.5814,-5.77059 11.0692,-9.30873 -1.9702,-2.07621 2.6548,-1.99001 3.7497,-2.78593 4.7529,-1.8934 9.6886,-5.42437 9.8937,-11.08835 2.214,-4.01157 7.1504,-5.61662 8.2739,-10.35733 0.5337,-1.43207 1.6574,-3.92319 2.9352,-1.85257 2.0054,0.98007 3.0261,-1.36722 3.0228,-3.08207 1.669,-4.45211 5.9247,-8.60871 4.8623,-13.59404 -0.8116,0.51532 -3.8448,2.46913 -2.7088,0.62615 4.1298,-4.4643 9.8511,-9.65489 7.2514,-17.12099 0.7418,-2.90891 4.7582,-4.21081 2.9436,-7.97909 -0.3703,-4.01184 -2.2301,-8.26114 -3.4904,-12.02487 2.8637,-1.14914 -0.2729,-5.37246 0.034,-8.03362 -0.632,-5.04825 -0.7702,-11.35288 -4.8651,-15.48936 -2.6669,1.71821 -0.9723,-1.96353 -1.0763,-2.73034 0.1718,-2.56837 -1.7148,-5.40369 -4.4155,-6.94181 -2.1815,-5.32819 -1.8791,-11.1951 -6.6905,-15.95866 -1.1779,2.20189 -1.4925,5.68407 -4.7727,6.51038 -3.0837,-6.06821 -6.6411,-13.96892 -2.6157,-18.24267 1.5845,-4.61636 -1.5202,-10.99021 -5.9688,-15.29641 -3.416,-2.8091 -2.4748,-7.49659 -7.4409,-9.49279 -6.169,-4.45541 -6.6255,-11.2319 -12.1447,-16.03713 -7.8942,-7.95199 -18.0905,-14.23131 -26.3083,-21.94118 -21.0742,-18.53606 -36.9121,-41.1735 -43.0779,-65.32866 -7.6163,-34.46532 -0.8524,-69.07494 15.9537,-101.14806 10.2476,-19.31727 25.4959,-37.51887 45.7422,-49.46517 0.9055,-0.55833 2.7539,-1.80104 3.2309,-1.72364 l 0,0 -0.016,7.8e-4 z m -163.3002,176.71929 c -0.9963,0.41621 0.07,-0.0755 0,0 z m 72.3425,5.36611 c 4.453,1.45274 9.6364,3.98765 13.2726,6.06859 -4.2737,-2.3257 -10.6936,-4.21588 -13.8399,-6.24891 0.1886,0.0596 0.3784,0.11988 0.5673,0.18026 l 0,6e-5 z m -1.2388,6.47156 c -0.1819,0 -0.733,-0.17047 0,0 z m 0.054,0.0168 c 2.3591,0.3426 6.4761,1.91823 7.3757,3.09223 -2.4385,-1.07553 -4.8697,-2.25191 -7.3757,-3.09223 z m -17.3064,61.02184 c 1.8092,-0.36023 3.4176,2.22078 0.9699,3.0517 -1.7627,1.02018 -5.7113,0.34969 -4.6429,-2.80677 1.1949,-0.5778 2.4644,-0.26043 3.673,-0.24493 z m 17.0238,8.3668 c 3.7889,2.38701 9.0205,4.60234 10.3384,10.17209 -1.5107,3.26709 -5.3522,3.38636 -6.6159,-0.063 -0.912,-0.92721 -3.1802,-3.07468 -2.5704,-4.08862 2.3797,1.68025 4.1179,6.48053 7.2918,5.14956 -0.4282,-6.16899 -5.3946,-8.68763 -8.9241,-11.41642 0.1618,0.0809 0.3202,0.16341 0.4802,0.24595 l 0,4.4e-4 z m 59.4806,33.14364 c 3.0116,20.82937 -4.8862,40.69434 -14.375,56.88401 -6.2211,10.31912 -14.2331,19.46936 -24.0019,25.17603 6.0544,-8.12151 15.2759,-12.35063 19.8589,-21.95523 -3.4028,3.76306 -7.0081,7.54877 -11.3487,9.72083 6.2105,-6.39356 13.2061,-13.20932 15.5992,-22.89589 0.6001,-2.84538 3.7562,-3.14196 4.494,-5.99664 7.6123,-11.39476 7.9162,-28.11856 9.7045,-41.38894 0.034,0.15121 0.046,0.30422 0.07,0.45583 l -10e-4,0 z m -43.413,-1.51621 c 3.805,4.33689 3.0437,13.40501 -0.7494,17.39672 -2.0112,-0.32376 -0.1852,-4.10771 -0.4301,-5.89648 0.3972,-3.98663 0.8032,-7.98007 0.8696,-11.98689 0.1007,0.16171 0.2055,0.32443 0.3099,0.48665 l 0,0 z m -191.01388,32.91223 c 0,4.79965 0.4976,10.68504 0,14.82723 -0.1486,-4.81092 -0.1246,-10.37626 0,-14.82723 z m 5.6537,6.79382 c 0.034,1.3341 -0.9174,4.59556 -1.6212,4.67007 0.094,-1.19375 -0.1617,-5.58934 1.6212,-4.67007 z m 0.4384,1.92966 c 0.1616,1.22945 -0.034,1.00787 0,0 z m -2.2925,4.69813 c -0.2053,0.96195 0.1183,-1.10938 0,0 z m 190.59688,33.83756 c -3.7752,2.25962 -7.5757,4.69795 -11.7396,5.78405 4.1268,-1.79332 7.7115,-5.42356 12.1237,-6.03358 -0.1279,0.0836 -0.2561,0.16678 -0.3841,0.24965 l 0,-1.2e-4 z m 11.8377,2.62119 c -4.4321,3.8793 -9.6148,9.60736 -15.2863,8.88507 0.7388,-2.67767 4.0476,-1.99483 5.5607,-3.97768 3.5049,-2.16856 8.6188,-5.6866 11.3256,-6.41634 -0.5331,0.50261 -1.0666,1.00564 -1.6,1.50895 l 0,0 z m -134.2945,103.32538 c 2.4291,-0.0809 6.0529,2.16108 5.8144,4.33106 -2.2015,-0.97998 -7.2096,-0.581 -6.2857,-4.28528 0.1486,-0.0428 0.3166,-0.10038 0.4713,-0.0456 l 0,-1.8e-4 z m 28.167,10.12476 c 2.5674,0.77934 5.5298,0.64142 7.769,2.27529 -3.4288,0.452 -8.5378,0.11588 -10.1784,-2.75515 0.803,0.16002 1.6062,0.31972 2.4094,0.47986 l 0,0 z"
         id="path6536-8-0" />
      <path
         id="text4116-4"
         d="m -309.95822,619.81609 0,204.81138 47.1197,0 0,-21.32214 c 6.4936,8.59969 13.6817,14.96012 21.5796,19.08436 7.8975,4.03664 16.9704,6.06999 27.2379,6.06999 18.1646,0 33.082,-7.21366 44.7533,-21.60505 4.1696,-5.17277 7.5826,-10.87837 10.2623,-17.10395 -11.0773,-16.76915 -16.6151,-37.82206 -16.6151,-63.16928 0,-12.38243 1.3318,-23.73406 3.9608,-34.05378 -11.2917,-12.58907 -25.4238,-18.8786 -42.3613,-18.87876 -10.2675,1.6e-4 -19.3404,2.07443 -27.2379,6.1987 -7.8979,4.03669 -15.086,10.35624 -21.5796,18.9558 l 0,-78.98727 -47.1197,0 0,0 z m -352.3687,8.30776 0,196.50362 53.4469,0 c 29.4844,0 51.5902,-2.08929 66.3328,-6.30144 14.7422,-4.2999 27.3813,-11.55452 37.9116,-21.73382 9.2139,-8.86289 16.0749,-19.07528 20.5505,-30.65867 4.4752,-11.67097 6.713,-24.93348 6.7133,-39.76365 -3e-4,-14.65452 -2.2381,-27.7687 -6.7133,-39.35218 -4.4756,-11.58314 -11.3366,-21.79561 -20.5505,-30.65873 -10.4427,-10.17899 -22.9744,-17.39278 -37.629,-21.60511 -14.5668,-4.2997 -36.78,-6.42984 -66.6154,-6.43002 l -53.4469,0 z m 50.6946,38.29755 18.1585,0 c 20.7972,1.6e-4 36.6244,5.07314 47.5055,15.25225 10.8812,10.17937 16.3324,25.01533 16.3324,44.49624 0,19.56886 -5.492,34.48645 -16.4608,44.75339 -10.8815,10.2671 -26.6675,15.40661 -47.3771,15.40661 l -18.1585,0 0,-119.90849 0,0 z m 219.369,7.22746 c -25.4483,1.6e-4 -45.4645,6.90216 -60.0312,20.67921 -14.4794,13.77719 -21.7081,32.66938 -21.7081,56.71343 0,24.48294 7.3773,43.54908 22.1195,57.15056 14.8302,13.51398 35.5664,20.26762 62.2434,20.26762 11.1443,0 22.2917,-1.09827 33.4364,-3.2921 11.1443,-2.10608 22.2917,-5.27878 33.4365,-9.49077 l 0,-36.31724 c -10.9692,5.96726 -21.6824,10.4425 -32.1246,13.42604 -10.355,2.89585 -20.4859,4.3468 -30.4016,4.3468 -12.2854,0 -21.8337,-2.77925 -28.6781,-8.30766 -6.8448,-5.52848 -10.8451,-13.81484 -11.9856,-24.87174 l 110.1602,0 0,-13.42595 c -4e-4,-23.34208 -6.9582,-41.98911 -20.9108,-55.9418 -13.8648,-13.95246 -32.3895,-20.93624 -55.556,-20.9364 z m -0.2559,31.32743 c 8.4236,9e-5 15.2185,2.77931 20.3958,8.30765 5.2653,5.44076 7.8962,12.62883 7.8965,21.57941 l -61.2146,0 c 1.4038,-9.65264 4.9701,-17.02975 10.6739,-22.1195 5.7039,-5.17729 13.1217,-7.76747 22.2484,-7.76756 z m 161.0094,2.90632 c 10.0913,2.1e-4 17.7543,3.68875 23.0195,11.05986 5.3529,7.37121 8.0506,18.05865 8.0506,32.09903 0,14.04041 -2.6977,24.75347 -8.0506,32.12465 -5.2652,7.37135 -12.9282,11.05983 -23.0195,11.05983 -10.0918,0 -17.8623,-3.68848 -23.3027,-11.05983 -5.3529,-7.45887 -8.025,-18.17208 -8.025,-32.12465 0,-13.95258 2.6721,-24.59918 8.025,-31.97046 5.4404,-7.45878 13.2109,-11.18822 23.3027,-11.18843 l 0,0 z"
         style="font-size:327.53112793px;font-style:normal;font-weight:normal;fill:#3f6c74;fill-opacity:1;stroke:none;font-family:Bitstream Vera Sans" />
      <path
         id="path4255-2"
         d="m 366.17643,616.80067 c -16.5855,2.7e-4 -28.6951,3.75771 -36.3295,11.30425 -7.6345,7.45918 -11.4432,19.39211 -11.4432,35.80153 l 0,10.27668 -23.164,0 0,18.83122 23.164,0 0,128.59659 24.3308,0 0,-128.59659 39.8845,0 0,-18.83122 -39.8845,0 0,-13.02631 c 0,-9.12615 1.6646,-15.45985 4.9994,-18.97012 3.4223,-3.50992 9.477,-5.24928 18.1645,-5.24935 l 23.192,0 0,-20.13668 -22.914,0 0,0 z m -435.951146,4.72171 c -29.748,1.6e-4 -53.186204,9.13352 -70.297904,27.3858 -17.1119,18.16488 -25.6636,43.03979 -25.6636,74.63047 0,31.50319 8.5517,56.37803 25.6636,74.63054 17.1117,18.16473 40.549904,27.24694 70.297904,27.24694 11.583,0 22.5302,-1.56261 32.8853,-4.72172 10.4423,-3.15896 20.33355,-7.90242 29.6352504,-14.22055 l 0,-27.77465 c -8.9510004,8.33647 -18.5398504,14.56796 -28.7189504,18.69232 -10.0914,4.1243 -20.8385,6.19378 -32.2465,6.19378 -22.4644,0 -39.643304,-6.8639 -51.577404,-20.55328 -11.9344,-13.77712 -17.9146,-33.60626 -17.9146,-59.49338 0,-25.97451 5.9802,-45.80366 17.9146,-59.49325 11.9341,-13.777 29.113004,-20.66425 51.577404,-20.66435 11.408,1e-4 22.1551,2.06957 32.2465,6.19371 10.1791,4.12453 19.76795,10.35608 28.7189504,18.69237 l 0,-28.05248 c -9.1265004,-6.23012 -18.9151504,-10.87129 -29.3576504,-13.94276 -10.355,-3.15886 -21.4044,-4.74935 -33.1629,-4.74951 l 0,0 z m 145.06685,49.1056 c -21.1482,6e-5 -37.7502,6.83626 -49.7722,20.52551 -11.9344,13.68931 -17.8868996,32.66281 -17.8868996,56.88249 0,24.13178 5.9524996,43.07757 17.8868996,56.85466 12.022,13.68938 28.624,20.52549 49.7722,20.52549 21.0604,0 37.583596,-6.83611 49.605596,-20.52549 12.0219,-13.77709 18.0533,-32.72279 18.0537,-56.85466 -4e-4,-24.21962 -6.0318,-43.19311 -18.0537,-56.88249 -12.022,-13.68925 -28.545196,-20.52545 -49.605596,-20.52551 l 0,0 z m 158.926496,0 c -10.2671,6e-5 -19.3491,2.1951 -27.2468,6.58254 -7.8098,4.38775 -14.6228,11.0239 -20.4143,19.88662 l 0,-22.91401 -24.3308,0 0,147.42781 24.3308,0 0,-83.32389 c 0,-14.39128 3.7852,-25.77075 11.332,-34.10732 7.5464,-8.33631 17.8656,-12.4984 30.9409,-12.49857 10.8812,1.7e-4 19.0288,3.48316 24.4695,10.41545 5.4404,6.93255 8.1657,17.37735 8.1657,31.32981 l 0,88.18452 24.2196,0 0,-88.98993 c 0,-20.35845 -4.3391,-35.74667 -13.0263,-46.1893 -8.6876,-10.53002 -21.5041,-15.80367 -38.4403,-15.80373 l 0,0 z M 75.292134,691.15349 c 12.8997,0 23.1166,5.14794 30.663396,15.4149 7.5464,10.17937 11.304,24.00493 11.304,41.46759 0,17.55037 -3.7576,31.39932 -11.304,41.57859 -7.546796,10.17924 -17.763696,15.27607 -30.663396,15.27607 -13.0751,0 -23.3945,-5.04562 -30.9409,-15.13723 -7.4592,-10.17921 -11.1931,-24.07926 -11.1931,-41.71743 0,-17.63823 3.785,-31.51496 11.332,-41.60652 7.5468,-10.17914 17.8148,-15.27591 30.802,-15.27597 l 0,0 z"
         style="font-size:303.30599976px;font-style:normal;font-weight:normal;fill:#c18a00;fill-opacity:1;stroke:none;font-family:Bitstream Vera Sans" />
      <g
         id="text4227"
         style="font-size:234.61767578px;font-style:normal;font-variant:normal;font-weight:normal;font-stretch:normal;text-align:start;line-height:125%;writing-mode:lr-tb;text-anchor:start;fill:#3f6c74;fill-opacity:1;stroke:none;font-family:Dyuthi;-inkscape-font-specification:Dyuthi"
         transform="matrix(1.6798628,0,0,1.6798628,1571.9109,-2837.8353)">
        <path
           style="fill:#3f6c74;fill-opacity:1"
           id="path4234"
           d="m -668.60684,2082.0629 -11.68506,0.6873 c -3.51317,-0.1526 -6.33897,-1.5273 -8.47739,-4.1241 -1.98571,-2.7493 -2.97856,-5.957 -2.97855,-9.623 -10e-6,-3.0548 0.99284,-5.957 2.97855,-8.7065 2.13842,-2.4438 4.96422,-3.6658 8.47739,-3.6659 l 29.09809,0 c 1.8329,10e-5 3.89497,1.1457 6.18621,3.4368 2.29113,2.1385 3.43672,4.0479 3.43679,5.728 l 0,97.8337 c -7e-5,5.4989 -1.37478,9.623 -4.12414,12.3724 -2.74949,3.0549 -5.95715,4.5824 -9.62299,4.5824 -3.51321,0 -6.56812,-1.3747 -9.16476,-4.1242 -2.74946,-3.0549 -4.12417,-6.9499 -4.12414,-11.685 l 0,-82.7119" />
        <path
           style="fill:#3f6c74;fill-opacity:1"
           id="path4236"
           d="m -575.58459,2053.1939 c 15.12176,10e-5 27.34142,6.9501 36.65901,20.8498 8.55366,12.678 12.83054,27.7999 12.83065,45.3656 -1.1e-4,16.9548 -4.12425,31.0838 -12.37241,42.3869 -9.16485,12.678 -21.99549,19.0169 -38.49197,19.0169 -16.03836,0 -28.79263,-6.6444 -38.26284,-19.9333 -8.55379,-11.7614 -12.83067,-26.2723 -12.83065,-43.5326 -2e-5,-17.413 4.42961,-32.1529 13.28889,-44.2199 9.62295,-13.2888 22.68271,-19.9333 39.17932,-19.9334 m -1.37472,21.079 c -7.17911,1e-4 -12.8307,3.8951 -16.95479,11.685 -3.81869,6.7209 -5.72801,16.9549 -5.72797,30.7019 -4e-5,14.9692 1.90928,25.8141 5.72797,32.5349 4.12409,7.4846 9.85205,11.2268 17.18391,11.2268 6.72075,0 11.99048,-3.9713 15.8092,-11.9142 3.66582,-7.0262 5.49877,-18.1767 5.49885,-33.4513 -8e-5,-13.4416 -1.75666,-23.37 -5.26973,-29.7854 -3.97147,-7.3317 -9.39394,-10.9976 -16.26744,-10.9977" />
      </g>
      <path
         id="path2911"
         d="m -824.80702,704.18747 c -0.5913,0 -0.9915,0.16879 -0.9915,0.16879 0,0 -3.9559,0.40608 -6.3309,0.80186 -2.3752,0.39587 -18.9927,6.33097 -18.9927,6.33097 0,0 -11.0786,4.35168 -12.6617,6.33089 -1.5835,1.97916 -11.484,7.91816 -15.0469,9.89731 -3.5625,1.97922 -15.4474,20.9764 -15.4474,20.9764 0,0 -5.9388,5.53998 -9.8971,17.81099 -3.9583,12.27105 -10.2912,29.29171 -14.6455,40.77105 -4.3542,11.47932 -24.1457,67.28856 -27.7082,76.39299 -3.5626,9.10443 -28.1092,59.78488 -28.1092,59.78488 1.1872,0.3961 84.7112,9.494 88.2741,-10.2983 3.5622,-19.7919 9.1164,-64.53297 9.1164,-64.53297 0,0 4.3512,-2.75823 6.3307,-5.52908 1.9793,-2.77086 5.5395,-10.6987 6.3309,-12.28193 0.7917,-1.58339 11.4892,-19.39057 15.4477,-27.30737 3.958,-7.91665 9.1036,-4.75898 14.6452,-3.96744 5.5419,0.79186 6.711,4.36832 6.711,4.36832 0,0 5.9497,-1.19642 9.1164,-3.96728 3.1666,-2.77085 1.9787,-8.70418 1.5827,-11.07908 -0.3957,-2.37518 -5.5498,-5.14908 -5.5498,-5.14908 0,0 2.7737,-0.78028 5.1489,-2.36356 2.375,-1.58349 3.1703,-2.76851 3.5663,-6.33097 0.3959,-3.5626 0.3965,-7.91738 -1.5828,-11.48001 -1.979,-3.56254 -6.331,-6.35201 -6.331,-6.35201 l 1.9838,-1.58277 c 0,0 5.534,-5.92926 5.93,-7.51264 0.3959,-1.58339 -1.1867,-7.92333 -1.5828,-10.29834 -0.3956,-2.37499 -7.9232,-7.1117 -10.2981,-7.1117 -2.3753,0 -15.044,-0.80768 -21.3772,0.37984 -6.3338,1.18751 -21.7572,6.73186 -21.7572,6.73186 l -0.4012,-3.16539 c 0,0 2.3789,-2.76388 3.5665,-4.34727 1.1876,-1.58338 4.3472,-9.49634 4.3472,-9.49634 0,0 4.7416,-3.5658 7.5128,-5.14912 2.7707,-1.58339 15.8483,-10.2983 15.8483,-10.2983 0,0 11.4785,-5.13247 14.6455,-7.11176 3.1666,-1.97915 4.3427,-7.14175 2.3634,-11.10015 -1.2372,-2.47403 -2.7707,-2.93336 -3.7566,-2.93336 l 0,7e-5 z m -15.9746,66.87553 c 6.0775,0 11.48,0.6753 13.5058,1.01295 2.0262,0.33765 1.6883,2.70118 1.6883,2.70118 0,0 -3.3765,-1.01292 -8.4411,-1.01292 -5.0647,0 -19.584,0.67527 -19.584,0.67527 l -1.6882,-0.33765 c 0,0 8.4414,-3.03883 14.5192,-3.03883 z m 7.0906,25.32362 c 2.701,0 6.4152,4.05183 6.4152,4.05183 0,0 -4.727,-0.6753 -6.7528,-1.68826 -2.0258,-1.01295 -8.4412,-1.01295 -8.7788,-1.35057 0,0 6.4151,-1.013 9.1164,-1.013 l 0,0 z"
         style="fill:#3f6c74;fill-opacity:1;stroke:none" />
      <path
         id="path2457"
         d="m -660.48832,862.34718 0,2.96875 2.7812,0 c 1.2736,2e-5 2.8712,0.0603 4.7813,0.1875 0.7642,0.12739 1.2451,0.21666 1.5,0.28125 0.5092,0.191 0.7812,0.82386 0.7812,1.90625 l 0,49.84376 c 10e-5,0.6368 -0.03,1.1804 -0.094,1.56251 -0.3185,3.6931 -3.5735,5.5312 -9.75,5.5312 l 0,2.9688 c 6.6858,-0.1909 10.4235,-0.2813 11.1875,-0.2813 0.764,0 4.4703,0.091 11.1562,0.2813 l 0,-2.9688 c -3.1837,0 -5.5944,-0.4824 -7.25,-1.4375 -1.7191,-1.0187 -2.5625,-2.9184 -2.5625,-5.65621 l 0,-49.65626 c 0.3821,0.38193 0.6827,0.77428 0.9375,1.15625 l 39,57.31252 c 0.6367,0.8278 1.148,1.25 1.5938,1.25 0.1909,0 0.3715,-0.029 0.5625,-0.094 l 0.094,0 c 0.4456,-0.1274 0.6875,-0.9417 0.6875,-2.4062 l 0,-52.71877 0,-1.4375 0.094,-0.0937 c 0.3183,-3.69303 3.5423,-5.53125 9.7187,-5.53125 l 0,-2.96875 c -6.6858,0.19092 -10.3923,0.28143 -11.1562,0.28125 -0.7642,2e-4 -4.5016,-0.0907 -11.1875,-0.28125 l 0,2.96875 c 3.1837,2e-5 5.6255,0.48244 7.2812,1.4375 1.7193,1.01889 2.5624,2.88695 2.5625,5.625 l 0,40.78126 -33.6875,-49.56251 -0.125,-0.1875 -0.062,-0.125 -0.125,-0.0625 -0.094,-0.125 c -0.382,-0.50935 -1.1964,-0.74991 -2.4063,-0.75 l -16.2187,0 z"
         style="font-size:100.47190094px;font-style:normal;font-variant:normal;font-weight:bold;font-stretch:normal;text-align:start;line-height:125%;writing-mode:lr-tb;text-anchor:start;fill:#3f6c74;fill-opacity:1;stroke:none;font-family:cmr10;-inkscape-font-specification:cmr10 Medium" />
      <path
         id="path2498"
         d="m -182.88392,860.57892 c -0.6368,6e-5 -1.2712,0.0184 -1.908,0.0829 -8.4687,0.44575 -15.7118,3.88239 -21.7607,10.31358 -6.3676,6.74942 -9.5671,14.85314 -9.5671,24.277 0,0.63691 0.047,1.27116 0.1107,1.90787 0.4456,9.42387 3.9872,17.30116 10.673,23.66873 6.3675,6.1127 13.8559,9.1799 22.4521,9.1799 7.4497,0 13.6227,-2.7554 18.5257,-8.2952 4.2662,-4.7755 6.4149,-10.14308 6.4149,-16.06477 0,-1.08255 -0.4165,-1.60372 -1.2443,-1.60372 -0.7004,0.0637 -1.0976,0.56571 -1.1613,1.52077 -0.3184,5.85808 -2.2878,10.76205 -5.9172,14.70992 -4.1388,4.5208 -9.2801,6.7743 -15.4565,6.7743 -3.5657,0 -7.0687,-0.8522 -10.5072,-2.5714 -9.36,-4.7756 -14.0463,-14.49823 -14.0463,-29.14345 0,-10.12426 2.3003,-17.96308 6.8849,-23.50279 l 0.083,-0.083 c 0.8914,-1.01869 1.8568,-1.98419 2.8756,-2.87564 4.2662,-3.56573 9.1234,-5.33652 14.5994,-5.33652 3.8205,-1e-5 7.3235,1.11721 10.5071,3.3457 5.6671,4.01155 9.1038,10.44935 10.3135,19.29994 0.064,0.38216 0.1106,0.61923 0.1106,0.74656 0.1274,0.57301 0.61,0.85725 1.4379,0.85716 0.4456,9e-5 0.749,-0.0184 0.9401,-0.083 0.3821,-0.12743 0.5807,-0.8749 0.5807,-2.21203 l 0,-22.61799 c -0.064,-0.95503 -0.4141,-1.72179 -1.0507,-2.29497 -0.5096,9e-5 -1.0115,0.36963 -1.5208,1.13366 l -4.7835,7.07849 -1.6314,-1.63137 c -4.7756,-4.39355 -10.0963,-6.5807 -15.9542,-6.58078 z m -104.4077,1.05071 -13.7699,1.05071 0,2.95859 2.4055,0 c 1.7193,0.12739 2.9218,0.39224 3.6223,0.77421 l 0.083,0 c 0.8915,0.57307 1.3549,2.079 1.3549,4.56231 l 0,49.68765 c 0,1.6555 -0.2456,2.7258 -0.6913,3.2351 l -0.1659,0.1936 c -0.6366,0.5731 -2.8518,0.8571 -6.6084,0.8571 l 0,2.9586 c 6.3037,-0.1909 9.7874,-0.2765 10.4241,-0.2765 3.1837,0 6.6866,0.086 10.5072,0.2765 l 0,-2.9586 c -3.2475,0 -5.2444,-0.1518 -5.9448,-0.47 -1.019,-0.382 -1.5208,-1.6508 -1.5208,-3.8158 l 0,-9.8435 6.1107,-5.25357 0.1935,0.2765 c 2.1651,2.99271 3.547,4.88836 4.12,5.66832 4.6442,6.471 7.0508,10.28685 7.0508,11.25365 1e-4,1.4647 -1.1366,2.1844 -3.4287,2.1844 l 0,2.9586 c 5.3486,-0.1909 8.7855,-0.2765 10.3137,-0.2765 2.8019,0 5.5845,0.086 8.3227,0.2765 l 0,-2.9586 c -1.2098,0 -2.1091,-0.018 -2.6821,-0.083 -2.2286,-0.3184 -4.416,-1.9844 -6.5808,-4.9771 l -12.1385,-17.0879 -0.5806,-1.05072 0.1106,-0.19355 0.083,-0.1106 c 1.4009,-1.52815 3.919,-3.71559 7.5486,-6.58078 4.0113,-3.24754 8.0163,-4.97959 12.0278,-5.17062 l 0,-2.95859 c -1.8466,0.19113 -4.0805,0.30416 -6.6913,0.30416 -4.4571,-10e-6 -8.0263,-0.11304 -10.7007,-0.30416 l 0,2.95859 c 0.191,-10e-6 0.3896,0.046 0.5806,0.1106 1.4646,0.25464 2.2121,1.02156 2.2121,2.29498 0,1.27349 -0.7006,2.49543 -2.1015,3.70515 l -13.4656,11.66844 0,-45.84427 z m 147.0721,2.37793 c -0.8914,-3e-5 -1.6775,0.21784 -2.3779,0.66361 -1.7828,0.95504 -2.6821,2.42254 -2.6821,4.3964 0,0.6369 0.1324,1.27117 0.3871,1.90788 l 0,0.1106 c 0.8915,2.03763 2.4442,3.04171 4.6729,3.04154 0.6368,1.9e-4 1.271,-0.10472 1.9079,-0.35946 2.1013,-0.76402 3.1522,-2.34448 3.1522,-4.70056 0,-0.76393 -0.1517,-1.48396 -0.47,-2.18437 -0.8915,-1.91025 -2.4252,-2.87564 -4.5901,-2.87564 z m 28.397,5.17061 c -0.064,2.73797 -0.4141,5.29493 -1.0508,7.71445 -1.8466,6.87704 -5.5866,10.44604 -11.2536,10.70068 l 0,2.10143 8.1015,0 0,26.37843 c 0,2.67435 0.4636,4.94714 1.3548,6.85724 1.974,4.0116 5.6284,6.0278 10.9773,6.0278 1.9738,0 3.659,-0.5489 5.059904,-1.6313 2.929,-2.2923 4.3965,-6.0323 4.3965,-11.25374 l 0,-5.44712 -2.4056,0 0,5.25357 c -1e-4,2.03763 -0.2178,3.80839 -0.6637,5.33649 -1.0824,3.5657 -2.985704,5.3642 -5.723504,5.3642 -0.3185,0 -0.6025,-0.047 -0.8571,-0.1106 -3.6933,-0.4457 -5.5301,-3.8355 -5.5301,-10.20299 l 0,-26.57198 13.659204,0 0,-2.95859 -13.659204,0 0,-17.55797 -2.4056,0 z m -254.1067,15.95425 c -5.0481,0.23129 -9.4562,2.21619 -13.2169,5.91718 -4.6483,4.45725 -6.9679,9.92953 -6.9679,16.4243 0,5.60342 1.884,10.46068 5.6407,14.5994 4.2026,4.5845 9.3438,6.8849 15.4565,6.8849 5.2851,0 9.9242,-1.7515 13.9358,-5.2535 4.8392,-4.2662 7.272,-9.67222 7.272,-16.2308 0,-5.73065 -1.8369,-10.72019 -5.53,-14.98648 -4.2027,-4.9029 -9.3907,-7.355 -15.5672,-7.355 -0.3422,0 -0.6865,-0.015 -1.023,0 z m 40.8395,0.55301 -13.2722,1.05071 0,2.95859 1.9079,0 c 1.974,0.0637 3.3283,0.32862 4.0923,0.77421 0.9551,0.57319 1.4378,2.10674 1.4378,4.58996 l 0,25.6042 c 0,1.6555 -0.2178,2.7258 -0.6636,3.2351 l -0.1936,0.1936 c -0.6366,0.5731 -2.824,0.8571 -6.5808,0.8571 l 0,2.9586 c 7.45,-0.1909 11.0853,-0.2765 10.8943,-0.2765 5.5398,0 9.5638,0.086 12.1108,0.2765 l 0,-2.9586 -1.9908,0 c -3.1199,0 -5.1363,-0.2649 -6.0278,-0.7742 l -0.083,-0.083 c -0.7641,-0.4456 -1.1613,-1.6482 -1.1613,-3.6222 l 0,-14.71002 c 0,-3.75672 0.6151,-7.12715 1.8249,-10.12002 2.0376,-5.22129 5.1902,-7.85261 9.4564,-7.8527 0.5731,7e-5 0.9232,0.046 1.0507,0.1106 -1.4645,0.76393 -2.212,1.98596 -2.212,3.70515 0,0.57318 0.113,1.10274 0.3041,1.54841 0.5731,1.71929 1.8418,2.57149 3.8158,2.57149 0.3184,-10e-6 0.6217,-0.0184 0.9401,-0.083 2.1014,-0.5094 3.152,-1.89116 3.1521,-4.11991 -10e-5,-0.89135 -0.218,-1.72449 -0.6636,-2.48853 -1.2735,-2.22866 -3.3946,-3.3456 -6.3872,-3.34569 -1.1461,8e-5 -2.244,0.17935 -3.2627,0.49771 -3.9479,1.33713 -6.7696,4.66083 -8.4887,10.00942 l 0,-10.50713 z m 189.5432,0 -13.3552,1.05071 0,2.95859 c 2.738,10e-6 4.5087,0.19869 5.3366,0.58066 l 0.1106,0.1106 0.083,0 c 1.0188,0.50958 1.5208,2.01547 1.5208,4.56231 l 0,25.7148 c 0,1.6555 -0.218,2.7258 -0.6636,3.2351 l -0.1936,0.1936 c -0.6367,0.5731 -2.8241,0.8571 -6.5808,0.8571 l 0,2.9586 c 6.1129,-0.1909 9.6157,-0.2765 10.5071,-0.2765 0.1275,0 3.4317,0.086 9.9265,0.2765 l 0,-2.9586 c -2.929,0 -4.766,-0.1986 -5.53,-0.5806 -0.7641,-0.4458 -1.1613,-1.6482 -1.1613,-3.6222 l 0,-35.06067 z m 48.526304,1.05071 0,2.95859 c 1.4644,10e-6 2.7995,0.0663 4.0093,0.19355 1.7191,0.25465 2.9687,1.30572 3.7328,3.15214 l 14.3229,34.86708 c -0.7006,1.8466 -1.4864,3.7304 -2.378,5.6407 -0.6367,1.5919 -1.1387,2.7944 -1.5207,3.6222 -2.4835,5.476 -5.6167,8.2121 -9.3734,8.2121 -1.7829,0 -3.2697,-0.5682 -4.4795,-1.7143 2.4833,-0.382 3.7053,-1.717 3.7053,-4.0093 -1e-4,-0.4456 -0.066,-0.8817 -0.1936,-1.3273 -0.573,-1.7828 -1.8419,-2.682 -3.8158,-2.682 -0.3183,0 -0.6216,0.019 -0.9401,0.083 -2.0374,0.4457 -3.0691,1.7807 -3.0692,4.0093 0,1.4009 0.4165,2.7165 1.2443,3.9263 1.7191,2.547 4.2375,3.8157 7.5486,3.8158 5.0939,-1e-4 9.1651,-3.6354 12.2213,-10.8943 l 16.8114,-40.78424 c 1.6555,-4.07498 4.6096,-6.11073 8.8759,-6.11073 l 0,-2.95859 c -2.165,0.19114 -4.5507,0.30416 -7.1614,0.30416 -1.3373,10e-6 -4.0927,-0.11304 -8.2951,-0.30416 l 0,2.95859 0.553,0 c 2.6104,0.31845 3.9263,1.7003 3.9262,4.1199 0,0.63673 -0.1985,1.40362 -0.5806,2.29498 l -9.6499,23.50279 -10.5901,-25.71482 c -0.3821,-0.95514 -0.5807,-1.5232 -0.5807,-1.71432 0,-1.65547 1.7983,-2.48853 5.3641,-2.48853 l 0,-2.95859 c -4.9666,0.19114 -8.4501,0.30416 -10.4241,0.30416 -3.3111,10e-6 -6.3976,-0.11304 -9.2629,-0.30416 z m -277.996604,0.49771 c 4.4573,0.19103 8.0457,2.24592 10.7836,6.19368 1.6556,2.73805 2.4886,7.15936 2.4886,13.27216 0,5.73075 -0.7006,10.00036 -2.1015,12.80211 l -0.9401,1.7143 c -2.4832,3.5657 -5.8538,5.3642 -10.12,5.3642 -4.5846,-0.1273 -8.2199,-2.276 -10.8942,-6.4149 -1.5918,-2.80164 -2.4056,-7.28928 -2.4056,-13.46571 0,-5.92186 0.7668,-10.27694 2.295,-13.07861 0.3183,-0.57308 0.7155,-1.1219 1.1613,-1.63137 2.5471,-3.18373 5.7851,-4.75586 9.7329,-4.75586 z"
         style="font-size:100.47190094px;font-style:normal;font-variant:normal;font-weight:bold;font-stretch:normal;text-align:start;line-height:125%;writing-mode:lr-tb;text-anchor:start;fill:#3f6c74;fill-opacity:1;stroke:none;font-family:cmr10;-inkscape-font-specification:cmr10 Medium" />
      <path
         id="path2449"
         d="m -449.67112,862.34718 0,2.9687 1.6875,0 c 1.4646,0 2.7012,0.0604 3.6562,0.1875 0.8279,0.0638 1.5208,0.2143 2.0938,0.4688 1.0826,0.3822 2.1072,1.3468 3.0625,2.875 l 20.0625,32.6562 0,18.65632 c 0,1.4646 -0.1203,2.398 -0.375,2.8437 -0.6369,1.0826 -3.0175,1.625 -7.1563,1.625 l -2.3125,0 0,2.9688 c 2.2923,-0.1909 6.9333,-0.2813 13.9375,-0.2813 7.004,0 11.6764,0.091 13.9688,0.2813 l 0,-2.9688 -2.2188,0 c -3.3749,0 -5.4836,-0.3019 -6.375,-0.875 -0.8276,-0.5093 -1.25,-1.775 -1.25,-3.8125 l 0,-18.43752 18.4063,-30 c 2.4833,-4.1387 6.5829,-6.1875 12.25,-6.1875 l 0,-2.9687 c -2.9292,0.1909 -6.0639,0.2814 -9.375,0.2812 -2.3558,2e-4 -6.0021,-0.0906 -10.9688,-0.2812 l 0,2.9687 c 0.7641,0 1.4268,0.0604 2,0.1875 2.2921,0.5094 3.4374,1.6849 3.4375,3.5313 -10e-5,0.9553 -0.332,1.9199 -0.9687,2.875 l -15.75,25.5937 -17.2813,-28.1875 c -0.4457,-0.6369 -0.6562,-1.1792 -0.6562,-1.625 0,-0.1908 0,-0.3713 0.062,-0.5625 0.3184,-1.2097 2.5499,-1.8125 6.625,-1.8125 l 0,-2.9687 c -2.2922,0.1909 -7.0249,0.2814 -14.1563,0.2812 -4.2662,2e-4 -8.3947,-0.0906 -12.4062,-0.2812 z m -121.7813,22.4687 c -4.9666,0 -9.3068,1.7781 -13,5.3438 -4.5846,4.3299 -6.8437,9.7841 -6.8437,16.4062 0,5.9217 1.8982,10.985 5.7187,15.18752 4.2027,4.5846 9.296,6.875 15.2813,6.875 1.0188,10e-5 2.0136,-0.091 2.9687,-0.2812 4.2662,-0.7005 7.7018,-2.8406 10.3125,-6.4063 1.7828,-2.4196 2.6563,-4.31792 2.6563,-5.71872 0,-0.7642 -0.4223,-1.125 -1.25,-1.125 -0.6368,0 -1.0277,0.421 -1.2188,1.3125 -0.5729,1.7191 -1.3574,3.19522 -2.3125,4.46872 -2.6743,3.5657 -6.2001,5.375 -10.5937,5.375 -4.1388,-0.3183 -7.7249,-2.4585 -10.7813,-6.4062 -1.9101,-3.05652 -2.8752,-7.84892 -2.875,-14.34382 l 26.6563,0 c 0.9551,10e-5 1.4966,0.002 1.6875,-0.0625 0.4457,-0.1909 0.6875,-0.8237 0.6875,-1.9062 0,-3.5021 -0.6629,-6.6972 -2,-9.5625 -2.8654,-6.1128 -7.8986,-9.1563 -15.0938,-9.1563 z m 21.5313,1.5938 0,2.9687 c 2.0377,10e-5 3.4535,0.0902 4.2812,0.2813 1.2099,0.3183 2.1445,1.3433 2.7813,3.0625 l 12.0312,33.81252 c 0.064,0.2548 0.1228,0.4042 0.1875,0.4687 0.382,1.0826 0.9847,1.625 1.8125,1.625 0.191,10e-5 0.4029,0 0.5938,-0.062 l 0.062,0 c 0.4458,-0.1272 0.8679,-0.7611 1.25,-1.8437 l 9.6562,-27.03132 9.75,27.12502 c 0.446,1.21 1.0785,1.8125 1.9063,1.8125 0.8277,-0.1274 1.4605,-0.73 1.9062,-1.8125 l 11.1875,-31.34372 c 1.401,-3.9477 4.0835,-5.9663 8.0313,-6.0938 l 0,-2.9687 c -2.1013,0.1911 -4.4219,0.3125 -6.9688,0.3125 -2.2924,0 -5.2768,-0.1214 -8.9062,-0.3125 l 0,2.9687 c 0.4457,0 0.8979,0.0292 1.3437,0.0938 2.8016,0.5094 4.2188,2.0167 4.2188,4.5 0,0.5093 -0.1816,1.1723 -0.5,2 l -8.6875,24.43752 -9.4688,-26.65632 c -0.3184,-0.9552 -0.4687,-1.5264 -0.4687,-1.7812 0,-1.7191 1.8993,-2.5938 5.6562,-2.5938 l 0,-2.9687 c -5.5396,0.1911 -8.8863,0.3125 -9.9687,0.3125 -2.8016,0 -5.6347,-0.1214 -8.5,-0.3125 l 0,2.9687 c 2.8654,0 4.8851,0.4825 6.0312,1.4375 0.3183,0.3821 1.0413,2.1299 2.1875,5.25 l -8.2187,23.12502 -9.0625,-25.50002 c -0.3185,-0.764 -0.5,-1.3366 -0.5,-1.7187 10e-5,-1.7191 1.8994,-2.5938 5.6562,-2.5938 l 0,-2.9687 c -5.7307,0.1911 -9.1966,0.3125 -10.4062,0.3125 -2.4834,0 -5.4365,-0.1214 -8.875,-0.3125 z m -21.5313,0.5 c 2.7379,0 4.9984,0.9948 6.7813,2.9687 2.6743,3.0565 3.9999,7.6073 4,13.6563 l -22.625,0 c 0.191,-5.2212 1.3965,-9.2908 3.625,-12.1563 2.2287,-2.9925 4.9713,-4.4687 8.2187,-4.4687 z"
         style="font-size:100.47190094px;font-style:normal;font-variant:normal;font-weight:bold;font-stretch:normal;text-align:start;line-height:125%;writing-mode:lr-tb;text-anchor:start;fill:#3f6c74;fill-opacity:1;stroke:none;font-family:cmr10;-inkscape-font-specification:cmr10 Medium" />
    </g>
    <text
       xml:space="preserve"
       style="font-size:60px;font-style:normal;font-weight:normal;text-align:center;text-anchor:middle;fill:#3f6c74;fill-opacity:1;stroke:none;font-family:Bitstream Vera Sans"
       x="140.03889"
       y="115.22951"
       id="text2961"><tspan
         sodipodi:role="line"
         x="140.03889"
         y="115.22951"
         id="tspan2965"
         style="font-size:48px;font-weight:bold;fill:#3f6c74;fill-opacity:1;stroke:none;-inkscape-font-specification:Bitstream Vera Sans Bold">Debian</tspan></text>
    <text
       xml:space="preserve"
       style="font-size:40px;font-style:normal;font-weight:normal;fill:#000000;fill-opacity:1;stroke:none;font-family:Bitstream Vera Sans"
       x="73.032784"
       y="925.62433"
       id="text4486"><tspan
         sodipodi:role="line"
         id="tspan4488"
         x="73.032784"
         y="925.62433"
         style="font-size:14px">DebConf 10 | Columbia University in the City of New York — August 1-7, 2010</tspan></text>
    <text
       xml:space="preserve"
       style="font-size:40px;font-style:normal;font-weight:normal;fill:#fcfcfc;fill-opacity:0.90376575;stroke:none;font-family:Bitstream Vera Sans"
       x="333.79694"
       y="955.89978"
       id="text4490"><tspan
         sodipodi:role="line"
         id="tspan4492"
         x="333.79694"
         y="955.89978"
         style="font-size:18px;font-weight:bold;fill:#fcfcfc;fill-opacity:0.90376575;-inkscape-font-specification:Bitstream Vera Sans Bold">debconf.org | sponsors@debconf.org</tspan></text>
    <text
       id="text4502"
       y="238.57378"
       x="216.75179"
       style="font-size:22px;font-style:normal;font-weight:normal;text-align:center;text-anchor:middle;fill:#3f6c74;fill-opacity:1;stroke:none;font-family:Bitstream Vera Sans"
       xml:space="preserve"><tspan
         style="font-size:22px;font-weight:bold;fill:#3f6c74;fill-opacity:1;stroke:none;-inkscape-font-specification:Bitstream Vera Sans Bold"
         id="tspan4504"
         y="238.57378"
         x="216.75179"
         sodipodi:role="line">A FREE OPERATING SYSTEM</tspan></text>
    <rect
       style="fill:#ffffff;fill-opacity:0.71193417;stroke:none"
       id="rect4516"
       width="632.95081"
       height="245.06558"
       x="73.032784"
       y="277.5246" />
    <flowRoot
       xml:space="preserve"
       style="font-size:40px;font-style:normal;font-weight:normal;fill:#000000;fill-opacity:1;stroke:none;font-family:Bitstream Vera Sans"
       id="flowRoot4526"
       transform="translate(0,-20)"><flowRegion
         id="flowRegion4528"><use
           x="0"
           y="0"
           xlink:href="#rect4516"
           id="use4530"
           width="765"
           height="990" /></flowRegion><flowPara
         id="flowPara4532"
         style="font-size:18px">Debian GNU/Linux is a free operating system, developed by more than a thousand volunteers from all over the world who collaborate via the Internet. Debian's dedication to Free Software, its non-profit nature, and its open development model make it unique among GNU/Linux distributions.</flowPara></flowRoot>    <rect
       y="599.21313"
       x="73.032784"
       height="246.68854"
       width="632.95081"
       id="rect4542"
       style="fill:#ffffff;fill-opacity:0.71193417;stroke:none" />
    <text
       xml:space="preserve"
       style="font-size:22px;font-style:normal;font-weight:normal;text-align:center;text-anchor:middle;fill:#3f6c74;fill-opacity:1;stroke:none;font-family:Bitstream Vera Sans"
       x="288.38068"
       y="448.19025"
       id="text4552"><tspan
         sodipodi:role="line"
         x="288.38068"
         y="448.19025"
         id="tspan4554"
         style="font-size:22px;font-weight:bold;fill:#3f6c74;fill-opacity:1;stroke:none;-inkscape-font-specification:Bitstream Vera Sans Bold">A LARGE SCALE, DISTRIBUTED PROJECT</tspan></text>
    <flowRoot
       xml:space="preserve"
       style="font-size:40px;font-style:normal;font-weight:normal;fill:#000000;fill-opacity:1;stroke:none;font-family:Bitstream Vera Sans"
       id="flowRoot4579"
       transform="translate(0.05427137,-129.83607)"><flowRegion
         id="flowRegion4581"><use
           x="0"
           y="0"
           xlink:href="#rect4542"
           id="use4583"
           width="765"
           height="990" /></flowRegion><flowPara
         id="flowPara4585"
         style="font-size:18px">The Debian project's key strengths are its volunteer base, its dedication to the Debian Social Contract, and its commitment to provide the best operating system possible.</flowPara><flowPara
         style="font-size:18px"
         id="flowPara4734" /><flowPara
         style="font-size:18px"
         id="flowPara4736">Debian is produced by over a thousand active developers spread around the world who volunteer in their spare time.</flowPara></flowRoot>    <image
       y="625.48242"
       x="153.52972"
       id="image4748"
       height="234.14754"
       width="390.24591"
       xlink:href="file:developers_map.png"
       style="stroke:#000000;stroke-width:20;stroke-miterlimit:4;stroke-opacity:1;stroke-dasharray:none" />
    <text
       xml:space="preserve"
       style="font-size:40px;font-style:normal;font-weight:normal;fill:#000000;fill-opacity:1;stroke:none;font-family:Bitstream Vera Sans"
       x="259.66089"
       y="880.10535"
       id="text4752"><tspan
         sodipodi:role="line"
         id="tspan4754"
         x="259.66089"
         y="880.10535"
         style="font-size:16px">debian developers around the world</tspan></text>
    <rect
       style="fill:none;stroke:#000000;stroke-width:0.99132764;stroke-miterlimit:4;stroke-opacity:1;stroke-dasharray:none"
       id="rect3648"
       width="397.00867"
       height="238.00867"
       x="150.99567"
       y="619.99567" />
  </g>
</svg>
