<?xml version="1.0" encoding="UTF-8" standalone="no"?>
<!-- Created with Inkscape (http://www.inkscape.org/) -->

<svg
   xmlns:i="http://ns.adobe.com/AdobeIllustrator/10.0/"
   xmlns:dc="http://purl.org/dc/elements/1.1/"
   xmlns:cc="http://creativecommons.org/ns#"
   xmlns:rdf="http://www.w3.org/1999/02/22-rdf-syntax-ns#"
   xmlns:svg="http://www.w3.org/2000/svg"
   xmlns="http://www.w3.org/2000/svg"
   xmlns:xlink="http://www.w3.org/1999/xlink"
   xmlns:sodipodi="http://sodipodi.sourceforge.net/DTD/sodipodi-0.dtd"
   xmlns:inkscape="http://www.inkscape.org/namespaces/inkscape"
   width="744.09448"
   height="1052.3622"
   id="svg2"
   sodipodi:version="0.32"
   inkscape:version="0.48.1 r9760"
   version="1.0"
   sodipodi:docname="certificate-en.svg"
   inkscape:output_extension="org.inkscape.output.svg.inkscape"
   inkscape:export-filename="/var/www/certificado.png"
   inkscape:export-xdpi="90"
   inkscape:export-ydpi="90">
  <defs
     id="defs4">
    <inkscape:perspective
       sodipodi:type="inkscape:persp3d"
       inkscape:vp_x="0 : 526.18109 : 1"
       inkscape:vp_y="0 : 1000 : 0"
       inkscape:vp_z="744.09448 : 526.18109 : 1"
       inkscape:persp3d-origin="372.04724 : 350.78739 : 1"
       id="perspective10" />
    <linearGradient
       y2="-1.3188398"
       x2="634.37122"
       y1="228.93231"
       x1="634.37122"
       gradientUnits="userSpaceOnUse"
       id="linearGradient3590"
       xlink:href="#linearGradient3533"
       inkscape:collect="always" />
    <linearGradient
       y2="-1.3188398"
       x2="634.37122"
       y1="228.93231"
       x1="634.37122"
       gradientUnits="userSpaceOnUse"
       id="linearGradient3588"
       xlink:href="#linearGradient3533"
       inkscape:collect="always" />
    <linearGradient
       y2="-1.3188398"
       x2="634.37122"
       y1="228.93231"
       x1="634.37122"
       gradientUnits="userSpaceOnUse"
       id="linearGradient3586"
       xlink:href="#linearGradient3533"
       inkscape:collect="always" />
    <linearGradient
       y2="-1.3188398"
       x2="634.37122"
       y1="228.93231"
       x1="634.37122"
       gradientUnits="userSpaceOnUse"
       id="linearGradient3584"
       xlink:href="#linearGradient3533"
       inkscape:collect="always" />
    <linearGradient
       y2="-1.3188398"
       x2="634.37122"
       y1="228.93231"
       x1="634.37122"
       gradientUnits="userSpaceOnUse"
       id="linearGradient3582"
       xlink:href="#linearGradient3533"
       inkscape:collect="always" />
    <linearGradient
       y2="-1.3188398"
       x2="634.37122"
       y1="228.93231"
       x1="634.37122"
       gradientUnits="userSpaceOnUse"
       id="linearGradient3580"
       xlink:href="#linearGradient3533"
       inkscape:collect="always" />
    <linearGradient
       y2="-1.3188398"
       x2="634.37122"
       y1="228.93231"
       x1="634.37122"
       gradientUnits="userSpaceOnUse"
       id="linearGradient3578"
       xlink:href="#linearGradient3533"
       inkscape:collect="always" />
    <linearGradient
       y2="-1.3188398"
       x2="634.37122"
       y1="228.93231"
       x1="634.37122"
       gradientUnits="userSpaceOnUse"
       id="linearGradient3576"
       xlink:href="#linearGradient3533"
       inkscape:collect="always" />
    <linearGradient
       y2="-1.3188398"
       x2="634.37122"
       y1="228.93231"
       x1="634.37122"
       gradientUnits="userSpaceOnUse"
       id="linearGradient3574"
       xlink:href="#linearGradient3533"
       inkscape:collect="always" />
    <linearGradient
       y2="-1.3188398"
       x2="634.37122"
       y1="228.93231"
       x1="634.37122"
       gradientUnits="userSpaceOnUse"
       id="linearGradient3572"
       xlink:href="#linearGradient3533"
       inkscape:collect="always" />
    <linearGradient
       y2="-1.3188398"
       x2="634.37122"
       y1="228.93231"
       x1="634.37122"
       gradientUnits="userSpaceOnUse"
       id="linearGradient3570"
       xlink:href="#linearGradient3533"
       inkscape:collect="always" />
    <linearGradient
       y2="-1.3188398"
       x2="634.37122"
       y1="228.93231"
       x1="634.37122"
       gradientUnits="userSpaceOnUse"
       id="linearGradient3568"
       xlink:href="#linearGradient3533"
       inkscape:collect="always" />
    <linearGradient
       y2="-1.3188398"
       x2="634.37122"
       y1="228.93231"
       x1="634.37122"
       gradientUnits="userSpaceOnUse"
       id="linearGradient3566"
       xlink:href="#linearGradient3533"
       inkscape:collect="always" />
    <linearGradient
       y2="-1.3188398"
       x2="634.37122"
       y1="228.93231"
       x1="634.37122"
       gradientUnits="userSpaceOnUse"
       id="linearGradient3564"
       xlink:href="#linearGradient3533"
       inkscape:collect="always" />
    <linearGradient
       y2="-1.3188398"
       x2="634.37122"
       y1="228.93231"
       x1="634.37122"
       gradientUnits="userSpaceOnUse"
       id="linearGradient3562"
       xlink:href="#linearGradient3533"
       inkscape:collect="always" />
    <linearGradient
       y2="-1.3188398"
       x2="634.37122"
       y1="228.93231"
       x1="634.37122"
       gradientUnits="userSpaceOnUse"
       id="linearGradient3560"
       xlink:href="#linearGradient3533"
       inkscape:collect="always" />
    <linearGradient
       y2="-1.3188398"
       x2="634.37122"
       y1="228.93231"
       x1="634.37122"
       gradientUnits="userSpaceOnUse"
       id="linearGradient3558"
       xlink:href="#linearGradient3533"
       inkscape:collect="always" />
    <linearGradient
       y2="-1.3188398"
       x2="634.37122"
       y1="228.93231"
       x1="634.37122"
       gradientUnits="userSpaceOnUse"
       id="linearGradient3556"
       xlink:href="#linearGradient3533"
       inkscape:collect="always" />
    <linearGradient
       y2="-1.3188398"
       x2="634.37122"
       y1="228.93231"
       x1="634.37122"
       gradientUnits="userSpaceOnUse"
       id="linearGradient3554"
       xlink:href="#linearGradient3533"
       inkscape:collect="always" />
    <linearGradient
       y2="-1.3188398"
       x2="634.37122"
       y1="228.93231"
       x1="634.37122"
       gradientUnits="userSpaceOnUse"
       id="linearGradient3552"
       xlink:href="#linearGradient3533"
       inkscape:collect="always" />
    <linearGradient
       y2="-1.3188398"
       x2="634.37122"
       y1="228.93231"
       x1="634.37122"
       gradientUnits="userSpaceOnUse"
       id="linearGradient3549"
       xlink:href="#linearGradient3533"
       inkscape:collect="always" />
    <linearGradient
       y2="-1.3188398"
       x2="634.37122"
       y1="228.93231"
       x1="634.37122"
       gradientUnits="userSpaceOnUse"
       id="linearGradient3547"
       xlink:href="#linearGradient3533"
       inkscape:collect="always" />
    <linearGradient
       y2="-1.3188398"
       x2="634.37122"
       y1="228.93231"
       x1="634.37122"
       gradientUnits="userSpaceOnUse"
       id="linearGradient3545"
       xlink:href="#linearGradient3533"
       inkscape:collect="always" />
    <linearGradient
       y2="-1.3188398"
       x2="634.37122"
       y1="228.93231"
       x1="634.37122"
       gradientUnits="userSpaceOnUse"
       id="linearGradient3543"
       xlink:href="#linearGradient3533"
       inkscape:collect="always" />
    <linearGradient
       y2="-1.3188398"
       x2="634.37122"
       y1="228.93231"
       x1="634.37122"
       gradientUnits="userSpaceOnUse"
       id="linearGradient3541"
       xlink:href="#linearGradient3533"
       inkscape:collect="always" />
    <linearGradient
       gradientUnits="userSpaceOnUse"
       y2="-1.3188398"
       x2="634.37122"
       y1="228.93231"
       x1="634.37122"
       id="linearGradient3539"
       xlink:href="#linearGradient3533"
       inkscape:collect="always" />
    <linearGradient
       y2="295.93362"
       x2="380.71429"
       y1="295.93362"
       x1="282.85715"
       gradientUnits="userSpaceOnUse"
       id="linearGradient6895"
       xlink:href="#linearGradient11079"
       inkscape:collect="always" />
    <linearGradient
       id="linearGradient11079">
      <stop
         offset="0"
         style="stop-color:#ffffff;stop-opacity:1;"
         id="stop11081" />
      <stop
         offset="1"
         style="stop-color:#ffffff;stop-opacity:0;"
         id="stop11083" />
    </linearGradient>
    <linearGradient
       y2="295.93362"
       x2="380.71429"
       y1="295.93362"
       inkscape:collect="always"
       gradientUnits="userSpaceOnUse"
       x1="282.85715"
       xlink:href="#linearGradient11079"
       id="linearGradient11085" />
    <inkscape:perspective
       sodipodi:type="inkscape:persp3d"
       inkscape:vp_x="0 : 526.18109 : 1"
       inkscape:vp_y="0 : 1000 : 0"
       inkscape:vp_z="744.09448 : 526.18109 : 1"
       inkscape:persp3d-origin="372.04724 : 350.78739 : 1"
       id="perspective2641" />
    <inkscape:perspective
       sodipodi:type="inkscape:persp3d"
       inkscape:vp_x="0 : 72.066498 : 1"
       inkscape:vp_y="0 : 1000 : 0"
       inkscape:vp_z="108.758 : 72.066498 : 1"
       inkscape:persp3d-origin="54.379002 : 48.044332 : 1"
       id="perspective5664" />
    <inkscape:perspective
       sodipodi:type="inkscape:persp3d"
       inkscape:vp_x="0 : 1489.9606 : 1"
       inkscape:vp_y="0 : 1000 : 0"
       inkscape:vp_z="2104.7244 : 1489.9606 : 1"
       inkscape:persp3d-origin="1052.3622 : 993.30705 : 1"
       id="perspective4822" />
    <linearGradient
       id="linearGradient9064">
      <stop
         style="stop-color:#000000;stop-opacity:0.65098041;"
         offset="0"
         id="stop9066" />
      <stop
         style="stop-color:#000000;stop-opacity:0;"
         offset="1"
         id="stop9068" />
    </linearGradient>
    <linearGradient
       id="linearGradient8156">
      <stop
         style="stop-color:#a2cade;stop-opacity:1;"
         offset="0"
         id="stop8158" />
      <stop
         style="stop-color:#1c3a67;stop-opacity:1;"
         offset="1"
         id="stop8160" />
    </linearGradient>
    <linearGradient
       id="linearGradient5486">
      <stop
         style="stop-color:#fdfa01;stop-opacity:1;"
         offset="0"
         id="stop5488" />
      <stop
         style="stop-color:#fd6401;stop-opacity:1;"
         offset="1"
         id="stop5490" />
    </linearGradient>
    <linearGradient
       id="linearGradient5478">
      <stop
         style="stop-color:#ffffff;stop-opacity:1;"
         offset="0"
         id="stop5480" />
      <stop
         style="stop-color:#8aafcf;stop-opacity:1;"
         offset="1"
         id="stop5482" />
    </linearGradient>
    <linearGradient
       id="linearGradient5470">
      <stop
         style="stop-color:#ffffff;stop-opacity:1;"
         offset="0"
         id="stop5472" />
      <stop
         style="stop-color:#ffffff;stop-opacity:0;"
         offset="1"
         id="stop5474" />
    </linearGradient>
    <linearGradient
       id="linearGradient3551">
      <stop
         style="stop-color:#ffffff;stop-opacity:1;"
         offset="0"
         id="stop3553" />
      <stop
         style="stop-color:#fffbfb;stop-opacity:0;"
         offset="1"
         id="stop3555" />
    </linearGradient>
    <linearGradient
       id="linearGradient4406">
      <stop
         style="stop-color:#787878;stop-opacity:1;"
         offset="0"
         id="stop4408" />
      <stop
         style="stop-color:#d4d4d4;stop-opacity:0;"
         offset="1"
         id="stop4410" />
    </linearGradient>
    <linearGradient
       id="linearGradient6048">
      <stop
         style="stop-color:#606060;stop-opacity:1;"
         offset="0"
         id="stop6050" />
      <stop
         style="stop-color:#ffffff;stop-opacity:0.73469388;"
         offset="1"
         id="stop6052" />
    </linearGradient>
    <linearGradient
       id="linearGradient4681">
      <stop
         style="stop-color:#ffffff;stop-opacity:1;"
         offset="0"
         id="stop4683" />
      <stop
         style="stop-color:#f9f9f9;stop-opacity:0;"
         offset="1"
         id="stop4685" />
    </linearGradient>
    <linearGradient
       inkscape:collect="always"
       id="linearGradient5868">
      <stop
         style="stop-color:#ffffff;stop-opacity:1;"
         offset="0"
         id="stop5870" />
      <stop
         style="stop-color:#ffffff;stop-opacity:0;"
         offset="1"
         id="stop5872" />
    </linearGradient>
    <linearGradient
       id="linearGradient6190">
      <stop
         style="stop-color:#b8eb8a;stop-opacity:1;"
         offset="0"
         id="stop6192" />
      <stop
         style="stop-color:#ffffff;stop-opacity:1;"
         offset="1"
         id="stop6194" />
    </linearGradient>
    <linearGradient
       id="linearGradient6264">
      <stop
         style="stop-color:#f9f9f9;stop-opacity:1;"
         offset="0"
         id="stop6266" />
      <stop
         style="stop-color:#f9f9f9;stop-opacity:0;"
         offset="1"
         id="stop6268" />
    </linearGradient>
    <linearGradient
       id="linearGradient13006">
      <stop
         style="stop-color:#060603;stop-opacity:1;"
         offset="0"
         id="stop13008" />
      <stop
         style="stop-color:#000000;stop-opacity:0.1010101;"
         offset="1"
         id="stop13010" />
    </linearGradient>
    <linearGradient
       id="linearGradient5796">
      <stop
         id="stop5798"
         offset="0"
         style="stop-color:#fed903;stop-opacity:1;" />
      <stop
         id="stop5800"
         offset="1"
         style="stop-color:#fab500;stop-opacity:1;" />
    </linearGradient>
    <linearGradient
       y2="245.0631"
       x2="60.864159"
       y1="245.0631"
       x1="21.942444"
       gradientUnits="userSpaceOnUse"
       id="linearGradient2394"
       xlink:href="#linearGradient6501"
       inkscape:collect="always" />
    <linearGradient
       gradientTransform="translate(-3.0874586,3.043669)"
       gradientUnits="userSpaceOnUse"
       y2="969.14893"
       x2="359.64331"
       y1="336.16403"
       x1="358.59549"
       id="linearGradient12899"
       xlink:href="#linearGradient6190"
       inkscape:collect="always" />
    <pattern
       id="pattern4350"
       patternTransform="translate(14.642855,1118.4336)"
       height="77.85714"
       width="77.85714"
       patternUnits="userSpaceOnUse">
      <path
         sodipodi:type="arc"
         style="opacity:1;fill:#666666;fill-opacity:1;stroke:none;stroke-width:4;stroke-miterlimit:4;stroke-dasharray:none;stroke-opacity:1"
         id="path3279"
         sodipodi:cx="125.35714"
         sodipodi:cy="826.29077"
         sodipodi:rx="38.92857"
         sodipodi:ry="38.92857"
         d="M 164.28571 826.29077 A 38.92857 38.92857 0 1 1  86.42857,826.29077 A 38.92857 38.92857 0 1 1  164.28571 826.29077 z"
         transform="translate(-86.42857,-787.3622)" />
    </pattern>
    <linearGradient
       id="linearGradient12891">
      <stop
         id="stop12893"
         offset="0"
         style="stop-color:#4f8e17;stop-opacity:1;" />
      <stop
         id="stop12895"
         offset="1"
         style="stop-color:#ffffff;stop-opacity:1;" />
    </linearGradient>
    <linearGradient
       id="linearGradient6248">
      <stop
         id="stop6250"
         offset="0"
         style="stop-color:#c2c2c2;stop-opacity:1;" />
      <stop
         id="stop6252"
         offset="1"
         style="stop-color:#ffffff;stop-opacity:0.02020202;" />
    </linearGradient>
    <linearGradient
       id="linearGradient12879">
      <stop
         id="stop12881"
         offset="0"
         style="stop-color:#f9f9f9;stop-opacity:1;" />
      <stop
         id="stop12883"
         offset="1"
         style="stop-color:#f9f9f9;stop-opacity:0;" />
    </linearGradient>
    <linearGradient
       id="linearGradient6501"
       inkscape:collect="always">
      <stop
         id="stop6503"
         offset="0"
         style="stop-color:#000000;stop-opacity:1;" />
      <stop
         id="stop6505"
         offset="1"
         style="stop-color:#000000;stop-opacity:0;" />
    </linearGradient>
    <linearGradient
       gradientTransform="matrix(0.1860103,0,0,0.1860103,-171.03731,870.54802)"
       gradientUnits="userSpaceOnUse"
       y2="587.69202"
       x2="1708.4447"
       y1="587.69202"
       x1="1184.6322"
       id="linearGradient13012"
       xlink:href="#linearGradient13006"
       inkscape:collect="always" />
    <linearGradient
       id="linearGradient12851">
      <stop
         id="stop12853"
         offset="0"
         style="stop-color:#060603;stop-opacity:1;" />
      <stop
         id="stop12855"
         offset="1"
         style="stop-color:#000000;stop-opacity:0.1010101;" />
    </linearGradient>
    <linearGradient
       y2="409.75565"
       x2="367.94257"
       y1="409.75565"
       x1="318.80969"
       gradientUnits="userSpaceOnUse"
       id="linearGradient7022"
       xlink:href="#linearGradient5868"
       inkscape:collect="always" />
    <linearGradient
       inkscape:collect="always"
       xlink:href="#linearGradient6048"
       id="linearGradient4812"
       gradientUnits="userSpaceOnUse"
       x1="364.78302"
       y1="90.478378"
       x2="155.27037"
       y2="405.23987" />
    <linearGradient
       inkscape:collect="always"
       xlink:href="#linearGradient6048"
       id="linearGradient4814"
       gradientUnits="userSpaceOnUse"
       x1="364.78302"
       y1="90.478378"
       x2="166.38203"
       y2="438.95398" />
    <inkscape:perspective
       sodipodi:type="inkscape:persp3d"
       inkscape:vp_x="0 : 600 : 1"
       inkscape:vp_y="0 : 1000 : 0"
       inkscape:vp_z="1600 : 600 : 1"
       inkscape:persp3d-origin="800 : 400 : 1"
       id="perspective30" />
    <linearGradient
       id="linearGradient3685">
      <stop
         style="stop-color: rgb(31, 112, 222); stop-opacity: 0.237113;"
         offset="0"
         id="stop3687" />
      <stop
         style="stop-color: rgb(224, 245, 255); stop-opacity: 1;"
         offset="1"
         id="stop3689" />
    </linearGradient>
    <linearGradient
       id="linearGradient3671">
      <stop
         id="stop3673"
         offset="0"
         style="stop-color: rgb(0, 66, 110); stop-opacity: 0.266667;" />
      <stop
         id="stop3675"
         offset="1"
         style="stop-color: rgb(9, 189, 255); stop-opacity: 1;" />
    </linearGradient>
    <linearGradient
       id="linearGradient2760">
      <stop
         style="stop-color: rgb(0, 37, 95); stop-opacity: 1;"
         offset="0"
         id="stop2762" />
      <stop
         style="stop-color: rgb(0, 152, 226); stop-opacity: 1;"
         offset="1"
         id="stop2764" />
    </linearGradient>
    <inkscape:perspective
       sodipodi:type="inkscape:persp3d"
       inkscape:vp_x="0 : 360 : 1"
       inkscape:vp_y="0 : 1000 : 0"
       inkscape:vp_z="765 : 360 : 1"
       inkscape:persp3d-origin="382.5 : 240 : 1"
       id="perspective2657" />
    <style
       type="text/css"
       id="style2610">
   
    .fil4 {fill:#1F1A17}
    .fil3 {fill:#605D5C}
    .fil0 {fill:#C2C1C1}
    .fil6 {fill:#509CD0}
    .fil5 {fill:#1F1A17;fill-rule:nonzero}
    .fil2 {fill:#383431;fill-rule:nonzero}
    .fil1 {fill:#838281;fill-rule:nonzero}
    .fil7 {fill:#F6C900;fill-rule:nonzero}
   
  </style>
    <inkscape:perspective
       id="perspective2434"
       inkscape:persp3d-origin="372.04724 : 350.78739 : 1"
       inkscape:vp_z="744.09448 : 526.18109 : 1"
       inkscape:vp_y="0 : 1000 : 0"
       inkscape:vp_x="0 : 526.18109 : 1"
       sodipodi:type="inkscape:persp3d" />
    <linearGradient
       id="linearGradient3533"
       inkscape:collect="always">
      <stop
         id="stop3535"
         offset="0"
         style="stop-color:#5893ec;stop-opacity:1;" />
      <stop
         id="stop3537"
         offset="1"
         style="stop-color:#5893ec;stop-opacity:0;" />
    </linearGradient>
    <inkscape:perspective
       sodipodi:type="inkscape:persp3d"
       inkscape:vp_x="0 : 240 : 1"
       inkscape:vp_y="0 : 1000 : 0"
       inkscape:vp_z="600 : 240 : 1"
       inkscape:persp3d-origin="300 : 160 : 1"
       id="perspective3134" />
    <inkscape:perspective
       id="perspective3182"
       inkscape:persp3d-origin="0.5 : 0.33333333 : 1"
       inkscape:vp_z="1 : 0.5 : 1"
       inkscape:vp_y="0 : 1000 : 0"
       inkscape:vp_x="0 : 0.5 : 1"
       sodipodi:type="inkscape:persp3d" />
    <foreignObject
       requiredExtensions="http://ns.adobe.com/AdobeIllustrator/10.0/"
       x="0"
       y="0"
       width="1"
       height="1"
       id="foreignObject7">
      <i:pgfRef
         xlink:href="#adobe_illustrator_pgf" />
    </foreignObject>
    <inkscape:perspective
       id="perspective27"
       inkscape:persp3d-origin="313.535 : 276.70101 : 1"
       inkscape:vp_z="627.07001 : 415.05151 : 1"
       inkscape:vp_y="0 : 1000 : 0"
       inkscape:vp_x="0 : 415.05151 : 1"
       sodipodi:type="inkscape:persp3d" />
  </defs>
  <sodipodi:namedview
     id="base"
     pagecolor="#ffffff"
     bordercolor="#666666"
     borderopacity="1.0"
     inkscape:pageopacity="1"
     inkscape:pageshadow="2"
     inkscape:zoom="0.46942014"
     inkscape:cx="981.18047"
     inkscape:cy="526.18109"
     inkscape:document-units="mm"
     inkscape:current-layer="layer1"
     showgrid="false"
     inkscape:window-width="749"
     inkscape:window-height="716"
     inkscape:window-x="50"
     inkscape:window-y="23"
     showguides="false"
     inkscape:guide-bbox="true"
     units="mm"
     inkscape:window-maximized="0">
    <sodipodi:guide
       orientation="0,1"
       position="346.48232,14.142136"
       id="guide6792" />
    <sodipodi:guide
       orientation="1,0"
       position="728.31998,371.23106"
       id="guide6794" />
    <sodipodi:guide
       orientation="1,0"
       position="13.435029,272.23611"
       id="guide6796" />
    <sodipodi:guide
       orientation="0,1"
       position="266.57926,509.11688"
       id="guide6798" />
  </sodipodi:namedview>
  <metadata
     id="metadata7">
    <rdf:RDF>
      <cc:Work
         rdf:about="">
        <dc:format>image/svg+xml</dc:format>
        <dc:type
           rdf:resource="http://purl.org/dc/dcmitype/StillImage" />
      </cc:Work>
    </rdf:RDF>
  </metadata>
  <g
     inkscape:label="Capa 1"
     inkscape:groupmode="layer"
     id="layer1">
    <text
       sodipodi:linespacing="125%"
       id="text2634"
       y="932.69153"
       x="275.90469"
       style="font-size:17.71127892px;font-style:normal;font-variant:normal;font-weight:200;font-stretch:normal;text-align:start;line-height:125%;writing-mode:lr-tb;text-anchor:start;fill:#000000;fill-opacity:1;stroke:none;stroke-width:1px;stroke-linecap:butt;stroke-linejoin:miter;stroke-opacity:1;font-family:BlackChancery;-inkscape-font-specification:BlackChancery Ultra-Light"
       xml:space="preserve"><tspan
         y="932.69153"
         x="275.90469"
         id="tspan2636"
         sodipodi:role="line" /></text>
    <g
       id="g5874"
       transform="matrix(0.5691397,0,0,0.5691397,585.38658,980.6207)">
      <g
         transform="matrix(0.3580469,0,0,0.3580469,-202.25397,44.195537)"
         id="g5737">
        <path
           id="path5623"
           d="M 662.63478,63.619429 C 659.57017,63.660454 663.21119,65.194811 667.21324,65.812246 C 668.32298,64.946606 669.3199,64.076864 670.21426,63.227635 C 667.72606,63.836864 665.19068,63.851223 662.63478,63.619429"
           i:knockout="Off"
           style="fill:#d70751" />
        <path
           id="path5670"
           d="M 679.07989,59.518923 C 680.91168,56.997902 682.24091,54.240983 682.71065,51.389706 C 682.29834,53.420472 681.20091,55.174315 680.15886,57.028671 C 674.42964,60.63687 679.61732,54.887136 680.15476,52.698422 C 673.99682,60.458409 679.30553,57.350721 679.07989,59.518923"
           i:knockout="Off"
           style="fill:#d70751" />
        <path
           id="path5627"
           d="M 685.15782,43.715873 C 685.53116,38.195882 684.0727,39.943571 683.58244,42.046132 C 684.1527,42.345619 684.60603,45.939459 685.15782,43.715873"
           i:knockout="Off"
           style="fill:#d70751" />
        <path
           id="path5629"
           d="M 651.00814,-31.728103 C 652.64506,-31.436821 654.54454,-31.211181 654.27172,-30.819387 C 656.06864,-31.215283 656.47274,-31.572206 651.00814,-31.728103"
           i:knockout="Off"
           style="fill:#d70751" />
        <path
           id="path5631"
           d="M 654.27377,-30.819387 L 653.12301,-30.579387 L 654.19582,-30.677848 L 654.27377,-30.819387"
           i:knockout="Off"
           style="fill:#d70751" />
        <path
           id="path5633"
           d="M 705.28702,45.808177 C 705.47164,50.764066 703.84087,53.172267 702.366,57.430721 L 699.7137,58.749694 C 697.5455,62.96302 699.92908,61.424561 698.37626,64.774299 C 694.98755,67.783524 688.10756,74.187616 685.90449,74.774282 C 684.29424,74.73941 686.99372,72.874798 687.34654,72.146594 C 682.81526,75.256332 683.70962,76.815304 676.77835,78.708634 L 676.57733,78.255302 C 659.49017,86.296314 635.75278,70.364033 636.06457,48.628685 C 635.88406,50.007144 635.5456,49.662529 635.16816,50.216375 C 634.28611,39.034855 640.33328,27.804105 650.53224,23.211292 C 660.50761,18.275915 672.20195,20.298476 679.34245,26.96308 C 675.4204,21.822576 667.60708,16.372329 658.35377,16.876943 C 649.28506,17.024635 640.79892,22.786677 637.96816,29.045128 C 633.32407,31.9682 632.78253,40.318955 630.75997,41.849209 C 628.03382,61.869688 635.88201,70.515828 649.15994,80.692221 C 651.24403,82.099398 649.7466,82.314782 650.02558,83.385549 C 645.61533,81.321963 641.57841,78.20402 638.25534,74.38659 C 640.01944,76.965047 641.92097,79.47171 644.38046,81.440937 C 640.21841,80.035812 634.6615,71.363006 633.04304,71.010186 C 640.21226,83.847087 662.12607,93.522968 673.60707,88.720925 C 668.29426,88.917848 661.54761,88.829643 655.58249,86.624518 C 653.06967,85.334264 649.6666,82.665551 650.27583,82.16709 C 665.93939,88.015285 682.11578,86.593749 695.66652,75.732229 C 699.11677,73.045054 702.88292,68.476857 703.97215,68.415318 C 702.33318,70.880955 704.25318,69.600957 702.99369,71.777364 C 706.42343,66.23686 701.49831,69.520957 706.5424,62.2102 L 708.40496,64.774299 C 707.70753,60.17123 714.11778,54.587649 713.46547,47.313815 C 714.93624,45.090229 715.10444,49.709709 713.54547,54.825598 C 715.70957,49.14971 714.11778,48.236891 714.67162,43.55177 C 715.26854,45.127152 716.06239,46.798944 716.46649,48.462531 C 715.05521,42.975361 717.90854,39.225624 718.61828,36.035886 C 717.91674,35.728194 716.44187,38.460497 716.10136,31.982559 C 716.15264,29.168205 716.887,30.50769 717.16803,29.814358 C 716.61828,29.496409 715.16803,27.338464 714.28803,23.201035 C 714.92188,22.226678 715.9947,25.722057 716.86444,25.863595 C 716.30444,22.575395 715.34239,20.066682 715.30136,17.541558 C 712.75778,12.228746 714.40085,18.2513 712.34137,15.260536 C 709.63368,6.8215757 714.58547,13.301565 714.92188,9.4697764 C 719.02033,15.408228 721.35674,24.618469 722.43366,28.431796 C 721.61315,23.781547 720.29007,19.274888 718.67161,14.915921 C 719.92084,15.4431 716.66341,5.350809 720.29418,12.033875 C 716.41931,-2.2122552 703.72395,-15.525053 692.04191,-21.769145 C 693.46755,-20.462481 695.27063,-18.821458 694.62653,-18.562997 C 688.8132,-22.019401 689.83474,-22.292221 689.00192,-23.752732 C 684.27372,-25.678882 683.95783,-23.594783 680.82963,-23.748629 C 671.90656,-28.48298 670.18759,-27.980417 661.97632,-30.942463 L 662.34966,-29.194774 C 656.43992,-31.164001 655.46351,-28.452211 649.07788,-29.190671 C 648.69019,-29.492209 651.12506,-30.290157 653.13121,-30.579387 C 647.41635,-29.824516 647.68302,-31.70759 642.09123,-30.372208 C 643.46764,-31.33836 644.92815,-31.98041 646.39686,-32.800922 C 641.73841,-32.517845 635.27073,-30.089131 637.26662,-32.30041 C 629.66664,-28.907595 616.16717,-24.146577 608.5918,-17.042999 L 608.35385,-18.634792 C 604.88309,-14.468645 593.21747,-6.1917357 592.28824,-0.79071914 L 591.35901,-0.57533489 C 589.55593,2.4831215 588.38465,5.9477311 586.95286,9.0923412 C 584.59184,13.119001 583.4903,10.643108 583.82671,11.274902 C 579.18057,20.694373 576.86878,28.608206 574.87698,35.102554 C 576.29647,37.225627 574.91186,47.886122 575.44724,56.41739 C 573.11699,98.558857 605.02257,139.47161 639.89841,148.9157 C 645.0102,150.74749 652.61019,150.68185 659.07582,150.86236 C 651.44916,148.6798 650.46455,149.70749 643.03072,147.11672 C 637.67072,144.58955 636.49739,141.7075 632.69843,138.4111 L 634.20201,141.0675 C 626.75587,138.43161 629.87176,137.80597 623.81229,135.88803 L 625.41844,133.79367 C 623.00408,133.60905 619.0246,129.72804 617.93742,127.57214 L 615.29538,127.67676 C 612.1241,123.76702 610.4318,120.94241 610.55692,118.7537 L 609.70359,120.27574 C 608.73744,118.61626 598.02977,105.59269 603.58463,108.62448 C 602.55283,107.685 601.18053,107.09218 599.69335,104.38654 L 600.82361,103.09629 C 598.15489,99.656291 595.90464,95.248094 596.07695,93.779378 C 597.50259,95.703477 598.4913,96.064503 599.47181,96.394758 C 592.72106,79.64812 592.34157,95.473734 587.23183,79.348633 L 588.31081,79.26248 C 587.48414,78.009148 586.97748,76.657356 586.31286,75.326076 L 586.78466,70.638904 C 581.92723,65.026606 585.42671,46.751765 586.1303,36.731269 C 586.61235,32.65743 590.18568,28.318975 592.89952,21.514884 L 591.24619,21.231808 C 594.40926,15.717971 609.30154,-0.91994969 616.20204,-0.066617797 C 619.54358,-4.2635338 615.53743,-0.083028026 614.88307,-1.1373852 C 622.2246,-8.7332699 624.53228,-6.50353 629.48612,-7.8717329 C 634.8256,-11.040958 624.90152,-6.6327606 627.43279,-9.079936 C 636.6697,-11.436855 633.97637,-14.441978 646.02353,-15.637874 C 647.29532,-14.915824 643.07584,-14.521978 642.01738,-13.584544 C 649.70968,-17.350691 666.36401,-16.491206 677.18656,-11.496342 C 689.73423,-5.6276341 703.84087,11.711824 704.39882,28.025643 L 705.03266,28.195899 C 704.71266,34.682042 706.02548,42.183568 703.74651,49.071761 L 705.28702,45.808177"
           i:knockout="Off"
           style="fill:#d70751" />
        <path
           id="path5635"
           d="M 629.17638,67.82455 L 628.74356,69.972239 C 630.75997,72.710696 632.35996,75.676845 634.93022,77.810174 C 633.07996,74.201975 631.70766,72.710696 629.17638,67.82455"
           i:knockout="Off"
           style="fill:#d70751" />
        <path
           id="path5637"
           d="M 633.9374,67.639935 C 632.87073,66.458398 632.24304,65.038914 631.5333,63.627634 C 632.21022,66.111732 633.59689,68.247113 634.88304,70.421469 L 633.9374,67.639935"
           i:knockout="Off"
           style="fill:#d70751" />
        <path
           id="path5639"
           d="M 718.21213,49.322017 L 717.7629,50.454323 C 716.93828,56.316877 715.15162,62.117893 712.41932,67.498397 C 715.4388,61.822509 717.38546,55.613289 718.21213,49.322017"
           i:knockout="Off"
           style="fill:#d70751" />
        <path
           id="path5641"
           d="M 651.61737,-33.19887 C 653.68711,-33.955792 656.70864,-33.615279 658.91171,-34.11374 C 656.04403,-33.87374 653.1907,-33.730151 650.37429,-33.371177 L 651.61737,-33.19887"
           i:knockout="Off"
           style="fill:#d70751" />
        <path
           id="path5643"
           d="M 578.85646,5.4923472 C 579.33441,9.9108013 575.53339,11.627722 579.69749,8.7108033 C 581.93338,3.6769656 578.82775,7.3220877 578.85646,5.4923472"
           i:knockout="Off"
           style="fill:#d70751" />
        <path
           id="path5645"
           d="M 573.95801,25.9518 C 574.92006,23.004113 575.09237,21.23591 575.45955,19.527195 C 572.80724,22.92001 574.23698,23.644112 573.95801,25.9518"
           i:knockout="Off"
           style="fill:#d70751" />
      </g>
      <g
         transform="matrix(0.7633509,0,0,0.7633509,-336.72446,-106.02289)"
         id="g5728">
        <path
           id="path5647"
           d="M 565.13341,223.33403 C 565.0411,223.43044 565.0411,238.73093 564.85033,242.72477 C 564.66162,245.95348 564.37444,252.89296 557.53137,252.89296 C 550.49754,252.89296 548.78677,244.81297 548.21652,241.29913 C 547.5519,237.4017 547.5519,234.16683 547.5519,232.7453 C 547.5519,228.1812 547.83703,215.44071 558.57752,215.44071 C 561.81034,215.44071 563.61546,216.39456 565.0411,217.15148 L 565.13341,223.33403 z M 537.57038,234.55247 C 537.57038,261.35448 551.82882,261.35448 553.91907,261.35448 C 559.81239,261.35448 563.61546,258.12167 565.22982,252.51552 L 565.42059,260.97294 C 567.22777,260.87653 569.03289,260.68782 571.97853,260.68782 C 573.02468,260.68782 573.87801,260.68782 574.64109,260.78423 C 575.40211,260.78423 576.16108,260.87653 577.01647,260.97294 C 575.49647,257.93295 574.35596,251.08988 574.35596,236.25709 C 574.35596,221.80993 574.35596,197.38331 575.59083,189.96793 C 572.17135,191.58639 569.22161,192.63255 562.75803,193.20075 C 565.32418,195.95767 565.32418,197.38331 565.32418,209.92688 C 563.52111,209.35867 561.23803,208.69201 557.3406,208.69201 C 540.3273,208.69406 537.57038,223.52275 537.57038,234.55247"
           i:knockout="Off" />
        <path
           id="path5649"
           d="M 589.11901,229.69915 C 589.21542,221.80993 590.83183,214.7761 597.57848,214.7761 C 604.99386,214.7761 605.56001,222.94839 605.37129,229.69915 L 589.11901,229.69915 z M 614.78051,230.65299 C 614.78051,219.53096 612.59589,208.59765 598.52823,208.59765 C 579.13954,208.59765 579.13954,230.08479 579.13954,234.64273 C 579.13954,253.93706 587.78773,261.54115 602.3313,261.54115 C 608.79077,261.54115 611.93128,260.59551 613.64205,260.11551 C 613.54769,256.69398 614.02153,254.50731 614.59589,251.56168 C 612.59589,252.80065 610.02975,254.41501 604.32719,254.41501 C 589.4985,254.41501 589.30773,240.91349 589.30773,236.25709 L 614.59589,236.25709 L 614.78051,230.65299"
           i:knockout="Off" />
        <path
           id="path5651"
           d="M 645.70353,234.73914 C 645.70353,243.5781 644.08918,255.46116 633.06355,255.46116 C 631.5415,255.46116 629.64202,255.17193 628.40715,254.88885 C 628.21638,251.46732 628.21638,245.57399 628.21638,238.73093 C 628.21638,230.55453 629.06971,226.28377 629.73843,224.18736 C 631.73227,217.44071 636.19996,217.3484 637.05329,217.3484 C 644.27789,217.3484 645.70353,227.32787 645.70353,234.73914 z M 618.42563,245.10015 C 618.42563,252.13603 618.42563,256.12577 617.28512,259.16577 C 621.18255,260.68782 626.02767,261.54115 631.82868,261.54115 C 635.53534,261.54115 646.27584,261.54115 652.07275,249.66219 C 654.82967,244.14836 655.77941,236.73298 655.77941,231.12479 C 655.77941,227.70326 655.39787,220.19558 652.64301,215.44071 C 649.98455,210.97713 645.70558,208.69406 641.14559,208.69406 C 632.01945,208.69406 629.35894,216.29815 627.93536,220.19558 C 627.93536,215.3484 628.02766,198.42946 628.78664,189.77922 C 622.61024,192.63255 618.80512,193.10434 614.72102,193.48588 C 618.42768,195.00382 618.42768,201.28279 618.42768,221.71968 L 618.42768,245.10015"
           i:knockout="Off" />
        <path
           id="path5653"
           d="M 674.0522,260.97294 C 672.14862,260.68782 670.81528,260.49705 668.05837,260.49705 C 665.02247,260.49705 662.92607,260.68987 660.74351,260.97294 C 661.69325,259.16577 662.07273,258.30833 662.35786,252.13398 C 662.7394,243.67246 662.83376,221.04891 662.16914,216.2961 C 661.69325,212.68174 660.83992,212.11354 659.50864,211.1638 C 667.30144,210.40277 669.48811,209.83457 673.09836,208.1238 C 672.34144,212.30226 672.24092,214.39866 672.24092,220.76378 C 672.05426,253.56167 671.95785,257.07551 674.0522,260.97294"
           i:knockout="Off" />
        <path
           id="path5655"
           d="M 704.48907,234.07042 C 704.30036,240.06016 704.20395,244.24271 702.58549,247.56784 C 700.58959,251.8468 697.26447,253.08167 694.79268,253.08167 C 689.08397,253.08167 687.8532,248.33091 687.8532,243.67451 C 687.8532,234.74119 695.83883,234.07042 699.44703,234.07042 L 704.48907,234.07042 z M 678.34758,245.76476 C 678.34758,251.7545 680.15476,257.74013 685.47987,260.30833 C 687.85526,261.35448 690.23064,261.35448 690.99371,261.35448 C 699.74036,261.35448 702.68395,254.88885 704.49112,250.89706 C 704.39471,255.07962 704.49112,257.64372 704.77625,260.97294 C 706.48702,260.87653 708.19779,260.68782 711.05111,260.68782 C 712.66547,260.68782 714.18752,260.87653 715.80187,260.97294 C 714.75572,259.35859 714.18752,258.40474 713.89829,254.69808 C 713.70957,251.08783 713.70957,247.47553 713.70957,242.43759 L 713.80598,223.04685 C 713.80598,215.8202 711.90239,208.69201 697.64396,208.69201 C 688.23679,208.69201 682.72501,211.54533 679.96809,212.97097 C 681.11065,215.06328 682.06039,216.8643 682.91373,220.9566 C 686.62449,217.72379 691.47166,216.01302 696.41114,216.01302 C 704.30446,216.01302 704.30446,221.24173 704.30446,228.653 C 702.49728,228.56069 700.97523,228.37197 698.40703,228.37197 C 686.33116,228.37402 678.34758,233.02427 678.34758,245.76476"
           i:knockout="Off" />
        <path
           id="path5657"
           d="M 759.2377,251.56373 C 759.33411,254.79654 759.33411,258.21808 760.66334,260.97499 C 758.56898,260.78628 757.33411,260.4991 753.44079,260.4991 C 751.15771,260.4991 749.92284,260.69192 748.11567,260.97499 C 748.4931,259.74012 748.68797,259.26423 748.87669,257.64577 C 749.16182,255.46321 749.35259,248.1422 749.35259,245.57399 L 749.35259,235.3094 C 749.35259,230.84171 749.35259,224.37608 749.06336,222.09711 C 748.87464,220.48275 748.40285,216.11148 742.88491,216.11148 C 737.46748,216.11148 735.66235,220.10122 734.99569,223.33403 C 734.23877,226.65915 734.23877,230.27351 734.23877,244.33912 C 734.33107,256.50731 734.33107,257.64372 735.28082,260.97294 C 733.66646,260.78423 731.67057,260.59551 728.81929,260.59551 C 726.53622,260.59551 725.01622,260.68782 723.11879,260.97294 C 723.7834,259.45089 724.16494,258.68987 724.35366,253.36885 C 724.54648,248.14014 724.92596,222.47455 724.06443,216.39456 C 723.59263,212.68379 722.63879,211.83046 721.59674,210.88072 C 729.29724,210.49918 731.76493,209.26226 734.14441,208.03149 L 734.14441,218.10327 C 735.28287,215.15353 737.65825,208.5956 747.16592,208.5956 C 759.04898,208.5956 759.14129,217.24584 759.2377,222.94634 L 759.2377,251.56373"
           i:knockout="Off" />
        <path
           id="path5659"
           d="M 674.85425,194.67152 L 666.98144,202.54022 L 659.11274,194.67152 L 666.98144,186.80281 L 674.85425,194.67152"
           i:knockout="Off"
           style="fill:#d70751" />
      </g>
    </g>
    <g
       id="g2925"
       transform="translate(10.651439,0)">
      <text
         sodipodi:linespacing="125%"
         id="text5974"
         y="1029.5442"
         x="28.619555"
         style="font-size:20.56236649px;font-style:normal;font-variant:normal;font-weight:200;font-stretch:normal;text-align:start;line-height:125%;writing-mode:lr-tb;text-anchor:start;fill:#000000;fill-opacity:1;stroke:none;stroke-width:1px;stroke-linecap:butt;stroke-linejoin:miter;stroke-opacity:1;font-family:Chancery Uralic;-inkscape-font-specification:Chancery Uralic Italic"
         xml:space="preserve"><tspan
           y="1029.5442"
           x="28.619555"
           id="tspan5976"
           sodipodi:role="line">DebConf 8 Organizer</tspan></text>
      <path
         id="path5990"
         d="M 5.49134,1007.1699 C 210.20008,1007.1699 210.20008,1007.1699 210.20008,1007.1699"
         style="fill:none;fill-rule:evenodd;stroke:#000000;stroke-width:1.04978848px;stroke-linecap:butt;stroke-linejoin:miter;stroke-opacity:1" />
    </g>
    <g
       id="g2930"
       transform="translate(3.5554513,0)">
      <text
         xml:space="preserve"
         style="font-size:20.56236649px;font-style:normal;font-variant:normal;font-weight:200;font-stretch:normal;text-align:start;line-height:125%;writing-mode:lr-tb;text-anchor:start;fill:#000000;fill-opacity:1;stroke:none;stroke-width:1px;stroke-linecap:butt;stroke-linejoin:miter;stroke-opacity:1;font-family:Chancery Uralic;-inkscape-font-specification:Chancery ralic Italic"
         x="321.51053"
         y="1029.5442"
         id="text3229"
         sodipodi:linespacing="125%"><tspan
           sodipodi:role="line"
           id="tspan3231"
           x="321.51053"
           y="1029.5442">DebConf 8 Organizer</tspan></text>
      <path
         style="fill:none;fill-rule:evenodd;stroke:#000000;stroke-width:1.04978848px;stroke-linecap:butt;stroke-linejoin:miter;stroke-opacity:1"
         d="M 298.3823,1007.1699 C 503.09104,1007.1699 503.09104,1007.1699 503.09104,1007.1699"
         id="path3233" />
    </g>
    <text
       xml:space="preserve"
       style="font-size:73.88174438px;font-style:italic;font-variant:normal;font-weight:bold;font-stretch:normal;text-align:start;line-height:125%;writing-mode:lr-tb;text-anchor:start;fill:#000000;fill-opacity:1;stroke:none;stroke-width:1px;stroke-linecap:butt;stroke-linejoin:miter;stroke-opacity:1;font-family:Chancery Uralic;-inkscape-font-specification:Chancery Uralic Bold Italic"
       x="37.659061"
       y="499.1727"
       id="text5897"
       sodipodi:linespacing="125%"><tspan
         sodipodi:role="line"
         id="tspan5899"
         x="37.659061"
         y="499.1727">Certificate of Attendance</tspan></text>
    <text
       sodipodi:linespacing="125%"
       id="text4182"
       y="661.67053"
       x="198.04633"
       style="font-size:43.32093811px;font-style:normal;font-variant:normal;font-weight:200;font-stretch:normal;text-align:start;line-height:125%;writing-mode:lr-tb;text-anchor:start;fill:#000000;fill-opacity:1;stroke:none;stroke-width:1px;stroke-linecap:butt;stroke-linejoin:miter;stroke-opacity:1;font-family:Chancery Uralic;-inkscape-font-specification:Chancery Uralic Italic"
       xml:space="preserve"><tspan
         y="661.67053"
         x="198.04633"
         id="tspan4184"
         sodipodi:role="line">We hereby certify that</tspan></text>
    <text
       sodipodi:linespacing="125%"
       id="text4186"
       y="786.74048"
       x="365.85703"
       style="font-size:46.79883194px;font-style:normal;font-variant:normal;font-weight:200;font-stretch:normal;text-align:start;line-height:125%;writing-mode:lr-tb;text-anchor:start;fill:#000000;fill-opacity:1;stroke:none;font-family:Chancery Uralic;-inkscape-font-specification:Chancery Uralic Italic"
       xml:space="preserve"><tspan
         style="text-align:center;text-anchor:middle"
         y="786.74048"
         x="365.85703"
         sodipodi:role="line"
         id="tspan2889">has attended  DebConf12 conference for</tspan><tspan
         style="text-align:center;text-anchor:middle"
         y="845.23901"
         x="365.85703"
         sodipodi:role="line"
         id="tspan2893">the period July %VAR_sdbot% 2012</tspan><tspan
         style="text-align:center;text-anchor:middle"
         y="903.73755"
         x="365.85703"
         sodipodi:role="line"
         id="tspan2895">through July %VAR_tdbot% 2012</tspan></text>
    <text
       xml:space="preserve"
       style="font-size:52.39874268px;font-style:italic;font-variant:normal;font-weight:bold;font-stretch:normal;text-align:center;line-height:125%;writing-mode:lr-tb;text-anchor:middle;fill:#000000;fill-opacity:1;stroke:none;stroke-width:1px;stroke-linecap:butt;stroke-linejoin:miter;stroke-opacity:1;font-family:Chancery Uralic;-inkscape-font-specification:Chancery Uralic Bold Italic"
       x="367.24457"
       y="724.69855"
       id="text4194"
       sodipodi:linespacing="125%"><tspan
         id="tspan4196"
         sodipodi:role="line"
         x="367.24457"
         y="724.69855"
         style="font-size:52.39874268px;font-style:italic;font-variant:normal;font-weight:bold;font-stretch:normal;text-align:center;line-height:125%;writing-mode:lr-tb;text-anchor:middle;font-family:Chancery Uralic;-inkscape-font-specification:Chancery Uralic Bold Italic">%VAR_namebot%</tspan></text>
    <text
       xml:space="preserve"
       style="font-size:10px;font-style:normal;font-variant:normal;font-weight:normal;font-stretch:condensed;text-align:start;line-height:125%;writing-mode:lr-tb;text-anchor:start;fill:#000000;fill-opacity:1;stroke:none;stroke-width:1px;stroke-linecap:butt;stroke-linejoin:miter;stroke-opacity:1;font-family:Impact;-inkscape-font-specification:Impact Condensed"
       x="640.24365"
       y="-1925.6573"
       id="text3199"
       sodipodi:linespacing="125%"><tspan
         y="-1925.6573"
         x="640.24365"
         sodipodi:role="line"
         id="tspan3201" /></text>
    <text
       xml:space="preserve"
       style="font-size:72px;font-style:normal;font-variant:normal;font-weight:normal;font-stretch:condensed;text-align:start;line-height:125%;writing-mode:lr-tb;text-anchor:start;fill:#000000;fill-opacity:1;stroke:none;stroke-width:1px;stroke-linecap:butt;stroke-linejoin:miter;stroke-opacity:1;font-family:Impact;-inkscape-font-specification:Sans"
       x="503.08075"
       y="-1751.0863"
       id="text3215"
       sodipodi:linespacing="125%"><tspan
         sodipodi:role="line"
         id="tspan3217"
         x="503.08075"
         y="-1751.0863" /></text>
    <text
       xml:space="preserve"
       style="font-size:72px;font-style:normal;font-variant:normal;font-weight:bold;font-stretch:condensed;text-align:start;line-height:125%;writing-mode:lr-tb;text-anchor:start;fill:#000000;fill-opacity:1;stroke:none;stroke-width:1px;stroke-linecap:butt;stroke-linejoin:miter;stroke-opacity:1;font-family:Impact;-inkscape-font-specification:Sans Bold"
       x="1112.298"
       y="-1767.1184"
       id="text3529"
       sodipodi:linespacing="125%"><tspan
         y="-1767.1184"
         x="1112.298"
         sodipodi:role="line"
         id="tspan3531" /></text>
    <text
       xml:space="preserve"
       style="font-size:72px;font-style:normal;font-variant:normal;font-weight:bold;font-stretch:condensed;text-align:start;line-height:125%;writing-mode:lr-tb;text-anchor:start;fill:#000000;fill-opacity:1;stroke:none;stroke-width:1px;stroke-linecap:butt;stroke-linejoin:miter;stroke-opacity:1;font-family:Impact;-inkscape-font-specification:Sans Bold"
       x="1174.6448"
       y="-1900.7186"
       id="text3533"
       sodipodi:linespacing="125%"><tspan
         y="-1900.7186"
         x="1174.6448"
         sodipodi:role="line"
         id="tspan3535" /></text>
    <text
       xml:space="preserve"
       style="font-size:72px;font-style:normal;font-variant:normal;font-weight:bold;font-stretch:condensed;text-align:start;line-height:125%;writing-mode:lr-tb;text-anchor:start;fill:#006633;fill-opacity:1;stroke:none;stroke-width:1px;stroke-linecap:butt;stroke-linejoin:miter;stroke-opacity:1;font-family:Impact;-inkscape-font-specification:Sans Bold"
       x="590.36627"
       y="-1713.6782"
       id="text3570"
       sodipodi:linespacing="125%"><tspan
         sodipodi:role="line"
         id="tspan3572"
         x="590.36627"
         y="-1713.6782" /></text>
    <text
       xml:space="preserve"
       style="font-size:72px;font-style:normal;font-variant:normal;font-weight:bold;font-stretch:condensed;text-align:start;line-height:125%;writing-mode:lr-tb;text-anchor:start;fill:#000000;fill-opacity:1;stroke:none;stroke-width:1px;stroke-linecap:butt;stroke-linejoin:miter;stroke-opacity:1;font-family:Impact;-inkscape-font-specification:Sans Bold"
       x="715.05981"
       y="-1667.3635"
       id="text3581"
       sodipodi:linespacing="125%"><tspan
         sodipodi:role="line"
         id="tspan3583"
         x="715.05981"
         y="-1667.3635" /></text>
    <g
       id="onCorBlackV"
       transform="matrix(0.411888,0,0,0.411888,555.20376,-1081.6265)"
       inkscape:label="#g3194" />
    <path
       sodipodi:type="arc"
       style="color:#000000;fill:#52711b;fill-opacity:1;fill-rule:nonzero;stroke:none;stroke-width:4;marker:none;visibility:visible;display:inline;overflow:visible;enable-background:accumulate"
       id="path3002"
       sodipodi:cx="214.6069"
       sodipodi:cy="733.45703"
       sodipodi:rx="47.022602"
       sodipodi:ry="62.225395"
       d="m 261.62951,733.45703 a 47.022602,62.225395 0 1 1 -94.04521,0 47.022602,62.225395 0 1 1 94.04521,0 z"
       transform="matrix(0.27099276,0,0,0.28280176,312.84652,-13.301106)" />
    <path
       id="path3004"
       d="m 366.87739,207.92781 -0.29257,12.873 c -0.0565,2.5169 1.22195,4.6546 3.00547,5.2662 l 0,18.9903 c -2.77215,0.8026 -4.97773,6.712 -3.48421,9.575 1.02393,1.9627 4.04112,2.5417 6.19711,1.7022 2.156,0.8395 5.17319,0.2605 6.19712,-1.7022 1.4935,-2.863 -0.71206,-8.7724 -3.48422,-9.575 l 0,-18.9903 c 1.78353,-0.6116 3.06203,-2.7493 3.00547,-5.2662 l -0.29257,-12.873 -10.8516,0 z m 5.4258,17.8466 c 0.4598,0.2635 0.96209,0.4225 1.48944,0.4522 l 0,18.8307 c -0.51909,0.1503 -1.03141,0.4742 -1.48944,0.9309 -0.4573,-0.456 -0.94464,-0.7802 -1.46284,-0.9309 l 0,-18.8307 c 0.52356,-0.031 1.00607,-0.1904 1.46284,-0.4522 z"
       style="color:#000000;fill:#124745;fill-opacity:1;fill-rule:nonzero;marker:none;visibility:visible;display:inline;overflow:visible;enable-background:accumulate"
       inkscape:connector-curvature="0" />
    <path
       inkscape:connector-curvature="0"
       id="path3010"
       d="m 360.57759,183.97461 c -0.14983,1.0088 3.83566,0.6116 5.75906,0.4834 1.38244,-2.2862 10.89877,-5.83385 10.89877,-8.76208 l 5.83203,0 c -0.12016,-0.80804 -0.22269,-1.89976 -0.62666,-2.64243 -10.1055,-10.39847 -21.89517,-2.13645 -21.8632,10.92111 z"
       style="color:#000000;fill:#abae29;fill-opacity:1;fill-rule:nonzero;stroke:none;stroke-width:4;marker:none;visibility:visible;display:inline;overflow:visible;enable-background:accumulate"
       sodipodi:nodetypes="cccccc" />
    <path
       sodipodi:nodetypes="ccccc"
       inkscape:connector-curvature="0"
       id="path3013"
       d="m 360.63991,191.63901 c 0,7.0956 1.88816,13.3955 4.80797,17.3467 l 14.3731,0 c 2.91982,-3.9512 4.80797,-10.2511 4.80797,-17.3467 -5.14386,-13.09324 -17.94965,-12.60309 -23.98904,0 z"
       style="color:#000000;fill:#c95c11;fill-opacity:1;fill-rule:nonzero;stroke:none;stroke-width:4;marker:none;visibility:visible;display:inline;overflow:visible;enable-background:accumulate" />
    <path
       id="path3015"
       d="m 376.69171,173.51114 c -9.84906,1.09197 -15.79133,7.94027 -16.06463,18.13927 -0.15435,5.7595 3.05453,9.7199 7.50037,11.3037 -2.27495,-2.0838 -3.87695,-5.2566 -3.69699,-8.511 -0.0615,-0.9855 0.0842,-2.2017 -0.0798,-2.447 0.23009,-0.7501 0.50057,-1.6779 1.03729,-2.7661 0.0214,0.021 0.15415,0.1062 0.37236,-0.2659 0.1654,-0.3633 0.29706,-0.7372 0.50534,-1.0905 l 0.10639,-0.026 c 0.10734,-0.6239 1.46085,-1.5933 1.86179,-2.0745 l 0.0265,0.1861 c 0.87509,-0.8205 2.42011,-1.3635 3.29804,-1.7554 -0.23056,0.2555 0.52574,-0.02 1.06388,-0.053 -0.16967,0.095 -0.34634,0.1544 -0.50534,0.266 0.64595,-0.1541 0.61649,0.06 1.27666,-0.026 l 0.13298,-0.026 c 0.0315,-0.045 -0.18327,-0.072 -0.37236,-0.1064 0.63126,0.018 0.57993,0.06 0.37236,0.1064 l 0,0.026 -0.13298,0 c -0.23175,0.033 -0.49692,0.1248 -0.45215,0.1596 0.73765,0.085 0.83335,-0.2274 1.51603,0 l -0.0265,-0.1861 c 0.94855,0.3421 1.15018,0.2776 2.18096,0.8244 0.36136,0.018 0.38471,-0.2225 0.9309,0 0.0962,0.1688 -0.007,0.1859 0.66492,0.5852 0.0744,-0.03 -0.15447,-0.1949 -0.31916,-0.3458 1.34948,0.7214 2.82382,2.2375 3.27144,3.8832 -0.41941,-0.772 -0.0419,0.4066 -0.18618,0.3457 0.18695,0.5036 0.33077,1.0321 0.42555,1.5693 -0.12441,-0.4405 -0.37767,-1.5216 -0.85111,-2.2076 -0.0389,0.4427 -0.63193,-0.3099 -0.31916,0.665 0.23792,0.3454 0.0519,-0.3478 0.34576,0.2659 0.005,0.2917 0.12158,0.5777 0.18618,0.9575 -0.10046,-0.016 -0.21929,-0.4051 -0.29257,-0.2926 0.10165,0.478 0.25568,0.7347 0.31917,0.7714 -0.0325,0.08 -0.0996,-0.086 -0.10639,0.2393 0.0393,0.7484 0.21154,0.4432 0.29257,0.4788 -0.082,0.3685 -0.42901,0.8024 -0.26597,1.4362 -0.0466,-0.1922 -0.14376,-0.4031 -0.21278,-0.5851 -0.0272,0.2305 0.0157,0.3832 0.0266,0.5319 -0.009,-0.1465 -0.081,-0.1986 -0.15958,-0.08 0.0753,0.8403 -0.66574,1.4631 -0.58514,1.9948 l -0.21277,-0.2926 c -0.5523,0.8006 -0.0868,0.5257 -0.37236,1.0373 0.0484,-0.1325 -0.0826,-0.075 0.0797,-0.3191 -0.12582,0.01 -0.55893,0.5407 -0.9575,0.8511 -1.56534,1.2547 -3.4302,1.4202 -5.23962,0.7447 0.009,-0.042 -0.0126,-0.1049 -0.13298,-0.1862 -1.53383,-1.1756 -2.44269,-2.1555 -2.12777,-4.4683 0.23364,-0.1768 0.28804,-1.1517 0.82451,-1.4895 0.327,-0.7229 1.31954,-1.3925 2.36714,-1.4096 1.06893,-0.058 1.96727,0.5765 2.42033,1.1703 -0.82484,-0.7699 -2.17229,-0.9957 -3.32463,-0.4255 -1.17817,0.5305 -1.8839,1.8201 -1.78201,3.1118 0.0436,-0.064 0.0856,-0.027 0.10639,-0.1862 -0.036,2.5109 2.7072,4.3599 4.68109,3.431 l 0.0266,0.053 c 0.80069,-0.2187 0.70001,-0.412 1.22346,-0.7713 -0.0408,0.084 -0.3456,0.3158 -0.15958,0.3192 0.2545,-0.068 1.04478,-0.8227 1.43624,-1.1703 0.17942,-0.387 -0.0909,-0.2048 0.15958,-0.6915 l 0.29257,-0.1596 c 0.17037,-0.4919 0.36713,-0.7574 0.34576,-1.3299 l -0.18618,0.3724 c 0.26327,-0.7957 0.12256,-1.6711 0.15959,-2.4204 l -0.0797,0 c -0.0644,-1.8845 -1.68897,-3.8967 -3.13846,-4.5747 -1.05506,-0.4869 -2.60256,-0.6528 -3.5906,-0.4255 0.008,-0.013 0.0261,-0.038 0,-0.053 -1.39166,0.1382 -1.08733,0.4991 -2.15436,0.7714 -0.2924,0.2826 0.85617,-0.2331 0.23937,0.1329 -0.57226,0.1581 -0.85413,-0.1061 -1.70221,0.7714 0.0756,0.1218 0.54559,-0.3519 0.15958,0.1329 -0.79712,-0.098 -2.53369,1.8101 -2.89908,2.4469 l 0.21278,0.026 c -0.3135,0.786 -0.74225,1.3114 -0.79792,1.7821 -0.0813,1.1575 -0.48133,3.2614 0.0798,3.9097 l -0.0532,0.5319 c 0.0768,0.1538 0.14388,0.3075 0.23938,0.4522 l -0.13299,0.026 c 0.59028,1.8627 0.6298,0.033 1.40965,1.9682 -0.11328,-0.038 -0.23426,-0.097 -0.39896,-0.3192 -0.0199,0.1697 0.25026,0.6931 0.55854,1.0905 l -0.13299,0.1596 c 0.17179,0.3126 0.33296,0.3702 0.45215,0.4787 -0.64168,-0.3502 0.60653,1.1647 0.71812,1.3565 l 0.0798,-0.1862 c -0.0145,0.2528 0.19221,0.5856 0.55854,1.0373 l 0.29257,-0.026 c 0.12559,0.2491 0.5988,0.6967 0.8777,0.7181 l -0.10639,0.133 c 0.82012,0.1515 1.65986,0.2128 2.52673,0.2128 6.62559,0 11.99527,-4.4965 11.99527,-12.0751 0,-3.7672 -2.07957,-6.7035 -3.45762,-9.6813 -1.05448,-2.2787 -0.0968,-5.08229 2.12777,-6.35682 -1.94601,-0.88907 -4.33322,-2.35203 -6.59607,-2.10113 z m -3.11186,10.53247 c -0.12737,0.01 -0.24306,0.015 -0.34576,0.053 l -0.15958,-0.026 c 0.16669,-0.021 0.33522,-0.013 0.50534,-0.026 z m -8.75043,4.5747 c 0.0627,0.069 0.3058,-0.1896 0.0797,0.3192 -0.12025,0.084 -0.18537,0.1388 -0.21278,0.1596 0.0269,-0.045 0.14298,-0.2239 0.13299,-0.4788 z m -0.39896,1.5692 c -0.0424,0.1975 -0.0751,0.4042 -0.18618,0.7447 0.0323,-0.2665 -0.12021,-0.3527 0.18618,-0.7447 z m 12.60701,2.3672 c 0.0434,0 0.0747,0.1067 0.0532,0.4256 -0.0637,0.2568 -0.1203,-0.1516 -0.18618,-0.1863 0.0283,-0.1214 0.0891,-0.2384 0.13299,-0.2393 z m 3.48422,1.0107 c 0.008,0.1762 -0.008,0.3637 -0.13299,0.6915 0.0822,-0.2715 0.12945,-0.5156 0.13299,-0.6915 z m 0.39895,0.053 c -0.0238,0.1817 -0.066,0.3792 -0.10639,0.5585 0.03,-0.1404 0.0333,-0.2837 0.0532,-0.4256 l 0.0532,-0.1329 z m -4.38851,0.3989 c -0.0465,0.1896 -0.4002,0.6167 -0.29257,0.6383 0.0359,0.01 0.12711,-0.029 0.29257,-0.1329 0.0602,-0.1072 0.10652,-0.2124 0.15958,-0.3192 -0.0777,0.2026 -0.15855,0.4273 -0.29257,0.6117 0.0117,-0.1127 -0.0917,-0.1244 -0.15958,-0.1596 -0.0829,-0.043 -0.0987,-0.1453 0.29257,-0.6383 z m 4.25553,0.2394 c -0.1221,0.5091 -0.28368,0.9961 -0.53195,1.4628 0.23673,-0.4662 0.41758,-0.9613 0.53195,-1.4628 z m -5.4258,0.984 c -0.10331,0.098 -0.21757,0.1926 -0.34577,0.2927 -0.46225,-0.072 -0.85936,-0.2609 -0.50534,-0.266 0.29525,0.027 0.56368,0.044 0.85111,-0.026 z m -4.33533,0.2927 c 0.0428,0.079 0.098,0.1445 0.15959,0.2127 l 0.10638,0.3192 c -0.10175,-0.1721 -0.18394,-0.3497 -0.26597,-0.5319 z m -0.39895,0.2393 c 0.2924,0.5644 0.45118,0.7268 0.66492,1.1437 -0.2969,-0.2465 -0.48518,-0.5879 -0.71812,-0.9043 l 0.0532,-0.2394 z m 0.45215,0.3458 c 0.18696,0.041 0.82246,1.0611 1.30325,1.2235 -0.28411,-0.2275 -0.48773,-0.5267 -0.69152,-0.8246 0.38388,0.441 0.84698,0.7989 1.35645,1.0373 -0.0119,-0.045 0.0138,-0.076 0.0265,-0.1064 0.0321,0.1 0.35774,0.3484 0.61173,0.4788 0.68909,0.2547 1.46086,0.2887 2.07458,0.266 -1.32627,0.5547 -3.85292,-0.5917 -4.68109,-2.0746 z"
       style="color:#000000;fill:#d8dd2d;fill-opacity:1;fill-rule:nonzero;stroke:none;stroke-width:4;marker:none;visibility:visible;display:inline;overflow:visible;enable-background:accumulate"
       inkscape:connector-curvature="0" />
    <path
       style="fill:#c95c11;fill-opacity:1"
       d="m 370.52686,171.21162 c -1.88991,0.50692 -1.46595,3.57184 -0.77573,4.93003 1.61681,0.29993 4.26824,-1.42713 5.0202,-3.73269 z"
       id="path3017"
       inkscape:connector-curvature="0"
       sodipodi:nodetypes="cccc" />
    <path
       sodipodi:nodetypes="ccssssc"
       inkscape:connector-curvature="0"
       id="path3029"
       d="m 373.95221,172.0217 c -1.50198,0.39041 -1.83449,1.22117 -1.96822,2.44693 -2.59552,0.95903 -4.61234,2.21552 -4.04276,3.59056 1.2627,3.04862 5.26516,-1.32117 9.81432,-1.83515 7.1234,-0.80489 15.73249,0.18546 15.72877,-0.22571 -0.0145,-1.59625 -8.15776,-3.41524 -12.3509,-3.41813 -2.75404,0 -4.98523,-0.42709 -7.18121,-0.5585 z"
       style="fill:#000000;fill-opacity:1" />
    <path
       transform="matrix(0.6710644,0,0,0.6710644,234.44148,171.39614)"
       d="m 211.25,3.4687495 a 3.25,3.25 0 1 1 -6.5,0 3.25,3.25 0 1 1 6.5,0 z"
       sodipodi:ry="3.25"
       sodipodi:rx="3.25"
       sodipodi:cy="3.4687495"
       sodipodi:cx="208"
       id="path3031"
       style="color:#000000;fill:#abae29;fill-opacity:1;stroke:none;stroke-width:1.55223882;marker:none;visibility:visible;display:inline;overflow:visible;enable-background:accumulate"
       sodipodi:type="arc" />
    <path
       sodipodi:type="arc"
       style="color:#000000;fill:#000000;fill-opacity:1;stroke:none;stroke-width:1.55223882;marker:none;visibility:visible;display:inline;overflow:visible;enable-background:accumulate"
       id="path3033"
       sodipodi:cx="208"
       sodipodi:cy="3.4687495"
       sodipodi:rx="3.25"
       sodipodi:ry="3.25"
       d="m 211.25,3.4687495 a 3.25,3.25 0 1 1 -6.5,0 3.25,3.25 0 1 1 6.5,0 z"
       transform="matrix(0.49102273,0,0,0.49102273,271.89015,172.02068)" />
    <path
       transform="matrix(1.6048611,0,0,1.7507575,35.98546,166.00115)"
       d="m 211.11557,4.1726246 a 0.26516503,0.24306795 0 1 1 -0.53033,0 0.26516503,0.24306795 0 1 1 0.53033,0 z"
       sodipodi:ry="0.24306795"
       sodipodi:rx="0.26516503"
       sodipodi:cy="4.1726246"
       sodipodi:cx="210.8504"
       id="path3035"
       style="color:#000000;fill:#ffffff;fill-opacity:1;fill-rule:nonzero;stroke:none;stroke-width:0.1;marker:none;visibility:visible;display:inline;overflow:visible;enable-background:accumulate"
       sodipodi:type="arc" />
    <path
       sodipodi:nodetypes="cczc"
       inkscape:connector-curvature="0"
       id="path3037"
       d="m 377.22707,172.75102 c 0.91619,-0.0987 2.01262,-0.24095 3.03654,-0.18512 -3.90542,-3.86794 -12.92263,-2.26156 -13.25356,-0.92949 -0.33092,1.33206 3.40114,-1.14772 10.21702,1.11461 z"
       style="fill:#ffffff;fill-opacity:1;stroke:none" />
    <path
       style="font-size:100.81187439px;font-style:normal;font-variant:normal;font-weight:normal;font-stretch:normal;text-align:start;line-height:125%;letter-spacing:-3.5px;word-spacing:0px;writing-mode:lr-tb;text-anchor:start;fill:#4c403b;fill-opacity:1;stroke:none;font-family:LaudatioC;-inkscape-font-specification:LaudatioC"
       d="m 220.69992,208.03381 -22.74049,0 0,60.85309 17.42108,0 c 22.70878,0 34.07078,-10.12039 34.07084,-31.17039 -6e-5,-10.1817 -2.26342,-17.6696 -6.78225,-22.4745 -4.51893,-4.8049 -11.84463,-7.2081 -21.96918,-7.2082 z m -3.16505,5.8249 c 14.52903,1e-4 21.78295,8.0278 21.783,24.044 -5e-5,8.5229 -1.81817,14.4185 -5.479,18.5371 -3.88971,4.4044 -10.04984,6.6231 -18.45836,6.6231 l -8.61745,0 0,-49.2042 z"
       id="path3050"
       inkscape:connector-curvature="0"
       sodipodi:nodetypes="ccccscccsccccc" />
    <path
       style="font-size:100.81187439px;font-style:normal;font-variant:normal;font-weight:normal;font-stretch:normal;text-align:start;line-height:125%;letter-spacing:-3.5px;word-spacing:0px;writing-mode:lr-tb;text-anchor:start;fill:#4c403b;fill-opacity:1;stroke:none;font-family:LaudatioC;-inkscape-font-specification:LaudatioC"
       d="m 274.74516,220.82731 c -7.15015,0 -12.63112,2.286 -16.46358,6.8621 -3.48927,4.233 -5.23963,9.993 -5.23963,17.3147 0,7.7794 2.21418,13.8452 6.67587,18.1924 4.46167,4.3473 10.5992,6.51619 18.37857,6.51619 3.79346,0 7.64486,-0.4653 11.27716,-1.40959 l 1.17027,-5.8513 c -2.63591,0.9846 -5.58514,1.5958 -10.9048,1.5958 -10.63942,0 -16.42608,-6.0884 -17.34129,-18.2722 l 30.98558,0 c 0.17156,-1.8304 0.23933,-3.5089 0.23938,-5.0535 -5e-5,-6.1776 -1.58426,-11.0287 -4.78747,-14.5751 -3.2033,-3.5464 -7.86958,-5.3195 -13.99006,-5.3195 z m -0.69152,4.8673 c 7.0357,0 10.53641,5.0172 10.47924,15.0273 l -22.31494,0 c 0.6292,-10.0101 4.57114,-15.0273 11.8357,-15.0273 z"
       id="path3052"
       inkscape:connector-curvature="0" />
    <path
       style="font-size:100.81187439px;font-style:normal;font-variant:normal;font-weight:normal;font-stretch:normal;text-align:start;line-height:125%;letter-spacing:-3.5px;word-spacing:0px;writing-mode:lr-tb;text-anchor:start;fill:#4c403b;fill-opacity:1;stroke:none;font-family:LaudatioC;-inkscape-font-specification:LaudatioC"
       d="m 307.114,204.52341 -8.80384,2.3524 0,60.7624 c 5.33602,1.38649 10.45051,2.07449 14.54859,2.07449 8.23693,0 14.69874,-2.70449 19.38926,-8.13869 4.34724,-5.0908 6.51624,-11.8317 6.51628,-20.2403 -4e-5,-6.0633 -1.21079,-10.869 -3.67039,-14.4156 -2.86009,-4.0612 -7.22469,-6.0908 -13.05916,-6.0908 -6.80695,0 -11.7175,3.4743 -14.92074,10.4527 z m 11.56951,23.5118 c 4.11844,0 7.22311,1.7956 9.28237,5.3992 1.6588,2.9745 2.47349,6.6599 2.47353,11.0643 -3e-5,13.3278 -5.34146,20.001 -16.03803,20.001 -2.40247,0 -4.82797,-0.3282 -7.2876,-0.9575 l 2.2e-4,-17.5008 c 1.4e-4,-12.0123 3.84734,-18.0062 11.56951,-18.0062 z"
       id="path3054"
       inkscape:connector-curvature="0"
       sodipodi:nodetypes="cccscccsccsccscss" />
    <path
       inkscape:connector-curvature="0"
       id="path3056"
       style="font-size:100.81187439px;font-style:normal;font-variant:normal;font-weight:normal;font-stretch:normal;text-align:start;line-height:125%;letter-spacing:-3.5px;word-spacing:0px;writing-mode:lr-tb;text-anchor:start;fill:#4c403b;fill-opacity:1;stroke:none;font-family:LaudatioC;-inkscape-font-specification:LaudatioC"
       d="m 388.30154,268.3497 c -4.46173,0.9724 -9.06642,1.4586 -13.81407,1.4586 -9.7814,0 -17.50354,-2.65979 -23.16643,-7.97959 -5.66291,-5.3769 -8.49436,-12.9274 -8.49436,-22.6516 0,-10.239 2.65985,-18.0468 7.97955,-23.4238 5.37689,-5.4341 13.18482,-8.1511 23.42384,-8.1512 6.23487,1e-4 11.61177,0.8581 16.1307,2.5741 l -2.61634,6.3656 c -3.3263,-2.6563 -7.67989,-3.5341 -13.51436,-3.5342 -6.97856,1e-4 -12.35545,2.4883 -16.1307,7.4647 -3.37488,4.4618 -5.06231,10.2963 -5.06229,17.5036 -2e-5,7.6077 1.88762,13.7569 5.6629,18.4473 4.11845,5.1481 9.89575,7.7222 17.33193,7.7222 5.66286,0 10.13823,-1.1217 13.6518,-2.7632 z"
       sodipodi:nodetypes="cscsccccccscscc" />
    <path
       inkscape:connector-curvature="0"
       id="path3058"
       style="font-size:100.81187439px;font-style:normal;font-variant:normal;font-weight:normal;font-stretch:normal;text-align:start;line-height:125%;letter-spacing:-3.5px;word-spacing:0px;writing-mode:lr-tb;text-anchor:start;fill:#4c403b;fill-opacity:1;stroke:none;font-family:LaudatioC;-inkscape-font-specification:LaudatioC"
       d="m 436.67625,244.84001 c -4e-5,7.4934 -1.83048,13.4423 -5.4913,17.8468 -3.88971,4.7476 -9.52401,7.12149 -16.90292,7.12149 -7.43616,0 -13.15625,-2.20219 -17.16032,-6.60679 -3.83247,-4.2328 -5.7487,-10.0959 -5.7487,-17.5893 0,-7.5505 1.85904,-13.528 5.5771,-17.9325 3.94686,-4.6333 9.63836,-6.9499 17.07452,-6.9499 7.26451,0 12.8988,2.2308 16.90292,6.6925 3.83242,4.2901 5.74866,10.096 5.7487,17.4177 m -9.09497,0.5149 c -4e-5,-12.7559 -4.34732,-19.1338 -13.04184,-19.1338 -9.49539,0 -14.24308,6.3779 -14.24307,19.1338 -1e-5,12.6985 4.63327,19.0479 13.89986,19.0479 8.92334,0 13.38501,-6.3494 13.38505,-19.0479" />
    <path
       style="font-size:100.81187439px;font-style:normal;font-variant:normal;font-weight:normal;font-stretch:normal;text-align:start;line-height:125%;letter-spacing:-3.5px;word-spacing:0px;writing-mode:lr-tb;text-anchor:start;fill:#4c403b;fill-opacity:1;stroke:none;font-family:LaudatioC;-inkscape-font-specification:LaudatioC"
       d="m 450.2062,220.13581 -8.80384,2.3581 0,46.39299 8.80384,0 0,-20.95709 c -1e-5,-6.4636 0.39037,-11.13 1.64881,-13.9901 2.00201,-4.3472 5.827,-6.5163 11.48993,-6.5163 3.26043,0 5.54639,0.9092 6.86204,2.7396 1.08679,1.4872 1.62239,3.9619 1.62243,7.3939 l 0,31.32999 8.80362,-0.1504 0,-30.05339 c -5e-5,-6.1776 -0.84279,-10.32 -2.10116,-12.7225 -1.83048,-3.432 -5.5877,-5.1333 -11.25056,-5.1333 -4.29011,0 -7.74164,0.7922 -10.37286,2.3938 -2.63127,1.6017 -4.81463,4.3063 -6.70225,8.1387 z"
       id="path3060"
       inkscape:connector-curvature="0"
       sodipodi:nodetypes="ccccccsccccccsccc" />
    <path
       style="font-size:100.81187439px;font-style:normal;font-variant:normal;font-weight:normal;font-stretch:normal;text-align:start;line-height:125%;letter-spacing:-3.5px;word-spacing:0px;writing-mode:lr-tb;text-anchor:start;fill:#4c403b;fill-opacity:1;stroke:none;font-family:LaudatioC;-inkscape-font-specification:LaudatioC"
       d="m 512.70909,204.60311 c -15.63958,1.3529 -20.61272,7.323 -20.61272,18.6712 l 0,4.2555 -7.63336,0 0,5.745 7.63336,0 0,35.61349 8.67064,0 0,-35.61349 9.01641,0 0,-5.745 -9.01641,0 0,-6.1173 c 0,-5.2662 2.16097,-10.3729 6.62267,-10.3729 0.99525,0 1.84009,0.021 2.63311,0.08 z"
       id="path3062"
       inkscape:connector-curvature="0"
       sodipodi:nodetypes="csccccccccccsscc" />
    <g
       id="g3148"
       transform="translate(294.92894,-820.4105)">
      <path
         inkscape:connector-curvature="0"
         id="path3043"
         style="font-size:138.47912598px;font-style:normal;font-variant:normal;font-weight:normal;font-stretch:normal;text-align:start;line-height:125%;letter-spacing:0px;word-spacing:0px;writing-mode:lr-tb;text-anchor:start;fill:#4c403b;fill-opacity:1;stroke:none;font-family:LaudatioC;-inkscape-font-specification:LaudatioC"
         d="m 283.0305,1089.2975 -29.15687,0 c 0,-19.2005 23.00132,-25.0179 21.59197,-35.7725 -0.93497,-5.5529 -4.3132,-7.6295 -9.58688,-6.9402 -5.55117,0.7256 -8.47195,4.1613 -11.26477,7.5585 l -2.38288,-5.7975 c 12.01235,-12.487 28.39679,-6.825 29.85779,4.0674 1.90744,14.2209 -14.9301,17.9624 -17.83294,31.0602 l 18.77458,0"
         sodipodi:nodetypes="cccsccscc" />
      <path
         inkscape:connector-curvature="0"
         id="path3853"
         style="font-size:138.47912598px;font-style:normal;font-variant:normal;font-weight:normal;font-stretch:normal;text-align:start;line-height:125%;letter-spacing:0px;word-spacing:0px;writing-mode:lr-tb;text-anchor:start;fill:#4c403b;fill-opacity:1;stroke:none;font-family:LaudatioC;-inkscape-font-specification:LaudatioC"
         d="m 245.99134,1089.2975 -8.80364,0 0,-39.9019 c -4.4537,1.8068 -9.44108,3.3968 -14.12722,4.2991 l 0,-5.7487 c 5.18232,-0.5909 13.51717,-3.4936 22.93086,-7.1875"
         sodipodi:nodetypes="cccccc" />
    </g>
    <path
       transform="matrix(0.73568824,0,0,0.73568824,211.76983,182.46531)"
       d="m 239.7092,151.14035 a 7.7781744,7.7781744 0 1 1 -15.55634,0 7.7781744,7.7781744 0 1 1 15.55634,0 z"
       sodipodi:ry="7.7781744"
       sodipodi:rx="7.7781744"
       sodipodi:cy="151.14035"
       sodipodi:cx="231.93103"
       id="path3057"
       style="color:#000000;fill:#406e19;fill-opacity:1;fill-rule:nonzero;stroke:none;marker:none;visibility:visible;display:inline;overflow:visible;enable-background:accumulate"
       sodipodi:type="arc" />
    <g
       id="g3114"
       transform="matrix(0.84046527,0,0,0.84046527,283.45017,-662.34978)">
      <path
         sodipodi:nodetypes="ccccccccccc"
         inkscape:connector-curvature="0"
         id="path3890"
         d="m 148.82236,1117.4237 -7.07646,0 0,35.9649 5.22732,0 -1e-5,-29.1694 17.53101,29.1696 5.22732,0 0,-35.9651 -5.22732,0 0,27.068 z"
         style="font-size:49.13095093px;font-style:normal;font-variant:normal;font-weight:normal;font-stretch:normal;text-align:start;line-height:125%;letter-spacing:-1.30589175px;word-spacing:0px;writing-mode:lr-tb;text-anchor:start;fill:#406e19;fill-opacity:1;stroke:none;font-family:LaudatioC;-inkscape-font-specification:LaudatioC" />
      <path
         sodipodi:nodetypes="cccscsccscscscc"
         d="m 202.1545,1130.087 c -1.4134,-1.4288 -3.20453,-1.869 -5.62092,-1.8691 -2.88628,10e-5 -5.10131,1.0572 -6.64512,3.1716 -1.37602,1.8794 -2.06402,4.3126 -2.06402,7.2995 0,3.3897 0.82225,6.2355 2.46675,8.3499 1.8123,2.3157 4.36294,3.4735 7.65196,3.4735 2.08077,0 3.719,-0.3763 4.9947,-1.2938 l -0.76598,3.8613 c -1.87946,0.4027 -3.50717,0.604 -4.88317,0.604 -4.66501,0 -8.3064,-1.225 -10.92416,-3.6749 -2.61779,-2.4835 -3.92667,-6.1347 -3.92667,-10.7662 0,-4.3965 1.27533,-7.8868 3.82598,-10.4711 2.5842,-2.6178 6.07457,-3.9266 10.47109,-3.9266 2.08078,0 4.44684,0.3859 7.0982,1.1578 z"
         style="font-size:49.13095093px;font-style:normal;font-variant:normal;font-weight:normal;font-stretch:normal;text-align:start;line-height:125%;letter-spacing:-1.30589175px;word-spacing:0px;writing-mode:lr-tb;text-anchor:start;fill:#406e19;fill-opacity:1;stroke:none;font-family:LaudatioC;-inkscape-font-specification:LaudatioC"
         id="path3894"
         inkscape:connector-curvature="0" />
      <path
         sodipodi:nodetypes="sccsscssssccccccsssccscsss"
         inkscape:connector-curvature="0"
         id="path3935"
         d="m 218.41432,1124.8845 c -3.62463,0 -7.52513,1.0379 -11.88808,2.9844 l 1.40783,3.4253 c 2.65015,-1.7623 6.13188,-3.3543 9.42358,-3.3678 3.52388,-0.014 5.28333,2.1387 5.28333,6.468 l 0,1.4488 c -1.00686,-0.034 -1.91627,-0.032 -2.72172,-0.032 -9.6992,0 -14.53716,3.0786 -14.53715,9.2538 -1e-5,2.5172 0.76316,4.569 2.27343,6.18 1.51024,1.6109 3.50422,2.4335 5.98777,2.4335 2.11434,0 3.98949,-0.5865 5.66757,-1.7612 1.67804,-1.2081 2.68907,-2.7308 3.39387,-4.7444 l 0.18114,6.2159 4.91033,0 0,-19.6346 c -3e-5,-3.1212 -0.79368,-5.3804 -2.33747,-6.7564 -1.51027,-1.4095 -3.85614,-2.1133 -7.04443,-2.1133 z m 0.70444,13.7444 c 1.17462,0 2.34755,0.088 3.52222,0.2562 -0.0671,2.0808 -0.21337,3.6039 -0.44828,4.6109 -0.3692,1.5773 -1.07296,2.9574 -2.11334,4.0985 -1.3089,1.4432 -2.89313,2.1454 -4.73898,2.1454 -1.37603,0 -2.49108,-0.4402 -3.3301,-1.3128 -0.80548,-0.8726 -1.18475,-1.9861 -1.18474,-3.3621 -1e-5,-4.2958 2.75561,-6.4361 8.29322,-6.4361 z"
         style="font-size:49.13095093px;font-style:normal;font-variant:normal;font-weight:normal;font-stretch:normal;text-align:start;line-height:125%;letter-spacing:-1.30589175px;word-spacing:0px;writing-mode:lr-tb;text-anchor:start;fill:#406e19;fill-opacity:1;stroke:none;font-family:LaudatioC;-inkscape-font-specification:LaudatioC" />
      <path
         style="font-size:49.13095093px;font-style:normal;font-variant:normal;font-weight:normal;font-stretch:normal;text-align:start;line-height:125%;letter-spacing:-1.30589175px;word-spacing:0px;writing-mode:lr-tb;text-anchor:start;fill:#406e19;fill-opacity:1;stroke:none;font-family:LaudatioC;-inkscape-font-specification:LaudatioC"
         d="m 260.12292,1124.8845 c -3.62462,0 -7.52513,1.0379 -11.88808,2.9844 l 1.40783,3.4253 c 2.65015,-1.7623 6.13188,-3.3543 9.42358,-3.3678 3.52388,-0.014 5.28333,2.1387 5.28333,6.468 l 0,1.4488 c -1.00686,-0.034 -1.91627,-0.032 -2.72171,-0.032 -9.6992,0 -14.53717,3.0786 -14.53716,9.2538 -1e-5,2.5172 0.76317,4.569 2.27343,6.18 1.51025,1.6109 3.50423,2.4335 5.98777,2.4335 2.11434,0 3.98949,-0.5865 5.66757,-1.7612 1.67804,-1.2081 2.68907,-2.7308 3.39387,-4.7444 l 0.18114,6.2159 4.91034,0 0,-19.6346 c -3e-5,-3.1212 -0.79368,-5.3804 -2.33747,-6.7564 -1.51028,-1.4095 -3.85614,-2.1133 -7.04444,-2.1133 z m 0.70444,13.7444 c 1.17463,0 2.34756,0.088 3.52222,0.2562 -0.0671,2.0808 -0.21337,3.6039 -0.44828,4.6109 -0.3692,1.5773 -1.07296,2.9574 -2.11333,4.0985 -1.3089,1.4432 -2.89314,2.1454 -4.73899,2.1454 -1.37602,0 -2.49107,-0.4402 -3.33009,-1.3128 -0.80549,-0.8726 -1.18476,-1.9861 -1.18475,-3.3621 -1e-5,-4.2958 2.75561,-6.4361 8.29322,-6.4361 z"
         id="path3937"
         inkscape:connector-curvature="0"
         sodipodi:nodetypes="sccsscssssccccccsssccscsss" />
      <path
         inkscape:connector-curvature="0"
         id="path3941"
         style="font-size:49.13095093px;font-style:normal;font-variant:normal;font-weight:normal;font-stretch:normal;text-align:start;line-height:125%;letter-spacing:-1.30589175px;word-spacing:0px;writing-mode:lr-tb;text-anchor:start;fill:#406e19;fill-opacity:1;stroke:none;font-family:LaudatioC;-inkscape-font-specification:LaudatioC"
         d="m 294.3215,1129.3758 c 0.80544,1.2082 1.20818,2.6849 1.20821,4.4301 -3e-5,2.9533 -0.93974,5.2187 -2.81915,6.7962 -1.84589,1.5437 -4.27907,2.3157 -7.29956,2.3157 -0.46987,0 -1.17465,-0.067 -2.11436,-0.2014 -0.90616,-0.1678 -1.59416,-0.2517 -2.06401,-0.2517 -0.46986,0 -1.1243,0.3523 -1.96332,1.0571 -0.83905,0.7048 -1.25856,1.2922 -1.25856,1.762 0,0.9062 0.85581,1.527 2.56744,1.8627 0.3356,0.068 1.56058,0.1845 3.67495,0.3523 l 5.03419,0.4027 c 2.98692,0.235 5.18517,0.772 6.59477,1.611 1.98008,1.1411 2.97014,3.0373 2.97017,5.6886 -3e-5,3.5575 -1.81233,6.2928 -5.43691,8.2058 -2.8863,1.5102 -6.29275,2.2654 -10.2194,2.2654 -2.65134,0 -4.95029,-0.4363 -6.89682,-1.3089 -2.58422,-1.1412 -3.87632,-2.8695 -3.87632,-5.1852 0,-1.611 0.73834,-3.0877 2.21504,-4.4301 0.90614,-0.8055 2.34927,-1.7285 4.32939,-2.7689 -3.85954,-0.5705 -5.78931,-2.1311 -5.78931,-4.6817 0,-1.4767 0.65444,-2.6849 1.96334,-3.6247 0.43629,-0.3019 1.72839,-0.9564 3.87631,-1.9633 -3.49036,-1.4095 -5.23555,-4.0944 -5.23555,-8.0546 0,-2.9534 1.05718,-5.2021 3.17154,-6.7459 1.87942,-1.3759 4.34616,-2.0639 7.40024,-2.0639 2.78557,0 5.45369,0.5873 8.00436,1.7619 2.4835,0 4.81599,-0.1678 6.99751,-0.5035 l 0,3.675 z m -4.17837,4.2287 c -2e-5,-1.8458 -0.41953,-3.3393 -1.25854,-4.4804 -0.93973,-1.2753 -2.31574,-1.913 -4.12803,-1.913 -1.84588,0 -3.27223,0.6544 -4.27905,1.9633 -0.90617,1.1746 -1.35924,2.7185 -1.35924,4.6315 0,1.8123 0.45307,3.3058 1.35924,4.4804 1.00682,1.3088 2.38283,1.9634 4.12803,1.9633 1.81229,10e-5 3.22185,-0.6712 4.22871,-2.0137 0.87257,-1.2081 1.30886,-2.7519 1.30888,-4.6314 m 4.3294,23.2075 c -3e-5,-2.9869 -3.33936,-4.4803 -10.01802,-4.4803 -0.43631,0 -1.05719,0.016 -1.86265,0.05 -0.90616,0 -1.52704,0 -1.86265,0 -1.27532,1.141 -2.11436,1.9633 -2.51708,2.4667 -0.83904,1.0404 -1.25855,2.0976 -1.25855,3.1716 0,1.7116 0.93971,2.987 2.81914,3.8259 1.40956,0.6042 3.08762,0.9062 5.03418,0.9062 2.41639,0 4.49719,-0.4028 6.24238,-1.2082 2.28215,-1.0405 3.42322,-2.6178 3.42325,-4.7322"
         sodipodi:nodetypes="cccscsccccccccscsccsccscsccccccscscccccscccscscc" />
      <path
         style="font-size:49.13095093px;font-style:normal;font-variant:normal;font-weight:normal;font-stretch:normal;text-align:start;line-height:125%;letter-spacing:-1.30589175px;word-spacing:0px;writing-mode:lr-tb;text-anchor:start;fill:#406e19;fill-opacity:1;stroke:none;font-family:LaudatioC;-inkscape-font-specification:LaudatioC"
         d="m 307.88524,1125.3238 -5.22732,0 0,20.4652 c 0,5.2692 2.6688,7.877 8.00504,7.877 4.12801,0 7.22976,-2.1774 8.9414,-6.3054 l 0.18113,6.0284 4.91034,-2e-4 0,-28.065 -5.22732,0 -0.22363,14.0612 c -2e-5,6.813 -2.22757,10.2145 -6.72475,10.2145 -3.32257,0 -4.99516,-1.8188 -4.99515,-5.4435 z"
         id="path3943"
         inkscape:connector-curvature="0"
         sodipodi:nodetypes="cccsccccccscc" />
      <g
         id="g3110">
        <path
           style="color:#000000;fill:#406e19;fill-opacity:1;fill-rule:nonzero;stroke:none;stroke-width:1;marker:none;visibility:visible;display:inline;overflow:visible;enable-background:accumulate"
           d="m 173.90835,1125.3237 5.22731,0 0,28.0651 -5.22731,0 z"
           id="rect3957"
           inkscape:connector-curvature="0"
           sodipodi:nodetypes="ccccc" />
        <path
           sodipodi:type="arc"
           style="color:#000000;fill:#406e19;fill-opacity:1;fill-rule:nonzero;stroke:none;stroke-width:1;marker:none;visibility:visible;display:inline;overflow:visible;enable-background:accumulate"
           id="path3959"
           sodipodi:cx="280.58078"
           sodipodi:cy="389.87177"
           sodipodi:rx="4.1842651"
           sodipodi:ry="4.1842651"
           d="m 284.76505,389.87177 c 0,2.3109 -1.87336,4.18426 -4.18427,4.18426 -2.31091,0 -4.18427,-1.87336 -4.18427,-4.18426 0,-2.31091 1.87336,-4.18427 4.18427,-4.18427 2.31091,0 4.18427,1.87336 4.18427,4.18427 z"
           transform="matrix(0.73991753,0,0,0.73991753,-31.084653,830.70863)" />
      </g>
      <path
         sodipodi:nodetypes="ccccccccc"
         inkscape:connector-curvature="0"
         id="path3970"
         d="m 231.71688,1125.8427 0,27.5398 5.21929,0 0,-14.7494 c 0,-7.4548 3.59995,-10.9743 8.38928,-8.5613 l 1.66505,-4.0666 c -5.09179,-1.7219 -7.91588,0.9657 -10.05433,5.0065 l 0.008,-6.5691 z"
         style="color:#000000;fill:#406e19;fill-opacity:1;fill-rule:nonzero;stroke:none;stroke-width:1;marker:none;visibility:visible;display:inline;overflow:visible;enable-background:accumulate" />
      <path
         style="font-size:49.13095093px;font-style:normal;font-variant:normal;font-weight:normal;font-stretch:normal;text-align:start;line-height:125%;letter-spacing:-1.30589175px;word-spacing:0px;writing-mode:lr-tb;text-anchor:start;fill:#406e19;fill-opacity:1;stroke:none;font-family:LaudatioC;-inkscape-font-specification:LaudatioC"
         d="m 341.03026,1124.8845 c -3.62462,0 -7.52513,1.0379 -11.88808,2.9844 l 1.40783,3.4253 c 2.65016,-1.7623 6.13188,-3.3543 9.42358,-3.3678 3.52388,-0.014 5.28333,2.1387 5.28333,6.468 l 0,1.4488 c -1.00685,-0.034 -1.91627,-0.032 -2.72171,-0.032 -9.6992,0 -14.53717,3.0786 -14.53716,9.2538 -10e-6,2.5172 0.76317,4.569 2.27343,6.18 1.51025,1.6109 3.50423,2.4335 5.98778,2.4335 2.11433,0 3.98948,-0.5865 5.66757,-1.7612 1.67804,-1.2081 2.68906,-2.7308 3.39387,-4.7444 l 0.18113,6.2159 4.91034,0 0,-19.6346 c -3e-5,-3.1212 -0.79368,-5.3804 -2.33747,-6.7564 -1.51028,-1.4095 -3.85614,-2.1133 -7.04444,-2.1133 z m 0.70444,13.7444 c 1.17463,0 2.34756,0.088 3.52222,0.2562 -0.0671,2.0808 -0.21337,3.6039 -0.44828,4.6109 -0.3692,1.5773 -1.07296,2.9574 -2.11333,4.0985 -1.3089,1.4432 -2.89314,2.1454 -4.73899,2.1454 -1.37602,0 -2.49107,-0.4402 -3.33009,-1.3128 -0.80549,-0.8726 -1.18476,-1.9861 -1.18475,-3.3621 -1e-5,-4.2958 2.75561,-6.4361 8.29322,-6.4361 z"
         id="path3983"
         inkscape:connector-curvature="0"
         sodipodi:nodetypes="sccsscssssccccccsssccscsss" />
    </g>
    <g
       id="g3133"
       transform="matrix(0.84046527,0,0,0.84046527,278.15638,-662.34978)">
      <path
         sodipodi:nodetypes="cccccccccccccc"
         inkscape:connector-curvature="0"
         id="path3061"
         d="m -87.395908,1117.4238 -8.023796,0 0,35.965 5.227316,0 3e-6,-29.1384 9.854177,29.1384 2.657674,0 12.543882,-31.1121 0,31.1121 5.227319,0 0,-35.965 -7.588787,0 -10.694736,27.6654 z"
         style="font-size:49.13095093px;font-style:normal;font-variant:normal;font-weight:normal;font-stretch:normal;text-align:start;line-height:125%;letter-spacing:-1.30589175px;word-spacing:0px;writing-mode:lr-tb;text-anchor:start;fill:#406e19;fill-opacity:1;stroke:none;font-family:LaudatioC;-inkscape-font-specification:LaudatioC" />
      <path
         sodipodi:nodetypes="sccsscssssccccccsssccscsss"
         inkscape:connector-curvature="0"
         id="path3063"
         d="m -43.574896,1124.8845 c -3.624621,0 -7.525128,1.0379 -11.888077,2.9844 l 1.40783,3.4253 c 2.650152,-1.7623 6.131878,-3.3543 9.423582,-3.3678 3.523878,-0.014 5.283328,2.1387 5.283328,6.468 l 0,1.4488 c -1.006854,-0.034 -1.916264,-0.032 -2.721715,-0.032 -9.699194,0 -14.537158,3.0786 -14.537156,9.2538 -2e-6,2.5172 0.763175,4.569 2.273432,6.18 1.510248,1.6109 3.504235,2.4335 5.987771,2.4335 2.114344,0 3.989495,-0.5865 5.66757,-1.7612 1.678042,-1.2081 2.689071,-2.7308 3.393875,-4.7444 l 0.181132,6.2159 4.910338,0 -1e-6,-19.6346 c -2.4e-5,-3.1212 -0.79368,-5.3804 -2.337472,-6.7564 -1.510275,-1.4095 -3.856141,-2.1133 -7.044437,-2.1133 z m 0.704444,13.7444 c 1.174625,0 2.347559,0.088 3.522219,0.2562 -0.06715,2.0808 -0.213374,3.6039 -0.448283,4.6109 -0.369192,1.5773 -1.072951,2.9574 -2.113331,4.0985 -1.308902,1.4432 -2.893133,2.1454 -4.738985,2.1454 -1.37602,0 -2.491077,-0.4402 -3.330097,-1.3128 -0.805477,-0.8726 -1.184754,-1.9861 -1.184747,-3.3621 -7e-6,-4.2958 2.755615,-6.4361 8.293224,-6.4361 z"
         style="font-size:49.13095093px;font-style:normal;font-variant:normal;font-weight:normal;font-stretch:normal;text-align:start;line-height:125%;letter-spacing:-1.30589175px;word-spacing:0px;writing-mode:lr-tb;text-anchor:start;fill:#406e19;fill-opacity:1;stroke:none;font-family:LaudatioC;-inkscape-font-specification:LaudatioC" />
      <path
         sodipodi:nodetypes="cccscsccccccccscsccsccscsccccccscscccccscccscscc"
         d="m 43.923522,1129.3758 c 0.805445,1.2082 1.208179,2.6849 1.208204,4.4301 -2.5e-5,2.9533 -0.939737,5.2187 -2.819141,6.7962 -1.845886,1.5437 -4.279071,2.3157 -7.299561,2.3157 -0.469872,0 -1.174656,-0.067 -2.114356,-0.2014 -0.906165,-0.1678 -1.594168,-0.2517 -2.064014,-0.2517 -0.469867,0 -1.12431,0.3523 -1.96333,1.0571 -0.839038,0.7048 -1.258553,1.2922 -1.258546,1.762 -7e-6,0.9062 0.855803,1.527 2.567432,1.8627 0.335602,0.068 1.560585,0.1845 3.674952,0.3523 l 5.03418,0.4027 c 2.986925,0.235 5.185182,0.772 6.594776,1.611 1.980084,1.1411 2.970138,3.0373 2.970167,5.6886 -2.9e-5,3.5575 -1.812331,6.2928 -5.436915,8.2058 -2.886284,1.5102 -6.292742,2.2654 -10.219386,2.2654 -2.651345,0 -4.950285,-0.4363 -6.896827,-1.3089 -2.584216,-1.1412 -3.87632,-2.8695 -3.876319,-5.1852 -10e-7,-1.611 0.738344,-3.0877 2.215039,-4.4301 0.906148,-0.8055 2.349278,-1.7285 4.329395,-2.7689 -3.859542,-0.5705 -5.78931,-2.1311 -5.789306,-4.6817 -4e-6,-1.4767 0.654439,-2.6849 1.96333,-3.6247 0.436291,-0.3019 1.728395,-0.9564 3.876318,-1.9633 -3.490369,-1.4095 -5.23555,-4.0944 -5.235547,-8.0546 -3e-6,-2.9534 1.057174,-5.2021 3.171533,-6.7459 1.879419,-1.3759 4.346165,-2.0639 7.400246,-2.0639 2.785563,0 5.453676,0.5873 8.004346,1.7619 2.483505,0 4.816007,-0.1678 6.997511,-0.5035 l 0,3.675 z m -4.178369,4.2287 c -2e-5,-1.8458 -0.419534,-3.3393 -1.258546,-4.4804 -0.93973,-1.2753 -2.315738,-1.913 -4.128028,-1.913 -1.845878,0 -3.272227,0.6544 -4.279053,1.9633 -0.906161,1.1746 -1.359236,2.7185 -1.359228,4.6315 -8e-6,1.8123 0.453067,3.3058 1.359228,4.4804 1.006826,1.3088 2.382833,1.9634 4.128028,1.9633 1.81229,10e-5 3.221859,-0.6712 4.228711,-2.0137 0.872573,-1.2081 1.308868,-2.7519 1.308888,-4.6314 m 4.329395,23.2075 c -2.4e-5,-2.9869 -3.33936,-4.4803 -10.018019,-4.4803 -0.436309,0 -1.057191,0.016 -1.862647,0.05 -0.906163,0 -1.527045,0 -1.862647,0 -1.275334,1.141 -2.114363,1.9633 -2.517089,2.4667 -0.839037,1.0404 -1.258552,2.0976 -1.258546,3.1716 -6e-6,1.7116 0.939707,2.987 2.819141,3.8259 1.409561,0.6042 3.087618,0.9062 5.03418,0.9062 2.416391,0 4.497183,-0.4028 6.242384,-1.2082 2.282139,-1.0405 3.423219,-2.6178 3.423243,-4.7322"
         style="font-size:49.13095093px;font-style:normal;font-variant:normal;font-weight:normal;font-stretch:normal;text-align:start;line-height:125%;letter-spacing:-1.30589175px;word-spacing:0px;writing-mode:lr-tb;text-anchor:start;fill:#406e19;fill-opacity:1;stroke:none;font-family:LaudatioC;-inkscape-font-specification:LaudatioC"
         id="path3069"
         inkscape:connector-curvature="0" />
      <path
         style="font-size:100.81187439px;font-style:normal;font-variant:normal;font-weight:normal;font-stretch:normal;text-align:start;line-height:125%;letter-spacing:-3.5px;word-spacing:0px;writing-mode:lr-tb;text-anchor:start;fill:#406e19;fill-opacity:1;stroke:none;font-family:LaudatioC;-inkscape-font-specification:LaudatioC"
         d="m -24.803639,1124.4426 -5.22732,1.4001 0,27.5461 5.22732,0 0,-12.4434 c -10e-6,-3.8378 0.231783,-6.6085 0.978985,-8.3067 1.188706,-2.5812 3.45981,-3.869 6.822199,-3.869 1.935892,0 3.293191,0.5397 4.074368,1.6266 0.645284,0.883 0.963299,2.3524 0.96332,4.3902 l 0,18.6023 5.2271917,-0.089 0,-17.8443 c -2.56e-5,-3.6681 -0.5004079,-6.1276 -1.2475761,-7.5541 -1.0868517,-2.0377 -3.3177216,-3.0479 -6.6800686,-3.0479 -2.547273,0 -4.596631,0.4703 -6.15893,1.4212 -1.562329,0.9511 -2.858708,2.5569 -3.979489,4.8325 z"
         id="path3082"
         inkscape:connector-curvature="0"
         sodipodi:nodetypes="ccccccsccccccsccc" />
      <path
         style="font-size:49.13095093px;font-style:normal;font-variant:normal;font-weight:normal;font-stretch:normal;text-align:start;line-height:125%;letter-spacing:-1.30589175px;word-spacing:0px;writing-mode:lr-tb;text-anchor:start;fill:#406e19;fill-opacity:1;stroke:none;font-family:LaudatioC;-inkscape-font-specification:LaudatioC"
         d="m 9.5968629,1124.8845 c -3.6246216,0 -7.525128,1.0379 -11.8880774,2.9844 l 1.40782999,3.4253 c 2.65015211,-1.7623 6.13187771,-3.3543 9.42358181,-3.3678 3.5238777,-0.014 5.2833267,2.1387 5.2833267,6.468 l 0,1.4488 c -1.006854,-0.034 -1.916263,-0.032 -2.721714,-0.032 -9.6991932,0 -14.5371579,3.0786 -14.5371558,9.2538 -2.1e-6,2.5172 0.7631754,4.569 2.273432,6.18 1.51024837,1.6109 3.504235,2.4335 5.9877715,2.4335 2.1143435,0 3.9894948,-0.5865 5.6675693,-1.7612 1.678042,-1.2081 2.689071,-2.7308 3.393874,-4.7444 l 0.181132,6.2159 4.910337,0 -1e-6,-19.6346 c -2.4e-5,-3.1212 -0.79368,-5.3804 -2.337472,-6.7564 -1.510275,-1.4095 -3.856139,-2.1133 -7.0444341,-2.1133 z m 0.7044441,13.7444 c 1.174623,0 2.347557,0.088 3.522217,0.2562 -0.06715,2.0808 -0.213374,3.6039 -0.448282,4.6109 -0.369192,1.5773 -1.072952,2.9574 -2.113332,4.0985 -1.3089009,1.4432 -2.8931318,2.1454 -4.7389833,2.1454 -1.3760199,0 -2.4910769,-0.4402 -3.3300976,-1.3128 -0.8054768,-0.8726 -1.1847534,-1.9861 -1.1847462,-3.3621 -7.2e-6,-4.2958 2.7556147,-6.4361 8.2932241,-6.4361 z"
         id="path3933"
         inkscape:connector-curvature="0"
         sodipodi:nodetypes="sccsscssssccccccsssccscsss" />
      <path
         sodipodi:nodetypes="sccsscssssccccccsssccscsss"
         inkscape:connector-curvature="0"
         id="path3987"
         d="m 90.632276,1124.8845 c -3.624621,0 -7.525129,1.0379 -11.888079,2.9844 l 1.407832,3.4253 c 2.650153,-1.7623 6.131878,-3.3543 9.423582,-3.3678 3.523878,-0.014 5.283327,2.1387 5.283327,6.468 l 0,1.4488 c -1.006857,-0.034 -1.916271,-0.032 -2.721714,-0.032 -9.699201,0 -14.537167,3.0786 -14.537157,9.2538 -10e-6,2.5172 0.763167,4.569 2.273432,6.18 1.510246,1.6109 3.504226,2.4335 5.987772,2.4335 2.114335,0 3.989488,-0.5865 5.66757,-1.7612 1.678041,-1.2081 2.689069,-2.7308 3.393871,-4.7444 l 0.181137,6.2159 4.910341,0 0,-19.6346 c -3e-5,-3.1212 -0.793684,-5.3804 -2.337477,-6.7564 -1.510276,-1.4095 -3.85614,-2.1133 -7.044437,-2.1133 z m 0.704444,13.7444 c 1.174623,0 2.347555,0.088 3.522218,0.2562 -0.06711,2.0808 -0.213372,3.6039 -0.448282,4.6109 -0.3692,1.5773 -1.072957,2.9574 -2.113331,4.0985 -1.308903,1.4432 -2.893138,2.1454 -4.738985,2.1454 -1.376027,0 -2.491077,-0.4402 -3.330098,-1.3128 -0.805484,-0.8726 -1.184756,-1.9861 -1.184746,-3.3621 -1e-5,-4.2958 2.75561,-6.4361 8.293224,-6.4361 z"
         style="font-size:49.13095093px;font-style:normal;font-variant:normal;font-weight:normal;font-stretch:normal;text-align:start;line-height:125%;letter-spacing:-1.30589175px;word-spacing:0px;writing-mode:lr-tb;text-anchor:start;fill:#406e19;fill-opacity:1;stroke:none;font-family:LaudatioC;-inkscape-font-specification:LaudatioC" />
      <path
         sodipodi:nodetypes="cccsccccccscc"
         inkscape:connector-curvature="0"
         id="path3070"
         d="m 57.487252,1125.3238 -5.22732,0 0,20.4652 c 0,5.2692 2.6688,7.877 8.00504,7.877 4.12801,0 7.22976,-2.1774 8.9414,-6.3054 l 0.18113,6.0284 4.91034,-2e-4 0,-28.065 -5.22732,0 -0.22363,14.0612 c -2e-5,6.813 -2.22757,10.2145 -6.72475,10.2145 -3.32257,0 -4.99516,-1.8188 -4.99515,-5.4435 z"
         style="font-size:49.13095093px;font-style:normal;font-variant:normal;font-weight:normal;font-stretch:normal;text-align:start;line-height:125%;letter-spacing:-1.30589175px;word-spacing:0px;writing-mode:lr-tb;text-anchor:start;fill:#406e19;fill-opacity:1;stroke:none;font-family:LaudatioC;-inkscape-font-specification:LaudatioC" />
    </g>
  </g>
</svg>
