<?xml version="1.0" encoding="UTF-8" standalone="no"?>
<!-- Created with Inkscape (http://www.inkscape.org/) -->

<svg
   xmlns:dc="http://purl.org/dc/elements/1.1/"
   xmlns:cc="http://creativecommons.org/ns#"
   xmlns:rdf="http://www.w3.org/1999/02/22-rdf-syntax-ns#"
   xmlns:svg="http://www.w3.org/2000/svg"
   xmlns="http://www.w3.org/2000/svg"
   version="1.1"
   width="577.96869"
   height="184.04317"
   id="svg3297">
  <defs
     id="defs3299" />
  <metadata
     id="metadata3302">
    <rdf:RDF>
      <cc:Work
         rdf:about="">
        <dc:format>image/svg+xml</dc:format>
        <dc:type
           rdf:resource="http://purl.org/dc/dcmitype/StillImage" />
        <dc:title></dc:title>
      </cc:Work>
    </rdf:RDF>
  </metadata>
  <g
     transform="translate(-65.30121,-448.88723)"
     id="layer1">
    <g
       transform="matrix(1.024699,0,0,1.024699,-8.7505073,-11.087076)"
       id="g3426">
      <path
         d="m 237.67621,453.86789 -28.40625,47.53121 -1.53125,-3.8437 -30.15625,38.7187 -14.3125,-7.9062 -20.28125,21.4062 -12.375,-30.7187 -65.3125,113.875 577.96871,0 -47.7187,-91.0938 -9.0313,22.4375 -14.81246,-15.625 -10.46875,5.7813 -22.03125,-28.3125 -24.28125,22.9687 -16,-38.9062 -56.90625,95.375 -101.6875,0 -77.46875,-129.8125 -6.03125,10.1562 z"
         id="path4413"
         style="fill:#999999;fill-opacity:1;stroke:none" />
      <path
         d="m 540.16852,537.6322 17.36408,29.0276 0.93759,-2.36279 20.36433,24.5273 -0.075,0.525 -28.35256,-21.4519 7.50067,26.8899 -29.19932,-31.1494 -4.23789,-10.46351 z"
         id="path4415"
         style="fill:#ffffff;fill-opacity:1;stroke:none" />
      <path
         d="m 562.35581,559.5958 6.29446,-3.3894 16.94665,15.49411 10.1679,-17.43081 14.0415,22.2727 -7.2628,0.9684 8.7154,21.7885 -17.915,-22.75689 -3.8735,12.10469 z"
         id="path4417"
         style="fill:#ffffff;stroke:none" />
      <path
         d="m 238.46497,469.1189 -23.76782,39.7328 -1.28336,-3.2341 -27.87458,33.5727 0.10267,0.7187 38.8088,-29.3633 -10.26687,36.80681 34.44537,-37.11481 -1.33469,26.18061 11.96091,-28.1826 21.41644,6.6083 -16.52049,-28.7756 -9.72138,9.847 z"
         id="path4419"
         style="fill:#ffffff;fill-opacity:1;stroke:none" />
      <path
         d="m 176.06496,543.3621 -8.61582,-4.6393 -23.19641,21.2082 -13.91785,-23.85919 -19.21987,30.48669 9.94131,1.3255 -11.92959,29.824 24.52192,-31.1495 5.30205,16.5689 z"
         id="path4421"
         style="fill:#ffffff;stroke:none" />
      <path
         d="m 277.68342,623.94231 26.73709,-92.8499 -0.51677,-1.4956 1.1458,-5.5143 0.0719,-3.9386 -0.71618,-0.573 -0.57286,-2.00511 -1.21742,-0.35809 -0.57295,-2.07671 -0.78771,-0.1433 -0.50124,-0.7162 -4.65493,-1.2174 0.0719,-0.57279 0.78771,-0.072 0,-0.71621 1.57543,-0.4297 4.15369,-2.3632 0.78771,-0.7162 13.39166,-21.4839 0.21486,-0.3581 0.64447,-9.3813 -0.64447,-0.5729 0.14323,-0.1433 0.50124,-0.1432 0.28648,-5.1562 0.358,0.1433 0,4.8697 0.7878,0.42971 0,0.35809 -0.85933,0.1432 0.21486,9.8826 9.38129,16.6143 1.86199,-0.1433 3.15095,-1.71859 19.90849,-3.0078 4.79807,-1.6472 0.21486,-1.2889 -3.15095,-1.3607 0,-0.3581 0.78772,-0.072 0,-0.5013 3.3658,-1.5038 2.00522,-1.36071 1.43228,-1.36059 3.29409,-6.0155 4.51169,-10.6705 1.21743,-1.647 0.85933,-13.17678 -0.57286,-0.2149 0,-0.5013 0.57286,-0.2865 -0.0719,-4.798 -1.5039,-0.072 -0.57286,0.4297 -0.21485,-0.1433 0.358,-0.5728 0,-1.0742 -0.64456,-0.7878 0.42971,-0.2865 0.57285,0.5013 1.43228,-0.072 0,-0.7877 0.35818,0.1433 0.14315,7.4477 0.7878,0.4297 0,0.2864 -0.28647,0.2865 -0.21485,0.072 0.21485,13.17678 1.71875,2.3632 6.94646,17.044 1.86198,2.3632 0.93087,-0.1432 1.79037,-2.2916 1.93352,-3.4375 3.07941,-7.4477 1.43219,-2.2201 0.85942,-1.2174 0.57286,-10.6704 -0.50115,-0.2865 0.21476,-0.4296 0.57295,0 0.21486,-6.23028 0.21485,0.1432 -0.14333,6.01548 0.42971,0.2149 0,0.4296 -0.42971,0.2148 0.21486,10.5272 1.00257,1.9335 1.1458,1.3607 4.58322,10.2407 2.43485,2.9361 3.07942,2.8646 -0.85934,2.4348 -0.14323,0.7161 -0.85942,0.4297 -0.21477,53.4235 23.84721,-18.1182 0,-0.7877 0.57286,-0.7161 1.00256,-0.1432 0,-1.4323 0.93104,-0.072 0,1.289 0.7161,-0.072 0.14315,-1.289 1.07427,0.072 0,1.8619 44.90144,17.5452 32.08272,26.6402 1.28913,47.1535 z"
         id="path4423"
         style="fill:#999999;stroke:none" />
      <path
         d="m 485.60586,544.3981 13.34267,-1.12439 12.57631,14.737 -12.73155,-34.90971 c -6.05128,5.65891 -8.71822,14.39331 -13.18743,21.2971 z"
         id="path4425"
         style="fill:#ffffff;stroke:none" />
    </g>
  </g>
</svg>
