<?xml version="1.0" encoding="UTF-8" standalone="no"?>
<!-- Created with Inkscape (http://www.inkscape.org/) -->

<svg
   xmlns:i="http://ns.adobe.com/AdobeIllustrator/10.0/"
   xmlns:dc="http://purl.org/dc/elements/1.1/"
   xmlns:cc="http://creativecommons.org/ns#"
   xmlns:rdf="http://www.w3.org/1999/02/22-rdf-syntax-ns#"
   xmlns:svg="http://www.w3.org/2000/svg"
   xmlns="http://www.w3.org/2000/svg"
   xmlns:xlink="http://www.w3.org/1999/xlink"
   xmlns:sodipodi="http://sodipodi.sourceforge.net/DTD/sodipodi-0.dtd"
   xmlns:inkscape="http://www.inkscape.org/namespaces/inkscape"
   width="612pt"
   height="792pt"
   id="svg2836"
   version="1.1"
   inkscape:version="0.48.3.1 r9886"
   sodipodi:docname="page-model.svg">
  <defs
     id="defs2838">
    <linearGradient
       id="linearGradient4318">
      <stop
         style="stop-color:#37528a;stop-opacity:1;"
         offset="0"
         id="stop4320" />
      <stop
         id="stop4328"
         offset="0.32394367"
         style="stop-color:#546a92;stop-opacity:0.48360655;" />
      <stop
         style="stop-color:#000000;stop-opacity:0;"
         offset="1"
         id="stop4322" />
    </linearGradient>
    <linearGradient
       id="linearGradient4272">
      <stop
         style="stop-color:#3d5a7a;stop-opacity:1;"
         offset="0"
         id="stop4274" />
      <stop
         id="stop4280"
         offset="0.28169015"
         style="stop-color:#3d5a7a;stop-opacity:0.95833325;" />
      <stop
         style="stop-color:#3d5a7a;stop-opacity:0;"
         offset="1"
         id="stop4276" />
    </linearGradient>
    <inkscape:perspective
       sodipodi:type="inkscape:persp3d"
       inkscape:vp_x="0 : 495 : 1"
       inkscape:vp_y="0 : 1000 : 0"
       inkscape:vp_z="765 : 495 : 1"
       inkscape:persp3d-origin="382.5 : 330 : 1"
       id="perspective2845" />
    <inkscape:perspective
       id="perspective2855"
       inkscape:persp3d-origin="0.5 : 0.33333333 : 1"
       inkscape:vp_z="1 : 0.5 : 1"
       inkscape:vp_y="0 : 1000 : 0"
       inkscape:vp_x="0 : 0.5 : 1"
       sodipodi:type="inkscape:persp3d" />
    <inkscape:perspective
       id="perspective2955"
       inkscape:persp3d-origin="0.5 : 0.33333333 : 1"
       inkscape:vp_z="1 : 0.5 : 1"
       inkscape:vp_y="0 : 1000 : 0"
       inkscape:vp_x="0 : 0.5 : 1"
       sodipodi:type="inkscape:persp3d" />
    <linearGradient
       inkscape:collect="always"
       xlink:href="#linearGradient4272"
       id="linearGradient4278"
       x1="2.9958073e-08"
       y1="601.07483"
       x2="767.763"
       y2="601.07483"
       gradientUnits="userSpaceOnUse"
       gradientTransform="matrix(1,0,0,1.6035339,-983.12161,-586.932)" />
    <inkscape:perspective
       id="perspective4290"
       inkscape:persp3d-origin="0.5 : 0.33333333 : 1"
       inkscape:vp_z="1 : 0.5 : 1"
       inkscape:vp_y="0 : 1000 : 0"
       inkscape:vp_x="0 : 0.5 : 1"
       sodipodi:type="inkscape:persp3d" />
    <inkscape:perspective
       id="perspective4304"
       inkscape:persp3d-origin="0.5 : 0.33333333 : 1"
       inkscape:vp_z="1 : 0.5 : 1"
       inkscape:vp_y="0 : 1000 : 0"
       inkscape:vp_x="0 : 0.5 : 1"
       sodipodi:type="inkscape:persp3d" />
    <linearGradient
       inkscape:collect="always"
       xlink:href="#linearGradient3769"
       id="linearGradient4324"
       x1="15.216037"
       y1="650.14093"
       x2="762.78394"
       y2="650.14093"
       gradientUnits="userSpaceOnUse"
       gradientTransform="matrix(0.1050252,0,0,1.086508,-967.68042,-324.38336)" />
    <inkscape:perspective
       id="perspective9710"
       inkscape:persp3d-origin="0.5 : 0.33333333 : 1"
       inkscape:vp_z="1 : 0.5 : 1"
       inkscape:vp_y="0 : 1000 : 0"
       inkscape:vp_x="0 : 0.5 : 1"
       sodipodi:type="inkscape:persp3d" />
    <inkscape:perspective
       id="perspective9765"
       inkscape:persp3d-origin="0.5 : 0.33333333 : 1"
       inkscape:vp_z="1 : 0.5 : 1"
       inkscape:vp_y="0 : 1000 : 0"
       inkscape:vp_x="0 : 0.5 : 1"
       sodipodi:type="inkscape:persp3d" />
    <linearGradient
       inkscape:collect="always"
       xlink:href="#linearGradient3769"
       id="linearGradient4324-9"
       x1="15.216037"
       y1="650.14093"
       x2="762.78394"
       y2="650.14093"
       gradientUnits="userSpaceOnUse"
       gradientTransform="matrix(0.92070911,0,0,1.086508,-980.73131,-324.3833)" />
    <linearGradient
       id="linearGradient3769">
      <stop
         id="stop3771"
         offset="0"
         style="stop-color:#d52b1e;stop-opacity:1;" />
      <stop
         style="stop-color:#d52b1e;stop-opacity:0.49803922;"
         offset="0.32394367"
         id="stop3773" />
      <stop
         id="stop3775"
         offset="1"
         style="stop-color:#000000;stop-opacity:0;" />
    </linearGradient>
    <linearGradient
       y2="650.14093"
       x2="762.78394"
       y1="650.14093"
       x1="15.216037"
       gradientTransform="matrix(0.92070911,0,0,1.086508,-1331.7658,-1086.9951)"
       gradientUnits="userSpaceOnUse"
       id="linearGradient9775"
       xlink:href="#linearGradient3769"
       inkscape:collect="always" />
    <linearGradient
       id="linearGradient3217">
      <stop
         style="stop-color:#caa451;stop-opacity:1;"
         offset="0"
         id="stop3219" />
      <stop
         style="stop-color:#fcfcfc;stop-opacity:1;"
         offset="1"
         id="stop3221" />
    </linearGradient>
    <linearGradient
       id="linearGradient3201">
      <stop
         style="stop-color:#fcdb9e;stop-opacity:1;"
         offset="0"
         id="stop3203" />
      <stop
         style="stop-color:#ffffff;stop-opacity:0;"
         offset="1"
         id="stop3205" />
    </linearGradient>
    <linearGradient
       id="linearGradient3905">
      <stop
         style="stop-color:#a6d9f6;stop-opacity:1;"
         offset="0"
         id="stop3907" />
      <stop
         style="stop-color:#a6d9f6;stop-opacity:0;"
         offset="1"
         id="stop3909" />
    </linearGradient>
    <linearGradient
       id="linearGradient3887">
      <stop
         style="stop-color:#96feff;stop-opacity:1;"
         offset="0"
         id="stop3889" />
      <stop
         id="stop3895"
         offset="0.5"
         style="stop-color:#ffffff;stop-opacity:1;" />
      <stop
         style="stop-color:#ffffff;stop-opacity:1;"
         offset="1"
         id="stop3891" />
    </linearGradient>
    <linearGradient
       id="linearGradient3809">
      <stop
         style="stop-color:#74c5f0;stop-opacity:1;"
         offset="0"
         id="stop3811" />
      <stop
         style="stop-color:#007cc4;stop-opacity:1"
         offset="1"
         id="stop3813" />
    </linearGradient>
    <linearGradient
       inkscape:collect="always"
       xlink:href="#linearGradient3905"
       id="linearGradient3924"
       gradientUnits="userSpaceOnUse"
       gradientTransform="matrix(1.0044578,0,0,1,-104.42416,-154.22857)"
       x1="411.28906"
       y1="265.88187"
       x2="411.28906"
       y2="412.47937" />
    <linearGradient
       inkscape:collect="always"
       xlink:href="#linearGradient3809"
       id="linearGradient3926"
       gradientUnits="userSpaceOnUse"
       gradientTransform="matrix(1.6751492,-0.2173479,0.21750849,1.6739124,-543.4412,-374.65558)"
       x1="411.16125"
       y1="493.25742"
       x2="405.30252"
       y2="538.37854" />
    <clipPath
       clipPathUnits="userSpaceOnUse"
       id="clipPath3937">
      <path
         style="color:#000000;fill:#d45500;fill-opacity:1;fill-rule:nonzero;stroke:none;stroke-width:1px;marker:none;visibility:visible;display:inline;overflow:visible;enable-background:accumulate"
         d="m -119.10781,114.71487 727.18004,0 c 19.68764,0 35.53729,18.06119 35.53729,40.49594 l 0,339.85506 c -196.85039,0 -627.530833,0 -798.2546,0 l 0,-339.85506 c 0,-22.43475 15.84962,-40.49594 35.53727,-40.49594 z"
         id="path3939"
         inkscape:connector-curvature="0"
         sodipodi:nodetypes="sssccss" />
    </clipPath>
  </defs>
  <sodipodi:namedview
     inkscape:document-units="in"
     pagecolor="#ffffff"
     bordercolor="#666666"
     borderopacity="1.0"
     inkscape:pageopacity="0.0"
     inkscape:pageshadow="2"
     inkscape:zoom="0.55656566"
     inkscape:cx="382.5"
     inkscape:cy="495"
     inkscape:current-layer="layer1"
     id="namedview2840"
     showgrid="false"
     inkscape:window-width="1022"
     inkscape:window-height="766"
     inkscape:window-x="0"
     inkscape:window-y="0"
     inkscape:window-maximized="0"
     showguides="true"
     inkscape:guide-bbox="true">
    <sodipodi:guide
       orientation="1,0"
       position="16,391"
       id="guide4314" />
    <sodipodi:guide
       orientation="1,0"
       position="748,312"
       id="guide4316" />
    <sodipodi:guide
       orientation="0,1"
       position="151,24"
       id="guide4326" />
    <sodipodi:guide
       orientation="0,1"
       position="363.84701,83.25313"
       id="guide4484" />
    <sodipodi:guide
       orientation="0,1"
       position="695.75196,860.69316"
       id="guide4496" />
    <sodipodi:guide
       orientation="0,1"
       position="839.06557,874.77049"
       id="guide4498" />
    <sodipodi:guide
       orientation="0,1"
       position="73.032787,752.15512"
       id="guide4500" />
    <sodipodi:guide
       orientation="1,0"
       position="73.032787,634.57377"
       id="guide4510" />
    <sodipodi:guide
       orientation="1,0"
       position="705.98361,295.37705"
       id="guide4577" />
    <sodipodi:guide
       orientation="1,0"
       position="45.070142,940.67826"
       id="guide4587" />
  </sodipodi:namedview>
  <metadata
     id="metadata2842">
    <rdf:RDF>
      <cc:Work
         rdf:about="">
        <dc:format>image/svg+xml</dc:format>
        <dc:type
           rdf:resource="http://purl.org/dc/dcmitype/StillImage" />
        <dc:title></dc:title>
      </cc:Work>
    </rdf:RDF>
  </metadata>
  <g
     inkscape:label="Layer 1"
     inkscape:groupmode="layer"
     id="layer1">
    <rect
       style="fill:url(#linearGradient4324);fill-opacity:1.0;stroke:none"
       id="rect4312"
       width="78.348816"
       height="732.00006"
       x="-966"
       y="15.999939"
       transform="matrix(0,-1,1,0,0,0)"
       inkscape:export-filename="/home/luca/src/Debian/DebConf/debconf-data/dc13/sponsorship-brochure/text4490_75.png"
       inkscape:export-xdpi="75"
       inkscape:export-ydpi="75" />
    <text
       xml:space="preserve"
       style="font-size:60px;font-style:normal;font-weight:normal;text-align:center;text-anchor:middle;fill:#d52b1e;fill-opacity:1;stroke:none;font-family:Bitstream Vera Sans"
       x="174.63264"
       y="115.22951"
       id="text2961"><tspan
         sodipodi:role="line"
         x="174.63264"
         y="115.22951"
         id="tspan2965"
         style="font-size:48px;font-weight:bold;fill:#d52b1e;fill-opacity:1;stroke:none;-inkscape-font-specification:Bitstream Vera Sans Bold">Main title</tspan></text>
    <text
       xml:space="preserve"
       style="font-size:40px;font-style:normal;font-weight:normal;fill:#000000;fill-opacity:1;stroke:none;font-family:Bitstream Vera Sans"
       x="73.032784"
       y="925.62433"
       id="text4486"
       inkscape:export-filename="/home/luca/src/Debian/DebConf/debconf-data/dc13/sponsorship-brochure/text4490_75.png"
       inkscape:export-xdpi="75"
       inkscape:export-ydpi="75"><tspan
         sodipodi:role="line"
         id="tspan4488"
         x="73.032784"
         y="925.62433"
         style="font-size:14px">DebConf13 | Vaumarcus, Switzerland - August 5-18, 2013</tspan></text>
    <text
       xml:space="preserve"
       style="font-size:40px;font-style:normal;font-weight:normal;fill:#fcfcfc;fill-opacity:0.90376575;stroke:none;font-family:Bitstream Vera Sans"
       x="333.79694"
       y="955.89978"
       id="text4490"
       inkscape:export-xdpi="75"
       inkscape:export-ydpi="75"><tspan
         sodipodi:role="line"
         id="tspan4492"
         x="333.79694"
         y="955.89978"
         style="font-size:18px;font-weight:bold;fill:#fcfcfc;fill-opacity:0.90376575;-inkscape-font-specification:Bitstream Vera Sans Bold">debconf.org | sponsors@debconf.org</tspan></text>
    <text
       id="text4502"
       y="238.57378"
       x="103.93733"
       style="font-size:22px;font-style:normal;font-weight:normal;text-align:center;text-anchor:middle;fill:#d52b1e;fill-opacity:1;stroke:none;font-family:Bitstream Vera Sans"
       xml:space="preserve"><tspan
         style="font-size:22px;font-weight:bold;fill:#d52b1e;fill-opacity:1;stroke:none;-inkscape-font-specification:Bitstream Vera Sans Bold"
         id="tspan4504"
         y="238.57378"
         x="103.93733"
         sodipodi:role="line">SUBTITLE</tspan></text>
    <rect
       style="fill:#ffffff;fill-opacity:0.71193417;stroke:none"
       id="rect4516"
       width="632.95081"
       height="245.06558"
       x="73.032784"
       y="277.5246" />
    <flowRoot
       xml:space="preserve"
       style="font-size:40px;font-style:normal;font-weight:normal;fill:#000000;fill-opacity:1;stroke:none;font-family:Bitstream Vera Sans"
       id="flowRoot4526"
       transform="translate(0,-12)"><flowRegion
         id="flowRegion4528"><use
           x="0"
           y="0"
           xlink:href="#rect4516"
           id="use4530"
           width="765"
           height="990" /></flowRegion><flowPara
         id="flowPara4532"
         style="font-size:18px">Lorem ipsum dolor sit amet, consectetur adipiscing elit. Donec eu diam mi. Duis lacinia tortor non elit tempus molestie sit amet et ligula. Morbi nec leo enim. Nam tincidunt ipsum nec dui aliquam ut blandit justo interdum. Suspendisse placerat, est id luctus auctor, mauris ante commodo purus, posuere iaculis neque ipsum in mauris. Cum sociis natoque penatibus et magnis dis parturient montes, nascetur ridiculus mus. Curabitur posuere congue nisl ac interdum. Quisque quis lacus augue. Curabitur ut nisl orci. Nam enim lorem, imperdiet non luctus non, varius eget tellus.</flowPara></flowRoot>    <rect
       y="599.21313"
       x="73.032784"
       height="246.68854"
       width="632.95081"
       id="rect4542"
       style="fill:#ffffff;fill-opacity:0.71193417;stroke:none" />
    <text
       xml:space="preserve"
       style="font-size:22px;font-style:normal;font-weight:normal;text-align:center;text-anchor:middle;fill:#d52b1e;fill-opacity:1;stroke:none;font-family:Bitstream Vera Sans"
       x="103.93733"
       y="556.02826"
       id="text4552"><tspan
         sodipodi:role="line"
         x="103.93733"
         y="556.02826"
         id="tspan4554"
         style="font-size:22px;font-weight:bold;fill:#d52b1e;fill-opacity:1;stroke:none;-inkscape-font-specification:Bitstream Vera Sans Bold">SUBTITLE</tspan></text>
    <flowRoot
       xml:space="preserve"
       style="font-size:40px;font-style:normal;font-weight:normal;fill:#000000;fill-opacity:1;stroke:none;font-family:Bitstream Vera Sans"
       id="flowRoot4579"><flowRegion
         id="flowRegion4581"><use
           x="0"
           y="0"
           xlink:href="#rect4542"
           id="use4583" /></flowRegion><flowPara
         id="flowPara4585"
         style="font-size:18px">Lorem ipsum dolor sit amet, consectetur adipiscing elit. Donec eu diam mi. Duis lacinia tortor non elit tempus molestie sit amet et ligula. Morbi nec leo enim. Nam tincidunt ipsum nec dui aliquam ut blandit justo interdum. Suspendisse placerat, est id luctus auctor, mauris ante commodo purus, posuere iaculis neque ipsum in mauris. Cum sociis natoque penatibus et magnis dis parturient montes, nascetur ridiculus mus. Curabitur posuere congue nisl ac interdum. Quisque quis lacus augue. Curabitur ut nisl orci. Nam enim lorem, imperdiet non luctus non, varius eget tellus. Cum sociis natoque penatibus et magnis dis parturient montes, nascetur ridiculus mus. Donec suscipit sapien eget lorem porttitor volutpat. Suspendisse pulvinar, mi ac molestie rutrum, turpis risus condimentum magna, sed luctus lectus sapien eu neque. Donec ut bibendum enim. Donec luctus condimentum felis id interdum.  Donec felis sem, eleifend at varius non, porttitor nec ligula. </flowPara></flowRoot>    <g
       transform="matrix(0.28160021,0,0,0.28160021,405.20527,-65.881102)"
       id="layer1-7"
       inkscape:label="Layer 1">
      <g
         id="g3591">
        <path
           style="fill:#000000;fill-opacity:1;stroke:none"
           d="m 662.51009,376.88352 -28.40625,47.53121 -1.53125,-3.8437 -30.15625,38.7187 -14.3125,-7.9062 -20.28125,21.4062 -12.375,-30.7187 -65.3125,113.875 577.96871,0 -47.7187,-91.0938 -9.0313,22.4375 -14.81246,-15.625 -10.46875,5.7813 -22.03125,-28.3125 -24.28125,22.9687 -16,-38.9062 -56.90625,95.375 -101.6875,0 -77.46875,-129.8125 -6.03125,10.1562 z"
           id="path6213-8"
           inkscape:connector-curvature="0"
           sodipodi:nodetypes="ccccccccccccccccccccc" />
        <path
           style="fill:#ffffff;fill-opacity:1;stroke:none"
           d="m 965.0024,460.64783 17.36408,29.0276 0.93759,-2.3628 20.36433,24.5273 -0.075,0.525 -28.35256,-21.4519 7.50067,26.8899 -29.19932,-31.1494 -4.23789,-10.4635 z"
           id="path6215-0"
           inkscape:connector-curvature="0"
           sodipodi:nodetypes="cccccccccc" />
        <path
           style="fill:#ffffff;stroke:none"
           d="m 987.18969,482.61143 6.29446,-3.3894 16.94665,15.4941 10.1679,-17.4308 14.0415,22.2727 -7.2628,0.9684 8.7154,21.7885 -17.915,-22.7569 -3.8735,12.1047 z"
           id="path6217-0"
           inkscape:connector-curvature="0" />
        <path
           sodipodi:nodetypes="cccccccccccccc"
           inkscape:connector-curvature="0"
           id="path5953-9-8"
           d="m 663.29885,392.13453 -23.76782,39.7328 -1.28336,-3.2341 -27.87458,33.5727 0.10267,0.7187 38.8088,-29.3633 -10.26687,36.8068 34.44537,-37.1148 -1.33469,26.1806 11.96091,-28.1826 21.41644,6.6083 -16.52049,-28.7756 -9.72138,9.847 z"
           style="fill:#ffffff;fill-opacity:1;stroke:none" />
        <path
           inkscape:connector-curvature="0"
           id="path5955-0-8"
           d="m 600.89884,466.37773 -8.61582,-4.6393 -23.19641,21.2082 -13.91785,-23.8592 -19.21987,30.4867 9.94131,1.3255 -11.92959,29.824 24.52192,-31.1495 5.30205,16.5689 z"
           style="fill:#ffffff;stroke:none" />
        <path
           style="fill:#000000;stroke:none"
           d="m 702.5173,546.95793 26.73709,-92.8499 -0.51677,-1.4956 1.1458,-5.5143 0.0719,-3.9386 -0.71618,-0.573 -0.57286,-2.0051 -1.21742,-0.3581 -0.57295,-2.0767 -0.78771,-0.1433 -0.50124,-0.7162 -4.65493,-1.2174 0.0719,-0.5728 0.78771,-0.072 0,-0.7162 1.57543,-0.4297 4.15369,-2.3632 0.78771,-0.7162 13.39166,-21.4839 0.21486,-0.3581 0.64447,-9.3813 -0.64447,-0.5729 0.14323,-0.1433 0.50124,-0.1432 0.28648,-5.1562 0.358,0.1433 0,4.8697 0.7878,0.4297 0,0.3581 -0.85933,0.1432 0.21486,9.8826 9.38129,16.6143 1.86199,-0.1433 3.15095,-1.7186 19.90849,-3.0078 4.79807,-1.6472 0.21486,-1.2889 -3.15095,-1.3607 0,-0.3581 0.78772,-0.072 0,-0.5013 3.3658,-1.5038 2.00522,-1.3607 1.43228,-1.3606 3.29409,-6.0155 4.51169,-10.6705 1.21743,-1.647 0.85933,-13.17678 -0.57286,-0.2149 0,-0.5013 0.57286,-0.2865 -0.0719,-4.798 -1.5039,-0.072 -0.57286,0.4297 -0.21485,-0.1433 0.358,-0.5728 0,-1.0742 -0.64456,-0.7878 0.42971,-0.2865 0.57285,0.5013 1.43228,-0.072 0,-0.7877 0.35818,0.1433 0.14315,7.4477 0.7878,0.4297 0,0.2864 -0.28647,0.2865 -0.21485,0.072 0.21485,13.17678 1.71875,2.3632 6.94646,17.044 1.86198,2.3632 0.93087,-0.1432 1.79037,-2.2916 1.93352,-3.4375 3.07941,-7.4477 1.43219,-2.2201 0.85942,-1.2174 0.57286,-10.6704 -0.50115,-0.2865 0.21476,-0.4296 0.57295,0 0.21486,-6.23028 0.21485,0.1432 -0.14333,6.01548 0.42971,0.2149 0,0.4296 -0.42971,0.2148 0.21486,10.5272 1.00257,1.9335 1.1458,1.3607 4.58322,10.2407 2.43485,2.9361 3.07942,2.8646 -0.85934,2.4348 -0.14323,0.7161 -0.85942,0.4297 -0.21477,53.4235 23.84721,-18.1182 0,-0.7877 0.57286,-0.7161 1.00256,-0.1432 0,-1.4323 0.93104,-0.072 0,1.289 0.7161,-0.072 0.14315,-1.289 1.07427,0.072 0,1.8619 44.90144,17.5452 32.08272,26.6402 1.28913,47.1535 z"
           id="path5534-7-8-1"
           inkscape:connector-curvature="0"
           sodipodi:nodetypes="ccccccccccccccccccccccccccccccccccccccccccccccccccccccccccccccccccccccccccccccccccccccccccccccccccccccccccccccccc" />
        <path
           style="fill:#ffffff;stroke:none"
           d="m 910.43974,467.41373 13.34267,-1.1244 12.57631,14.737 -12.73155,-34.9097 c -6.05128,5.6589 -8.71822,14.3933 -13.18743,21.2971 z"
           id="path6227-7"
           inkscape:connector-curvature="0"
           sodipodi:nodetypes="ccccc" />
        <path
           d="m 747.28277,655.70805 c 0.0363,-0.29097 0.0545,-0.77294 0.0546,-1.44593 -3e-5,-0.67291 -0.16372,-1.25491 -0.49107,-1.74602 -3e-5,-0.18184 0.26369,-0.34553 0.79116,-0.49107 0.52742,-0.16365 1.06396,-0.2455 1.60962,-0.24554 1.61868,4e-5 2.83726,0.51839 3.65574,1.55506 0.8366,1.01855 1.25492,2.2826 1.25495,3.79214 -3e-5,1.49143 -0.60932,3.80128 -1.82786,6.92954 -1.20043,3.11013 -3.0283,7.49337 -5.48361,13.14975 -2.43719,5.63821 -4.51059,10.8399 -6.22022,15.60509 -0.67297,0.0727 -1.40048,0.10913 -2.18253,0.10913 -2.23711,0 -3.64666,-0.39104 -4.22865,-1.17311 -0.3274,-0.4547 -1.76423,-4.32868 -4.3105,-11.62198 -4.80157,-13.74992 -8.05718,-21.16142 -9.76682,-22.23453 -0.40014,-0.21822 -0.78208,-0.33644 -1.14583,-0.35466 -0.36376,-0.0363 -0.67295,-0.0636 -0.92758,-0.0819 -0.23644,-0.0181 -0.38194,-0.0272 -0.4365,-0.0273 -0.36376,-0.90935 -0.50017,-1.67324 -0.40923,-2.29166 2.76454,-1.54592 5.83827,-2.3189 9.22119,-2.31894 0.52744,4e-5 0.91848,0.009 1.17311,0.0273 0.60019,0.61842 2.04611,4.18322 4.33778,10.6944 2.30983,6.49305 4.71971,13.74996 7.22964,21.77074 5.21986,-17.91491 7.92073,-27.78176 8.10264,-29.60057"
           style="font-size:55.87278748px;font-style:normal;font-variant:normal;font-weight:normal;font-stretch:normal;line-height:125%;letter-spacing:0px;word-spacing:0px;fill:#000000;fill-opacity:1;stroke:none;font-family:Marko One;-inkscape-font-specification:Marko One"
           id="path3471"
           inkscape:connector-curvature="0" />
        <path
           d="m 784.57677,676.60578 -0.16369,9.16663 c -3e-5,0.0909 -3e-5,0.18188 0,0.27282 -3e-5,1.00033 0.47285,1.50049 1.41864,1.50049 0.72748,0 1.50046,-0.23644 2.31894,-0.70933 0.2546,0.21826 0.49104,0.52745 0.70933,0.92758 0.2364,0.38195 0.37281,0.68204 0.40922,0.90029 -2.25531,2.87367 -4.60153,4.3105 -7.03866,4.3105 -2.419,0 -4.11046,-1.1913 -5.07439,-3.57389 -1.67329,1.16401 -3.38294,2.04612 -5.12894,2.64632 -1.72785,0.61838 -3.21925,0.92757 -4.47419,0.92757 -1.23678,0 -2.3917,-0.13641 -3.46477,-0.40922 -1.0549,-0.27282 -2.03703,-0.70933 -2.94642,-1.30952 -1.96428,-1.27314 -2.94641,-3.37383 -2.94641,-6.30206 0,-1.56414 0.42741,-2.92822 1.28224,-4.09224 0.873,-1.1822 2.05521,-2.10977 3.54661,-2.78273 2.85546,-1.29132 6.26567,-1.99155 10.23061,-2.10069 l 3.16467,-0.10912 c 0.12729,-1.47319 0.19095,-2.63721 0.19097,-3.49205 -2e-5,-1.92788 -0.37287,-3.3829 -1.11855,-4.36506 -0.72753,-0.98212 -2.09161,-1.47319 -4.09224,-1.47321 -1.20041,2e-5 -2.13708,0.41834 -2.81001,1.25495 -0.65477,0.83666 -0.98215,2.07343 -0.98214,3.7103 -10e-6,0.21828 -0.3092,0.482 -0.92757,0.79117 -1.03672,0.49109 -2.07342,0.73662 -3.11011,0.73661 -1.01852,10e-6 -1.83697,-0.29099 -2.45535,-0.87302 -0.6002,-0.58198 -0.9003,-1.40043 -0.90029,-2.45534 -1e-5,-1.05487 0.38194,-2.0461 1.14583,-2.9737 0.76388,-0.92755 1.78239,-1.64597 3.05554,-2.15525 2.52809,-1.0003 5.41084,-1.50046 8.64828,-1.50049 3.3829,3e-5 5.85643,0.53657 7.4206,1.60962 1.41862,0.94579 2.42804,2.30077 3.02827,4.06496 0.70929,2.05524 1.06395,4.67427 1.06398,7.85711 m -8.15721,9.93052 c -0.23646,-1.3277 -0.35468,-2.47353 -0.35466,-3.43749 -2e-5,-0.98213 0.0273,-2.34621 0.0818,-4.09225 l -3.79214,0.16369 c -1.94611,2e-5 -3.4466,0.4729 -4.50147,1.41865 -1.0549,0.94577 -1.58235,2.12798 -1.58234,3.54661 -10e-6,1.41865 0.30918,2.43717 0.92758,3.05554 0.61837,0.61839 1.86423,0.92758 3.73758,0.92758 1.89151,0 3.71938,-0.52744 5.48361,-1.58233"
           style="font-size:55.87278748px;font-style:normal;font-variant:normal;font-weight:normal;font-stretch:normal;line-height:125%;letter-spacing:0px;word-spacing:0px;fill:#000000;fill-opacity:1;stroke:none;font-family:Marko One;-inkscape-font-specification:Marko One"
           id="path3473"
           inkscape:connector-curvature="0" />
        <path
           d="m 794.42544,667.24818 c -1.20039,2e-5 -1.80059,-0.51833 -1.80058,-1.55505 -10e-6,-0.29098 0.0182,-0.50923 0.0546,-0.65476 0.63657,-0.45467 2.19162,-0.89118 4.66516,-1.30952 2.47352,-0.43648 4.47418,-0.65473 6.00196,-0.65476 0.56381,1.83699 0.84572,3.9013 0.84573,6.19293 -10e-6,2.29168 -0.11823,4.91071 -0.35466,7.85711 -0.21827,2.92824 -0.32739,4.99255 -0.32738,6.19293 -10e-6,1.2004 0.18186,2.17345 0.54563,2.91914 0.36374,0.72751 1.10944,1.09127 2.23709,1.09126 1.14582,10e-6 2.31893,-0.27281 3.51934,-0.81845 1.21856,-0.56381 2.76451,-1.59142 4.63787,-3.08282 -2e-5,-5.60182 0.0182,-12.25853 0.0546,-19.97016 2.09156,-0.32735 3.77393,-0.49104 5.0471,-0.49107 1.2913,3e-5 2.40985,0.16372 3.35564,0.49107 -0.27285,3.98315 -0.40926,7.81166 -0.40922,11.48557 -4e-5,3.65575 0.1,7.46608 0.30009,11.43101 0.0364,0.6002 0.15457,1.06398 0.35467,1.39136 0.20003,0.32738 0.71838,0.51835 1.55505,0.57291 0.85479,0.0546 1.44589,0.14551 1.7733,0.27282 0.0727,0.38195 0.1091,1.00033 0.10913,1.85515 -1.58237,0.8912 -3.1738,1.52777 -4.77428,1.90971 -1.60056,0.40013 -2.95554,0.6002 -4.06497,0.6002 -1.10948,0 -1.87336,-0.40922 -2.29166,-1.22767 -0.40015,-0.81845 -0.71844,-2.45535 -0.95485,-4.9107 -4.43783,4.09225 -8.67558,6.13837 -12.71324,6.13837 -4.03769,0 -6.05653,-3.20104 -6.05653,-9.60313 l 0.46379,-14.43199 c -10e-6,-0.61836 -0.19098,-1.05486 -0.57291,-1.30952 -0.36376,-0.2546 -0.76389,-0.38192 -1.2004,-0.38194"
           style="font-size:55.87278748px;font-style:normal;font-variant:normal;font-weight:normal;font-stretch:normal;line-height:125%;letter-spacing:0px;word-spacing:0px;fill:#000000;fill-opacity:1;stroke:none;font-family:Marko One;-inkscape-font-specification:Marko One"
           id="path3475"
           inkscape:connector-curvature="0" />
        <path
           d="m 853.79028,677.94258 0.0273,-1.66418 c -3e-5,-3.00096 -0.27285,-5.01071 -0.81845,-6.02924 -0.52747,-1.01849 -1.5278,-1.52775 -3.00098,-1.52777 -0.89122,2e-5 -1.86427,0.3274 -2.91914,0.98214 -1.0549,0.63659 -2.42808,1.6642 -4.11952,3.08282 0.0182,1.10947 0.0273,3.71941 0.0273,7.82983 -2e-5,4.09225 -0.009,7.89349 -0.0273,11.40372 -1.90973,0.38195 -3.56482,0.57292 -4.96526,0.57292 -1.40047,0 -2.55539,-0.17279 -3.46477,-0.51835 0.23644,-4.12862 0.35466,-7.87529 0.35466,-11.24004 0,-3.3829 -0.0637,-6.92042 -0.19097,-10.61255 -10e-6,-1.38225 -0.50926,-2.18251 -1.52777,-2.40079 -0.61839,-0.20004 -1.4914,-0.34554 -2.61904,-0.4365 -0.0182,-0.1091 -0.0455,-0.23642 -0.0818,-0.38195 -0.0182,-0.16366 -0.0364,-0.29097 -0.0546,-0.38194 -0.0364,-0.2546 -0.0546,-0.47285 -0.0546,-0.65476 0,-0.18185 0.009,-0.34554 0.0273,-0.49107 2.70997,-1.56412 5.97467,-2.34619 9.79411,-2.34622 0.34555,3e-5 0.84572,0.0182 1.50049,0.0546 0.4183,0.65478 0.70021,1.61873 0.84573,2.89185 0.14549,1.25498 0.25461,2.13708 0.32738,2.64632 3.14646,-2.87364 5.86553,-4.65604 8.15721,-5.3472 1.05486,-0.30917 2.08247,-0.46376 3.08282,-0.46379 1.0003,3e-5 1.8915,0.10006 2.6736,0.3001 0.80024,0.1819 1.54593,0.482 2.2371,0.90029 1.45499,0.89123 2.25525,2.39172 2.40078,4.50147 3.34651,-3.80121 7.04772,-5.70183 11.10363,-5.70186 2.27342,3e-5 4.05582,0.58204 5.3472,1.74602 1.41859,1.30955 2.12791,3.86493 2.12796,7.66614 -5e-5,1.56417 -0.12736,3.79217 -0.38194,6.684 -0.25468,2.87368 -0.38199,5.47453 -0.38194,7.80255 -5e-5,0.47289 0.33642,0.83664 1.00942,1.09127 0.67289,0.25463 1.32765,0.38194 1.96428,0.38194 0.6547,0 1.1003,-0.0364 1.3368,-0.10913 0.23638,0.56383 0.3546,1.02761 0.35466,1.39137 -6e-5,0.36375 -0.0273,0.62748 -0.0818,0.79116 -2.96465,1.85515 -5.4109,2.78273 -7.33876,2.78273 -3.14652,0 -4.71976,-2.50991 -4.71972,-7.52973 l 0.35466,-9.68498 c -4e-5,-2.76452 -0.23648,-4.64695 -0.70932,-5.6473 -0.47293,-1.0003 -1.32775,-1.50047 -2.56447,-1.50049 -2.34626,2e-5 -4.80161,1.10038 -7.36605,3.30108 0.1091,11.40373 0.27279,17.90585 0.49107,19.50637 -1.94612,0.54563 -3.52845,0.81845 -4.747,0.81845 -1.20042,0 -2.44628,-0.14551 -3.73758,-0.43651 -0.0182,-0.36375 -0.0273,-0.93667 -0.0273,-1.71874 l 0.35467,-12.30402"
           style="font-size:55.87278748px;font-style:normal;font-variant:normal;font-weight:normal;font-stretch:normal;line-height:125%;letter-spacing:0px;word-spacing:0px;fill:#000000;fill-opacity:1;stroke:none;font-family:Marko One;-inkscape-font-specification:Marko One"
           id="path3477"
           inkscape:connector-curvature="0" />
        <path
           d="m 914.76473,676.60578 -0.16369,9.16663 c -3e-5,0.0909 -3e-5,0.18188 0,0.27282 -3e-5,1.00033 0.47285,1.50049 1.41864,1.50049 0.72748,0 1.50046,-0.23644 2.31894,-0.70933 0.2546,0.21826 0.49104,0.52745 0.70932,0.92758 0.23641,0.38195 0.37282,0.68204 0.40923,0.90029 -2.25532,2.87367 -4.60153,4.3105 -7.03866,4.3105 -2.419,0 -4.11046,-1.1913 -5.07439,-3.57389 -1.67329,1.16401 -3.38294,2.04612 -5.12895,2.64632 -1.72785,0.61838 -3.21924,0.92757 -4.47418,0.92757 -1.23678,0 -2.3917,-0.13641 -3.46477,-0.40922 -1.0549,-0.27282 -2.03704,-0.70933 -2.94642,-1.30952 -1.96428,-1.27314 -2.94642,-3.37383 -2.94641,-6.30206 -10e-6,-1.56414 0.4274,-2.92822 1.28223,-4.09224 0.87301,-1.1822 2.05521,-2.10977 3.54662,-2.78273 2.85546,-1.29132 6.26566,-1.99155 10.23061,-2.10069 l 3.16467,-0.10912 c 0.12729,-1.47319 0.19095,-2.63721 0.19097,-3.49205 -2e-5,-1.92788 -0.37287,-3.3829 -1.11855,-4.36506 -0.72753,-0.98212 -2.09161,-1.47319 -4.09224,-1.47321 -1.20041,2e-5 -2.13708,0.41834 -2.81001,1.25495 -0.65477,0.83666 -0.98215,2.07343 -0.98214,3.7103 -1e-5,0.21828 -0.3092,0.482 -0.92758,0.79117 -1.03671,0.49109 -2.07341,0.73662 -3.1101,0.73661 -1.01852,10e-6 -1.83697,-0.29099 -2.45535,-0.87302 -0.6002,-0.58198 -0.9003,-1.40043 -0.90029,-2.45534 -10e-6,-1.05487 0.38193,-2.0461 1.14583,-2.9737 0.76387,-0.92755 1.78239,-1.64597 3.05554,-2.15525 2.52809,-1.0003 5.41084,-1.50046 8.64828,-1.50049 3.3829,3e-5 5.85643,0.53657 7.4206,1.60962 1.41862,0.94579 2.42804,2.30077 3.02826,4.06496 0.7093,2.05524 1.06396,4.67427 1.06399,7.85711 m -8.15721,9.93052 c -0.23646,-1.3277 -0.35468,-2.47353 -0.35466,-3.43749 -2e-5,-0.98213 0.0273,-2.34621 0.0818,-4.09225 l -3.79215,0.16369 c -1.9461,2e-5 -3.44659,0.4729 -4.50147,1.41865 -1.0549,0.94577 -1.58234,2.12798 -1.58233,3.54661 -10e-6,1.41865 0.30918,2.43717 0.92758,3.05554 0.61837,0.61839 1.86423,0.92758 3.73758,0.92758 1.89151,0 3.71938,-0.52744 5.48361,-1.58233"
           style="font-size:55.87278748px;font-style:normal;font-variant:normal;font-weight:normal;font-stretch:normal;line-height:125%;letter-spacing:0px;word-spacing:0px;fill:#000000;fill-opacity:1;stroke:none;font-family:Marko One;-inkscape-font-specification:Marko One"
           id="path3479"
           inkscape:connector-curvature="0" />
        <path
           d="m 942.81025,673.71393 c -2e-5,-3.11009 -0.70934,-4.66514 -2.12797,-4.66516 -1.03672,2e-5 -2.02795,0.30012 -2.97369,0.90029 -0.94578,0.58203 -1.9643,1.40048 -3.05555,2.45535 -1e-5,1.81879 -0.0546,8.37547 -0.16369,19.67006 -2.01885,0.34556 -3.67393,0.51835 -4.96525,0.51835 -1.27315,0 -2.37351,-0.17279 -3.30108,-0.51835 0.21825,-3.01917 0.32737,-8.19358 0.32738,-15.52325 l 0,-6.38391 c -10e-6,-1.38224 -0.48198,-2.20069 -1.44593,-2.45534 -0.65476,-0.20004 -1.53687,-0.34555 -2.64632,-0.43651 -0.12731,-0.54561 -0.19097,-0.95483 -0.19097,-1.22767 0,-0.29098 0.009,-0.51833 0.0273,-0.68204 2.61904,-1.47318 5.85645,-2.20979 9.71226,-2.20982 0.63656,3e-5 1.10945,0.009 1.41865,0.0273 0.52743,0.90941 0.83662,1.85517 0.92758,2.83729 0.10911,0.98216 0.19095,1.91883 0.24553,2.81 2.43714,-2.96457 4.49236,-4.76516 6.16565,-5.40176 0.80024,-0.30916 1.64597,-0.46376 2.53719,-0.46379 1.81875,3e-5 3.27377,0.50929 4.36506,1.52777 1.10943,1.00036 1.66415,2.47356 1.66418,4.41963 -3e-5,1.49142 -0.54566,2.73728 -1.6369,3.73758 -1.0731,0.98216 -2.37352,1.47323 -3.90127,1.47321 -0.3274,2e-5 -0.65478,-0.0273 -0.98214,-0.0818 l 0,-0.32738"
           style="font-size:55.87278748px;font-style:normal;font-variant:normal;font-weight:normal;font-stretch:normal;line-height:125%;letter-spacing:0px;word-spacing:0px;fill:#000000;fill-opacity:1;stroke:none;font-family:Marko One;-inkscape-font-specification:Marko One"
           id="path3481"
           inkscape:connector-curvature="0" />
        <path
           d="m 980.37706,669.73081 c -3e-5,2.76456 -1.43686,4.14682 -4.3105,4.14681 -0.98217,10e-6 -1.69149,-0.10911 -2.12797,-0.32738 -0.43653,-0.23643 -0.65478,-0.37283 -0.65476,-0.40923 0.0545,-0.34555 0.0818,-0.70021 0.0818,-1.06398 -3e-5,-1.70963 -0.55475,-3.06462 -1.66418,-4.06496 -1.09129,-1.01849 -2.5645,-1.52775 -4.41963,-1.52778 -1.85516,3e-5 -3.34656,0.80029 -4.47419,2.40079 -1.12765,1.58235 -1.69147,4.04679 -1.69146,7.39332 -10e-6,3.34656 0.96394,6.30207 2.89186,8.86653 1.94607,2.56448 4.11041,3.84672 6.49303,3.84671 2.05519,1e-5 4.1104,-0.82754 6.16564,-2.48263 0.47286,-0.38193 0.94574,-0.83663 1.41865,-1.36408 0.4001,0.25464 0.80933,0.61839 1.22767,1.09127 0.43648,0.4547 0.7002,0.8912 0.79117,1.30952 -0.85485,1.14583 -2.14618,2.24619 -3.87399,3.30107 -2.36443,1.41865 -4.97437,2.12797 -7.82983,2.12797 -2.85549,0 -5.45634,-0.6002 -7.80255,-1.80059 -2.32804,-1.20039 -4.165,-2.91913 -5.51089,-5.15623 -1.3459,-2.23708 -2.01884,-4.78337 -2.01884,-7.63885 0,-5.49269 2.02793,-9.73043 6.08381,-12.71325 2.60083,-1.90968 5.7655,-2.86454 9.494,-2.86457 3.14646,3e-5 5.88372,0.68207 8.21178,2.04613 1.05486,0.61841 1.90059,1.35501 2.53719,2.20981 0.63654,0.85485 0.96392,1.74605 0.98214,2.6736"
           style="font-size:55.87278748px;font-style:normal;font-variant:normal;font-weight:normal;font-stretch:normal;line-height:125%;letter-spacing:0px;word-spacing:0px;fill:#000000;fill-opacity:1;stroke:none;font-family:Marko One;-inkscape-font-specification:Marko One"
           id="path3483"
           inkscape:connector-curvature="0" />
        <path
           d="m 985.506,667.24818 c -1.2004,2e-5 -1.80059,-0.51833 -1.80059,-1.55505 0,-0.29098 0.0182,-0.50923 0.0546,-0.65476 0.63657,-0.45467 2.19162,-0.89118 4.66516,-1.30952 2.47353,-0.43648 4.47418,-0.65473 6.00196,-0.65476 0.56381,1.83699 0.84572,3.9013 0.84573,6.19293 -1e-5,2.29168 -0.11823,4.91071 -0.35466,7.85711 -0.21827,2.92824 -0.32739,4.99255 -0.32738,6.19293 -10e-6,1.2004 0.18186,2.17345 0.54563,2.91914 0.36374,0.72751 1.10944,1.09127 2.2371,1.09126 1.14581,10e-6 2.31892,-0.27281 3.51935,-0.81845 1.2185,-0.56381 2.7645,-1.59142 4.6379,-3.08282 -10e-5,-5.60182 0.018,-12.25853 0.055,-19.97016 2.0915,-0.32735 3.7739,-0.49104 5.0471,-0.49107 1.2912,3e-5 2.4098,0.16372 3.3556,0.49107 -0.2729,3.98315 -0.4093,7.81166 -0.4092,11.48557 -10e-5,3.65575 0.1,7.46608 0.3001,11.43101 0.036,0.6002 0.1545,1.06398 0.3546,1.39136 0.2001,0.32738 0.7184,0.51835 1.5551,0.57291 0.8548,0.0546 1.4459,0.14551 1.7733,0.27282 0.073,0.38195 0.1091,1.00033 0.1091,1.85515 -1.5824,0.8912 -3.1738,1.52777 -4.7743,1.90971 -1.6005,0.40013 -2.9555,0.6002 -4.0649,0.6002 -1.1095,0 -1.8734,-0.40922 -2.2917,-1.22767 -0.4002,-0.81845 -0.7184,-2.45535 -0.9548,-4.9107 -4.4379,4.09225 -8.67563,6.13837 -12.71329,6.13837 -4.03769,0 -6.05653,-3.20104 -6.05653,-9.60313 l 0.46379,-14.43199 c 0,-0.61836 -0.19098,-1.05486 -0.57291,-1.30952 -0.36376,-0.2546 -0.76389,-0.38192 -1.20039,-0.38194"
           style="font-size:55.87278748px;font-style:normal;font-variant:normal;font-weight:normal;font-stretch:normal;line-height:125%;letter-spacing:0px;word-spacing:0px;fill:#000000;fill-opacity:1;stroke:none;font-family:Marko One;-inkscape-font-specification:Marko One"
           id="path3485"
           inkscape:connector-curvature="0" />
        <path
           d="m 1024.0822,683.34434 c 0.4184,-0.0727 1.0186,-0.10911 1.8006,-0.10912 0.8003,10e-6 1.8552,0.31829 3.1647,0.95485 -0.018,0.14551 -0.027,0.41833 -0.027,0.81845 0,0.40014 0.091,0.89121 0.2728,1.47321 0.2001,0.58201 0.5002,1.11855 0.9003,1.60962 0.873,1.09127 2.3098,1.6369 4.3105,1.6369 2.0006,0 3.3102,-0.67295 3.9286,-2.01884 0.5274,-1.23677 0.4365,-2.519 -0.2728,-3.84672 -0.5275,-0.98212 -1.9371,-1.91879 -4.2287,-2.81 -0.382,-0.14549 -0.9094,-0.34556 -1.5823,-0.6002 -6.0384,-2.16433 -9.0939,-5.29262 -9.1667,-9.38488 0,-1.85513 0.5184,-3.41928 1.5551,-4.69244 1.9643,-2.38257 5.2835,-3.57387 9.9578,-3.5739 3.0737,3e-5 5.6654,0.6366 7.7753,1.90972 2.1279,1.27317 3.1919,2.83731 3.1919,4.69244 0,2.07342 -1.0094,3.11012 -3.0283,3.1101 -1.4368,2e-5 -2.4462,-0.15457 -3.0282,-0.46378 -0.582,-0.32736 -0.8731,-0.50924 -0.873,-0.54564 -10e-5,-0.1091 -10e-5,-0.20913 0,-0.30009 -10e-5,-3.40109 -1.6551,-5.10164 -4.9653,-5.10167 -1.1458,3e-5 -2.0552,0.30012 -2.7282,0.90029 -0.6547,0.58204 -0.9821,1.44595 -0.9821,2.59176 0,1.12766 0.4001,2.06433 1.2004,2.81001 0.8184,0.74572 2.3826,1.58235 4.6924,2.50991 2.3281,0.92759 3.8194,1.55507 4.4742,1.88243 4.0922,1.98248 6.1384,4.54695 6.1384,7.69342 0,2.72817 -1.155,4.82885 -3.4648,6.30206 -2.2917,1.45502 -5.3472,2.18253 -9.1666,2.18253 -2.5281,0 -4.4378,-0.21825 -5.7291,-0.65476 -1.2914,-0.4365 -2.2735,-0.83663 -2.9465,-1.20039 -0.6547,-0.36375 -1.2004,-0.7457 -1.6369,-1.14583 -0.4183,-0.40013 -0.7729,-0.81845 -1.0639,-1.25495 -0.7821,-1.14583 -1.0095,-2.30984 -0.6821,-3.49205 0.2728,-1.00032 1.0094,-1.6278 2.2098,-1.88244"
           style="font-size:55.87278748px;font-style:normal;font-variant:normal;font-weight:normal;font-stretch:normal;line-height:125%;letter-spacing:0px;word-spacing:0px;fill:#000000;fill-opacity:1;stroke:none;font-family:Marko One;-inkscape-font-specification:Marko One"
           id="path3487"
           inkscape:connector-curvature="0" />
        <path
           id="path4236-7-5"
           d="m 844.92022,591.11019 c 8.45872,0 16.91745,1.43799 25.37618,4.22937 0,19.79342 0.16917,40.77106 -25.37618,52.02117 -25.54536,-11.25011 -25.37619,-32.22775 -25.37619,-52.02117 8.45873,-2.79138 16.91746,-4.22937 25.37619,-4.22937 z"
           inkscape:connector-curvature="0"
           style="fill:#d52b1e" />
        <path
           id="path4238-0-0"
           d="m 828.00276,611.41114 h 11.84222 v -11.84222 h 10.15047 v 11.84222 h 11.84222 v 10.15047 h -11.84222 v 11.84222 h -10.15047 v -11.84222 h -11.84222 z"
           inkscape:connector-curvature="0"
           style="fill:#ffffff" />
        <path
           d="m 578.34355,613.73065 0.30297,-16.36062 c -10e-6,-3.29903 -0.0673,-6.24458 -0.20198,-8.83672 -0.10101,-2.62569 -0.40398,-4.3931 -0.90893,-5.30207 -0.4713,-0.94251 -0.94259,-1.54847 -1.41387,-1.81788 -0.4713,-0.30285 -0.94259,-0.53856 -1.41389,-0.70688 -0.47129,-0.16824 -0.7406,-0.25239 -0.80793,-0.25248 -0.53862,-0.13462 -0.80793,-1.02675 -0.80793,-2.6763 0,-1.68317 0.0673,-2.72672 0.20199,-3.13069 11.71498,-2.59207 20.56856,-3.88813 26.56074,-3.88819 14.30707,6e-5 25.41611,3.45058 33.32717,10.3516 6.66535,5.79026 9.99807,13.93687 9.99815,24.43992 -8e-5,8.41602 -2.00307,15.77151 -6.009,22.06663 -4.00606,6.26143 -9.52692,11.02494 -16.56259,14.29027 -7.00212,3.23172 -15.04776,4.84758 -24.13694,4.84758 -4.98227,0 -9.6447,-0.42079 -13.98731,-1.26238 -2.22183,-0.90889 -3.48422,-3.23172 -3.78718,-6.96839 -0.23566,-2.89509 -0.35349,-7.25456 -0.35347,-13.07843 l 0,-11.71497 m 15.50218,-19.33986 -0.50496,30.70135 0,3.43373 c -2e-5,6.42983 0.58909,10.11604 1.76735,11.05863 1.21187,0.20201 2.50793,0.30294 3.88817,0.30294 1.38019,0 3.23169,-0.0505 5.55452,-0.15155 2.32277,-0.13463 4.79706,-0.85836 7.42288,-2.17128 2.65939,-1.31284 5.10002,-3.19802 7.32187,-5.65555 2.22176,-2.45745 3.9891,-5.72278 5.30205,-9.79609 1.31283,-4.107 1.96928,-8.50009 1.96933,-13.17944 -5e-5,-4.71288 -0.53868,-8.78618 -1.61586,-12.21992 -1.04364,-3.43365 -2.42384,-6.27819 -4.14065,-8.53379 -1.68323,-2.25543 -3.63574,-4.15738 -5.8575,-5.70601 -4.24168,-2.9287 -8.60114,-4.39301 -13.07839,-4.39317 -4.47731,1.6e-4 -7.55754,0.23579 -9.24071,0.70696 0.80791,3.53482 1.21187,7.7259 1.2119,12.5734 l 0,3.02979"
           style="font-size:161.78579712px;font-style:normal;font-variant:normal;font-weight:normal;font-stretch:normal;line-height:125%;letter-spacing:0px;word-spacing:0px;fill:#000000;fill-opacity:1;stroke:none;font-family:Marko One;-inkscape-font-specification:Marko One"
           id="path4240-2-3"
           inkscape:connector-curvature="0" />
        <path
           d="m 660.48548,623.67829 c 1.00989,4.98228 3.16437,9.00504 6.46345,12.06853 3.29903,3.0634 7.15353,4.59502 11.56353,4.59502 4.4099,0 8.85352,-1.90195 13.33086,-5.70593 1.68313,1.11091 2.70988,2.42375 3.08023,3.9386 -3.09711,3.60205 -7.67539,6.17735 -13.73483,7.7259 -2.45749,0.63958 -5.30208,0.95936 -8.53377,0.95936 -3.19809,0 -6.51397,-0.58903 -9.94766,-1.76733 -3.43372,-1.1446 -6.51396,-2.82777 -9.24071,-5.04959 -2.69311,-2.22182 -4.83077,-5.13367 -6.41296,-8.73572 -1.5822,-3.63567 -2.3733,-7.65851 -2.37329,-12.06845 -10e-6,-4.40994 0.80792,-8.39909 2.42379,-11.96753 1.61585,-3.60197 3.7535,-6.54751 6.41295,-8.83672 5.55451,-4.81389 11.91697,-7.22087 19.08738,-7.22095 6.29509,8e-5 11.74863,1.70018 16.36061,5.10013 2.22176,1.68317 3.98911,3.87138 5.30205,6.56437 1.34649,2.65954 2.01977,5.67248 2.01983,9.03882 -6e-5,5.75648 -1.90206,8.78627 -5.70602,9.08921 l -30.09544,2.27228 m 22.21811,-12.87634 c -4e-5,-4.006 -1.11094,-7.13679 -3.33271,-9.39231 -2.22185,-2.25535 -5.13377,-3.3831 -8.73576,-3.38319 -3.60205,9e-5 -6.32882,1.7001 -8.1803,5.10006 -1.85154,3.36651 -2.77728,8.04569 -2.77727,14.03787 8.38226,-0.90889 15.95661,-1.86833 22.72307,-2.87823 0.20194,-1.21192 0.30293,-2.37329 0.30297,-3.4842"
           style="font-size:161.78579712px;font-style:normal;font-variant:normal;font-weight:normal;font-stretch:normal;line-height:125%;letter-spacing:0px;word-spacing:0px;fill:#000000;fill-opacity:1;stroke:none;font-family:Marko One;-inkscape-font-specification:Marko One"
           id="path4242-6-6"
           inkscape:connector-curvature="0" />
        <path
           d="m 715.92967,604.64145 0,12.97742 c -2e-5,9.82979 0.0673,17.53884 0.20198,23.127 1.6495,0.26932 3.6525,0.40394 6.00899,0.40394 4.40992,0 8.34858,-1.81779 11.81599,-5.45353 3.80397,-4.03962 5.70597,-10.0318 5.70602,-17.97648 -5e-5,-12.0853 -3.60208,-18.12795 -10.80608,-18.12795 -1.91887,0 -3.85454,0.40403 -5.807,1.21192 -1.95254,0.80797 -4.32584,2.08719 -7.1199,3.83768 m 0.30297,-28.63108 0.0505,1.71686 c -3e-5,0.94268 -0.0168,2.32283 -0.0505,4.14062 -0.0337,1.81796 -0.0674,4.19124 -0.10099,7.11994 -0.0337,2.92879 -0.0674,5.70602 -0.10099,8.33178 4.88122,-3.73667 10.16643,-5.60501 15.85565,-5.60509 7.77629,8e-5 13.58329,2.13774 17.42101,6.41298 3.87128,4.27532 5.80695,10.36851 5.80701,18.27942 -6e-5,7.3051 -1.66642,13.22998 -4.99907,17.77454 -6.49717,8.92089 -15.82203,13.38137 -27.97462,13.38137 -8.4833,0 -15.62002,-0.85843 -21.41018,-2.5753 0.53861,-8.92088 0.80792,-20.34976 0.80794,-34.28655 -2e-5,-13.93678 -0.10101,-24.08643 -0.30298,-30.44895 -0.101,-1.68309 -0.72378,-3.01286 -1.86834,-3.98915 -1.14458,-0.97618 -2.62579,-1.54847 -4.44363,-1.71683 -0.23564,-1.64948 -0.35346,-2.57525 -0.35346,-2.77731 0,-0.23554 0.0169,-0.48803 0.0505,-0.7574 6.36245,-2.45738 12.7249,-3.68614 19.08738,-3.6862 0.30295,6e-5 0.60592,6e-5 0.90892,0 0.77424,0.97634 1.31286,3.87138 1.61586,8.68527"
           style="font-size:161.78579712px;font-style:normal;font-variant:normal;font-weight:normal;font-stretch:normal;line-height:125%;letter-spacing:0px;word-spacing:0px;fill:#000000;fill-opacity:1;stroke:none;font-family:Marko One;-inkscape-font-specification:Marko One"
           id="path4244-9-9"
           inkscape:connector-curvature="0" />
        <path
           d="m 816.74783,636.80718 c -6.69916,6.9684 -15.24976,10.45259 -25.65182,10.45259 -9.79619,0 -17.84184,-2.97924 -24.13695,-8.93773 -3.13074,-2.99601 -5.5882,-6.91785 -7.37237,-11.76551 -1.75052,-4.8812 -2.62578,-10.78914 -2.62578,-17.72392 0,-6.9684 1.6327,-13.39822 4.89809,-19.2894 3.26537,-5.8911 7.84365,-10.45251 13.73483,-13.68431 5.9248,-3.23167 12.50606,-4.84753 19.74382,-4.8476 7.27132,7e-5 13.85259,1.38025 19.74382,4.14062 0.60589,0.74076 0.90886,1.68327 0.90892,2.82779 -6e-5,1.11099 -6e-5,1.83472 0,2.17127 l -0.70694,11.15964 c -1.85157,1.24553 -3.65258,1.86833 -5.40304,1.86825 -1.71691,8e-5 -3.08029,-0.25239 -4.09015,-0.75742 -1.00996,-0.53857 -1.75057,-1.27915 -2.22181,-2.22182 -0.80798,-1.61578 -1.21194,-3.23164 -1.2119,-4.84758 -4e-5,-1.64948 0.0336,-3.11387 0.10099,-4.39309 -1.88521,-1.38016 -4.39317,-2.07027 -7.52386,-2.07035 -3.09711,8e-5 -5.60506,0.31986 -7.52385,0.95944 -1.88521,0.60604 -3.66939,1.61586 -5.35255,3.02978 -1.68322,1.41393 -3.11393,3.18126 -4.29214,5.30199 -2.55847,4.61204 -3.83769,10.89031 -3.83767,18.83491 -2e-5,10.0318 2.18812,17.74085 6.56444,23.127 4.40993,5.35253 10.11593,8.02884 17.11805,8.02884 5.08317,0 10.11591,-2.13758 15.09821,-6.41298 1.95244,0.94267 3.29899,2.62584 4.03966,5.04959"
           style="font-size:161.78579712px;font-style:normal;font-variant:normal;font-weight:normal;font-stretch:normal;line-height:125%;letter-spacing:0px;word-spacing:0px;fill:#000000;fill-opacity:1;stroke:none;font-family:Marko One;-inkscape-font-specification:Marko One"
           id="path4246-8-1"
           inkscape:connector-curvature="0" />
        <path
           d="m 917.25914,634.5349 0.50496,-19.23885 c -4e-5,-4.37625 -0.15153,-7.13671 -0.45445,-8.28132 -0.26936,-1.14452 -0.62283,-2.00295 -1.06042,-2.5753 -0.94263,-1.17813 -2.32285,-1.76733 -4.14065,-1.76733 -1.81788,0 -3.36641,0.20202 -4.6456,0.60588 -2.62581,0.87536 -5.99219,3.33281 -10.09914,7.37242 -3e-5,4.37632 -0.10102,16.02398 -0.30297,34.94305 -3.73671,0.63957 -6.8506,0.95936 -9.3417,0.95936 -2.49114,0 -4.59513,-0.31979 -6.31197,-0.95936 0.60594,-8.18031 0.90891,-15.72104 0.90893,-22.62204 -2e-5,-6.93478 -0.0842,-12.91012 -0.25249,-17.92602 -10e-6,-2.55837 -0.90893,-4.07322 -2.72676,-4.54464 -1.14458,-0.37017 -2.76044,-0.63957 -4.84759,-0.80797 -0.20199,-0.8752 -0.30298,-1.56524 -0.30297,-2.07027 -10e-6,-0.53857 0.0673,-1.02667 0.20198,-1.46431 4.84757,-2.72677 10.87339,-4.09015 18.07746,-4.09024 1.17821,9e-5 2.05347,0.0163 2.62577,0.0505 1.31287,2.25551 2.03664,6.12689 2.17132,11.61404 6.2951,-8.07922 13.66747,-12.11891 22.11712,-12.11899 3.90494,8e-5 6.95152,1.32985 9.13973,3.98922 2.22174,2.62577 3.48414,6.1942 3.78717,10.70507 0.13459,2.0535 0.20192,4.107 0.20198,6.1605 -6e-5,2.0535 -0.10105,4.27524 -0.30297,6.66538 -0.57235,7.27141 -0.85849,12.8428 -0.85842,16.71409 -7e-5,0.87529 0.62271,1.54855 1.86833,2.01989 1.2455,0.47126 2.45739,0.70688 3.63569,0.70688 1.21183,0 2.03659,-0.0675 2.4743,-0.20201 0.40389,0.90898 0.60586,1.75056 0.60594,2.52484 -8e-5,0.74058 -0.0338,1.24553 -0.10099,1.51485 -6.29519,3.26542 -10.99129,4.89805 -14.08831,4.89805 -3.09711,0 -5.28526,-1.04352 -6.56444,-3.13072 -1.27926,-2.12081 -1.91888,-5.33576 -1.91884,-9.64462"
           style="font-size:161.78579712px;font-style:normal;font-variant:normal;font-weight:normal;font-stretch:normal;line-height:125%;letter-spacing:0px;word-spacing:0px;fill:#000000;fill-opacity:1;stroke:none;font-family:Marko One;-inkscape-font-specification:Marko One"
           id="path4248-1-2"
           inkscape:connector-curvature="0" />
        <path
           d="m 960.78635,598.22847 11.41204,0.45449 c 0.9762,0 1.68314,-0.0163 2.12081,-0.0505 0.13462,0 0.20195,1.0436 0.20199,3.13072 -4e-5,2.0535 -0.0674,3.08025 -0.20199,3.08017 -3.93869,0.47142 -8.44964,0.70704 -13.53285,0.70696 -2e-5,21.54492 0.33662,34.82528 1.00992,39.84118 -1.71688,0.70696 -4.12383,1.06036 -7.22089,1.06036 -3.09709,0 -5.75652,-0.31978 -7.97832,-0.95944 -0.33665,-16.0239 -0.50496,-29.53989 -0.50495,-40.54806 -2.96243,-0.33655 -5.5882,-0.50487 -7.87733,-0.50487 -0.16832,-0.26932 -0.25248,-1.26237 -0.25248,-2.97932 0,-1.71679 0.0842,-2.65938 0.25248,-2.8277 2.28913,-0.30293 4.9149,-0.50495 7.87733,-0.60604 0.13464,-6.49697 0.23563,-10.55343 0.30297,-12.16937 0.0673,-1.61578 0.50495,-3.66936 1.31289,-6.1605 0.80792,-2.52476 1.81783,-4.59506 3.02974,-6.21099 1.24554,-1.64941 2.67625,-3.02966 4.29214,-4.14061 2.96239,-1.98609 6.19411,-2.97917 9.69517,-2.9793 3.53467,1.3e-4 6.46342,0.35355 8.78625,1.06045 2.32277,0.70703 4.20793,1.93572 5.65552,3.6862 1.4475,1.71692 2.17127,3.87138 2.17131,6.46344 -4e-5,2.55853 -0.62282,4.67934 -1.86833,6.36243 -1.24561,1.68325 -3.23177,2.52484 -5.9585,2.52476 -1.2456,8e-5 -2.39017,-0.23555 -3.4337,-0.70689 -1.00995,-0.47125 -1.73372,-0.90889 -2.17132,-1.31284 -0.404,-0.43764 -0.60598,-0.70696 -0.60595,-0.80797 0.23561,-1.07721 0.35344,-2.42375 0.35347,-4.03969 -3e-5,-1.61578 -0.40399,-3.06332 -1.2119,-4.34262 -0.80795,-1.31282 -1.95253,-1.96929 -3.4337,-1.96935 -1.48124,6e-5 -2.65947,0.53873 -3.5347,1.61586 -0.84162,1.0436 -1.26242,2.42391 -1.2624,4.1407 -2e-5,1.71694 0.42078,4.32586 1.2624,7.82682 0.87523,3.50105 1.31286,5.87442 1.31288,7.11986 l 0,4.24163"
           style="font-size:161.78579712px;font-style:normal;font-variant:normal;font-weight:normal;font-stretch:normal;line-height:125%;letter-spacing:0px;word-spacing:0px;fill:#000000;fill-opacity:1;stroke:none;font-family:Marko One;-inkscape-font-specification:Marko One"
           id="path4250-7-4"
           inkscape:connector-curvature="0" />
        <path
           d="m 1011.8808,574.84893 -0.6059,16.36068 0,38.17469 c -10e-5,3.66936 0.2019,8.16354 0.6059,13.48238 l 0.202,2.62576 c -2.8615,0.87529 -5.9922,1.31284 -9.3922,1.31284 -3.40008,0 -5.63871,-0.43755 -6.71594,-1.31284 0.97623,-7.10301 1.46436,-12.52293 1.46437,-16.25961 l 0,-34.84204 c -10e-6,-3.13072 0.2188,-6.31189 0.65645,-9.54369 l 0.25247,-1.61586 c -5.55453,4.94866 -10.45261,8.36555 -14.69424,10.25065 -0.0673,-0.101 -0.28615,-0.38709 -0.65645,-0.85843 -0.3703,-0.47126 -0.69011,-0.9089 -0.95942,-1.31284 -0.87526,-1.21192 -1.43071,-2.25552 -1.66636,-3.1308 1.34656,-1.51485 4.56145,-4.64556 9.64468,-9.39222 5.08322,-4.7465 8.33178,-7.23764 9.74567,-7.47331 1.41387,-0.26924 3.09707,-0.40391 5.04957,-0.40398 1.9861,7e-5 4.1406,0.42085 6.4635,1.26238 0.4039,0.53865 0.6059,1.43081 0.6059,2.67624"
           style="font-size:161.78579712px;font-style:normal;font-variant:normal;font-weight:normal;font-stretch:normal;line-height:125%;letter-spacing:0px;word-spacing:0px;fill:#000000;fill-opacity:1;stroke:none;font-family:Marko One;-inkscape-font-specification:Marko One"
           id="path4252-7-0"
           inkscape:connector-curvature="0" />
        <path
           d="m 1032.5551,588.93725 c -0.9763,1.91896 -2.6426,2.87832 -4.9991,2.87824 -2.3228,8e-5 -3.9723,-0.53857 -4.9485,-1.61586 -1.7169,-1.95241 -2.5753,-5.95841 -2.5753,-12.01799 0,-2.59198 0.3029,-4.25835 0.9089,-4.99906 4.8476,-1.51481 9.4932,-2.2722 13.9368,-2.27227 4.4773,7e-5 7.9783,0.20205 10.5031,0.60591 2.5584,0.37042 4.9317,0.97633 7.1199,1.81785 2.1881,0.84171 4.0565,1.9021 5.605,3.18125 3.3664,2.65946 5.0496,6.24466 5.0496,10.75561 0,6.83377 -2.8615,12.52294 -8.5843,17.06758 3.905,1.0099 7.1367,3.16441 9.6952,6.46344 2.5584,3.29903 3.8376,7.65851 3.8377,13.07835 -10e-5,9.52685 -4.1239,16.25961 -12.3715,20.1983 -4.6119,2.18812 -10.4021,3.28218 -17.3705,3.28218 -6.1268,0 -12.1358,-1.38023 -18.027,-4.1407 -0.6059,-0.70688 -0.9089,-1.61586 -0.9089,-2.72669 0,-1.1446 0,-1.88518 0,-2.22181 l 0.707,-12.119 c 1.8515,-0.60596 3.5683,-0.90889 5.1505,-0.90889 1.5822,0 2.8109,0.18516 3.6862,0.55541 0.9089,0.37033 1.6159,0.85851 2.1208,1.46439 0.5386,0.57226 0.9594,1.29608 1.2624,2.17136 0.4713,1.31284 0.7069,2.70992 0.707,4.19108 -10e-5,1.44754 -0.034,2.81092 -0.101,4.09023 2.4237,1.17814 5.302,1.76733 8.6347,1.76733 3.3664,0 6.0595,-1.36338 8.0793,-4.09015 2.0198,-2.72677 3.0298,-6.37929 3.0298,-10.95754 0,-4.61204 -1.01,-8.07931 -3.0298,-10.40213 -2.0198,-2.35652 -5.2852,-3.53466 -9.7961,-3.53474 -0.6733,8e-5 -1.1951,0.0163 -1.5654,0.0505 l -5.2515,0.30302 c -0.202,-0.0675 -0.303,-0.5218 -0.303,-1.36338 0,-0.84159 0.2188,-2.03666 0.6564,-3.58521 0.4713,-1.58216 0.9426,-2.52475 1.4139,-2.82785 0.4713,-0.33656 1.6495,-0.50487 3.5347,-0.50487 1.8852,0 4.1238,0.1347 6.7159,0.40394 3.4337,-3.56827 5.1506,-7.97829 5.1506,-13.2299 0,-7.60797 -4.3258,-11.41195 -12.9774,-11.41203 -1.1782,8e-5 -2.7436,0.11794 -4.6961,0.35348 l 0,10.25066"
           style="font-size:161.78579712px;font-style:normal;font-variant:normal;font-weight:normal;font-stretch:normal;line-height:125%;letter-spacing:0px;word-spacing:0px;fill:#000000;fill-opacity:1;stroke:none;font-family:Marko One;-inkscape-font-specification:Marko One"
           id="path4254-3-7"
           inkscape:connector-curvature="0" />
        <path
           id="path4258-3-6"
           d="m 536.45827,609.69993 c -1.59839,0.0214 0.30063,0.82166 2.38795,1.14369 0.5788,-0.45148 1.09875,-0.90511 1.56522,-1.34804 -1.29775,0.31776 -2.62011,0.32524 -3.95317,0.20435"
           i:knockout="Off"
           inkscape:connector-curvature="0"
           style="fill:#d70751" />
        <path
           id="path4260-7-4"
           d="m 545.03541,607.56126 c 0.9554,-1.31487 1.64867,-2.75277 1.89367,-4.23989 -0.21504,1.05917 -0.78742,1.97391 -1.33092,2.94107 -2.98814,1.8819 -0.28244,-1.11694 -0.002,-2.25849 -3.21174,4.04731 -0.44292,2.42646 -0.56061,3.55731"
           i:knockout="Off"
           inkscape:connector-curvature="0"
           style="fill:#d70751" />
        <path
           id="path4262-9-2"
           d="m 548.20544,599.31899 c 0.19471,-2.87902 -0.56597,-1.96749 -0.82166,-0.87088 0.29742,0.1562 0.53386,2.03062 0.82166,0.87088"
           i:knockout="Off"
           inkscape:connector-curvature="0"
           style="fill:#d70751" />
        <path
           id="path4264-6-0"
           d="m 530.39425,559.97026 c 0.85376,0.15192 1.84445,0.26961 1.70216,0.47395 0.93721,-0.20648 1.14797,-0.39264 -1.70216,-0.47395"
           i:knockout="Off"
           inkscape:connector-curvature="0"
           style="fill:#d70751" />
        <path
           id="path4266-4-3"
           d="m 532.09748,560.44421 -0.6002,0.12518 0.55955,-0.0514 0.0407,-0.0738"
           i:knockout="Off"
           inkscape:connector-curvature="0"
           style="fill:#d70751" />
        <path
           id="path4268-5-1"
           d="m 558.70406,600.41025 c 0.0963,2.58481 -0.75425,3.84083 -1.52349,6.06188 l -1.38334,0.68793 c -1.13085,2.19751 0.11233,1.39511 -0.69756,3.14221 -1.76742,1.56949 -5.35576,4.90963 -6.5048,5.21561 -0.83985,-0.0182 0.5681,-0.9907 0.75212,-1.3705 -2.36335,1.62192 -1.89688,2.43502 -5.51197,3.42251 l -0.10485,-0.23644 c -8.91201,4.19389 -21.29254,-4.11579 -21.12992,-15.45213 -0.0942,0.71896 -0.27068,0.53922 -0.46753,0.82808 -0.46005,-5.83186 2.69393,-11.68939 8.01332,-14.08483 5.20277,-2.5741 11.3021,-1.51921 15.02632,1.95679 -2.04559,-2.68109 -6.12073,-5.52373 -10.94691,-5.26054 -4.72989,0.077 -9.15594,3.08229 -10.63236,6.34646 -2.42218,1.52456 -2.70463,5.88 -3.75952,6.67813 -1.42186,10.44192 2.67146,14.95142 9.59673,20.25904 1.08698,0.73393 0.30598,0.84627 0.45148,1.40474 -2.30022,-1.07629 -4.40572,-2.70249 -6.13891,-4.69352 0.92009,1.34483 1.91186,2.65221 3.19463,3.67929 -2.17076,-0.73287 -5.06904,-5.25627 -5.91317,-5.44029 3.7392,6.69524 15.16861,11.74182 21.15667,9.23725 -2.77096,0.10271 -6.28976,0.0567 -9.40094,-1.0934 -1.31059,-0.67295 -3.0855,-2.06485 -2.76775,-2.32483 8.16952,3.0502 16.60651,2.30878 23.67407,-3.35618 1.79952,-1.40153 3.7638,-3.78413 4.3319,-3.81623 -0.85483,1.28599 0.14657,0.61839 -0.51033,1.75352 1.78882,-2.88972 -0.77993,-1.17686 1.85087,-4.98987 l 0.97145,1.33734 c -0.36376,-2.40079 2.97958,-5.31298 2.63936,-9.10673 0.7671,-1.15974 0.85483,1.24961 0.0417,3.91786 1.12871,-2.96033 0.29849,-3.43642 0.58736,-5.88 0.31133,0.82166 0.72537,1.6936 0.93613,2.56126 -0.73607,-2.8619 0.75212,-4.81762 1.1223,-6.48126 -0.3659,-0.16048 -1.13514,1.26458 -1.31273,-2.11407 0.0267,-1.46786 0.40976,-0.76923 0.55633,-1.13085 -0.28673,-0.16583 -1.04313,-1.29133 -1.5021,-3.44926 0.33059,-0.50818 0.89013,1.31487 1.34376,1.38869 -0.29208,-1.715 -0.79385,-3.02345 -0.81524,-4.34046 -1.32664,-2.77096 -0.46968,0.37018 -1.54383,-1.18969 -1.41222,-4.40144 1.17044,-1.02173 1.3459,-3.02024 2.1376,3.09727 3.35618,7.90098 3.91786,9.88987 -0.42795,-2.42539 -1.11801,-4.7759 -1.96214,-7.04937 0.65155,0.27496 -1.0474,-4.9888 0.84627,-1.50317 -2.02098,-7.43024 -8.64241,-14.37369 -14.73531,-17.63037 0.74356,0.6815 1.68397,1.5374 1.34803,1.6722 -3.03201,-1.80273 -2.49921,-1.94502 -2.93358,-2.70677 -2.46605,-1.0046 -2.63081,0.0824 -4.26236,0.002 -4.65393,-2.46926 -5.55048,-2.20714 -9.83317,-3.75203 l 0.19472,0.91153 c -3.0823,-1.02708 -3.59155,0.38729 -6.92206,0.002 -0.2022,-0.15727 1.06773,-0.57345 2.11406,-0.7243 -2.98065,0.39371 -2.84157,-0.58843 -5.75803,0.10805 0.71788,-0.5039 1.47963,-0.83877 2.24565,-1.26672 -2.42967,0.14764 -5.80297,1.41437 -4.76199,0.26105 -3.96386,1.76956 -11.00467,4.25273 -14.9557,7.95769 l -0.1241,-0.83022 c -1.81022,2.1729 -7.89457,6.48982 -8.37922,9.30679 l -0.48465,0.11234 c -0.94042,1.59517 -1.55131,3.40218 -2.29808,5.04229 -1.23142,2.10015 -1.80594,0.80882 -1.63048,1.13834 -2.42326,4.91284 -3.629,9.0404 -4.66784,12.42761 0.74035,1.10731 0.0182,6.66742 0.29742,11.11701 -1.21537,21.9794 15.42538,43.31794 33.6153,48.24362 2.66611,0.95539 6.62998,0.92116 10.00221,1.01531 -3.97778,-1.13835 -4.49132,-0.60234 -8.36852,-1.95359 -2.79557,-1.31808 -3.40754,-2.82124 -5.38893,-4.54052 l 0.78421,1.38548 c -3.88363,-1.37478 -2.25849,-1.70109 -5.41889,-2.70142 l 0.83771,-1.09234 c -1.25924,-0.0963 -3.33478,-2.12048 -3.90181,-3.24491 l -1.378,0.0546 c -1.65401,-2.03917 -2.53666,-3.51238 -2.47139,-4.65393 l -0.44507,0.79384 c -0.50391,-0.86552 -6.08863,-7.65812 -3.19142,-6.07686 -0.53815,-0.49 -1.25389,-0.79919 -2.02954,-2.21035 l 0.58949,-0.67294 c -1.3919,-1.79417 -2.56554,-4.09332 -2.47567,-4.85935 0.74356,1.00354 1.25923,1.19183 1.77063,1.36408 -3.52094,-8.73441 -3.71887,-0.48037 -6.38391,-8.89061 l 0.56275,-0.0449 c -0.43116,-0.65369 -0.69541,-1.35873 -1.04205,-2.05308 l 0.24607,-2.44465 c -2.53345,-2.92716 -0.70825,-12.45863 -0.34129,-17.68494 0.25142,-2.12476 2.11513,-4.38753 3.53057,-7.93629 l -0.86232,-0.14764 c 1.64974,-2.87581 9.41699,-11.55352 13.01604,-11.10846 1.74281,-2.18895 -0.34664,-0.009 -0.68793,-0.55847 3.82906,-3.96172 5.03267,-2.79878 7.6164,-3.51238 2.78487,-1.65295 -2.39116,0.6462 -1.07094,-0.63015 4.81762,-1.22928 3.41288,-2.79664 9.69623,-3.42037 0.66332,0.37659 -1.53741,0.582 -2.08946,1.07094 4.01201,-1.96429 12.69828,-1.51601 18.34291,1.08912 6.54439,3.0609 13.90189,12.1045 14.19289,20.61318 l 0.33059,0.0888 c -0.1669,3.38292 0.51782,7.29543 -0.67081,10.88806 l 0.80347,-1.70217"
           i:knockout="Off"
           inkscape:connector-curvature="0"
           style="fill:#d70751" />
        <path
           id="path4270-2-1"
           d="m 519.00763,611.89316 -0.22574,1.12016 c 1.05168,1.42827 1.88618,2.9753 3.22672,4.08797 -0.96502,-1.8819 -1.68076,-2.6597 -3.00098,-5.20813"
           i:knockout="Off"
           inkscape:connector-curvature="0"
           style="fill:#d70751" />
        <path
           id="path4272-9-0"
           d="m 521.4908,611.79687 c -0.55634,-0.61624 -0.88372,-1.35659 -1.25389,-2.09266 0.35306,1.29561 1.07629,2.40935 1.7471,3.54341 l -0.49321,-1.45075"
           i:knockout="Off"
           inkscape:connector-curvature="0"
           style="fill:#d70751" />
        <path
           id="path4274-7-2"
           d="m 565.44531,602.24294 -0.2343,0.59057 c -0.43009,3.05768 -1.36194,6.08328 -2.78701,8.88954 1.57485,-2.96033 2.59015,-6.19882 3.02131,-9.48011"
           i:knockout="Off"
           inkscape:connector-curvature="0"
           style="fill:#d70751" />
        <path
           id="path4276-1-2"
           d="m 530.712,559.20316 c 1.0795,-0.39478 2.65542,-0.21718 3.80446,-0.47716 -1.49568,0.12518 -2.98387,0.20007 -4.4528,0.38729 l 0.64834,0.0899"
           i:knockout="Off"
           inkscape:connector-curvature="0"
           style="fill:#d70751" />
        <path
           id="path4278-7-3"
           d="m 492.76266,579.38304 c 0.24928,2.3045 -1.73319,3.19998 0.43865,1.67863 1.16616,-2.62546 -0.45362,-0.72431 -0.43865,-1.67863"
           i:knockout="Off"
           inkscape:connector-curvature="0"
           style="fill:#d70751" />
        <path
           id="path4280-9-2"
           d="m 490.20782,590.05392 c 0.50176,-1.5374 0.59163,-2.45963 0.78314,-3.35083 -1.38334,1.76956 -0.63764,2.14722 -0.78314,3.35083"
           i:knockout="Off"
           inkscape:connector-curvature="0"
           style="fill:#d70751" />
      </g>
    </g>
  </g>
</svg>
