\relax 
\providecommand\hyper@newdestlabel[2]{}
\providecommand\HyperFirstAtBeginDocument{\AtBeginDocument}
\HyperFirstAtBeginDocument{\ifx\hyper@anchor\@undefined
\global\let\oldcontentsline\contentsline
\gdef\contentsline#1#2#3#4{\oldcontentsline{#1}{#2}{#3}}
\global\let\oldnewlabel\newlabel
\gdef\newlabel#1#2{\newlabelxx{#1}#2}
\gdef\newlabelxx#1#2#3#4#5#6{\oldnewlabel{#1}{{#2}{#3}}}
\AtEndDocument{\ifx\hyper@anchor\@undefined
\let\contentsline\oldcontentsline
\let\newlabel\oldnewlabel
\fi}
\fi}
\global\let\hyper@last\relax 
\gdef\HyperFirstAtBeginDocument#1{#1}
\providecommand*\HyPL@Entry[1]{}
\HyPL@Entry{0<</S/D>>}
\HyPL@Entry{1<</S/D>>}
\@writefile{toc}{\contentsline {section}{\numberline {1}Purpose of DebConf}{2}{section.1}}
\@writefile{toc}{\contentsline {section}{\numberline {2}Money matters: Fundraising and Expenses}{3}{section.2}}
\@writefile{toc}{\contentsline {subsection}{\numberline {2.1}Fundraising}{3}{subsection.2.1}}
\@writefile{toc}{\contentsline {section}{\numberline {3}DebConf 16 in Numbers}{4}{section.3}}
\@writefile{toc}{\contentsline {subsection}{\numberline {3.1}Attendees}{4}{subsection.3.1}}
\@writefile{toc}{\contentsline {subsection}{\numberline {3.2}Content}{4}{subsection.3.2}}
\@writefile{toc}{\contentsline {subsection}{\numberline {3.3}Food}{4}{subsection.3.3}}
\@writefile{toc}{\contentsline {subsection}{\numberline {3.4}General}{4}{subsection.3.4}}
\@writefile{toc}{\contentsline {subsection}{\numberline {3.5}People with blue hair}{5}{subsection.3.5}}
\@writefile{toc}{\contentsline {subsection}{\numberline {3.6}On a hill}{5}{subsection.3.6}}
\@writefile{toc}{\contentsline {subsection}{\numberline {3.7}New Debian Developers during DebConf}{5}{subsection.3.7}}
\@writefile{toc}{\contentsline {subsection}{\numberline {3.8}Video}{5}{subsection.3.8}}
\@writefile{toc}{\contentsline {subsection}{\numberline {3.9}Cheese and Wine}{5}{subsection.3.9}}
\@writefile{toc}{\contentsline {section}{\numberline {4}Video team}{6}{section.4}}
\@writefile{toc}{\contentsline {section}{\numberline {5}The 'shorts' -- venue, food, accommodation}{7}{section.5}}
\@writefile{toc}{\contentsline {subsection}{\numberline {5.1}Cheese and wine party}{7}{subsection.5.1}}
\@writefile{toc}{\contentsline {section}{\numberline {6}Content}{9}{section.6}}
\@writefile{toc}{\contentsline {section}{\numberline {7}Attendee impressions}{9}{section.7}}
\@writefile{toc}{\contentsline {section}{\numberline {8}Lessons learnt, what could have been improved}{10}{section.8}}
\@writefile{toc}{\contentsline {section}{\numberline {9}Credits}{10}{section.9}}
\@writefile{toc}{\contentsline {section}{\numberline {10}About Debian}{11}{section.10}}
\@writefile{toc}{\contentsline {subsection}{\numberline {10.1}What is Debian?}{11}{subsection.10.1}}
\@writefile{toc}{\contentsline {subsection}{\numberline {10.2}Be part of the project that ...}{11}{subsection.10.2}}
\@writefile{toc}{\contentsline {subsection}{\numberline {10.3}Get in touch}{11}{subsection.10.3}}
\@writefile{toc}{\contentsline {section}{\numberline {11}Sponsors}{12}{section.11}}
