%!PS-Adobe-2.0 EPSF-1.2
%%BoundingBox: 0 0 135 135
%%Pages: 1 1
%%EndComments
/p { moveto 0 1 rlineto 1 0 rlineto 0 -1 rlineto fill } bind def 3 3 scale 4 40 p 5 40 p 6 40 p 7 40 p 8 40 p 9 40 p 10 40 p 12 40 p 13 40 p 14 40 p 16 40 p 22 40 p 26 40 p 27 40 p 28 40 p 29 40 p 31 40 p 32 40 p 34 40 p 35 40 p 36 40 p 37 40 p 38 40 p 39 40 p 40 40 p 4 39 p 10 39 p 12 39 p 13 39 p 14 39 p 20 39 p 21 39 p 22 39 p 23 39 p 28 39 p 29 39 p 34 39 p 40 39 p 4 38 p 6 38 p 7 38 p 8 38 p 10 38 p 12 38 p 14 38 p 15 38 p 17 38 p 19 38 p 20 38 p 21 38 p 22 38 p 23 38 p 24 38 p 25 38 p 28 38 p 30 38 p 34 38 p 36 38 p 37 38 p 38 38 p 40 38 p 4 37 p 6 37 p 7 37 p 8 37 p 10 37 p 12 37 p 13 37 p 15 37 p 18 37 p 19 37 p 20 37 p 22 37 p 23 37 p 26 37 p 27 37 p 29 37 p 30 37 p 31 37 p 32 37 p 34 37 p 36 37 p 37 37 p 38 37 p 40 37 p 4 36 p 6 36 p 7 36 p 8 36 p 10 36 p 17 36 p 18 36 p 20 36 p 21 36 p 22 36 p 26 36 p 27 36 p 30 36 p 31 36 p 32 36 p 34 36 p 36 36 p 37 36 p 38 36 p 40 36 p 4 35 p 10 35 p 12 35 p 15 35 p 16 35 p 17 35 p 18 35 p 19 35 p 22 35 p 23 35 p 24 35 p 25 35 p 26 35 p 28 35 p 32 35 p 34 35 p 40 35 p 4 34 p 5 34 p 6 34 p 7 34 p 8 34 p 9 34 p 10 34 p 12 34 p 14 34 p 16 34 p 18 34 p 20 34 p 22 34 p 24 34 p 26 34 p 28 34 p 30 34 p 32 34 p 34 34 p 35 34 p 36 34 p 37 34 p 38 34 p 39 34 p 40 34 p 13 33 p 16 33 p 18 33 p 21 33 p 23 33 p 25 33 p 28 33 p 4 32 p 5 32 p 8 32 p 9 32 p 10 32 p 15 32 p 17 32 p 18 32 p 19 32 p 20 32 p 21 32 p 23 32 p 26 32 p 27 32 p 28 32 p 31 32 p 35 32 p 37 32 p 38 32 p 39 32 p 40 32 p 5 31 p 6 31 p 8 31 p 14 31 p 16 31 p 25 31 p 26 31 p 27 31 p 29 31 p 30 31 p 31 31 p 36 31 p 38 31 p 39 31 p 5 30 p 7 30 p 8 30 p 10 30 p 12 30 p 13 30 p 15 30 p 16 30 p 17 30 p 18 30 p 19 30 p 21 30 p 22 30 p 27 30 p 28 30 p 30 30 p 31 30 p 34 30 p 35 30 p 36 30 p 37 30 p 39 30 p 4 29 p 6 29 p 7 29 p 8 29 p 9 29 p 11 29 p 12 29 p 13 29 p 15 29 p 17 29 p 19 29 p 20 29 p 21 29 p 22 29 p 23 29 p 25 29 p 28 29 p 34 29 p 37 29 p 38 29 p 40 29 p 5 28 p 8 28 p 9 28 p 10 28 p 13 28 p 14 28 p 16 28 p 17 28 p 21 28 p 23 28 p 24 28 p 25 28 p 26 28 p 27 28 p 28 28 p 32 28 p 33 28 p 34 28 p 35 28 p 38 28 p 40 28 p 4 27 p 6 27 p 7 27 p 11 27 p 17 27 p 18 27 p 20 27 p 26 27 p 27 27 p 29 27 p 31 27 p 36 27 p 37 27 p 38 27 p 39 27 p 5 26 p 8 26 p 9 26 p 10 26 p 13 26 p 14 26 p 20 26 p 24 26 p 26 26 p 27 26 p 28 26 p 29 26 p 31 26 p 34 26 p 36 26 p 4 25 p 5 25 p 6 25 p 9 25 p 11 25 p 12 25 p 16 25 p 18 25 p 21 25 p 23 25 p 24 25 p 25 25 p 31 25 p 32 25 p 33 25 p 34 25 p 37 25 p 38 25 p 39 25 p 4 24 p 8 24 p 10 24 p 11 24 p 12 24 p 14 24 p 15 24 p 17 24 p 18 24 p 19 24 p 20 24 p 21 24 p 25 24 p 26 24 p 28 24 p 32 24 p 33 24 p 34 24 p 35 24 p 38 24 p 40 24 p 4 23 p 5 23 p 6 23 p 7 23 p 11 23 p 14 23 p 16 23 p 22 23 p 23 23 p 26 23 p 27 23 p 29 23 p 30 23 p 31 23 p 36 23 p 37 23 p 38 23 p 39 23 p 5 22 p 8 22 p 9 22 p 10 22 p 12 22 p 13 22 p 15 22 p 16 22 p 17 22 p 18 22 p 19 22 p 21 22 p 22 22 p 25 22 p 26 22 p 27 22 p 31 22 p 35 22 p 4 21 p 11 21 p 12 21 p 14 21 p 15 21 p 17 21 p 19 21 p 20 21 p 21 21 p 22 21 p 25 21 p 26 21 p 30 21 p 32 21 p 33 21 p 34 21 p 35 21 p 38 21 p 39 21 p 6 20 p 7 20 p 9 20 p 10 20 p 11 20 p 12 20 p 13 20 p 14 20 p 16 20 p 17 20 p 23 20 p 25 20 p 26 20 p 28 20 p 34 20 p 35 20 p 38 20 p 39 20 p 40 20 p 5 19 p 7 19 p 8 19 p 11 19 p 13 19 p 17 19 p 18 19 p 20 19 p 21 19 p 25 19 p 27 19 p 30 19 p 31 19 p 32 19 p 36 19 p 37 19 p 38 19 p 39 19 p 4 18 p 5 18 p 6 18 p 7 18 p 8 18 p 10 18 p 20 18 p 22 18 p 24 18 p 27 18 p 28 18 p 31 18 p 32 18 p 34 18 p 38 18 p 6 17 p 7 17 p 9 17 p 11 17 p 14 17 p 16 17 p 18 17 p 21 17 p 22 17 p 25 17 p 27 17 p 28 17 p 30 17 p 31 17 p 33 17 p 34 17 p 35 17 p 38 17 p 39 17 p 4 16 p 5 16 p 8 16 p 10 16 p 11 16 p 12 16 p 15 16 p 17 16 p 18 16 p 19 16 p 21 16 p 24 16 p 25 16 p 26 16 p 28 16 p 33 16 p 34 16 p 35 16 p 38 16 p 39 16 p 40 16 p 4 15 p 5 15 p 8 15 p 11 15 p 13 15 p 14 15 p 16 15 p 22 15 p 25 15 p 27 15 p 29 15 p 31 15 p 32 15 p 36 15 p 37 15 p 39 15 p 7 14 p 8 14 p 10 14 p 12 14 p 13 14 p 14 14 p 15 14 p 16 14 p 17 14 p 18 14 p 19 14 p 20 14 p 22 14 p 27 14 p 29 14 p 31 14 p 34 14 p 36 14 p 38 14 p 6 13 p 11 13 p 12 13 p 15 13 p 17 13 p 21 13 p 25 13 p 26 13 p 27 13 p 28 13 p 30 13 p 34 13 p 35 13 p 36 13 p 38 13 p 39 13 p 4 12 p 5 12 p 6 12 p 10 12 p 12 12 p 14 12 p 16 12 p 17 12 p 21 12 p 24 12 p 25 12 p 26 12 p 28 12 p 31 12 p 32 12 p 33 12 p 34 12 p 35 12 p 36 12 p 38 12 p 12 11 p 17 11 p 18 11 p 19 11 p 20 11 p 26 11 p 27 11 p 30 11 p 32 11 p 36 11 p 37 11 p 4 10 p 5 10 p 6 10 p 7 10 p 8 10 p 9 10 p 10 10 p 14 10 p 19 10 p 20 10 p 24 10 p 26 10 p 27 10 p 28 10 p 32 10 p 34 10 p 36 10 p 37 10 p 38 10 p 4 9 p 10 9 p 12 9 p 13 9 p 14 9 p 16 9 p 18 9 p 19 9 p 21 9 p 23 9 p 25 9 p 28 9 p 30 9 p 31 9 p 32 9 p 36 9 p 38 9 p 39 9 p 4 8 p 6 8 p 7 8 p 8 8 p 10 8 p 12 8 p 13 8 p 15 8 p 17 8 p 18 8 p 21 8 p 22 8 p 23 8 p 25 8 p 26 8 p 27 8 p 28 8 p 32 8 p 33 8 p 34 8 p 35 8 p 36 8 p 38 8 p 40 8 p 4 7 p 6 7 p 7 7 p 8 7 p 10 7 p 16 7 p 19 7 p 20 7 p 21 7 p 22 7 p 25 7 p 27 7 p 28 7 p 30 7 p 31 7 p 32 7 p 33 7 p 34 7 p 35 7 p 38 7 p 39 7 p 40 7 p 4 6 p 6 6 p 7 6 p 8 6 p 10 6 p 15 6 p 16 6 p 17 6 p 18 6 p 19 6 p 20 6 p 22 6 p 27 6 p 28 6 p 29 6 p 30 6 p 32 6 p 34 6 p 38 6 p 4 5 p 10 5 p 12 5 p 14 5 p 15 5 p 17 5 p 19 5 p 20 5 p 21 5 p 23 5 p 25 5 p 28 5 p 31 5 p 33 5 p 35 5 p 38 5 p 39 5 p 4 4 p 5 4 p 6 4 p 7 4 p 8 4 p 9 4 p 10 4 p 12 4 p 14 4 p 16 4 p 17 4 p 20 4 p 21 4 p 23 4 p 25 4 p 26 4 p 28 4 p 31 4 p 35 4 p 36 4 p 38 4 p 39 4 p 40 4 p 
%%EOF
