<?xml version="1.0" encoding="UTF-8" standalone="no"?>
<!-- Created with Inkscape (http://www.inkscape.org/) -->

<svg
   xmlns:dc="http://purl.org/dc/elements/1.1/"
   xmlns:cc="http://creativecommons.org/ns#"
   xmlns:rdf="http://www.w3.org/1999/02/22-rdf-syntax-ns#"
   xmlns:svg="http://www.w3.org/2000/svg"
   xmlns="http://www.w3.org/2000/svg"
   xmlns:sodipodi="http://sodipodi.sourceforge.net/DTD/sodipodi-0.dtd"
   xmlns:inkscape="http://www.inkscape.org/namespaces/inkscape"
   width="756.78711mm"
   height="373.0094mm"
   viewBox="0 0 2681.5291 1321.6868"
   id="svg4997"
   version="1.1"
   inkscape:version="0.91 r13725"
   sodipodi:docname="chopsticks-dynamic.svg"
   inkscape:export-filename="/Users/medicalwei/Desktop/chopsticks-dynamic.png"
   inkscape:export-xdpi="90"
   inkscape:export-ydpi="90">
  <defs
     id="defs4999" />
  <sodipodi:namedview
     id="base"
     pagecolor="#ffffff"
     bordercolor="#666666"
     borderopacity="1.0"
     inkscape:pageopacity="0.0"
     inkscape:pageshadow="2"
     inkscape:zoom="0.25"
     inkscape:cx="1104.2313"
     inkscape:cy="512.72839"
     inkscape:document-units="px"
     inkscape:current-layer="layer1"
     showgrid="false"
     inkscape:snap-bbox="true"
     inkscape:bbox-paths="true"
     inkscape:bbox-nodes="true"
     inkscape:snap-bbox-edge-midpoints="true"
     inkscape:snap-bbox-midpoints="true"
     inkscape:object-paths="true"
     inkscape:snap-intersection-paths="true"
     inkscape:object-nodes="true"
     inkscape:snap-smooth-nodes="true"
     inkscape:snap-midpoints="true"
     inkscape:window-width="1280"
     inkscape:window-height="707"
     inkscape:window-x="0"
     inkscape:window-y="1"
     inkscape:window-maximized="1"
     inkscape:snap-global="true"
     fit-margin-top="10"
     fit-margin-left="10"
     fit-margin-right="10"
     fit-margin-bottom="10"
     showguides="false">
    <inkscape:grid
       type="xygrid"
       id="grid5594"
       units="mm"
       spacingx="35.43307"
       spacingy="35.433069"
       originx="35.933071"
       originy="540.64615" />
  </sodipodi:namedview>
  <metadata
     id="metadata5002">
    <rdf:RDF>
      <cc:Work
         rdf:about="">
        <dc:format>image/svg+xml</dc:format>
        <dc:type
           rdf:resource="http://purl.org/dc/dcmitype/StillImage" />
        <dc:title />
      </cc:Work>
    </rdf:RDF>
  </metadata>
  <g
     inkscape:label="Layer 1"
     inkscape:groupmode="layer"
     id="layer1"
     transform="translate(35.933071,-271.32157)">
    <rect
       style="opacity:1;fill:#ffffff;fill-opacity:1;stroke:#000000;stroke-width:1.12134945;stroke-linecap:round;stroke-linejoin:round;stroke-miterlimit:4;stroke-dasharray:none;stroke-dashoffset:0;stroke-opacity:1"
       id="rect4305"
       width="708.0401"
       height="920.63849"
       x="0.060674742"
       y="343.76147" />
    <path
       style="opacity:1;fill:none;fill-rule:evenodd;stroke:#a80030;stroke-width:17.71241379;stroke-linecap:round;stroke-linejoin:miter;stroke-miterlimit:4;stroke-dasharray:none;stroke-opacity:1"
       d="M 455.6104,802.69834 C 384.91889,788.07006 325.80504,730.55427 308.61312,660.50897 c -12.55667,-43.35417 -11.03281,-103.18346 8.87151,-133.6979 23.09281,-39.45344 62.11475,-71.5132 108.29696,-77.92728 38.98347,-3.63853 79.45628,8.69324 110.62085,32.20316 34.97197,27.65839 42.63495,78.59728 29.5948,119.31727 -9.83329,31.07457 -35.50161,60.27624 -69.93425,62.19423 -37.00048,4.09453 -80.6816,-17.08605 -88.90004,-55.76535 -5.45342,-28.69342 11.6177,-61.78751 41.04397,-68.96113"
       id="path4977"
       inkscape:connector-curvature="0"
       sodipodi:nodetypes="ccccccccc" />
    <path
       style="fill:none;fill-rule:evenodd;stroke:#a80030;stroke-width:17.32762146;stroke-linecap:round;stroke-linejoin:miter;stroke-miterlimit:4;stroke-dasharray:none;stroke-opacity:1"
       d="m 141.73228,450.00003 0,502.39158"
       id="path5560"
       inkscape:connector-curvature="0" />
    <path
       style="fill:none;fill-rule:evenodd;stroke:#a80030;stroke-width:17.32762146;stroke-linecap:round;stroke-linejoin:miter;stroke-miterlimit:4;stroke-dasharray:none;stroke-opacity:1"
       d="m 177.16535,450.00003 0,502.39158"
       id="path5560-8"
       inkscape:connector-curvature="0" />
    <path
       style="fill:none;fill-rule:evenodd;stroke:#a80030;stroke-width:17.71241379;stroke-linecap:butt;stroke-linejoin:miter;stroke-miterlimit:4;stroke-dasharray:none;stroke-opacity:1"
       d="m 296.10952,812.56354 c 0,0 0,149.9651 149.9651,149.9651 149.9651,0 149.9651,-149.9651 149.9651,-149.9651"
       id="path5600"
       inkscape:connector-curvature="0"
       sodipodi:nodetypes="csc" />
    <ellipse
       style="opacity:1;fill:none;fill-opacity:1;stroke:#a80030;stroke-width:17.71241379;stroke-linecap:round;stroke-linejoin:round;stroke-miterlimit:4;stroke-dasharray:none;stroke-opacity:1"
       id="path5602"
       cx="446.07465"
       cy="812.56354"
       rx="149.9651"
       ry="49.988338" />
    <text
       xml:space="preserve"
       style="font-style:normal;font-weight:normal;font-size:40px;line-height:125%;font-family:Sans;text-align:center;letter-spacing:0px;word-spacing:0px;text-anchor:middle;fill:#a80030;fill-opacity:1;stroke:none;stroke-width:1px;stroke-linecap:butt;stroke-linejoin:miter;stroke-opacity:1"
       x="351.82584"
       y="1086.9164"
       id="text4139"
       sodipodi:linespacing="125%"><tspan
         sodipodi:role="line"
         id="tspan4141"
         x="351.82584"
         y="1086.9164"
         style="font-style:normal;font-variant:normal;font-weight:300;font-stretch:normal;font-size:90px;font-family:'Open Sans';-inkscape-font-specification:'Open Sans Light';text-align:center;text-anchor:middle;fill:#a80030;fill-opacity:1">DebConf<tspan
   style="font-style:normal;font-variant:normal;font-weight:normal;font-stretch:normal;font-family:'Open Sans';-inkscape-font-specification:'Open Sans'"
   id="tspan4303">18</tspan></tspan><tspan
         sodipodi:role="line"
         x="351.82584"
         y="1169.9838"
         style="font-style:normal;font-variant:normal;font-weight:normal;font-stretch:normal;font-size:60px;font-family:'Open Sans';-inkscape-font-specification:'Open Sans';text-align:center;text-anchor:middle;fill:#a80030;fill-opacity:1"
         id="tspan4301">Hsinchu, Taiwan</tspan></text>
    <path
       style="opacity:1;fill:none;fill-rule:evenodd;stroke:#a80030;stroke-width:17.71241379;stroke-linecap:round;stroke-linejoin:miter;stroke-miterlimit:4;stroke-dasharray:none;stroke-opacity:1"
       d="M 982.20009,807.04447 C 911.50858,792.41619 852.39473,734.9004 835.20281,664.8551 822.64614,621.50093 824.17,561.67164 844.07432,531.1572 c 23.09281,-39.45344 62.11475,-71.5132 108.29696,-77.92728 38.98347,-3.63853 79.45632,8.69324 110.62082,32.20316 34.972,27.65839 42.635,78.59728 29.5948,119.31727 -9.8333,31.07457 -35.5016,60.27624 -69.9342,62.19423 -37.0005,4.09453 -80.68162,-17.08605 -88.90006,-55.76535 -5.45342,-28.69342 11.6177,-61.78751 41.04397,-68.96113"
       id="path4977-2"
       inkscape:connector-curvature="0"
       sodipodi:nodetypes="ccccccccc" />
    <path
       style="fill:none;fill-rule:evenodd;stroke:#4b0080;stroke-width:17.32762146;stroke-linecap:round;stroke-linejoin:miter;stroke-miterlimit:4;stroke-dasharray:none;stroke-opacity:1"
       d="M 818.1131,324.39121 943.63989,810.84812"
       id="path5560-1"
       inkscape:connector-curvature="0" />
    <path
       style="fill:#000000;fill-rule:evenodd;stroke:#4b0080;stroke-width:17.32762146;stroke-linecap:round;stroke-linejoin:miter;stroke-miterlimit:4;stroke-dasharray:none;stroke-opacity:1;fill-opacity:1"
       d="M 852.42232,315.53796 977.94911,801.99487"
       id="path5560-8-7"
       inkscape:connector-curvature="0" />
    <path
       style="opacity:1;fill:none;fill-rule:evenodd;stroke:#a80030;stroke-width:17.71241379;stroke-linecap:round;stroke-linejoin:miter;stroke-miterlimit:4;stroke-dasharray:none;stroke-opacity:1"
       d="m 1652.4641,830.88131 c -70.6915,-14.6283 -129.8054,-72.1441 -146.9973,-142.1894 -12.5567,-43.3542 -11.0328,-103.18346 8.8715,-133.6979 23.0928,-39.45344 62.1147,-71.5132 108.297,-77.92728 38.9834,-3.63853 79.4562,8.69324 110.6208,32.20316 34.972,27.65839 42.635,78.59728 29.5948,119.31722 -9.8333,31.0746 -35.5016,60.2763 -69.9342,62.1943 -37.0005,4.0945 -80.6816,-17.0861 -88.9001,-55.7654 -5.4534,-28.6934 11.6177,-61.78748 41.044,-68.9611"
       id="path4977-7"
       inkscape:connector-curvature="0"
       sodipodi:nodetypes="ccccccccc" />
    <path
       style="fill:none;fill-rule:evenodd;stroke:#c100b1;stroke-width:17.32762146;stroke-linecap:round;stroke-linejoin:miter;stroke-miterlimit:4;stroke-dasharray:none;stroke-opacity:1"
       d="m 1304.8135,607.73214 430.2123,259.45084"
       id="path5560-6"
       inkscape:connector-curvature="0" />
    <path
       style="fill:none;fill-rule:evenodd;stroke:#c100b1;stroke-width:17.32762146;stroke-linecap:round;stroke-linejoin:miter;stroke-miterlimit:4;stroke-dasharray:none;stroke-opacity:1"
       d="M 1395.4241,494.66716 1751.879,848.69708"
       id="path5560-8-4"
       inkscape:connector-curvature="0"
       inkscape:transform-center-x="179.5048"
       inkscape:transform-center-y="-175.5506" />
    <path
       style="opacity:1;fill:none;fill-rule:evenodd;stroke:#a80030;stroke-width:17.71241379;stroke-linecap:round;stroke-linejoin:miter;stroke-miterlimit:4;stroke-dasharray:none;stroke-opacity:1"
       d="m 1193.422,1344.5712 c -30.6208,65.3731 -100.2758,109.5398 -172.3984,110.0219 -45.0842,2.1619 -102.9296,-13.193 -127.9972,-39.6302 -33.0238,-31.6115 -55.1618,-77.0036 -50.6928,-123.4145 5.4996,-38.7647 26.8797,-75.2751 56.975,-100.1392 35.0135,-27.6057 86.341,-23.2487 122.9276,-1.1222 27.9477,16.7706 50.4019,48.5103 44.2838,82.4492 -4.5964,36.9415 -35.3281,74.5211 -74.8588,73.547 -29.1759,-1.3483 -57.4099,-25.6276 -57.5649,-55.9153"
       id="path4977-7-5"
       inkscape:connector-curvature="0"
       sodipodi:nodetypes="ccccccccc" />
    <path
       style="fill:none;fill-rule:evenodd;stroke:#00aa6d;stroke-width:17.32762146;stroke-linecap:round;stroke-linejoin:miter;stroke-miterlimit:4;stroke-dasharray:none;stroke-opacity:1"
       d="m 1180.8268,1051.8413 -104.9397,491.3095"
       id="path5560-6-1"
       inkscape:connector-curvature="0" />
    <path
       style="fill:none;fill-rule:evenodd;stroke:#00aa6d;stroke-width:17.32762146;stroke-linecap:round;stroke-linejoin:miter;stroke-miterlimit:4;stroke-dasharray:none;stroke-opacity:1"
       d="m 1264.1762,1074.1973 -164.786,474.5976"
       id="path5560-8-4-0"
       inkscape:connector-curvature="0"
       inkscape:transform-center-x="-80.519941"
       inkscape:transform-center-y="-237.81613" />
    <path
       style="opacity:1;fill:none;fill-rule:evenodd;stroke:#a80030;stroke-width:17.71241379;stroke-linecap:round;stroke-linejoin:miter;stroke-miterlimit:4;stroke-dasharray:none;stroke-opacity:1"
       d="m 1771.4247,960.21863 c 53.4853,48.48287 75.2278,128.04277 54.49,197.12137 -11.1849,43.7282 -42.8636,94.5054 -75.501,110.6952 -39.9216,22.2737 -89.8156,30.092 -132.8629,12.1792 -35.436,-16.6506 -64.0496,-47.8176 -78.9697,-83.8917 -16.095,-41.5809 3.1559,-89.3605 35.0587,-117.8276 24.2444,-21.7839 61.1819,-33.9172 91.8234,-18.0939 33.9588,15.2513 60.8457,55.6711 48.2956,93.1694 -9.8642,27.4909 -41.3697,47.3415 -70.3652,38.5873"
       id="path4977-7-5-8"
       inkscape:connector-curvature="0"
       sodipodi:nodetypes="ccccccccc" />
    <path
       style="fill:none;fill-rule:evenodd;stroke:#009caa;stroke-width:17.32762146;stroke-linecap:round;stroke-linejoin:miter;stroke-miterlimit:4;stroke-dasharray:none;stroke-opacity:1"
       d="m 1495.4663,1433.6002 421.7562,-272.9819"
       id="path5560-6-1-3"
       inkscape:connector-curvature="0" />
    <path
       style="fill:none;fill-rule:evenodd;stroke:#009caa;stroke-width:17.32762146;stroke-linecap:round;stroke-linejoin:miter;stroke-miterlimit:4;stroke-dasharray:none;stroke-opacity:1"
       d="m 1452.3769,1358.8325 452.2282,-218.8311"
       id="path5560-8-4-0-0"
       inkscape:connector-curvature="0"
       inkscape:transform-center-x="225.15636"
       inkscape:transform-center-y="111.10625" />
    <path
       style="opacity:1;fill:none;fill-rule:evenodd;stroke:#a80030;stroke-width:17.71241379;stroke-linecap:round;stroke-linejoin:miter;stroke-miterlimit:4;stroke-dasharray:none;stroke-opacity:1"
       d="m 2388.2137,422.054 c 53.4853,48.4829 75.2278,128.0428 54.49,197.1214 -11.1849,43.7282 -42.8636,94.5054 -75.501,110.6952 -39.9216,22.2737 -89.8156,30.092 -132.8629,12.1792 -35.436,-16.6506 -64.0496,-47.8176 -78.9697,-83.8917 -16.095,-41.5809 3.1559,-89.3605 35.0587,-117.8276 24.2444,-21.7839 61.1819,-33.9172 91.8234,-18.0939 33.9588,15.2513 60.8457,55.6711 48.2956,93.1694 -9.8642,27.4909 -41.3697,47.3415 -70.3652,38.5873"
       id="path4977-7-5-8-2"
       inkscape:connector-curvature="0"
       sodipodi:nodetypes="ccccccccc" />
    <path
       style="fill:none;fill-rule:evenodd;stroke:#a7aa00;stroke-width:17.32762146;stroke-linecap:round;stroke-linejoin:miter;stroke-miterlimit:4;stroke-dasharray:none;stroke-opacity:1"
       d="m 2466.1452,829.6019 -256.219,-432.145"
       id="path5560-6-1-3-4"
       inkscape:connector-curvature="0" />
    <path
       style="fill:none;fill-rule:evenodd;stroke:#a7aa00;stroke-width:17.32762146;stroke-linecap:round;stroke-linejoin:miter;stroke-miterlimit:4;stroke-dasharray:none;stroke-opacity:1"
       d="M 2389.7439,869.7237 2188.8301,409.2554"
       id="path5560-8-4-0-0-4"
       inkscape:connector-curvature="0"
       inkscape:transform-center-x="-102.18394"
       inkscape:transform-center-y="229.34347" />
    <path
       style="opacity:1;fill:none;fill-rule:evenodd;stroke:#a80030;stroke-width:17.71241379;stroke-linecap:round;stroke-linejoin:miter;stroke-miterlimit:4;stroke-dasharray:none;stroke-opacity:1"
       d="m 2188.888,1186.2271 c 11.0109,-71.3444 65.4431,-133.3093 134.5225,-154.0445 42.6589,-14.7472 102.4882,-16.2708 133.9762,2.0544 40.5778,21.0545 74.5822,58.394 83.3388,104.1898 5.6182,38.7478 -4.6374,79.7958 -26.5304,112.1168 -25.8424,36.3344 -76.3252,46.5804 -117.6562,35.6299 -31.5349,-8.2389 -62.0053,-32.3874 -65.6735,-66.6777 -5.9726,-36.7441 12.9571,-81.4468 51.1678,-91.6234 28.3787,-6.907 62.2989,8.4573 70.961,37.4805"
       id="path4977-7-5-8-7"
       inkscape:connector-curvature="0"
       sodipodi:nodetypes="ccccccccc" />
    <path
       style="fill:none;fill-rule:evenodd;stroke:#c47800;stroke-width:17.32762146;stroke-linecap:round;stroke-linejoin:miter;stroke-miterlimit:4;stroke-dasharray:none;stroke-opacity:1"
       d="m 2101.1035,1384.0289 500.2729,-46.0923"
       id="path5560-6-1-3-7"
       inkscape:connector-curvature="0"
       inkscape:transform-center-x="252.9759"
       inkscape:transform-center-y="36.710284" />
    <path
       style="fill:none;fill-rule:evenodd;stroke:#c47800;stroke-width:17.32762146;stroke-linecap:round;stroke-linejoin:miter;stroke-miterlimit:4;stroke-dasharray:none;stroke-opacity:1"
       d="m 2096.9886,1331.3092 502.098,-17.1738"
       id="path5560-8-4-0-0-8"
       inkscape:connector-curvature="0"
       inkscape:transform-center-x="250.85716"
       inkscape:transform-center-y="10.5205" />
  </g>
</svg>
