<?xml version="1.0" encoding="UTF-8" standalone="no"?>
<!-- Created with Inkscape (http://www.inkscape.org/) -->

<svg
   xmlns:dc="http://purl.org/dc/elements/1.1/"
   xmlns:cc="http://creativecommons.org/ns#"
   xmlns:rdf="http://www.w3.org/1999/02/22-rdf-syntax-ns#"
   xmlns:svg="http://www.w3.org/2000/svg"
   xmlns="http://www.w3.org/2000/svg"
   xmlns:sodipodi="http://sodipodi.sourceforge.net/DTD/sodipodi-0.dtd"
   xmlns:inkscape="http://www.inkscape.org/namespaces/inkscape"
   width="210mm"
   height="297mm"
   viewBox="0 0 210 297"
   version="1.1"
   id="svg8"
   inkscape:version="0.92.3 (2405546, 2018-03-11)"
   sodipodi:docname="legend-vegan.svg">
  <defs
     id="defs2" />
  <sodipodi:namedview
     id="base"
     pagecolor="#ffffff"
     bordercolor="#666666"
     borderopacity="1.0"
     inkscape:pageopacity="0.0"
     inkscape:pageshadow="2"
     inkscape:zoom="0.32504293"
     inkscape:cx="306.50845"
     inkscape:cy="430.89301"
     inkscape:document-units="mm"
     inkscape:current-layer="layer1"
     showgrid="false"
     inkscape:window-width="1024"
     inkscape:window-height="718"
     inkscape:window-x="0"
     inkscape:window-y="29"
     inkscape:window-maximized="1" />
  <metadata
     id="metadata5">
    <rdf:RDF>
      <cc:Work
         rdf:about="">
        <dc:format>image/svg+xml</dc:format>
        <dc:type
           rdf:resource="http://purl.org/dc/dcmitype/StillImage" />
        <dc:title></dc:title>
      </cc:Work>
    </rdf:RDF>
  </metadata>
  <g
     inkscape:label="Layer 1"
     inkscape:groupmode="layer"
     id="layer1">
    <rect
       style="fill:#7570b3;fill-opacity:0.59215689;stroke-width:0.53020906"
       id="rect10-0"
       width="210"
       height="148.5"
       x="-1.4210855e-14"
       y="-1.9073486e-06"
       ry="0.19716778" />
    <path
       style="fill:#000000;fill-opacity:1;stroke:#000000;stroke-width:0.5945884;stroke-linecap:butt;stroke-linejoin:miter;stroke-miterlimit:4;stroke-dasharray:none;stroke-opacity:1"
       d="M -2.4999992e-8,74.249998 H 210"
       id="path865-5-0"
       inkscape:connector-curvature="0" />
    <text
       xml:space="preserve"
       style="font-style:normal;font-variant:normal;font-weight:normal;font-stretch:normal;font-size:25.39999962px;line-height:1.10000002;font-family:'Open Sans';-inkscape-font-specification:'Open Sans';letter-spacing:0px;word-spacing:0px;fill:#000000;fill-opacity:1;stroke:none;stroke-width:0.26458332"
       x="64.748192"
       y="101.69781"
       id="text961-7"><tspan
         sodipodi:role="line"
         x="64.748192"
         y="101.69781"
         style="font-size:25.39999962px;line-height:1.10000002;stroke-width:0.26458332"
         id="tspan1191">VEGAN</tspan></text>
    <path
       style="fill:#000000;fill-opacity:1;stroke:#000000;stroke-width:0.5945884;stroke-linecap:butt;stroke-linejoin:miter;stroke-miterlimit:4;stroke-dasharray:none;stroke-opacity:1"
       d="M 2.345e-6,148.5 H 210"
       id="path865-5-0-6"
       inkscape:connector-curvature="0" />
    <flowRoot
       xml:space="preserve"
       id="flowRoot1148"
       style="fill:black;fill-opacity:1;stroke:none;font-family:'Open Sans';font-style:normal;font-weight:normal;font-size:33.33333333px;line-height:1.25;letter-spacing:0px;word-spacing:0px;-inkscape-font-specification:'Open Sans';font-stretch:normal;font-variant:normal"><flowRegion
         id="flowRegion1150"><rect
           id="rect1152"
           width="21.754257"
           height="65.262772"
           x="565.61072"
           y="1183.4315" /></flowRegion><flowPara
         id="flowPara1154" /></flowRoot>    <text
       xml:space="preserve"
       style="font-style:normal;font-variant:normal;font-weight:normal;font-stretch:normal;font-size:25.39999962px;line-height:1.10000002;font-family:'Open Sans';-inkscape-font-specification:'Open Sans';letter-spacing:0px;word-spacing:0px;fill:#000000;fill-opacity:1;stroke:none;stroke-width:0.26458332"
       x="66.900002"
       y="135.94736"
       id="text961-7-7"><tspan
         sodipodi:role="line"
         x="66.900002"
         y="135.94736"
         style="font-size:25.39999962px;line-height:1.10000002;stroke-width:0.26458332"
         id="tspan1191-5">純素食</tspan></text>
    <text
       xml:space="preserve"
       style="font-style:normal;font-variant:normal;font-weight:normal;font-stretch:normal;font-size:25.39999962px;line-height:1.10000002;font-family:'Open Sans';-inkscape-font-specification:'Open Sans';letter-spacing:0px;word-spacing:0px;fill:#000000;fill-opacity:1;stroke:none;stroke-width:0.26458332"
       x="-145.2518"
       y="-41.620281"
       id="text961-7-9"
       transform="scale(-1)"><tspan
         sodipodi:role="line"
         x="-145.2518"
         y="-41.620281"
         style="font-size:25.39999962px;line-height:1.10000002;stroke-width:0.26458332"
         id="tspan1191-1">VEGAN</tspan></text>
    <text
       xml:space="preserve"
       style="font-style:normal;font-variant:normal;font-weight:normal;font-stretch:normal;font-size:25.39999962px;line-height:1.10000002;font-family:'Open Sans';-inkscape-font-specification:'Open Sans';letter-spacing:0px;word-spacing:0px;fill:#000000;fill-opacity:1;stroke:none;stroke-width:0.26458332"
       x="-143.10001"
       y="-7.3707352"
       id="text961-7-7-2"
       transform="scale(-1)"><tspan
         sodipodi:role="line"
         x="-143.10001"
         y="-7.3707352"
         style="font-size:25.39999962px;line-height:1.10000002;stroke-width:0.26458332"
         id="tspan1191-5-7">純素食</tspan></text>
    <rect
       style="fill:#7570b3;fill-opacity:0.59215686;stroke-width:0.53020906"
       id="rect10-0-0"
       width="210"
       height="148.5"
       x="2.345e-06"
       y="148.5"
       ry="0.1971678" />
    <path
       style="fill:#000000;fill-opacity:1;stroke:#000000;stroke-width:0.5945884;stroke-linecap:butt;stroke-linejoin:miter;stroke-miterlimit:4;stroke-dasharray:none;stroke-opacity:1"
       d="M -5.9460156e-6,222.74999 H 209.99999"
       id="path865-5-0-9"
       inkscape:connector-curvature="0" />
    <text
       xml:space="preserve"
       style="font-style:normal;font-variant:normal;font-weight:normal;font-stretch:normal;font-size:25.39999962px;line-height:1.10000002;font-family:'Open Sans';-inkscape-font-specification:'Open Sans';letter-spacing:0px;word-spacing:0px;fill:#000000;fill-opacity:1;stroke:none;stroke-width:0.26458332"
       x="64.748184"
       y="250.1978"
       id="text961-7-3"><tspan
         sodipodi:role="line"
         x="64.748184"
         y="250.1978"
         style="font-size:25.39999962px;line-height:1.10000002;stroke-width:0.26458332"
         id="tspan1191-6">VEGAN</tspan></text>
    <path
       style="fill:#000000;fill-opacity:1;stroke:#000000;stroke-width:0.5945884;stroke-linecap:butt;stroke-linejoin:miter;stroke-miterlimit:4;stroke-dasharray:none;stroke-opacity:1"
       d="M -5.9460156e-6,296.99999 H 209.99999"
       id="path865-5-0-6-0"
       inkscape:connector-curvature="0" />
    <text
       xml:space="preserve"
       style="font-style:normal;font-variant:normal;font-weight:normal;font-stretch:normal;font-size:25.39999962px;line-height:1.10000002;font-family:'Open Sans';-inkscape-font-specification:'Open Sans';letter-spacing:0px;word-spacing:0px;fill:#000000;fill-opacity:1;stroke:none;stroke-width:0.26458332"
       x="66.899994"
       y="284.44733"
       id="text961-7-7-6"><tspan
         sodipodi:role="line"
         x="66.899994"
         y="284.44733"
         style="font-size:25.39999962px;line-height:1.10000002;stroke-width:0.26458332"
         id="tspan1191-5-2">純素食</tspan></text>
    <text
       xml:space="preserve"
       style="font-style:normal;font-variant:normal;font-weight:normal;font-stretch:normal;font-size:25.39999962px;line-height:1.10000002;font-family:'Open Sans';-inkscape-font-specification:'Open Sans';letter-spacing:0px;word-spacing:0px;fill:#000000;fill-opacity:1;stroke:none;stroke-width:0.26458332"
       x="-145.2518"
       y="-190.12029"
       id="text961-7-9-6"
       transform="scale(-1)"><tspan
         sodipodi:role="line"
         x="-145.2518"
         y="-190.12029"
         style="font-size:25.39999962px;line-height:1.10000002;stroke-width:0.26458332"
         id="tspan1191-1-1">VEGAN</tspan></text>
    <text
       xml:space="preserve"
       style="font-style:normal;font-variant:normal;font-weight:normal;font-stretch:normal;font-size:25.39999962px;line-height:1.10000002;font-family:'Open Sans';-inkscape-font-specification:'Open Sans';letter-spacing:0px;word-spacing:0px;fill:#000000;fill-opacity:1;stroke:none;stroke-width:0.26458332"
       x="-143.10001"
       y="-155.87073"
       id="text961-7-7-2-8"
       transform="scale(-1)"><tspan
         sodipodi:role="line"
         x="-143.10001"
         y="-155.87073"
         style="font-size:25.39999962px;line-height:1.10000002;stroke-width:0.26458332"
         id="tspan1191-5-7-7">純素食</tspan></text>
  </g>
</svg>
