Date,Total,Receipt No.,Details (zh),English
2018/08/04,36,EW22652709,"4x6專用紙-6元x6=36.00,
",Photo Paper
2018/08/03,165,FC40976442,"林鳳營低脂鮮乳９３６x1=93.00,
林鳳營低脂鮮乳９３６x1=93.00,
低溫促x1=-21.00,
",Milk
2018/08/03,108,FQ78472301,"林鳳營936ml全脂x1=93.00,
義美巧克力夾心酥x1=35.00,
新草莓夾心x1=28.00,
新草莓夾心x-1=-28.00,
","Milk, Dessert"
2018/08/02,276,EX57239838,"瑞穗鮮乳930ml(盒)x3=276.00,
紅牛點數x5=0.00,
",Milk
2018/07/31,1557,FN33739851,"【113F 12095001】９５無鉛汽油x51.3700=1557.00,
",Gasoline
2018/07/31,165,FC40972907,"林鳳營全脂鮮乳９３６x2=186.00,
低溫促x1=-21.00,
",Milk
2018/07/31,276,EX57237677,"瑞穗鮮乳930ml(盒)x3=276.00,
",Milk
2018/07/30,84,EX57236774,"冠億二號砂糖x3=96.00,
折扣（12％）x1=-12.00,
",Sugar
2018/07/30,276,EX57234083,"瑞穗低脂鮮乳930ml(盒)x3=276.00,
",Milk
2018/07/29,340,EX57231347,"Pure Source澳洲進口鮮乳1Lx2=278.00,
統一陽光陽光黃金豆豆漿900mlx2=70.00,
折扣（12％）x1=-8.00,
Snoopy點數x6=0.00,
","Milk, Soy Milk"
2018/07/28,264,EW55745490,"瑞穗鮮乳930ml(盒)x2=184.00,
統一陽光陽光黃金豆豆漿900mlx1=35.00,
拿鐵冰咖啡(中)x1=45.00,
Snoopy點數x5=0.00,
","Milk, Soy Milk, Coffee"
2018/07/28,62,EX57230726,"統一陽光陽光黃金豆豆漿900mlx2=70.00,
折扣（12％）x1=-8.00,
Snoopy點數x1=0.00,
",Soy Milk
2018/07/28,368,EX57230731,"瑞穗鮮乳930ml(盒)x4=368.00,
Snoopy點數x7=0.00,
",Milk
2018/07/27,148,FC40969618,"特級砂糖x1=32.00,
精製二砂x1=32.00,
林鳳營低脂鮮乳９３６x1=93.00,
小計折扣-15%x1=-9.00,
","Sugar, Milk"
2018/07/26,93,FC40967047,"林鳳營全脂鮮乳９３６x1=93.00,
",Milk
2018/07/25,93,FC40966239,"林鳳營低脂鮮乳９３６x1=93.00,
",Milk
2018/07/25,119,FC40964807,"林鳳營低脂鮮乳９３６x1=93.00,
光泉巧克力牛乳x1=30.00,
小計折扣-15%x1=-4.00,
","Milk, Chocolate Milk"
2018/07/24,1197,FV33777406,"6-RIB EP 12m S654410x1=399.00,
6-RIB EP 12m S654410x1=399.00,
6-RIB EP 12m S654410x1=399.00,
",Label Printer Tape
2018/07/21,99,FC40962250,"（串）抽取式衛生紙x1=200.00,
日用促x1=-101.00,
",Toilet Paper
