<?xml version="1.0" encoding="UTF-8" standalone="no"?>
<!-- Created with Inkscape (http://www.inkscape.org/) -->

<svg
   xmlns:dc="http://purl.org/dc/elements/1.1/"
   xmlns:cc="http://creativecommons.org/ns#"
   xmlns:rdf="http://www.w3.org/1999/02/22-rdf-syntax-ns#"
   xmlns:svg="http://www.w3.org/2000/svg"
   xmlns="http://www.w3.org/2000/svg"
   xmlns:sodipodi="http://sodipodi.sourceforge.net/DTD/sodipodi-0.dtd"
   xmlns:inkscape="http://www.inkscape.org/namespaces/inkscape"
   width="64"
   height="92"
   viewBox="0 0 64.000001 91.999992"
   id="svg4997"
   version="1.1"
   inkscape:version="0.91 r13725"
   sodipodi:docname="chopsticks-v2-alt.svg"
   inkscape:export-filename="/Users/medicalwei/Desktop/chopsticks-v2-alt.png"
   inkscape:export-xdpi="1800"
   inkscape:export-ydpi="1800">
  <defs
     id="defs4999" />
  <sodipodi:namedview
     id="base"
     pagecolor="#ffffff"
     bordercolor="#666666"
     borderopacity="1.0"
     inkscape:pageopacity="0.0"
     inkscape:pageshadow="2"
     inkscape:zoom="8"
     inkscape:cx="34.137248"
     inkscape:cy="53.773029"
     inkscape:document-units="px"
     inkscape:current-layer="layer1"
     showgrid="true"
     inkscape:snap-bbox="true"
     inkscape:bbox-paths="true"
     inkscape:bbox-nodes="true"
     inkscape:snap-bbox-edge-midpoints="true"
     inkscape:snap-bbox-midpoints="true"
     inkscape:object-paths="true"
     inkscape:snap-intersection-paths="true"
     inkscape:object-nodes="true"
     inkscape:snap-smooth-nodes="true"
     inkscape:snap-midpoints="true"
     inkscape:window-width="1280"
     inkscape:window-height="756"
     inkscape:window-x="0"
     inkscape:window-y="1"
     inkscape:window-maximized="0"
     inkscape:snap-global="true"
     fit-margin-top="10"
     fit-margin-left="10"
     fit-margin-right="10"
     fit-margin-bottom="10"
     showguides="true"
     units="px"
     inkscape:guide-bbox="true">
    <inkscape:grid
       type="xygrid"
       id="grid5594"
       units="px"
       spacingx="1"
       spacingy="0.99999992"
       originx="0"
       originy="0"
       empspacing="4"
       enabled="true"
       visible="true"
       snapvisiblegridlinesonly="true" />
    <sodipodi:guide
       position="0,23.999998"
       orientation="0,1"
       id="guide4162" />
  </sodipodi:namedview>
  <metadata
     id="metadata5002">
    <rdf:RDF>
      <cc:Work
         rdf:about="">
        <dc:format>image/svg+xml</dc:format>
        <dc:type
           rdf:resource="http://purl.org/dc/dcmitype/StillImage" />
        <dc:title></dc:title>
      </cc:Work>
    </rdf:RDF>
  </metadata>
  <g
     inkscape:label="Layer 1"
     inkscape:groupmode="layer"
     id="layer1"
     transform="translate(10.5,-1182.9607)">
    <path
       style="color:#000000;font-style:normal;font-variant:normal;font-weight:normal;font-stretch:normal;font-size:medium;line-height:normal;font-family:sans-serif;text-indent:0;text-align:start;text-decoration:none;text-decoration-line:none;text-decoration-style:solid;text-decoration-color:#000000;letter-spacing:normal;word-spacing:normal;text-transform:none;direction:ltr;block-progression:tb;writing-mode:lr-tb;baseline-shift:baseline;text-anchor:start;white-space:normal;clip-rule:nonzero;display:inline;overflow:visible;visibility:visible;opacity:1;isolation:auto;mix-blend-mode:normal;color-interpolation:sRGB;color-interpolation-filters:linearRGB;solid-color:#000000;solid-opacity:1;fill:#4b0080;fill-opacity:1;fill-rule:nonzero;stroke:none;stroke-width:2;stroke-linecap:round;stroke-linejoin:round;stroke-miterlimit:4;stroke-dasharray:none;stroke-dashoffset:0;stroke-opacity:1;color-rendering:auto;image-rendering:auto;shape-rendering:auto;text-rendering:auto;enable-background:accumulate"
       d="M 38 38.476562 C 36.265524 38.476562 34.60406 38.572303 33.042969 38.744141 C 33.96411 39.348984 35.016983 39.939965 36.212891 40.515625 C 36.799981 40.492302 37.39344 40.476562 38 40.476562 C 42.070024 40.476562 45.755223 41.020222 48.337891 41.857422 C 49.629224 42.276022 50.641411 42.775053 51.263672 43.251953 C 51.885933 43.728853 52.056645 44.100322 52.056641 44.357422 A 1.0001 1.0001 0 1 0 54.056641 44.357422 C 54.056658 43.266722 53.38195 42.354963 52.480469 41.664062 C 51.578988 40.973162 50.388348 40.419678 48.955078 39.955078 C 46.088538 39.025878 42.245212 38.476562 38 38.476562 z M 27.826172 39.724609 C 27.56154 39.799795 27.29506 39.873995 27.044922 39.955078 C 25.611652 40.419678 24.421012 40.973162 23.519531 41.664062 C 22.61805 42.354963 21.943342 43.266722 21.943359 44.357422 A 1.0001 1.0001 0 1 0 23.943359 44.357422 C 23.943355 44.100322 24.114067 43.728853 24.736328 43.251953 C 25.358589 42.775053 26.370776 42.276022 27.662109 41.857422 C 28.28628 41.65509 28.977871 41.471155 29.720703 41.306641 C 29.027781 40.796137 28.408591 40.265383 27.826172 39.724609 z "
       transform="translate(-10.5,1182.9607)"
       id="path4314" />
    <path
       style="color:#000000;font-style:normal;font-variant:normal;font-weight:normal;font-stretch:normal;font-size:medium;line-height:normal;font-family:sans-serif;text-indent:0;text-align:start;text-decoration:none;text-decoration-line:none;text-decoration-style:solid;text-decoration-color:#000000;letter-spacing:normal;word-spacing:normal;text-transform:none;direction:ltr;block-progression:tb;writing-mode:lr-tb;baseline-shift:baseline;text-anchor:start;white-space:normal;clip-rule:nonzero;display:inline;overflow:visible;visibility:visible;opacity:1;isolation:auto;mix-blend-mode:normal;color-interpolation:sRGB;color-interpolation-filters:linearRGB;solid-color:#000000;solid-opacity:1;fill:#4b0080;fill-opacity:1;fill-rule:nonzero;stroke:none;stroke-width:2;stroke-linecap:round;stroke-linejoin:round;stroke-miterlimit:4;stroke-dasharray:none;stroke-dashoffset:0;stroke-opacity:1;color-rendering:auto;image-rendering:auto;shape-rendering:auto;text-rendering:auto;enable-background:accumulate"
       d="m 12.400391,1226.334 c -0.529431,0.023 -0.949202,0.4545 -0.957032,0.9844 0,0 -0.01182,3.8777 1.994141,7.7793 2.00596,3.9015 6.210333,7.8632 14.0625,7.8632 7.852168,0 12.056538,-3.9617 14.0625,-7.8632 2.005962,-3.9016 1.994141,-7.7793 1.994141,-7.7793 -0.01859,-1.3146 -1.981408,-1.3146 -2,0 4e-6,0.257 -0.170708,0.6305 -0.792969,1.1074 -0.622262,0.4769 -1.634446,0.974 -2.925781,1.3926 -2.58267,0.8372 -6.267867,1.3808 -10.337891,1.3808 -4.070024,0 -7.75522,-0.5436 -10.337891,-1.3808 -1.291335,-0.4186 -2.303518,-0.9157 -2.925781,-1.3926 -0.622262,-0.4769 -0.792973,-0.8504 -0.792969,-1.1074 -0.0083,-0.5633 -0.480098,-1.0086 -1.042968,-0.9844 z"
       id="path5602"
       inkscape:connector-curvature="0"
       sodipodi:nodetypes="ccsssccssssscc" />
    <text
       xml:space="preserve"
       style="font-style:normal;font-weight:normal;font-size:4.00842428px;line-height:125%;font-family:Sans;text-align:center;letter-spacing:0px;word-spacing:0px;text-anchor:middle;fill:#a80030;fill-opacity:1;stroke:none;stroke-width:1px;stroke-linecap:butt;stroke-linejoin:miter;stroke-opacity:1"
       x="21.376221"
       y="1257.8638"
       id="text4139"
       sodipodi:linespacing="125%"><tspan
         sodipodi:role="line"
         id="tspan4141"
         x="21.376221"
         y="1257.8638"
         style="font-style:normal;font-variant:normal;font-weight:300;font-stretch:normal;font-size:9px;font-family:'Open Sans';-inkscape-font-specification:'Open Sans Light';text-align:center;text-anchor:middle;fill:#a80030;fill-opacity:1"><tspan
           style="fill:#4b0080;fill-opacity:1"
           id="tspan4272">DebConf</tspan><tspan
           style="font-style:normal;font-variant:normal;font-weight:normal;font-stretch:normal;font-size:9px;font-family:'Open Sans';-inkscape-font-specification:'Open Sans'"
           id="tspan4303"
           dx="0.5 -1">18</tspan></tspan><tspan
         sodipodi:role="line"
         x="21.376221"
         y="1266.1705"
         style="font-style:normal;font-variant:normal;font-weight:normal;font-stretch:normal;font-size:6px;font-family:'Open Sans';-inkscape-font-specification:'Open Sans';text-align:center;text-anchor:middle;fill:#a80030;fill-opacity:1"
         id="tspan4301">Hsinchu, Taiwan</tspan></text>
    <path
       style="opacity:1;fill:#a80030;fill-opacity:1;stroke:none;stroke-width:1;stroke-linecap:round;stroke-linejoin:round;stroke-miterlimit:4;stroke-dasharray:none;stroke-dashoffset:0;stroke-opacity:1"
       d="m 1.5000002,1190.8375 0.9999999,0 c 0.554,0 1,0.446 1,1 l 0,49 c 0,0.554 0.054,2.1232 -1.0000003,2.1232 -1.0539999,0 -0.9886957,-1.5693 -0.9999996,-2.1232 l -0.99999996,-49 c -0.011304,-0.5539 0.446,-1 0.99999996,-1 z"
       id="rect4166"
       inkscape:connector-curvature="0"
       sodipodi:nodetypes="sssscsss" />
    <path
       style="opacity:1;fill:#a80030;fill-opacity:1;stroke:none;stroke-width:1;stroke-linecap:round;stroke-linejoin:round;stroke-miterlimit:4;stroke-dasharray:none;stroke-dashoffset:0;stroke-opacity:1"
       d="m 6.5000001,1190.8375 1,0 c 0.554,0 1.011304,0.4461 1,1 l -1,49 c -0.011304,0.5539 0.054,2.1232 -1.0000004,2.1232 -1.054,0 -0.9999996,-1.5692 -0.9999996,-2.1232 l 0,-49 c 0,-0.554 0.446,-1 1,-1 z"
       id="rect4166-4"
       inkscape:connector-curvature="0"
       sodipodi:nodetypes="sssscsss" />
    <path
       style="opacity:1;fill:none;fill-rule:evenodd;stroke:#a80030;stroke-width:2;stroke-linecap:round;stroke-linejoin:miter;stroke-miterlimit:4;stroke-dasharray:none;stroke-opacity:1"
       d="m 28.499999,1226.8375 c -13.466759,-5.0072 -14.981784,-12.0282 -14.999999,-20 -0.01821,-7.9718 7.999999,-15 14.999999,-15 7,0 11,5 11,11 0,6 -4.345565,9.9518 -9,10 -4.654435,0.048 -7,-3.5 -7,-7 0,-3.5 3,-5 5,-5"
       id="path4977"
       inkscape:connector-curvature="0"
       sodipodi:nodetypes="czzzzzc" />
  </g>
</svg>
