"item","name","desc","china","title","color","name2","desc2","china2","title2","color2"
"bf1","Plain brown rice porridge","(congee)","糙米稀飯","VEGAN 全素","#1b9e77","Pork and rice stew",,"滷肉飯","REGULAR","#000000"
"bf2","Pickled cucumbers",,"醬瓜","VEGAN 全素","#1b9e77","Soup dumpling"," (pork)","小籠湯包(肉)","REGULAR","#000000"
"bf3","Salt-brined hard-boiled eggs",,"鹹蛋","VEGETARIAN 奶蛋素","#f3b618","Steamed buns filled with meat","(pork)","肉包/菜包","REGULAR","#000000"
"bf4","Four seasonal vegetables dishes",,"季節時蔬四樣","VEGAN 全素","#1b9e77","Steamed bread, Toasts","(white bread,whole bread)","饅頭 /土司(白吐司,全麥吐司)","VEGAN 全素","#1b9e77"
"l1","Grilled salmon",,"蒲燒鯛魚片 （鯛魚清肉)","REGULAR","#000000","Stir-fried seasonal vegetables dish"," (varies with local market arrival)","季節炒時蔬 （當日青菜)","VEGAN 全素","#1b9e77"
"l2","Pork and black pepper","（onions)","黑胡椒肉絲 （洋蔥，肉絲)","REGULAR","#000000","Pork liver and ginger soup",,"薑絲豬肝湯 （薑絲，豬肝）","REGULAR","#000000"
"l3","Braised pumpkins, shrimps and squid",,"南瓜燴雙鮮 （南瓜，蝦仁，尤魚)","REGULAR","#000000","Plain brown rice",,"養生糙米飯 （糙米)","VEGAN 全素","#1b9e77"
"l4","Scallions omelet",,"三星蔥煎蛋 （蔥，雞蛋)","VEGETARIAN 奶蛋素","#f3b618","Summer fruits"," (varies with local market arrival)","夏季鮮水果 （當日水果)","VEGAN 全素","#1b9e77"
"d1","Taiwanese old-style pork ","（pork, carrots)","古早味控肉 （五花肉，紅白蘿蔔)","REGULAR","#000000","Stir-fried seasonal vegetables dish"," (varies with local market arrival)","季節炒時蔬 （當日青菜)","VEGAN 全素","#1b9e77"
"d2","Hakka-style braised bamboo shoots and cabbage",,"客家悶桂筍 （桂竹筍，福菜）","VEGAN 全素","#1b9e77","Bitter squash and pork short ribs soup",,"苦瓜排骨湯 （苦瓜，湯排)","REGULAR","#000000"
"d3","Stir-fried pineapple and wood ear mushrooms",,"鳳梨炒木耳 （鳳梨，木耳)","VEGAN 全素","#1b9e77","Brown rice and sweet potatoes",,"糙米地瓜飯 （糙米，地瓜)","VEGAN 全素","#1b9e77"
"d4","Fried spring rolls",,"酥炸脆春捲 （春捲)","REGULAR","#000000","Summer fruits"," (varies with local market arrival)","夏季鮮水果 （當天水果)","VEGAN 全素","#1b9e77"
