<?xml version="1.0" encoding="UTF-8" standalone="no"?>
<!-- Created with Inkscape (http://www.inkscape.org/) -->

<svg
   xmlns:dc="http://purl.org/dc/elements/1.1/"
   xmlns:cc="http://creativecommons.org/ns#"
   xmlns:rdf="http://www.w3.org/1999/02/22-rdf-syntax-ns#"
   xmlns:svg="http://www.w3.org/2000/svg"
   xmlns="http://www.w3.org/2000/svg"
   xmlns:xlink="http://www.w3.org/1999/xlink"
   xmlns:sodipodi="http://sodipodi.sourceforge.net/DTD/sodipodi-0.dtd"
   xmlns:inkscape="http://www.inkscape.org/namespaces/inkscape"
   width="210mm"
   height="297mm"
   viewBox="0 0 210 297"
   version="1.1"
   id="svg8"
   inkscape:version="0.92.3 (2405546, 2018-03-11)"
   sodipodi:docname="B5-B6.svg">
  <defs
     id="defs2" />
  <sodipodi:namedview
     id="base"
     pagecolor="#ffffff"
     bordercolor="#666666"
     borderopacity="1.0"
     inkscape:pageopacity="0.0"
     inkscape:pageshadow="2"
     inkscape:zoom="1"
     inkscape:cx="338.97203"
     inkscape:cy="503.24572"
     inkscape:document-units="mm"
     inkscape:current-layer="layer1"
     showgrid="false"
     inkscape:window-width="1024"
     inkscape:window-height="718"
     inkscape:window-x="0"
     inkscape:window-y="29"
     inkscape:window-maximized="1"
     inkscape:snap-page="true"
     inkscape:snap-bbox="true"
     showguides="true"
     inkscape:guide-bbox="true">
    <sodipodi:guide
       position="30.572688,20.929774"
       orientation="1,0"
       id="guide1054"
       inkscape:locked="false" />
    <sodipodi:guide
       position="30.572688,20.929774"
       orientation="0,1"
       id="guide1157"
       inkscape:locked="false" />
    <sodipodi:guide
       position="10.877482,20.929774"
       orientation="1,0"
       id="guide1159"
       inkscape:locked="false" />
    <sodipodi:guide
       position="30.572688,3.8447818"
       orientation="0,1"
       id="guide1161"
       inkscape:locked="false" />
    <sodipodi:guide
       position="10.877486,152.34475"
       orientation="0,1"
       id="guide1468"
       inkscape:locked="false" />
    <sodipodi:guide
       position="10.877486,169.42978"
       orientation="0,1"
       id="guide1470"
       inkscape:locked="false" />
  </sodipodi:namedview>
  <metadata
     id="metadata5">
    <rdf:RDF>
      <cc:Work
         rdf:about="">
        <dc:format>image/svg+xml</dc:format>
        <dc:type
           rdf:resource="http://purl.org/dc/dcmitype/StillImage" />
        <dc:title></dc:title>
      </cc:Work>
    </rdf:RDF>
  </metadata>
  <g
     inkscape:label="Layer 1"
     inkscape:groupmode="layer"
     id="layer1">
    <flowRoot
       xml:space="preserve"
       id="flowRoot1148"
       style="font-style:normal;font-variant:normal;font-weight:normal;font-stretch:normal;font-size:33.33333206px;line-height:1.25;font-family:'Open Sans';-inkscape-font-specification:'Open Sans';letter-spacing:0px;word-spacing:0px;fill:#000000;fill-opacity:1;stroke:none"><flowRegion
         id="flowRegion1150"><rect
           id="rect1152"
           width="21.754257"
           height="65.262772"
           x="565.61072"
           y="1183.4315" /></flowRegion><flowPara
         id="flowPara1154" /></flowRoot>    <text
       xml:space="preserve"
       style="font-style:normal;font-variant:normal;font-weight:normal;font-stretch:normal;font-size:25.39999962px;line-height:2.82222223px;font-family:'Open Sans';-inkscape-font-specification:'Open Sans';text-align:center;letter-spacing:0px;word-spacing:0px;text-anchor:middle;fill:#000000;fill-opacity:1;stroke:none;stroke-width:0.26458332"
       x="90.222916"
       y="102.53125"
       id="text998"><tspan
         sodipodi:role="line"
         id="tspan996"
         x="90.222916"
         y="110.57301"
         style="font-size:25.39999962px;stroke-width:0.26458332" /></text>
    <text
       xml:space="preserve"
       style="font-style:normal;font-variant:normal;font-weight:normal;font-stretch:normal;font-size:22.57777786px;line-height:2.82222223px;font-family:'Open Sans';-inkscape-font-specification:'Open Sans';text-align:center;letter-spacing:0px;word-spacing:0px;text-anchor:middle;fill:#000000;fill-opacity:1;stroke:none;stroke-width:0.26458332"
       x="47.625"
       y="116.28958"
       id="text1002"><tspan
         sodipodi:role="line"
         id="tspan1000"
         x="47.625"
         y="123.5946"
         style="font-size:22.57777786px;stroke-width:0.26458332" /></text>
    <text
       xml:space="preserve"
       style="font-style:normal;font-variant:normal;font-weight:normal;font-stretch:normal;font-size:19.75555611px;line-height:2.82222223px;font-family:'Open Sans';-inkscape-font-specification:'Open Sans';text-align:center;letter-spacing:0px;word-spacing:0px;text-anchor:middle;fill:#000000;fill-opacity:1;stroke:none;stroke-width:0.26458332"
       x="52.387501"
       y="99.356247"
       id="text1006"><tspan
         sodipodi:role="line"
         id="tspan1004"
         x="52.387501"
         y="105.92453"
         style="font-size:19.75555611px;stroke-width:0.26458332" /></text>
    <text
       xml:space="preserve"
       style="font-style:normal;font-variant:normal;font-weight:normal;font-stretch:normal;font-size:19.7555542px;line-height:2.82222223px;font-family:'Open Sans';-inkscape-font-specification:'Open Sans';text-align:center;letter-spacing:0px;word-spacing:0px;text-anchor:middle;fill:#000000;fill-opacity:1;stroke:none;stroke-width:0.26458332"
       x="53.181248"
       y="118.40625"
       id="text1010"><tspan
         sodipodi:role="line"
         id="tspan1008"
         x="53.181248"
         y="124.97453"
         style="stroke-width:0.26458332" /></text>
    <g
       id="g1043">
      <rect
         ry="0.17682996"
         y="276.07022"
         x="10.877482"
         height="17.085011"
         width="19.695208"
         id="rect1032"
         style="opacity:1;vector-effect:none;fill:#ffffff;fill-opacity:1;stroke:none;stroke-width:1.42330158;stroke-linecap:round;stroke-linejoin:round;stroke-miterlimit:4;stroke-dasharray:none;stroke-dashoffset:0;stroke-opacity:1;paint-order:stroke fill markers" />
      <text
         id="text994"
         y="288.13843"
         x="20.435698"
         style="font-style:normal;font-variant:normal;font-weight:normal;font-stretch:normal;font-size:6.32777786px;line-height:2.53111124px;font-family:'Open Sans';-inkscape-font-specification:'Open Sans';text-align:center;letter-spacing:0px;word-spacing:0px;text-anchor:middle;fill:#000000;fill-opacity:1;stroke:none;stroke-width:0.23729166"
         xml:space="preserve"><tspan
           style="font-style:normal;font-variant:normal;font-weight:bold;font-stretch:normal;font-size:9.87777805px;font-family:'Open Sans';-inkscape-font-specification:'Open Sans Bold';text-align:center;text-anchor:middle;stroke-width:0.23729166"
           y="288.13843"
           x="20.435698"
           sodipodi:role="line"
           id="tspan880">B6</tspan></text>
      <flowRoot
         transform="matrix(0.23729165,0,0,0.23729165,10.877482,158.91461)"
         style="font-style:normal;font-variant:normal;font-weight:normal;font-stretch:normal;font-size:48px;line-height:1.20000005;font-family:'Open Sans', 'Noto Sans CJK TC';-inkscape-font-specification:'Open Sans';text-align:center;letter-spacing:0px;word-spacing:0px;text-anchor:middle;fill:#000000;fill-opacity:1;stroke:none"
         id="flowRoot1012"
         xml:space="preserve"><flowRegion
           style="font-size:64px;line-height:1"
           id="flowRegion1014"><rect
             style="font-size:64px;line-height:1"
             y="303.51968"
             x="40"
             height="179"
             width="718"
             id="rect1016" /></flowRegion><flowPara
           style="font-style:normal;font-variant:normal;font-weight:bold;font-stretch:normal;font-family:'Open Sans', 'Noto Sans CJK TC';-inkscape-font-specification:'Open Sans, Noto Sans CJK TC Bold'"
           id="flowPara1024"> Stir-fried seasonal vegetables dish</flowPara><flowPara
           style="font-style:normal;font-variant:normal;font-weight:bold;font-stretch:normal;font-family:'Open Sans', 'Noto Sans CJK TC';-inkscape-font-specification:'Open Sans, Noto Sans CJK TC Bold'"
           id="flowPara886">季節炒時蔬 </flowPara></flowRoot>      <g
         id="g1176"
         transform="translate(185.20833,-34.169985)">
        <rect
           style="fill:#f3b618;fill-opacity:1;stroke-width:0.1611634"
           id="rect10"
           width="168.64336"
           height="17.084999"
           x="30.572689"
           y="276.07022"
           ry="0.022684252" />
        <text
           id="text1108"
           y="288.43542"
           x="114.99809"
           style="font-style:normal;font-variant:normal;font-weight:normal;font-stretch:normal;font-size:11.38999939px;line-height:1.20000005;font-family:'Open Sans', 'Noto Sans CJK TC';-inkscape-font-specification:'Open Sans';text-align:center;letter-spacing:0px;word-spacing:0px;text-anchor:middle;fill:#ffffff;fill-opacity:1;stroke:none;stroke-width:0.23729165"
           xml:space="preserve"><tspan
             style="font-style:normal;font-variant:normal;font-weight:bold;font-stretch:normal;font-size:9.87777805px;font-family:'Open Sans', 'Noto Sans CJK TC';-inkscape-font-specification:'Open Sans, Noto Sans CJK TC Bold';fill:#ffffff;stroke-width:0.23729165"
             id="tspan1106"
             y="288.43542"
             x="114.99809"
             sodipodi:role="line">VEGETARIAN 奶蛋素</tspan></text>
      </g>
      <g
         id="g1166"
         transform="translate(-36.447301,-48.899775)">
        <rect
           style="fill:#1b9e77;fill-opacity:1;stroke-width:0.16116342"
           id="rect10-2"
           width="168.64336"
           height="17.084999"
           x="67.019989"
           y="324.97"
           ry="0.022684252" />
        <text
           id="text1108-1"
           y="337.33521"
           x="151.44539"
           style="font-style:normal;font-variant:normal;font-weight:normal;font-stretch:normal;font-size:11.38999939px;line-height:1.20000005;font-family:'Open Sans', 'Noto Sans CJK TC';-inkscape-font-specification:'Open Sans';text-align:center;letter-spacing:0px;word-spacing:0px;text-anchor:middle;fill:#ffffff;fill-opacity:1;stroke:none;stroke-width:0.23729165"
           xml:space="preserve"><tspan
             style="font-style:normal;font-variant:normal;font-weight:bold;font-stretch:normal;font-size:9.87777805px;font-family:'Open Sans', 'Noto Sans CJK TC';-inkscape-font-specification:'Open Sans, Noto Sans CJK TC Bold';fill:#ffffff;stroke-width:0.23729165"
             id="tspan1106-0"
             y="337.33521"
             x="151.44539"
             sodipodi:role="line">VEGAN 全素</tspan></text>
      </g>
      <g
         id="g1171"
         transform="translate(173.89645,-77.739382)">
        <rect
           style="fill:#000000;fill-opacity:1;stroke-width:0.16116343"
           id="rect10-2-5"
           width="168.64336"
           height="17.084999"
           x="41.884571"
           y="353.8096"
           ry="0.022684252" />
        <text
           id="text1108-1-8"
           y="366.1748"
           x="126.30997"
           style="font-style:normal;font-variant:normal;font-weight:normal;font-stretch:normal;font-size:11.38999939px;line-height:1.20000005;font-family:'Open Sans', 'Noto Sans CJK TC';-inkscape-font-specification:'Open Sans';text-align:center;letter-spacing:0px;word-spacing:0px;text-anchor:middle;fill:#ffffff;fill-opacity:1;stroke:none;stroke-width:0.23729165"
           xml:space="preserve"><tspan
             style="font-style:normal;font-variant:normal;font-weight:bold;font-stretch:normal;font-size:9.87777805px;font-family:'Open Sans', 'Noto Sans CJK TC';-inkscape-font-specification:'Open Sans, Noto Sans CJK TC Bold';fill:#ffffff;stroke-width:0.23729165"
             id="tspan1106-0-5"
             y="366.1748"
             x="126.30997"
             sodipodi:role="line">CONTAINS MEAT/FISH 葷食</tspan></text>
      </g>
    </g>
    <use
       x="0"
       y="0"
       xlink:href="#g1043"
       id="use1253"
       transform="rotate(-180,105.86019,223.38912)"
       width="100%"
       height="100%" />
    <path
       style="fill:none;fill-opacity:1;stroke:#000000;stroke-width:0.30000001;stroke-linecap:butt;stroke-linejoin:miter;stroke-miterlimit:4;stroke-dasharray:2.40000015, 2.40000015;stroke-dashoffset:0;stroke-opacity:1"
       d="M 11.690908,223.38912 H 200.02948"
       id="path865-5-0"
       inkscape:connector-curvature="0" />
    <path
       style="fill:none;fill-opacity:1;stroke:#000000;stroke-width:0.30000001;stroke-linecap:butt;stroke-linejoin:miter;stroke-miterlimit:4;stroke-dasharray:none;stroke-dashoffset:0;stroke-opacity:1"
       d="M 10.830714,148.5 H 199.16929"
       id="path865-5-0-7"
       inkscape:connector-curvature="0" />
    <g
       transform="translate(4e-6,-148.5)"
       id="g1043-6">
      <rect
         ry="0.17682996"
         y="276.07022"
         x="10.877482"
         height="17.085011"
         width="19.695208"
         id="rect1032-9"
         style="opacity:1;vector-effect:none;fill:#ffffff;fill-opacity:1;stroke:none;stroke-width:1.42330158;stroke-linecap:round;stroke-linejoin:round;stroke-miterlimit:4;stroke-dasharray:none;stroke-dashoffset:0;stroke-opacity:1;paint-order:stroke fill markers" />
      <text
         id="text994-2"
         y="288.13843"
         x="20.435698"
         style="font-style:normal;font-variant:normal;font-weight:normal;font-stretch:normal;font-size:6.32777786px;line-height:2.53111124px;font-family:'Open Sans';-inkscape-font-specification:'Open Sans';text-align:center;letter-spacing:0px;word-spacing:0px;text-anchor:middle;fill:#000000;fill-opacity:1;stroke:none;stroke-width:0.23729166"
         xml:space="preserve"><tspan
           style="font-style:normal;font-variant:normal;font-weight:bold;font-stretch:normal;font-size:9.87777805px;font-family:'Open Sans';-inkscape-font-specification:'Open Sans Bold';text-align:center;text-anchor:middle;stroke-width:0.23729166"
           y="288.13843"
           x="20.435698"
           id="tspan992-1"
           sodipodi:role="line">B5</tspan></text>
      <flowRoot
         transform="matrix(0.23729165,0,0,0.23729165,10.877482,159.97295)"
         style="font-style:normal;font-variant:normal;font-weight:normal;font-stretch:normal;font-size:48px;line-height:1.20000005;font-family:'Open Sans', 'Noto Sans CJK TC';-inkscape-font-specification:'Open Sans';text-align:center;letter-spacing:0px;word-spacing:0px;text-anchor:middle;fill:#000000;fill-opacity:1;stroke:none"
         id="flowRoot1012-7"
         xml:space="preserve"><flowRegion
           style="font-size:64px;line-height:1"
           id="flowRegion1014-7"><rect
             style="font-size:64px;line-height:1"
             y="303.51968"
             x="40"
             height="179"
             width="718"
             id="rect1016-9" /></flowRegion><flowPara
           style="font-style:normal;font-variant:normal;font-weight:bold;font-stretch:normal;font-family:'Open Sans', 'Noto Sans CJK TC';-inkscape-font-specification:'Open Sans, Noto Sans CJK TC Bold'"
           id="flowPara1020-7"> Hakka-style rice cake with vegetables</flowPara><flowPara
           style="font-style:normal;font-variant:normal;font-weight:bold;font-stretch:normal;font-family:'Open Sans', 'Noto Sans CJK TC';-inkscape-font-specification:'Open Sans, Noto Sans CJK TC Bold'"
           id="flowPara1024-6"> 客家米碗粿 (在來米漿，菜圃) </flowPara></flowRoot>      <g
         transform="translate(185.20834,-34.169961)"
         id="g1176-7">
        <rect
           style="fill:#f3b618;fill-opacity:1;stroke-width:0.1611634"
           id="rect10-8"
           width="168.64336"
           height="17.084999"
           x="30.572689"
           y="276.07022"
           ry="0.022684252" />
        <text
           id="text1108-8"
           y="288.43542"
           x="114.99809"
           style="font-style:normal;font-variant:normal;font-weight:normal;font-stretch:normal;font-size:11.38999939px;line-height:1.20000005;font-family:'Open Sans', 'Noto Sans CJK TC';-inkscape-font-specification:'Open Sans';text-align:center;letter-spacing:0px;word-spacing:0px;text-anchor:middle;fill:#ffffff;fill-opacity:1;stroke:none;stroke-width:0.23729165"
           xml:space="preserve"><tspan
             style="font-style:normal;font-variant:normal;font-weight:bold;font-stretch:normal;font-size:9.87777805px;font-family:'Open Sans', 'Noto Sans CJK TC';-inkscape-font-specification:'Open Sans, Noto Sans CJK TC Bold';fill:#ffffff;stroke-width:0.23729165"
             id="tspan1106-9"
             y="288.43542"
             x="114.99809"
             sodipodi:role="line">VEGETARIAN 奶蛋素</tspan></text>
      </g>
      <g
         id="g1166-0"
         transform="translate(-36.447305,-48.899742)">
        <rect
           style="fill:#1b9e77;fill-opacity:1;stroke-width:0.16116342"
           id="rect10-2-7"
           width="168.64336"
           height="17.084999"
           x="67.019989"
           y="324.97"
           ry="0.022684252" />
        <text
           id="text1108-1-80"
           y="337.33521"
           x="151.44539"
           style="font-style:normal;font-variant:normal;font-weight:normal;font-stretch:normal;font-size:11.38999939px;line-height:1.20000005;font-family:'Open Sans', 'Noto Sans CJK TC';-inkscape-font-specification:'Open Sans';text-align:center;letter-spacing:0px;word-spacing:0px;text-anchor:middle;fill:#ffffff;fill-opacity:1;stroke:none;stroke-width:0.23729165"
           xml:space="preserve"><tspan
             style="font-style:normal;font-variant:normal;font-weight:bold;font-stretch:normal;font-size:9.87777805px;font-family:'Open Sans', 'Noto Sans CJK TC';-inkscape-font-specification:'Open Sans, Noto Sans CJK TC Bold';fill:#ffffff;stroke-width:0.23729165"
             id="tspan1106-0-3"
             y="337.33521"
             x="151.44539"
             sodipodi:role="line">VEGAN 全素</tspan></text>
      </g>
      <g
         id="g1171-1"
         transform="translate(173.89646,-77.73936)">
        <rect
           style="fill:#000000;fill-opacity:1;stroke-width:0.16116343"
           id="rect10-2-5-0"
           width="168.64336"
           height="17.084999"
           x="41.884571"
           y="353.8096"
           ry="0.022684252" />
        <text
           id="text1108-1-8-3"
           y="366.1748"
           x="126.30997"
           style="font-style:normal;font-variant:normal;font-weight:normal;font-stretch:normal;font-size:11.38999939px;line-height:1.20000005;font-family:'Open Sans', 'Noto Sans CJK TC';-inkscape-font-specification:'Open Sans';text-align:center;letter-spacing:0px;word-spacing:0px;text-anchor:middle;fill:#ffffff;fill-opacity:1;stroke:none;stroke-width:0.23729165"
           xml:space="preserve"><tspan
             style="font-style:normal;font-variant:normal;font-weight:bold;font-stretch:normal;font-size:9.87777805px;font-family:'Open Sans', 'Noto Sans CJK TC';-inkscape-font-specification:'Open Sans, Noto Sans CJK TC Bold';fill:#ffffff;stroke-width:0.23729165"
             id="tspan1106-0-5-6"
             y="366.1748"
             x="126.30997"
             sodipodi:role="line">CONTAINS MEAT/FISH 葷食</tspan></text>
      </g>
    </g>
    <use
       x="0"
       y="0"
       xlink:href="#g1043-6"
       id="use1253-8"
       transform="rotate(-180,105.86019,74.88912)"
       width="100%"
       height="100%" />
    <path
       style="fill:none;fill-opacity:1;stroke:#000000;stroke-width:0.30000001;stroke-linecap:butt;stroke-linejoin:miter;stroke-miterlimit:4;stroke-dasharray:2.40000018, 2.40000018;stroke-dashoffset:0;stroke-opacity:1"
       d="M 11.690914,74.88913 H 200.02949"
       id="path865-5-0-8"
       inkscape:connector-curvature="0" />
  </g>
</svg>
