<?xml version="1.0" encoding="UTF-8" standalone="no"?>
<!-- Created with Inkscape (http://www.inkscape.org/) -->

<svg
   xmlns:i="http://ns.adobe.com/AdobeIllustrator/10.0/"
   xmlns:dc="http://purl.org/dc/elements/1.1/"
   xmlns:cc="http://creativecommons.org/ns#"
   xmlns:rdf="http://www.w3.org/1999/02/22-rdf-syntax-ns#"
   xmlns:svg="http://www.w3.org/2000/svg"
   xmlns="http://www.w3.org/2000/svg"
   xmlns:xlink="http://www.w3.org/1999/xlink"
   xmlns:sodipodi="http://sodipodi.sourceforge.net/DTD/sodipodi-0.dtd"
   xmlns:inkscape="http://www.inkscape.org/namespaces/inkscape"
   width="1100mm"
   height="220mm"
   viewBox="0 0 1100 220"
   version="1.1"
   id="svg876"
   inkscape:version="0.92.2 5c3e80d, 2017-08-06"
   sodipodi:docname="towel-2.svg">
  <defs
     id="defs870" />
  <sodipodi:namedview
     id="base"
     pagecolor="#ffffff"
     bordercolor="#666666"
     borderopacity="1.0"
     inkscape:pageopacity="0.0"
     inkscape:pageshadow="2"
     inkscape:zoom="0.14142136"
     inkscape:cx="2113.8304"
     inkscape:cy="149.94516"
     inkscape:document-units="mm"
     inkscape:current-layer="layer1"
     showgrid="false"
     showguides="true"
     inkscape:guide-bbox="true"
     inkscape:window-width="1280"
     inkscape:window-height="755"
     inkscape:window-x="0"
     inkscape:window-y="1"
     inkscape:window-maximized="1"
     borderlayer="true" />
  <metadata
     id="metadata873">
    <rdf:RDF>
      <cc:Work
         rdf:about="">
        <dc:format>image/svg+xml</dc:format>
        <dc:type
           rdf:resource="http://purl.org/dc/dcmitype/StillImage" />
        <dc:title></dc:title>
      </cc:Work>
    </rdf:RDF>
  </metadata>
  <g
     inkscape:label="Layer 1"
     inkscape:groupmode="layer"
     id="layer1"
     transform="translate(0,-77)">
    <rect
       style="opacity:1;fill:#a80030;fill-opacity:1;stroke:none;stroke-width:1.5;stroke-linecap:round;stroke-linejoin:miter;stroke-miterlimit:4;stroke-dasharray:none;stroke-dashoffset:10;stroke-opacity:1"
       id="rect1567"
       width="1299.1041"
       height="367.77084"
       x="-100.54166"
       y="8.6041594" />
    <g
       id="g2503"
       transform="matrix(-3.9246206,0,0,-3.9246206,361.61815,196.04274)"
       style="fill:#ffffff">
      <g
         style="fill:#ffffff"
         transform="matrix(0,-0.14128022,0.14128022,0,71.756782,22.95669)"
         id="g1640">
        <path
           style="fill:#ffffff"
           inkscape:connector-curvature="0"
           i:knockout="Off"
           d="m 60.969,47.645 c -1.494,0.02 0.281,0.768 2.232,1.069 0.541,-0.422 1.027,-0.846 1.463,-1.26 -1.213,0.297 -2.449,0.304 -3.695,0.191"
           id="path1602" />
        <path
           style="fill:#ffffff"
           inkscape:connector-curvature="0"
           i:knockout="Off"
           d="m 68.986,45.646 c 0.893,-1.229 1.541,-2.573 1.77,-3.963 -0.201,0.99 -0.736,1.845 -1.244,2.749 -2.793,1.759 -0.264,-1.044 -0.002,-2.111 -3.002,3.783 -0.414,2.268 -0.524,3.325"
           id="path1604" />
        <path
           style="fill:#ffffff"
           inkscape:connector-curvature="0"
           i:knockout="Off"
           d="m 71.949,37.942 c 0.182,-2.691 -0.529,-1.839 -0.768,-0.814 0.278,0.146 0.499,1.898 0.768,0.814"
           id="path1606" />
        <path
           style="fill:#ffffff"
           inkscape:connector-curvature="0"
           i:knockout="Off"
           d="m 55.301,1.163 c 0.798,0.142 1.724,0.252 1.591,0.443 0.876,-0.193 1.073,-0.367 -1.591,-0.443"
           id="path1608" />
        <path
           style="fill:#ffffff"
           inkscape:connector-curvature="0"
           i:knockout="Off"
           d="M 56.893,1.606 56.332,1.723 56.855,1.675 56.893,1.606"
           id="path1610" />
        <path
           style="fill:#ffffff"
           inkscape:connector-curvature="0"
           i:knockout="Off"
           d="m 81.762,38.962 c 0.09,2.416 -0.705,3.59 -1.424,5.666 l -1.293,0.643 c -1.057,2.054 0.105,1.304 -0.652,2.937 -1.652,1.467 -5.006,4.589 -6.08,4.875 -0.785,-0.017 0.531,-0.926 0.703,-1.281 -2.209,1.516 -1.773,2.276 -5.152,3.199 L 67.766,54.78 c -8.33,3.92 -19.902,-3.847 -19.75,-14.443 -0.088,0.672 -0.253,0.504 -0.437,0.774 -0.43,-5.451 2.518,-10.926 7.49,-13.165 4.863,-2.406 10.564,-1.42 14.045,1.829 -1.912,-2.506 -5.721,-5.163 -10.232,-4.917 -4.421,0.072 -8.558,2.881 -9.938,5.932 -2.264,1.425 -2.528,5.496 -3.514,6.242 -1.329,9.76 2.497,13.975 8.97,18.936 1.016,0.686 0.286,0.791 0.422,1.313 -2.15,-1.006 -4.118,-2.526 -5.738,-4.387 0.86,1.257 1.787,2.479 2.986,3.439 -2.029,-0.685 -4.738,-4.913 -5.527,-5.085 3.495,6.258 14.178,10.975 19.775,8.634 -2.59,0.096 -5.879,0.053 -8.787,-1.022 -1.225,-0.629 -2.884,-1.93 -2.587,-2.173 7.636,2.851 15.522,2.158 22.128,-3.137 1.682,-1.31 3.518,-3.537 4.049,-3.567 -0.799,1.202 0.137,0.578 -0.477,1.639 1.672,-2.701 -0.729,-1.1 1.73,-4.664 l 0.908,1.25 c -0.34,-2.244 2.785,-4.966 2.467,-8.512 0.717,-1.084 0.799,1.168 0.039,3.662 1.055,-2.767 0.279,-3.212 0.549,-5.496 0.291,0.768 0.678,1.583 0.875,2.394 -0.688,-2.675 0.703,-4.503 1.049,-6.058 -0.342,-0.15 -1.061,1.182 -1.227,-1.976 0.025,-1.372 0.383,-0.719 0.52,-1.057 -0.268,-0.155 -0.975,-1.207 -1.404,-3.224 0.309,-0.475 0.832,1.229 1.256,1.298 -0.273,-1.603 -0.742,-2.826 -0.762,-4.057 -1.24,-2.59 -0.439,0.346 -1.443,-1.112 -1.32,-4.114 1.094,-0.955 1.258,-2.823 1.998,2.895 3.137,7.385 3.662,9.244 -0.4,-2.267 -1.045,-4.464 -1.834,-6.589 0.609,0.257 -0.979,-4.663 0.791,-1.405 C 87.189,15.552 81,9.062 75.305,6.018 76,6.655 76.879,7.455 76.565,7.581 73.731,5.896 74.229,5.763 73.823,5.051 71.518,4.112 71.364,5.128 69.839,5.053 65.489,2.745 64.651,2.99 60.648,1.546 L 60.83,2.398 C 57.949,1.438 57.473,2.76 54.36,2.4 54.171,2.253 55.358,1.864 56.336,1.723 53.55,2.091 53.68,1.173 50.954,1.824 51.625,1.353 52.337,1.04 53.053,0.64 50.782,0.778 47.629,1.962 48.602,0.884 44.897,2.538 38.316,4.859 34.623,8.322 L 34.507,7.546 c -1.692,2.031 -7.379,6.066 -7.832,8.699 l -0.453,0.105 c -0.879,1.491 -1.45,3.18 -2.148,4.713 -1.151,1.963 -1.688,0.756 -1.524,1.064 -2.265,4.592 -3.392,8.45 -4.363,11.616 0.692,1.035 0.017,6.232 0.278,10.391 -1.136,20.544 14.418,40.489 31.42,45.093 2.492,0.893 6.197,0.861 9.349,0.949 -3.718,-1.064 -4.198,-0.563 -7.822,-1.826 -2.613,-1.232 -3.185,-2.637 -5.037,-4.244 l 0.733,1.295 c -3.63,-1.285 -2.111,-1.59 -5.065,-2.525 l 0.783,-1.021 c -1.177,-0.09 -3.117,-1.982 -3.647,-3.033 l -1.288,0.051 c -1.546,-1.906 -2.371,-3.283 -2.31,-4.35 l -0.416,0.742 c -0.471,-0.809 -5.691,-7.158 -2.983,-5.68 -0.503,-0.458 -1.172,-0.747 -1.897,-2.066 l 0.551,-0.629 c -1.301,-1.677 -2.398,-3.826 -2.314,-4.542 0.695,0.938 1.177,1.114 1.655,1.275 -3.291,-8.164 -3.476,-0.449 -5.967,-8.31 l 0.526,-0.042 c -0.403,-0.611 -0.65,-1.27 -0.974,-1.919 l 0.23,-2.285 c -2.368,-2.736 -0.662,-11.645 -0.319,-16.53 0.235,-1.986 1.977,-4.101 3.3,-7.418 l -0.806,-0.138 c 1.542,-2.688 8.802,-10.799 12.166,-10.383 1.629,-2.046 -0.324,-0.008 -0.643,-0.522 3.579,-3.703 4.704,-2.616 7.119,-3.283 2.603,-1.545 -2.235,0.604 -1.001,-0.589 4.503,-1.149 3.19,-2.614 9.063,-3.197 0.62,0.352 -1.437,0.544 -1.953,1.001 3.75,-1.836 11.869,-1.417 17.145,1.018 6.117,2.861 12.994,11.314 13.266,19.267 l 0.309,0.083 c -0.156,3.162 0.484,6.819 -0.627,10.177 l 0.751,-1.591"
           id="path1612" />
        <path
           style="fill:#ffffff"
           inkscape:connector-curvature="0"
           i:knockout="Off"
           d="m 44.658,49.695 -0.211,1.047 c 0.983,1.335 1.763,2.781 3.016,3.821 -0.902,-1.759 -1.571,-2.486 -2.805,-4.868"
           id="path1614" />
        <path
           style="fill:#ffffff"
           inkscape:connector-curvature="0"
           i:knockout="Off"
           d="m 46.979,49.605 c -0.52,-0.576 -0.826,-1.268 -1.172,-1.956 0.33,1.211 1.006,2.252 1.633,3.312 l -0.461,-1.356"
           id="path1616" />
        <path
           style="fill:#ffffff"
           inkscape:connector-curvature="0"
           i:knockout="Off"
           d="m 88.063,40.675 -0.219,0.552 c -0.402,2.858 -1.273,5.686 -2.605,8.309 1.472,-2.767 2.421,-5.794 2.824,-8.861"
           id="path1618" />
        <path
           style="fill:#ffffff"
           inkscape:connector-curvature="0"
           i:knockout="Off"
           d="M 55.598,0.446 C 56.607,0.077 58.08,0.243 59.154,0 57.756,0.117 56.365,0.187 54.992,0.362 l 0.606,0.084"
           id="path1620" />
        <path
           style="fill:#ffffff"
           inkscape:connector-curvature="0"
           i:knockout="Off"
           d="m 20.127,19.308 c 0.233,2.154 -1.62,2.991 0.41,1.569 1.09,-2.454 -0.424,-0.677 -0.41,-1.569"
           id="path1622" />
        <path
           style="fill:#ffffff"
           inkscape:connector-curvature="0"
           i:knockout="Off"
           d="m 17.739,29.282 c 0.469,-1.437 0.553,-2.299 0.732,-3.132 -1.293,1.654 -0.596,2.007 -0.732,3.132"
           id="path1624" />
      </g>
      <g
         style="fill:#ffffff"
         id="g2294"
         transform="matrix(0,-0.23526651,0.23526651,0,48.50336,7.6224733)">
        <path
           style="fill:#ffffff"
           id="path1626"
           d="m 13.437,125.506 c -0.045,0.047 -0.045,7.506 -0.138,9.453 -0.092,1.574 -0.232,4.957 -3.568,4.957 -3.429,0 -4.263,-3.939 -4.541,-5.652 -0.324,-1.9 -0.324,-3.477 -0.324,-4.17 0,-2.225 0.139,-8.436 5.375,-8.436 1.576,0 2.456,0.465 3.151,0.834 z M 0,130.975 c 0,13.066 6.951,13.066 7.97,13.066 2.873,0 4.727,-1.576 5.514,-4.309 l 0.093,4.123 c 0.881,-0.047 1.761,-0.139 3.197,-0.139 0.51,0 0.926,0 1.298,0.047 0.371,0 0.741,0.045 1.158,0.092 -0.741,-1.482 -1.297,-4.818 -1.297,-12.049 0,-7.043 0,-18.951 0.602,-22.566 -1.667,0.789 -3.105,1.299 -6.256,1.576 1.251,1.344 1.251,2.039 1.251,8.154 -0.879,-0.277 -1.992,-0.602 -3.892,-0.602 C 1.344,118.369 0,125.598 0,130.975"
           i:knockout="Off"
           inkscape:connector-curvature="0" />
        <path
           style="fill:#ffffff"
           id="path1628"
           d="m 25.13,128.609 c 0.047,-3.846 0.835,-7.275 4.124,-7.275 3.615,0 3.891,3.984 3.799,7.275 z m 12.51,0.465 c 0,-5.422 -1.065,-10.752 -7.923,-10.752 -9.452,0 -9.452,10.475 -9.452,12.697 0,9.406 4.216,13.113 11.306,13.113 3.149,0 4.68,-0.461 5.514,-0.695 -0.046,-1.668 0.185,-2.734 0.465,-4.17 -0.975,0.604 -2.226,1.391 -5.006,1.391 -7.229,0 -7.322,-6.582 -7.322,-8.852 H 37.55 l 0.09,-2.732"
           i:knockout="Off"
           inkscape:connector-curvature="0" />
        <path
           style="fill:#ffffff"
           id="path1630"
           d="m 52.715,131.066 c 0,4.309 -0.787,10.102 -6.162,10.102 -0.742,0 -1.668,-0.141 -2.27,-0.279 -0.093,-1.668 -0.093,-4.541 -0.093,-7.877 0,-3.986 0.416,-6.068 0.742,-7.09 0.972,-3.289 3.15,-3.334 3.566,-3.334 3.522,0 4.217,4.865 4.217,8.478 z m -13.298,5.051 c 0,3.43 0,5.375 -0.556,6.857 1.9,0.742 4.262,1.158 7.09,1.158 1.807,0 7.043,0 9.869,-5.791 1.344,-2.688 1.807,-6.303 1.807,-9.037 0,-1.668 -0.186,-5.328 -1.529,-7.646 -1.296,-2.176 -3.382,-3.289 -5.605,-3.289 -4.449,0 -5.746,3.707 -6.44,5.607 0,-2.363 0.045,-10.611 0.415,-14.828 -3.011,1.391 -4.866,1.621 -6.857,1.807 1.807,0.74 1.807,3.801 1.807,13.764 v 11.398"
           i:knockout="Off"
           inkscape:connector-curvature="0" />
        <path
           style="fill:#ffffff"
           id="path1632"
           d="m 66.535,143.855 c -0.928,-0.139 -1.578,-0.232 -2.922,-0.232 -1.48,0 -2.502,0.094 -3.566,0.232 0.463,-0.881 0.648,-1.299 0.787,-4.309 0.186,-4.125 0.232,-15.154 -0.092,-17.471 -0.232,-1.762 -0.648,-2.039 -1.297,-2.502 3.799,-0.371 4.865,-0.648 6.625,-1.482 -0.369,2.037 -0.418,3.059 -0.418,6.162 -0.091,15.989 -0.138,17.702 0.883,19.602"
           i:knockout="Off"
           inkscape:connector-curvature="0" />
        <path
           style="fill:#ffffff"
           id="path1634"
           d="m 81.373,130.74 c -0.092,2.92 -0.139,4.959 -0.928,6.58 -0.973,2.086 -2.594,2.688 -3.799,2.688 -2.783,0 -3.383,-2.316 -3.383,-4.586 0,-4.355 3.893,-4.682 5.652,-4.682 z m -12.744,5.701 c 0,2.92 0.881,5.838 3.477,7.09 1.158,0.51 2.316,0.51 2.688,0.51 4.264,0 5.699,-3.152 6.58,-5.098 -0.047,2.039 0,3.289 0.139,4.912 0.834,-0.047 1.668,-0.139 3.059,-0.139 0.787,0 1.529,0.092 2.316,0.139 -0.51,-0.787 -0.787,-1.252 -0.928,-3.059 -0.092,-1.76 -0.092,-3.521 -0.092,-5.977 l 0.047,-9.453 c 0,-3.523 -0.928,-6.998 -7.879,-6.998 -4.586,0 -7.273,1.391 -8.617,2.086 0.557,1.02 1.02,1.898 1.436,3.893 1.809,-1.576 4.172,-2.41 6.58,-2.41 3.848,0 3.848,2.549 3.848,6.162 -0.881,-0.045 -1.623,-0.137 -2.875,-0.137 -5.887,10e-4 -9.779,2.268 -9.779,8.479"
           i:knockout="Off"
           inkscape:connector-curvature="0" />
        <path
           style="fill:#ffffff"
           id="path1636"
           d="m 108.063,139.268 c 0.047,1.576 0.047,3.244 0.695,4.588 -1.021,-0.092 -1.623,-0.232 -3.521,-0.232 -1.113,0 -1.715,0.094 -2.596,0.232 0.184,-0.602 0.279,-0.834 0.371,-1.623 0.139,-1.064 0.232,-4.633 0.232,-5.885 v -5.004 c 0,-2.178 0,-5.33 -0.141,-6.441 -0.092,-0.787 -0.322,-2.918 -3.012,-2.918 -2.641,0 -3.521,1.945 -3.846,3.521 -0.369,1.621 -0.369,3.383 -0.369,10.24 0.045,5.932 0.045,6.486 0.508,8.109 -0.787,-0.092 -1.76,-0.184 -3.15,-0.184 -1.113,0 -1.854,0.045 -2.779,0.184 0.324,-0.742 0.51,-1.113 0.602,-3.707 0.094,-2.549 0.279,-15.061 -0.141,-18.025 -0.23,-1.809 -0.695,-2.225 -1.203,-2.688 3.754,-0.186 4.957,-0.789 6.117,-1.389 v 4.91 c 0.555,-1.438 1.713,-4.635 6.348,-4.635 5.793,0 5.838,4.217 5.885,6.996 v 13.951"
           i:knockout="Off"
           inkscape:connector-curvature="0" />
        <path
           id="path1638"
           d="m 66.926,111.533 -3.838,3.836 -3.836,-3.836 3.836,-3.836 3.838,3.836"
           i:knockout="Off"
           inkscape:connector-curvature="0"
           style="fill:#ffffff" />
      </g>
    </g>
    <g
       id="g1565"
       transform="matrix(1.2013097,0,0,1.201309,-120.63154,14.102242)"
       style="fill:#ffffff">
      <path
         d="m 230.71489,183.76613 h 17.71787 c 11.53722,0 18.43896,-1.13315 24.61961,-4.22348 11.74325,-5.76864 18.64497,-18.33591 18.64497,-33.68457 0,-14.42156 -5.97462,-26.37076 -16.58476,-32.75747 -5.97462,-3.60542 -15.03958,-5.45961 -26.98885,-5.45961 h -17.40884 z m 14.11249,-13.49447 v -49.1362 h 2.78129 c 8.96195,0 13.80347,0.82441 18.23293,3.09033 7.21077,3.70839 11.64024,11.84622 11.64024,21.63229 0,9.16801 -4.22345,17.30584 -11.02217,21.01423 -4.22344,2.36928 -10.09507,3.39935 -18.54197,3.39935 z"
         style="font-style:normal;font-variant:normal;font-weight:600;font-stretch:normal;font-size:medium;line-height:1;font-family:'URW Gothic L';-inkscape-font-specification:'URW Gothic L Semi-Bold';text-align:center;letter-spacing:0px;word-spacing:0px;text-anchor:middle;fill:#ffffff;fill-opacity:1;stroke:none;stroke-width:2.5752728"
         id="path1708"
         inkscape:connector-curvature="0" />
      <path
         d="m 343.34605,106.30189 c -22.6624,0 -40.17426,17.20285 -40.17426,39.45321 0,21.94133 17.71788,39.35014 40.07125,39.35014 22.14734,0 39.24715,-17.20286 39.24715,-39.45321 0,-21.73527 -17.40884,-39.35014 -39.14414,-39.35014 z m -0.20606,13.59744 c 14.1125,0 25.13467,11.33123 25.13467,25.95875 0,14.62752 -10.71314,25.64971 -25.13467,25.64971 -14.42152,0 -25.75272,-11.33123 -25.75272,-25.75269 0,-14.73059 11.12517,-25.85577 25.75272,-25.85577 z"
         style="font-style:normal;font-variant:normal;font-weight:600;font-stretch:normal;font-size:medium;line-height:1;font-family:'URW Gothic L';-inkscape-font-specification:'URW Gothic L Semi-Bold';text-align:center;letter-spacing:0px;word-spacing:0px;text-anchor:middle;fill:#ffffff;fill-opacity:1;stroke:none;stroke-width:2.5752728"
         id="path1710"
         inkscape:connector-curvature="0" />
      <path
         d="m 393.96463,183.76613 h 14.11252 v -55.31686 l 31.83039,55.31686 h 15.76062 V 107.641 h -14.11245 v 55.41993 L 410.03432,107.641 h -16.06969 z"
         style="font-style:normal;font-variant:normal;font-weight:600;font-stretch:normal;font-size:medium;line-height:1;font-family:'URW Gothic L';-inkscape-font-specification:'URW Gothic L Semi-Bold';text-align:center;letter-spacing:0px;word-spacing:0px;text-anchor:middle;fill:#ffffff;fill-opacity:1;stroke:none;stroke-width:2.5752728"
         id="path1712"
         inkscape:connector-curvature="0" />
      <path
         d="M 476.90289,130.92153 V 107.641 h -9.76028 v 23.28053 z"
         style="font-style:normal;font-variant:normal;font-weight:600;font-stretch:normal;font-size:medium;line-height:1;font-family:'URW Gothic L';-inkscape-font-specification:'URW Gothic L Semi-Bold';text-align:center;letter-spacing:0px;word-spacing:0px;text-anchor:middle;fill:#ffffff;fill-opacity:1;stroke:none;stroke-width:2.5752728"
         id="path1714"
         inkscape:connector-curvature="0"
         sodipodi:nodetypes="ccccc" />
      <path
         d="m 502.48986,183.76613 h 14.11245 v -62.63067 h 14.11252 V 107.641 h -42.33749 v 13.49446 h 14.11252 z"
         style="font-style:normal;font-variant:normal;font-weight:600;font-stretch:normal;font-size:medium;line-height:1;font-family:'URW Gothic L';-inkscape-font-specification:'URW Gothic L Semi-Bold';text-align:center;letter-spacing:0px;word-spacing:0px;text-anchor:middle;fill:#ffffff;fill-opacity:1;stroke:none;stroke-width:2.5752728"
         id="path1716"
         inkscape:connector-curvature="0" />
      <path
         d="m 585.78576,183.76612 h 14.1125 v -28.9461 h 4.53248 c 10.81615,0 15.76068,-0.82441 19.98411,-3.39936 6.18066,-3.81137 9.99207,-11.53719 9.99207,-20.29308 0,-8.756 -3.70839,-15.96673 -10.3011,-19.98415 -4.32645,-2.57524 -9.37399,-3.50234 -19.46906,-3.50234 h -18.851 z m 14.1125,-42.44046 v -20.19021 h 4.7385 c 4.63549,0 6.69571,0.20635 8.96195,0.72124 4.12044,1.13306 6.59271,4.73847 6.59271,9.47694 0,3.70839 -1.64819,6.59276 -4.6355,8.24091 -2.16323,1.13315 -6.07765,1.75121 -11.53723,1.75121 z"
         style="font-style:normal;font-variant:normal;font-weight:600;font-stretch:normal;font-size:medium;line-height:1;font-family:'URW Gothic L';-inkscape-font-specification:'URW Gothic L Semi-Bold';text-align:center;letter-spacing:0px;word-spacing:0px;text-anchor:middle;fill:#ffffff;fill-opacity:1;stroke:none;stroke-width:2.5752728"
         id="path1718"
         inkscape:connector-curvature="0"
         sodipodi:nodetypes="cccscscsccccscsccc" />
      <path
         d="m 626.94345,183.76612 h 15.55466 L 650.945,164.091 h 27.09186 l 8.13787,19.67512 h 15.55465 L 669.796,107.64109 h -11.12518 z m 29.15209,-33.16948 8.13787,-23.07448 8.13786,23.07448 z"
         style="font-style:normal;font-variant:normal;font-weight:600;font-stretch:normal;font-size:medium;line-height:1;font-family:'URW Gothic L';-inkscape-font-specification:'URW Gothic L Semi-Bold';text-align:center;letter-spacing:0px;word-spacing:0px;text-anchor:middle;fill:#ffffff;fill-opacity:1;stroke:none;stroke-width:2.5752728"
         id="path1720"
         inkscape:connector-curvature="0" />
      <path
         d="m 709.47934,183.76612 h 14.1125 v -55.31686 l 31.83038,55.31686 h 15.76063 v -76.12503 h -14.11246 v 55.41984 l -31.52134,-55.41984 h -16.06971 z"
         style="font-style:normal;font-variant:normal;font-weight:600;font-stretch:normal;font-size:medium;line-height:1;font-family:'URW Gothic L';-inkscape-font-specification:'URW Gothic L Semi-Bold';text-align:center;letter-spacing:0px;word-spacing:0px;text-anchor:middle;fill:#ffffff;fill-opacity:1;stroke:none;stroke-width:2.5752728"
         id="path1722"
         inkscape:connector-curvature="0" />
      <path
         d="m 869.20097,162.54584 c -6.1807,6.48969 -11.5372,8.96195 -18.851,8.96195 -14.0094,0 -25.5467,-11.74324 -25.5467,-25.95875 0,-6.18066 2.3693,-12.77332 6.2837,-17.30583 4.6355,-5.45952 11.2282,-8.34389 18.954,-8.34389 8.8589,0 14.8335,2.88437 19.9841,9.58002 h 15.7607 c -2.9873,-6.59267 -5.6657,-10.19808 -10.8162,-14.42147 -7.0047,-5.66566 -15.9666,-8.75599 -25.2376,-8.75599 -21.5293,0 -39.14421,17.61487 -39.14421,39.14418 0,21.94133 17.82091,39.65917 40.07121,39.65917 15.5547,0 29.1521,-8.65292 35.1268,-22.55939 z"
         style="font-style:normal;font-variant:normal;font-weight:600;font-stretch:normal;font-size:medium;line-height:1;font-family:'URW Gothic L';-inkscape-font-specification:'URW Gothic L Semi-Bold';text-align:center;letter-spacing:0px;word-spacing:0px;text-anchor:middle;fill:#ffffff;fill-opacity:1;stroke:none;stroke-width:2.5752728"
         id="path1724"
         inkscape:connector-curvature="0" />
      <path
         sodipodi:nodetypes="csccccccc"
         inkscape:connector-curvature="0"
         i:knockout="Off"
         d="m 801.55783,183.89742 c -2.50197,-0.37473 -4.2545,-0.62585 -7.87808,-0.62585 -3.99024,0 -6.74572,0.25306 -9.61435,0.62585 1.24827,-2.37532 1.74709,-3.50224 2.12181,-11.61759 0.50151,-11.12148 0.62547,-25.40541 -0.248,-31.65235 -0.62541,-4.75054 -1.74709,-5.49737 -3.49686,-6.74567 10.24258,-1.00029 13.11665,-1.74713 17.86184,-3.99572 -0.99489,5.49202 -1.12699,8.24743 -1.12699,16.6135 -0.24538,43.10837 -0.3721,32.27519 2.3807,37.39783"
         id="path1632-3"
         style="fill:#ffffff;stroke-width:2.69612408" />
      <path
         style="fill:#ffffff;stroke-width:2.69612408"
         inkscape:connector-curvature="0"
         i:knockout="Off"
         d="m 802.61201,112.20503 -10.34772,10.34233 -10.34234,-10.34233 10.34234,-10.34232 10.34772,10.34232"
         id="path1638-6" />
    </g>
    <g
       id="g1677"
       transform="matrix(0,-3.3745642,3.3745642,0,-546.52886,3381.2375)"
       style="fill:#ffffff">
      <g
         id="g2533"
         transform="matrix(1.0564088,0,0,1.0564088,884.24371,398.03933)"
         style="fill:#ffffff">
        <path
           inkscape:connector-curvature="0"
           id="path2362"
           d="m 41.822227,71.23583 c -0.619803,0 -1.207338,0.04056 -1.743607,0.113333 0.177813,0.160134 0.36862,0.304993 0.567698,0.438466 a 3.956539,1.0240972 0 0 1 1.174882,-0.04769 3.956539,1.0240972 0 0 1 3.956965,1.024114 3.956539,1.0240972 0 0 1 -3.956965,1.024112 3.956539,1.0240972 0 0 1 -3.956451,-1.024112 3.956539,1.0240972 0 0 1 1.928228,-0.878471 c -0.151767,-0.129883 -0.296895,-0.267111 -0.433853,-0.412825 -0.211413,0.04512 -0.412253,0.09544 -0.597442,0.151797 -0.402809,0.122588 -0.740638,0.269874 -0.99847,0.455389 -0.257835,0.185513 -0.451287,0.432103 -0.451287,0.719495 0,0.0084 0.0017,0.01627 0.0021,0.02462 h -0.0047 c 0.0018,0.01083 0.0053,0.02198 0.0071,0.03282 0.0054,0.05877 0.01817,0.115876 0.03846,0.17077 0.004,0.01477 0.0054,0.02927 0.0097,0.0441 0.581717,1.943771 1.994991,3.597472 4.456454,3.597472 2.461467,0 3.884865,-1.685815 4.456969,-3.597472 0.0046,-0.01542 0.0062,-0.03078 0.01026,-0.04615 0.01971,-0.05418 0.03215,-0.110758 0.03743,-0.168717 0.0019,-0.01098 0.0054,-0.02185 0.0071,-0.03282 h -0.0047 c 3.25e-4,-0.0083 0.0021,-0.0162 0.0021,-0.02462 0,-0.287392 -0.191912,-0.533982 -0.449748,-0.719495 -0.257836,-0.185515 -0.595661,-0.332801 -0.998471,-0.455389 -0.80562,-0.245171 -1.87658,-0.388721 -3.060031,-0.388721 z"
           style="color:#000000;clip-rule:nonzero;display:inline;overflow:visible;visibility:visible;opacity:1;isolation:auto;mix-blend-mode:normal;color-interpolation:sRGB;color-interpolation-filters:linearRGB;solid-color:#000000;solid-opacity:1;fill:#ffffff;fill-opacity:1;fill-rule:nonzero;stroke:none;stroke-width:0.64241016;stroke-linecap:round;stroke-linejoin:round;stroke-miterlimit:4;stroke-dasharray:none;stroke-dashoffset:0;stroke-opacity:1;marker:none;color-rendering:auto;image-rendering:auto;shape-rendering:auto;text-rendering:auto;enable-background:accumulate" />
        <path
           inkscape:connector-curvature="0"
           id="path1498"
           d="m 42.589421,62.69479 c -0.920382,-0.117265 -1.863361,0.09758 -2.655829,0.566028 -1.27347,0.752789 -2.096067,2.1207 -2.310966,3.564847 -0.218268,1.466771 0.172445,3.004432 1.064581,4.188977 0.892136,1.184545 2.261645,1.98452 3.731656,2.179768 a 0.29799258,0.29799258 0 1 0 0.07872,-0.590392 c -1.306125,-0.173481 -2.541635,-0.894873 -3.334312,-1.947359 -0.792678,-1.052487 -1.144185,-2.439656 -0.95025,-3.742903 0.190173,-1.277986 0.92854,-2.493583 2.024203,-3.141265 0.681826,-0.403049 1.498729,-0.586495 2.277229,-0.487309 0.77708,0.099 1.522787,0.488615 2.026078,1.079577 0.527192,0.619023 0.787102,1.477762 0.657866,2.271606 -0.06484,0.398242 -0.224085,0.782216 -0.461069,1.105814 -0.23685,0.323422 -0.554635,0.590096 -0.91464,0.760952 -0.280108,0.132937 -0.587225,0.20825 -0.890274,0.211791 -0.302399,0.0035 -0.605401,-0.06654 -0.86591,-0.206169 -0.37356,-0.20022 -0.668637,-0.562083 -0.777819,-0.965245 -0.108712,-0.401428 -0.03331,-0.861834 0.204295,-1.195779 0.182045,-0.255859 0.46435,-0.448386 0.768447,-0.526668 0.304095,-0.07829 0.642925,-0.04618 0.925887,0.08996 a 0.29799258,0.29799258 0 1 0 0.258647,-0.53604 c -0.413205,-0.198819 -0.890388,-0.245516 -1.334472,-0.131197 -0.444082,0.114317 -0.838096,0.385441 -1.103941,0.759076 -0.348879,0.490331 -0.449983,1.123057 -0.294259,1.698082 0.155255,0.57329 0.554011,1.056802 1.072077,1.334476 0.356568,0.191113 0.756871,0.280203 1.154546,0.275516 0.397024,-0.0046 0.785278,-0.102649 1.137677,-0.269893 0.452868,-0.214928 0.846658,-0.543994 1.141426,-0.946503 0.294637,-0.402327 0.488157,-0.872749 0.567902,-1.362589 0.159919,-0.98232 -0.151344,-2.002287 -0.790939,-2.753293 -0.607129,-0.712886 -1.484748,-1.166424 -2.406553,-1.283869 z"
           style="color:#000000;font-style:normal;font-variant:normal;font-weight:normal;font-stretch:normal;font-size:medium;line-height:normal;font-family:sans-serif;text-indent:0;text-align:start;text-decoration:none;text-decoration-line:none;text-decoration-style:solid;text-decoration-color:#000000;letter-spacing:normal;word-spacing:normal;text-transform:none;writing-mode:lr-tb;direction:ltr;baseline-shift:baseline;text-anchor:start;white-space:normal;clip-rule:nonzero;display:inline;overflow:visible;visibility:visible;opacity:1;isolation:auto;mix-blend-mode:normal;color-interpolation:sRGB;color-interpolation-filters:linearRGB;solid-color:#000000;solid-opacity:1;fill:#ffffff;fill-opacity:1;fill-rule:evenodd;stroke:none;stroke-width:0.59486675;stroke-linecap:round;stroke-linejoin:round;stroke-miterlimit:4;stroke-dasharray:none;stroke-dashoffset:0;stroke-opacity:1;color-rendering:auto;image-rendering:auto;shape-rendering:auto;text-rendering:auto;enable-background:accumulate" />
        <path
           sodipodi:nodetypes="cccsccc"
           inkscape:connector-curvature="0"
           id="path2310"
           d="m 35.178035,62.643715 c -0.207835,0.0032 -0.373927,0.199009 -0.370559,0.437035 l 0.195072,13.381169 c 0,0.138201 0.0905,0.207301 0.181002,0.207301 0.0905,0 0.181001,-0.0691 0.181001,-0.207301 L 35.559625,63.08075 c 0.0034,-0.242984 -0.169432,-0.440981 -0.38159,-0.437035 z"
           style="color:#000000;font-style:normal;font-variant:normal;font-weight:normal;font-stretch:normal;font-size:medium;line-height:normal;font-family:sans-serif;text-indent:0;text-align:start;text-decoration:none;text-decoration-line:none;text-decoration-style:solid;text-decoration-color:#000000;letter-spacing:normal;word-spacing:normal;text-transform:none;writing-mode:lr-tb;direction:ltr;baseline-shift:baseline;text-anchor:start;white-space:normal;clip-rule:nonzero;display:inline;overflow:visible;visibility:visible;opacity:1;isolation:auto;mix-blend-mode:normal;color-interpolation:sRGB;color-interpolation-filters:linearRGB;solid-color:#000000;solid-opacity:1;fill:#ffffff;fill-opacity:1;fill-rule:evenodd;stroke:none;stroke-width:0.51925528;stroke-linecap:round;stroke-linejoin:round;stroke-miterlimit:4;stroke-dasharray:none;stroke-dashoffset:0;stroke-opacity:1;color-rendering:auto;image-rendering:auto;shape-rendering:auto;text-rendering:auto;enable-background:accumulate" />
        <use
           transform="translate(1.2531102)"
           height="100%"
           width="100%"
           id="use2337"
           xlink:href="#path2310"
           y="0"
           x="0"
           style="fill:#ffffff" />
      </g>
      <g
         aria-label="DebConf"
         style="font-style:normal;font-variant:normal;font-weight:300;font-stretch:normal;font-size:2.96265769px;line-height:125%;font-family:'Alegreya Sans';-inkscape-font-specification:'Alegreya Sans, Light';text-align:start;letter-spacing:0px;word-spacing:0px;writing-mode:lr-tb;text-anchor:start;fill:#ffffff;fill-opacity:1;stroke:none;stroke-width:0.07406633px;stroke-linecap:butt;stroke-linejoin:miter;stroke-opacity:1"
         id="text2392"
         transform="matrix(2.5377547,0,0,2.5377547,848.52468,268.26036)">
        <path
           inkscape:connector-curvature="0"
           d="m 34.612102,78.242528 0.0089,1.318382 -0.0089,0.574756 c 0.148133,0.0059 0.500689,0.01481 0.592532,0.01481 0.56883,0 0.882872,-0.364407 0.882872,-1.025079 0,-0.577719 -0.296266,-0.894723 -0.832507,-0.894723 z m 0.61327,1.777594 c -0.06518,0 -0.322929,-0.0089 -0.459212,-0.01778 l -0.0059,-0.450324 0.0089,-1.176175 c 0.121469,-0.0059 0.414772,-0.01481 0.476988,-0.01481 0.444399,0 0.684374,0.269602 0.684374,0.79103 0,0.56883 -0.254789,0.868058 -0.705113,0.868058 z"
           style="font-style:normal;font-variant:normal;font-weight:300;font-stretch:normal;font-size:2.96265769px;font-family:'Alegreya Sans';-inkscape-font-specification:'Alegreya Sans, Light';text-align:start;writing-mode:lr-tb;text-anchor:start;fill:#ffffff;fill-opacity:1;stroke-width:0.07406633px"
           id="path2544" />
        <path
           inkscape:connector-curvature="0"
           d="m 36.96885,78.769881 c -0.361444,0 -0.595494,0.269602 -0.595494,0.705112 0,0.414772 0.213311,0.678449 0.574756,0.678449 0.142207,0 0.281452,-0.04444 0.396996,-0.118506 l 0.01778,-0.13332 -0.0237,-0.0089 c -0.109618,0.08592 -0.251825,0.13332 -0.37922,0.13332 -0.287378,0 -0.441436,-0.216274 -0.441436,-0.559943 v -0.0474 l 0.862134,-0.01481 0.03555,-0.02963 c 0.003,-0.02963 0.0059,-0.08592 0.0059,-0.112581 0,-0.305154 -0.168872,-0.491801 -0.453287,-0.491801 z m 0.308117,0.515502 -0.74659,0.02074 c 0.04444,-0.263677 0.198498,-0.420698 0.426623,-0.420698 0.195535,0 0.325892,0.124432 0.325892,0.361445 z"
           style="font-style:normal;font-variant:normal;font-weight:300;font-stretch:normal;font-size:2.96265769px;font-family:'Alegreya Sans';-inkscape-font-specification:'Alegreya Sans, Light';text-align:start;writing-mode:lr-tb;text-anchor:start;fill:#ffffff;fill-opacity:1;stroke-width:0.07406633px"
           id="path2546" />
        <path
           inkscape:connector-curvature="0"
           d="m 38.397638,78.772843 c -0.154058,0.02074 -0.281452,0.08592 -0.405884,0.207386 h -0.01481 l 0.0059,-0.924349 -0.151095,0.01481 0.0089,1.49318 -0.01185,0.571793 0.02963,0.01778 0.109618,-0.05333 c 0.09777,0.03555 0.201461,0.05629 0.302191,0.05629 0.402921,0 0.639934,-0.266639 0.639934,-0.731776 0,-0.408847 -0.180722,-0.651785 -0.51254,-0.651785 z m -0.115543,1.265055 c -0.09184,0 -0.192573,-0.02666 -0.302191,-0.08295 l -0.0059,-0.405884 0.003,-0.417735 c 0.127394,-0.154058 0.263676,-0.228125 0.408847,-0.228125 0.239975,0 0.376257,0.195536 0.37922,0.533279 0.003,0.394033 -0.180722,0.601419 -0.482913,0.601419 z"
           style="font-style:normal;font-variant:normal;font-weight:300;font-stretch:normal;font-size:2.96265769px;font-family:'Alegreya Sans';-inkscape-font-specification:'Alegreya Sans, Light';text-align:start;writing-mode:lr-tb;text-anchor:start;fill:#ffffff;fill-opacity:1;stroke-width:0.07406633px"
           id="path2548" />
        <path
           inkscape:connector-curvature="0"
           d="m 39.999881,78.227714 c -0.521428,0 -0.814731,0.349594 -0.814731,0.971752 0,0.61327 0.281452,0.953976 0.779179,0.953976 0.18961,0 0.373295,-0.05925 0.539203,-0.168872 l 0.01185,-0.14517 -0.0237,-0.0089 c -0.151096,0.118506 -0.334781,0.186648 -0.518465,0.186648 -0.402922,0 -0.631046,-0.287378 -0.631046,-0.826582 0,-0.539204 0.231087,-0.829544 0.651784,-0.829544 0.17776,0 0.337743,0.06222 0.4681,0.165909 l 0.0237,-0.003 0.03259,-0.139245 c -0.142208,-0.10073 -0.325893,-0.157021 -0.518465,-0.157021 z"
           style="font-style:normal;font-variant:normal;font-weight:300;font-stretch:normal;font-size:2.96265769px;font-family:'Alegreya Sans';-inkscape-font-specification:'Alegreya Sans, Light';text-align:start;writing-mode:lr-tb;text-anchor:start;fill:#ffffff;fill-opacity:1;stroke-width:0.07406633px"
           id="path2550" />
        <path
           inkscape:connector-curvature="0"
           d="m 41.268037,78.766918 c -0.370333,0 -0.589569,0.263677 -0.589569,0.711038 0,0.42366 0.207386,0.675486 0.562905,0.675486 0.373295,0 0.592531,-0.263677 0.592531,-0.708075 0,-0.426623 -0.210348,-0.678449 -0.565867,-0.678449 z m -0.0059,0.115544 c 0.269602,0 0.426623,0.213311 0.426623,0.592531 0,0.361444 -0.159983,0.562905 -0.441436,0.562905 -0.266639,0 -0.42366,-0.207386 -0.42366,-0.589569 0,-0.358481 0.159984,-0.565867 0.438473,-0.565867 z"
           style="font-style:normal;font-variant:normal;font-weight:300;font-stretch:normal;font-size:2.96265769px;font-family:'Alegreya Sans';-inkscape-font-specification:'Alegreya Sans, Light';text-align:start;writing-mode:lr-tb;text-anchor:start;fill:#ffffff;fill-opacity:1;stroke-width:0.07406633px"
           id="path2552" />
        <path
           inkscape:connector-curvature="0"
           d="m 43.093867,80.135666 h 0.154058 l -0.0059,-0.583644 0.003,-0.37922 c 0.003,-0.254788 -0.14517,-0.402921 -0.420698,-0.402921 -0.133319,0.01481 -0.284415,0.09777 -0.417734,0.228124 h -0.01481 v -0.216274 l -0.14517,0.01778 0.0059,0.758441 -0.0089,0.577718 h 0.154058 l -0.0089,-0.586606 0.003,-0.399959 C 42.528,78.99208 42.685021,78.9032 42.827228,78.9032 c 0.180722,0 0.27849,0.112581 0.275527,0.299229 z"
           style="font-style:normal;font-variant:normal;font-weight:300;font-stretch:normal;font-size:2.96265769px;font-family:'Alegreya Sans';-inkscape-font-specification:'Alegreya Sans, Light';text-align:start;writing-mode:lr-tb;text-anchor:start;fill:#ffffff;fill-opacity:1;stroke-width:0.07406633px"
           id="path2554" />
        <path
           inkscape:connector-curvature="0"
           d="m 44.219677,78.049955 c -0.272564,0 -0.426622,0.162946 -0.426622,0.462174 l 0.003,0.27849 h -0.20146 l -0.01185,0.0948 0.01185,0.01481 h 0.20146 l 0.003,0.666598 -0.0089,0.56883 h 0.151095 l -0.0089,-0.583644 0.0059,-0.651784 h 0.358481 l 0.01185,-0.09481 -0.0089,-0.01481 h -0.361444 l 0.003,-0.296265 c 0,-0.213312 0.09481,-0.325893 0.269602,-0.325893 0.0711,0 0.130357,0.01185 0.201461,0.04148 l 0.01481,-0.0089 0.01185,-0.124431 c -0.07999,-0.01778 -0.151096,-0.02666 -0.219237,-0.02666 z"
           style="font-style:normal;font-variant:normal;font-weight:300;font-stretch:normal;font-size:2.96265769px;font-family:'Alegreya Sans';-inkscape-font-specification:'Alegreya Sans, Light';text-align:start;writing-mode:lr-tb;text-anchor:start;fill:#ffffff;fill-opacity:1;stroke-width:0.07406633px"
           id="path2556" />
      </g>
      <g
         aria-label="Hsinchu, Taiwan"
         style="font-style:normal;font-variant:normal;font-weight:300;font-stretch:normal;font-size:2.06427693px;line-height:125%;font-family:'Alegreya Sans';-inkscape-font-specification:'Alegreya Sans, Light';text-indent:0;text-align:start;text-decoration:none;text-decoration-line:none;text-decoration-style:solid;text-decoration-color:#000000;letter-spacing:0px;word-spacing:0px;text-transform:none;writing-mode:lr-tb;direction:ltr;baseline-shift:baseline;text-anchor:start;white-space:normal;opacity:1;fill:#ffffff;fill-opacity:1;stroke:none;stroke-width:0.36179897;stroke-linecap:round;stroke-linejoin:round;stroke-miterlimit:4;stroke-dasharray:none;stroke-dashoffset:0;stroke-opacity:1"
         id="text2400"
         transform="matrix(2.5350891,0,0,2.5350891,848.61693,268.2221)">
        <path
           inkscape:connector-curvature="0"
           d="m 35.587761,81.915725 0.0041,-0.91241 h -0.109407 l 0.0041,0.602769 -0.390149,0.0021 -0.379827,-0.0021 0.0041,-0.602769 h -0.109407 l 0.0062,0.918603 -0.0062,0.40047 h 0.107343 l -0.0041,-0.406663 0.0021,-0.214685 0.369506,-0.0021 0.40047,0.0021 0.0021,0.220878 -0.0062,0.40047 h 0.107343 z"
           style="font-style:normal;font-variant:normal;font-weight:300;font-stretch:normal;font-size:2.06427693px;line-height:125%;font-family:'Alegreya Sans';-inkscape-font-specification:'Alegreya Sans, Light';text-indent:0;text-align:start;text-decoration:none;text-decoration-line:none;text-decoration-style:solid;text-decoration-color:#000000;letter-spacing:0px;word-spacing:0px;text-transform:none;writing-mode:lr-tb;direction:ltr;text-anchor:start;white-space:normal;fill:#ffffff;fill-opacity:1;stroke:none;stroke-width:0.36179897;stroke-linecap:round;stroke-linejoin:round;stroke-miterlimit:4;stroke-dasharray:none;stroke-dashoffset:0;stroke-opacity:1"
           id="path2559" />
        <path
           inkscape:connector-curvature="0"
           d="m 36.160276,81.37282 c -0.185785,0 -0.301385,0.107343 -0.301385,0.251842 0,0.28487 0.44382,0.245649 0.44382,0.456205 0,0.0867 -0.07638,0.1734 -0.210556,0.1734 -0.07638,0 -0.165143,-0.03096 -0.235328,-0.08876 l -0.01445,0.0083 -0.01445,0.09289 c 0.07638,0.04335 0.169271,0.06812 0.258035,0.06812 0.196106,0 0.315834,-0.125921 0.315834,-0.27042 0,-0.276613 -0.443819,-0.237392 -0.443819,-0.447948 0,-0.0867 0.07431,-0.163078 0.191977,-0.163078 0.0578,0 0.119728,0.01651 0.187849,0.05574 l 0.01858,-0.0041 0.01651,-0.08876 c -0.07431,-0.03096 -0.148628,-0.04335 -0.21262,-0.04335 z"
           style="font-style:normal;font-variant:normal;font-weight:300;font-stretch:normal;font-size:2.06427693px;line-height:125%;font-family:'Alegreya Sans';-inkscape-font-specification:'Alegreya Sans, Light';text-indent:0;text-align:start;text-decoration:none;text-decoration-line:none;text-decoration-style:solid;text-decoration-color:#000000;letter-spacing:0px;word-spacing:0px;text-transform:none;writing-mode:lr-tb;direction:ltr;text-anchor:start;white-space:normal;fill:#ffffff;fill-opacity:1;stroke:none;stroke-width:0.36179897;stroke-linecap:round;stroke-linejoin:round;stroke-miterlimit:4;stroke-dasharray:none;stroke-dashoffset:0;stroke-opacity:1"
           id="path2561" />
        <path
           inkscape:connector-curvature="0"
           d="m 36.738854,80.984736 c -0.04335,0 -0.07019,0.0289 -0.07019,0.07225 0,0.04335 0.02477,0.06812 0.06812,0.06812 0.04335,0 0.07019,-0.02684 0.07019,-0.07225 0,-0.04129 -0.02477,-0.06812 -0.06812,-0.06812 z m 0.04335,0.928925 0.0083,-0.534648 -0.107343,0.01239 0.0062,0.528455 -0.0062,0.402534 h 0.105279 z"
           style="font-style:normal;font-variant:normal;font-weight:300;font-stretch:normal;font-size:2.06427693px;line-height:125%;font-family:'Alegreya Sans';-inkscape-font-specification:'Alegreya Sans, Light';text-indent:0;text-align:start;text-decoration:none;text-decoration-line:none;text-decoration-style:solid;text-decoration-color:#000000;letter-spacing:0px;word-spacing:0px;text-transform:none;writing-mode:lr-tb;direction:ltr;text-anchor:start;white-space:normal;fill:#ffffff;fill-opacity:1;stroke:none;stroke-width:0.36179897;stroke-linecap:round;stroke-linejoin:round;stroke-miterlimit:4;stroke-dasharray:none;stroke-dashoffset:0;stroke-opacity:1"
           id="path2563" />
        <path
           inkscape:connector-curvature="0"
           d="m 37.751317,82.322388 h 0.107342 l -0.0041,-0.406663 0.0021,-0.264227 c 0.0021,-0.177528 -0.101149,-0.280742 -0.293127,-0.280742 -0.09289,0.01032 -0.198171,0.06812 -0.291063,0.158949 h -0.01032 v -0.150692 l -0.101149,0.01239 0.0041,0.528455 -0.0062,0.402534 h 0.107342 l -0.0062,-0.408727 0.0021,-0.278678 c 0.09496,-0.109406 0.204364,-0.171335 0.303449,-0.171335 0.125921,0 0.194042,0.07844 0.191978,0.208492 z"
           style="font-style:normal;font-variant:normal;font-weight:300;font-stretch:normal;font-size:2.06427693px;line-height:125%;font-family:'Alegreya Sans';-inkscape-font-specification:'Alegreya Sans, Light';text-indent:0;text-align:start;text-decoration:none;text-decoration-line:none;text-decoration-style:solid;text-decoration-color:#000000;letter-spacing:0px;word-spacing:0px;text-transform:none;writing-mode:lr-tb;direction:ltr;text-anchor:start;white-space:normal;fill:#ffffff;fill-opacity:1;stroke:none;stroke-width:0.36179897;stroke-linecap:round;stroke-linejoin:round;stroke-miterlimit:4;stroke-dasharray:none;stroke-dashoffset:0;stroke-opacity:1"
           id="path2565" />
        <path
           inkscape:connector-curvature="0"
           d="m 38.520809,81.368692 c -0.241521,0 -0.392213,0.191978 -0.392213,0.491298 0,0.291063 0.146564,0.474783 0.383956,0.474783 0.09289,0 0.189913,-0.0289 0.262163,-0.06812 l 0.01032,-0.09083 -0.01445,-0.0083 c -0.07019,0.04748 -0.165142,0.07844 -0.247713,0.07844 -0.181656,0 -0.293127,-0.152756 -0.293127,-0.390148 0,-0.245649 0.111471,-0.396341 0.288998,-0.396341 0.08051,0 0.165143,0.03303 0.225007,0.07431 l 0.01651,-0.0021 0.02064,-0.09289 c -0.06812,-0.04129 -0.169271,-0.07019 -0.260099,-0.07019 z"
           style="font-style:normal;font-variant:normal;font-weight:300;font-stretch:normal;font-size:2.06427693px;line-height:125%;font-family:'Alegreya Sans';-inkscape-font-specification:'Alegreya Sans, Light';text-indent:0;text-align:start;text-decoration:none;text-decoration-line:none;text-decoration-style:solid;text-decoration-color:#000000;letter-spacing:0px;word-spacing:0px;text-transform:none;writing-mode:lr-tb;direction:ltr;text-anchor:start;white-space:normal;fill:#ffffff;fill-opacity:1;stroke:none;stroke-width:0.36179897;stroke-linecap:round;stroke-linejoin:round;stroke-miterlimit:4;stroke-dasharray:none;stroke-dashoffset:0;stroke-opacity:1"
           id="path2567" />
        <path
           inkscape:connector-curvature="0"
           d="m 39.430381,81.370756 c -0.09083,0.01032 -0.196107,0.06812 -0.288999,0.158949 h -0.01239 l 0.0062,-0.65644 -0.107342,0.01032 0.0062,1.036267 -0.0062,0.402534 h 0.105278 l -0.0062,-0.408727 0.0021,-0.278678 c 0.09702,-0.109406 0.202299,-0.171335 0.303449,-0.171335 0.125921,0 0.194042,0.07844 0.194042,0.208492 l -0.0083,0.650248 h 0.107342 l -0.0041,-0.406663 0.0041,-0.264227 c 0.0021,-0.177528 -0.101149,-0.280742 -0.295191,-0.280742 z"
           style="font-style:normal;font-variant:normal;font-weight:300;font-stretch:normal;font-size:2.06427693px;line-height:125%;font-family:'Alegreya Sans';-inkscape-font-specification:'Alegreya Sans, Light';text-indent:0;text-align:start;text-decoration:none;text-decoration-line:none;text-decoration-style:solid;text-decoration-color:#000000;letter-spacing:0px;word-spacing:0px;text-transform:none;writing-mode:lr-tb;direction:ltr;text-anchor:start;white-space:normal;fill:#ffffff;fill-opacity:1;stroke:none;stroke-width:0.36179897;stroke-linecap:round;stroke-linejoin:round;stroke-miterlimit:4;stroke-dasharray:none;stroke-dashoffset:0;stroke-opacity:1"
           id="path2569" />
        <path
           inkscape:connector-curvature="0"
           d="m 40.738455,81.379013 -0.103214,0.01239 V 82.085 c -0.09496,0.101149 -0.196106,0.154821 -0.291063,0.154821 -0.119728,0 -0.183721,-0.07638 -0.181656,-0.208492 l 0.0062,-0.652312 -0.107342,0.01239 0.0041,0.435562 -0.0021,0.225006 c -0.0021,0.179593 0.09702,0.280742 0.278678,0.280742 0.09908,-0.01032 0.19817,-0.06399 0.291063,-0.156885 h 0.01238 c 0.0062,0.10115 0.04954,0.152757 0.127985,0.154821 0.03716,-0.0021 0.07431,-0.01445 0.105279,-0.03303 l 0.01239,-0.06812 -0.01445,-0.01032 c -0.0289,0.01445 -0.05573,0.02064 -0.07638,0.02064 -0.04748,0 -0.06812,-0.0289 -0.06812,-0.10115 z"
           style="font-style:normal;font-variant:normal;font-weight:300;font-stretch:normal;font-size:2.06427693px;line-height:125%;font-family:'Alegreya Sans';-inkscape-font-specification:'Alegreya Sans, Light';text-indent:0;text-align:start;text-decoration:none;text-decoration-line:none;text-decoration-style:solid;text-decoration-color:#000000;letter-spacing:0px;word-spacing:0px;text-transform:none;writing-mode:lr-tb;direction:ltr;text-anchor:start;white-space:normal;fill:#ffffff;fill-opacity:1;stroke:none;stroke-width:0.36179897;stroke-linecap:round;stroke-linejoin:round;stroke-miterlimit:4;stroke-dasharray:none;stroke-dashoffset:0;stroke-opacity:1"
           id="path2571" />
        <path
           inkscape:connector-curvature="0"
           d="m 41.190144,82.186145 c -0.0289,0.01032 -0.05367,0.02477 -0.07431,0.04129 v 0.01239 c 0.04129,0.02271 0.06399,0.05161 0.06399,0.08463 0,0.05574 -0.03922,0.115599 -0.113535,0.171335 v 0.01032 l 0.03922,0.03716 c 0.109407,-0.08257 0.167206,-0.163078 0.167206,-0.235327 0,-0.04954 -0.03096,-0.09083 -0.08257,-0.121793 z"
           style="font-style:normal;font-variant:normal;font-weight:300;font-stretch:normal;font-size:2.06427693px;line-height:125%;font-family:'Alegreya Sans';-inkscape-font-specification:'Alegreya Sans, Light';text-indent:0;text-align:start;text-decoration:none;text-decoration-line:none;text-decoration-style:solid;text-decoration-color:#000000;letter-spacing:0px;word-spacing:0px;text-transform:none;writing-mode:lr-tb;direction:ltr;text-anchor:start;white-space:normal;fill:#ffffff;fill-opacity:1;stroke:none;stroke-width:0.36179897;stroke-linecap:round;stroke-linejoin:round;stroke-miterlimit:4;stroke-dasharray:none;stroke-dashoffset:0;stroke-opacity:1"
           id="path2573" />
        <path
           inkscape:connector-curvature="0"
           d="m 42.680165,81.0157 -0.01032,-0.01238 h -0.875253 l -0.01032,0.08257 0.0083,0.01238 0.225006,-0.0062 h 0.161014 l 0.0062,0.829839 -0.0062,0.40047 h 0.107342 l -0.0041,-0.406663 0.0062,-0.823646 h 0.161013 l 0.220878,0.0062 z"
           style="font-style:normal;font-variant:normal;font-weight:300;font-stretch:normal;font-size:2.06427693px;line-height:125%;font-family:'Alegreya Sans';-inkscape-font-specification:'Alegreya Sans, Light';text-indent:0;text-align:start;text-decoration:none;text-decoration-line:none;text-decoration-style:solid;text-decoration-color:#000000;letter-spacing:0px;word-spacing:0px;text-transform:none;writing-mode:lr-tb;direction:ltr;text-anchor:start;white-space:normal;fill:#ffffff;fill-opacity:1;stroke:none;stroke-width:0.36179897;stroke-linecap:round;stroke-linejoin:round;stroke-miterlimit:4;stroke-dasharray:none;stroke-dashoffset:0;stroke-opacity:1"
           id="path2575" />
        <path
           inkscape:connector-curvature="0"
           d="m 43.0498,81.368692 c -0.109406,0 -0.222942,0.04748 -0.332348,0.134178 l 0.01651,0.07638 0.01239,0.0062 c 0.103214,-0.08876 0.200235,-0.134178 0.288998,-0.134178 0.1156,0 0.181657,0.06399 0.181657,0.181656 l -0.0041,0.167207 -0.34267,0.08051 c -0.115599,0.02684 -0.181656,0.09496 -0.181656,0.208492 0,0.152757 0.09702,0.245649 0.264227,0.245649 0.08464,-0.01651 0.169271,-0.07431 0.243585,-0.158949 h 0.01032 c 0.0041,0.103214 0.04954,0.152757 0.13005,0.154821 0.03716,-0.0021 0.07431,-0.01445 0.105278,-0.03303 l 0.01239,-0.06812 -0.01445,-0.01032 c -0.0289,0.01445 -0.05574,0.02064 -0.07844,0.02064 -0.04954,0 -0.06812,-0.02684 -0.06812,-0.09702 0,-0.06193 0.02271,-0.470656 0.02271,-0.532584 0,-0.152756 -0.09908,-0.24152 -0.266292,-0.24152 z m 0.161014,0.507812 -0.0083,0.200235 c -0.08051,0.105278 -0.169271,0.167206 -0.253906,0.167206 -0.10115,0 -0.163078,-0.06193 -0.163078,-0.167206 0,-0.06812 0.03716,-0.107343 0.105278,-0.123857 z"
           style="font-style:normal;font-variant:normal;font-weight:300;font-stretch:normal;font-size:2.06427693px;line-height:125%;font-family:'Alegreya Sans';-inkscape-font-specification:'Alegreya Sans, Light';text-indent:0;text-align:start;text-decoration:none;text-decoration-line:none;text-decoration-style:solid;text-decoration-color:#000000;letter-spacing:0px;word-spacing:0px;text-transform:none;writing-mode:lr-tb;direction:ltr;text-anchor:start;white-space:normal;fill:#ffffff;fill-opacity:1;stroke:none;stroke-width:0.36179897;stroke-linecap:round;stroke-linejoin:round;stroke-miterlimit:4;stroke-dasharray:none;stroke-dashoffset:0;stroke-opacity:1"
           id="path2577" />
        <path
           inkscape:connector-curvature="0"
           d="m 43.762234,80.984736 c -0.04335,0 -0.07019,0.0289 -0.07019,0.07225 0,0.04335 0.02477,0.06812 0.06812,0.06812 0.04335,0 0.07019,-0.02684 0.07019,-0.07225 0,-0.04129 -0.02477,-0.06812 -0.06812,-0.06812 z m 0.04335,0.928925 0.0083,-0.534648 -0.107343,0.01239 0.0062,0.528455 -0.0062,0.402534 h 0.105278 z"
           style="font-style:normal;font-variant:normal;font-weight:300;font-stretch:normal;font-size:2.06427693px;line-height:125%;font-family:'Alegreya Sans';-inkscape-font-specification:'Alegreya Sans, Light';text-indent:0;text-align:start;text-decoration:none;text-decoration-line:none;text-decoration-style:solid;text-decoration-color:#000000;letter-spacing:0px;word-spacing:0px;text-transform:none;writing-mode:lr-tb;direction:ltr;text-anchor:start;white-space:normal;fill:#ffffff;fill-opacity:1;stroke:none;stroke-width:0.36179897;stroke-linecap:round;stroke-linejoin:round;stroke-miterlimit:4;stroke-dasharray:none;stroke-dashoffset:0;stroke-opacity:1"
           id="path2579" />
        <path
           inkscape:connector-curvature="0"
           d="m 44.157865,81.486356 -0.02477,-0.109407 -0.09909,0.01032 0.27042,0.935118 h 0.107342 l 0.258035,-0.792683 h 0.01239 l 0.222942,0.792683 h 0.105278 l 0.317898,-0.939246 h -0.09909 l -0.0289,0.107342 -0.231199,0.708047 h -0.01032 l -0.200235,-0.712175 -0.02271,-0.103214 h -0.107342 l -0.03097,0.107342 -0.229134,0.708047 H 44.3581 Z"
           style="font-style:normal;font-variant:normal;font-weight:300;font-stretch:normal;font-size:2.06427693px;line-height:125%;font-family:'Alegreya Sans';-inkscape-font-specification:'Alegreya Sans, Light';text-indent:0;text-align:start;text-decoration:none;text-decoration-line:none;text-decoration-style:solid;text-decoration-color:#000000;letter-spacing:0px;word-spacing:0px;text-transform:none;writing-mode:lr-tb;direction:ltr;text-anchor:start;white-space:normal;fill:#ffffff;fill-opacity:1;stroke:none;stroke-width:0.36179897;stroke-linecap:round;stroke-linejoin:round;stroke-miterlimit:4;stroke-dasharray:none;stroke-dashoffset:0;stroke-opacity:1"
           id="path2581" />
        <path
           inkscape:connector-curvature="0"
           d="m 45.779322,81.368692 c -0.109407,0 -0.222942,0.04748 -0.332348,0.134178 l 0.01651,0.07638 0.01239,0.0062 c 0.103214,-0.08876 0.200235,-0.134178 0.288999,-0.134178 0.1156,0 0.181657,0.06399 0.181657,0.181656 l -0.0041,0.167207 -0.34267,0.08051 c -0.115599,0.02684 -0.181656,0.09496 -0.181656,0.208492 0,0.152757 0.09702,0.245649 0.264227,0.245649 0.08463,-0.01651 0.169271,-0.07431 0.243585,-0.158949 h 0.01032 c 0.0041,0.103214 0.04954,0.152757 0.13005,0.154821 0.03716,-0.0021 0.07431,-0.01445 0.105278,-0.03303 l 0.01239,-0.06812 -0.01445,-0.01032 c -0.0289,0.01445 -0.05573,0.02064 -0.07844,0.02064 -0.04954,0 -0.06812,-0.02684 -0.06812,-0.09702 0,-0.06193 0.02271,-0.470656 0.02271,-0.532584 0,-0.152756 -0.09909,-0.24152 -0.266292,-0.24152 z m 0.161014,0.507812 -0.0083,0.200235 c -0.08051,0.105278 -0.169271,0.167206 -0.253906,0.167206 -0.10115,0 -0.163078,-0.06193 -0.163078,-0.167206 0,-0.06812 0.03716,-0.107343 0.105278,-0.123857 z"
           style="font-style:normal;font-variant:normal;font-weight:300;font-stretch:normal;font-size:2.06427693px;line-height:125%;font-family:'Alegreya Sans';-inkscape-font-specification:'Alegreya Sans, Light';text-indent:0;text-align:start;text-decoration:none;text-decoration-line:none;text-decoration-style:solid;text-decoration-color:#000000;letter-spacing:0px;word-spacing:0px;text-transform:none;writing-mode:lr-tb;direction:ltr;text-anchor:start;white-space:normal;fill:#ffffff;fill-opacity:1;stroke:none;stroke-width:0.36179897;stroke-linecap:round;stroke-linejoin:round;stroke-miterlimit:4;stroke-dasharray:none;stroke-dashoffset:0;stroke-opacity:1"
           id="path2583" />
        <path
           inkscape:connector-curvature="0"
           d="m 47.028468,82.322388 h 0.107343 l -0.0041,-0.406663 0.0021,-0.264227 c 0.0021,-0.177528 -0.10115,-0.280742 -0.293128,-0.280742 -0.09289,0.01032 -0.19817,0.06812 -0.291063,0.158949 H 46.5393 v -0.150692 l -0.10115,0.01239 0.0041,0.528455 -0.0062,0.402534 h 0.107342 l -0.0062,-0.408727 0.0021,-0.278678 c 0.09496,-0.109406 0.204363,-0.171335 0.303448,-0.171335 0.125921,0 0.194042,0.07844 0.191978,0.208492 z"
           style="font-style:normal;font-variant:normal;font-weight:300;font-stretch:normal;font-size:2.06427693px;line-height:125%;font-family:'Alegreya Sans';-inkscape-font-specification:'Alegreya Sans, Light';text-indent:0;text-align:start;text-decoration:none;text-decoration-line:none;text-decoration-style:solid;text-decoration-color:#000000;letter-spacing:0px;word-spacing:0px;text-transform:none;writing-mode:lr-tb;direction:ltr;text-anchor:start;white-space:normal;fill:#ffffff;fill-opacity:1;stroke:none;stroke-width:0.36179897;stroke-linecap:round;stroke-linejoin:round;stroke-miterlimit:4;stroke-dasharray:none;stroke-dashoffset:0;stroke-opacity:1"
           id="path2585" />
      </g>
      <g
         transform="matrix(0.74545767,0,0.08527487,0.74545767,928.28293,405.11037)"
         id="text2623"
         style="font-style:italic;font-variant:normal;font-weight:500;font-stretch:normal;font-size:10.58333302px;line-height:125%;font-family:'Alegreya Sans';-inkscape-font-specification:'Alegreya Sans, Medium Italic';text-align:start;letter-spacing:0px;word-spacing:0px;writing-mode:lr-tb;text-anchor:start;opacity:1;fill:#ffffff;fill-opacity:1;stroke:none;stroke-width:0.119;stroke-linecap:butt;stroke-linejoin:bevel;stroke-miterlimit:4;stroke-dasharray:none;stroke-dashoffset:0;stroke-opacity:1"
         aria-label="18">
        <path
           sodipodi:nodetypes="ccccccccccc"
           inkscape:connector-curvature="0"
           id="path2625"
           style="font-style:italic;font-variant:normal;font-weight:500;font-stretch:normal;font-size:10.58333302px;font-family:'Alegreya Sans';-inkscape-font-specification:'Alegreya Sans, Medium Italic';text-align:start;writing-mode:lr-tb;text-anchor:start;fill:#ffffff;fill-opacity:1;stroke:none;stroke-width:0.119;stroke-linecap:butt;stroke-linejoin:bevel;stroke-miterlimit:4;stroke-dasharray:none;stroke-dashoffset:0;stroke-opacity:1"
           d="m 38.168791,83.401873 -0.127,-0.105833 -2.338916,0.66675 -0.09525,0.814916 0.08467,0.05292 1.354667,-0.359833 -0.254,2.0955 -0.439209,2.934229 h 1.037167 l 0.343959,-3.050646 z" />
        <path
           inkscape:connector-curvature="0"
           id="path2627"
           style="font-style:italic;font-variant:normal;font-weight:500;font-stretch:normal;font-size:10.58333302px;font-family:'Alegreya Sans';-inkscape-font-specification:'Alegreya Sans, Medium Italic';text-align:start;writing-mode:lr-tb;text-anchor:start;fill:#ffffff;fill-opacity:1;stroke:none;stroke-width:0.119;stroke-linecap:butt;stroke-linejoin:bevel;stroke-miterlimit:4;stroke-dasharray:none;stroke-dashoffset:0;stroke-opacity:1"
           d="m 41.831782,83.224602 c -1.185333,0 -1.989667,0.73025 -1.989667,1.778 0,0.740834 0.381,1.0795 0.846667,1.344084 l -0.01058,0.05292 c -0.762,0.338667 -1.407584,0.762 -1.407584,1.629834 0,0.931333 0.751417,1.555749 1.93675,1.555749 1.312334,0 2.169583,-0.772583 2.169583,-1.841499 0,-0.8255 -0.486833,-1.17475 -1.037166,-1.4605 l 0.01058,-0.05292 c 0.582084,-0.296333 1.17475,-0.751417 1.17475,-1.576917 0,-0.899583 -0.66675,-1.42875 -1.693333,-1.42875 z m -0.02117,0.719667 c 0.5715,0 0.878417,0.296333 0.878417,0.804333 0,0.645584 -0.508,0.963084 -1.058333,1.2065 -0.529167,-0.22225 -0.941917,-0.455083 -0.941917,-1.037166 0,-0.5715 0.455083,-0.973667 1.121833,-0.973667 z m -0.433916,2.751667 c 0.66675,0.275166 1.143,0.508 1.143,1.11125 0,0.592666 -0.518584,1.068916 -1.291167,1.068916 -0.6985,0 -1.0795,-0.381 -1.0795,-0.973666 0,-0.709084 0.592667,-0.973667 1.227667,-1.2065 z" />
      </g>
    </g>
  </g>
</svg>
