<?xml version="1.0" encoding="UTF-8" standalone="no"?>
<!-- Created with Inkscape (http://www.inkscape.org/) -->

<svg
   xmlns:v="http://vecta.io"
   xmlns:dc="http://purl.org/dc/elements/1.1/"
   xmlns:cc="http://creativecommons.org/ns#"
   xmlns:rdf="http://www.w3.org/1999/02/22-rdf-syntax-ns#"
   xmlns:svg="http://www.w3.org/2000/svg"
   xmlns="http://www.w3.org/2000/svg"
   xmlns:sodipodi="http://sodipodi.sourceforge.net/DTD/sodipodi-0.dtd"
   xmlns:inkscape="http://www.inkscape.org/namespaces/inkscape"
   version="1.1"
   id="svg2"
   xml:space="preserve"
   width="14cm"
   height="5cm"
   viewBox="0 0 529.13388 188.97638"
   sodipodi:docname="tag-debian.svg"
   inkscape:version="0.92.4 (5da689c313, 2019-01-14)"
   inkscape:export-filename="/srv/debconf19/data/dc19/artwork/tag/tag-debian.png"
   inkscape:export-xdpi="299.98996"
   inkscape:export-ydpi="299.98996"><metadata
     id="metadata8"><rdf:RDF><cc:Work
         rdf:about=""><dc:format>image/svg+xml</dc:format><dc:type
           rdf:resource="http://purl.org/dc/dcmitype/StillImage" /><dc:title /></cc:Work></rdf:RDF></metadata><defs
     id="defs6"><clipPath
       clipPathUnits="userSpaceOnUse"
       id="clipPath68"><path
         d="M 0,0 H 961.86 V 842.909 H 0 Z"
         id="path66"
         inkscape:connector-curvature="0" /></clipPath><clipPath
       clipPathUnits="userSpaceOnUse"
       id="clipPath198"><path
         d="M 0,0 H 961.86 V 842.909 H 0 Z"
         id="path196"
         inkscape:connector-curvature="0" /></clipPath><clipPath
       clipPathUnits="userSpaceOnUse"
       id="clipPath290"><path
         d="M 0,0 H 961.86 V 842.909 H 0 Z"
         id="path288"
         inkscape:connector-curvature="0" /></clipPath><clipPath
       clipPathUnits="userSpaceOnUse"
       id="clipPath886"><path
         d="M 0,0 H 961.86 V 842.909 H 0 Z"
         id="path884"
         inkscape:connector-curvature="0" /></clipPath></defs><sodipodi:namedview
     pagecolor="#ffffff"
     bordercolor="#666666"
     borderopacity="1"
     objecttolerance="10"
     gridtolerance="10"
     guidetolerance="10"
     inkscape:pageopacity="0"
     inkscape:pageshadow="2"
     inkscape:window-width="1366"
     inkscape:window-height="707"
     id="namedview4"
     showgrid="false"
     inkscape:zoom="0.65832255"
     inkscape:cx="-141.71313"
     inkscape:cy="298.4062"
     inkscape:window-x="0"
     inkscape:window-y="0"
     inkscape:window-maximized="1"
     inkscape:current-layer="g2233"
     showguides="true"
     inkscape:guide-bbox="true"
     units="cm" /><g
     id="g10"
     inkscape:groupmode="layer"
     inkscape:label="gabarito-200"
     transform="matrix(1.3333333,0,0,-1.3333333,0,188.97641)">





















































<g
   transform="matrix(2.8301887,0,0,2.8301887,0,91.981132)"
   id="g10-3"><title
     id="title6">debian-ar21</title><g
     id="use8"
     transform="matrix(2.1226416,0,0,-2.1226416,0.5,774.4232)"><title
       id="title1241">debian-ar21</title><g
       v:size="106,41,0.5,0.5"
       v:abox="{&quot;x&quot;:0,&quot;y&quot;:0,&quot;width&quot;:104.68769836425781,&quot;height&quot;:39.6497650146484}"
       class="Group.cls"
       id="g1261"><g
         id="g1259"
         class="Prim.cls"><g
           class=""
           id="g1245"><path
             style="fill:#d70751;stroke:none;stroke-width:0.02666667"
             inkscape:connector-curvature="0"
             id="path1243"
             d="m 21.233047,21.658989 c -0.661346,0.016 0.125916,0.346291 0.991608,0.472214 0.236115,-0.188881 0.456482,-0.377762 0.645355,-0.550934 -0.535217,0.125915 -1.08609,0.125915 -1.636993,0.07866 m 3.557342,-0.881409 c 0.393525,-0.550934 0.676789,-1.133331 0.787018,-1.7472 -0.09448,0.44072 -0.330536,0.818505 -0.550934,1.211998 -1.243469,0.771286 -0.110198,-0.456474 0,-0.928665 -1.337921,1.66848 -0.188903,0.991631 -0.236114,1.463844 m 1.306457,-3.415626 c 0.07864,-1.196274 -0.236114,-0.818512 -0.346313,-0.36203 0.125916,0.07867 0.220398,0.849975 0.346313,0.36203 M 18.730331,1.0864029 c 0.346283,0.062927 0.771271,0.1101837 0.708313,0.1888733 0.377747,-0.078667 0.472199,-0.1574097 -0.708313,-0.1888733 m 0.708313,0.2046356 -0.251831,0.047203 0.236084,-0.015999 0.01602,-0.031471 m 8.641144,15.6461335 c 0.04718,1.070351 -0.314819,1.58976 -0.629334,2.50267 l -0.566681,0.283333 c -0.472198,0.912933 0.04721,0.582397 -0.283325,1.30645 -0.72406,0.645332 -2.219391,2.03051 -2.691589,2.156425 -0.346314,0 0.236084,-0.409248 0.314789,-0.566665 -0.975891,0.676803 -0.787018,1.007385 -2.282349,1.41661 l -0.04721,-0.09445 c -3.683197,1.731468 -8.814514,-1.700211 -8.736114,-6.390557 -0.03148,0.299065 -0.110199,0.220375 -0.188889,0.346291 -0.188873,-2.407997 1.11734,-4.832001 3.321198,-5.823921 2.156418,-1.070343 4.674881,-0.629334 6.217422,0.802749 -0.849975,-1.101814 -2.534179,-2.282348 -4.533203,-2.172157 -1.951782,0.03146 -3.793411,1.274666 -4.391556,2.628639 -1.007385,0.629334 -1.117324,2.439995 -1.558288,2.770294 -0.582398,4.312851 1.101822,6.185944 3.966568,8.373864 0.456482,0.299064 0.125915,0.34629 0.188873,0.582397 -0.944427,-0.44072 -1.825867,-1.117332 -2.53418,-1.93605 0.377762,0.550933 0.787003,1.101814 1.322175,1.526802 -0.897187,-0.299065 -2.093461,-2.172165 -2.439988,-2.250855 1.542557,2.770294 6.280381,4.863999 8.751603,3.824875 -1.149354,0.0472 -2.597168,0.01601 -3.887848,-0.456474 -0.535187,-0.283333 -1.274674,-0.849976 -1.149338,-0.96016 3.38417,1.259202 6.862778,0.96016 9.790451,-1.385147 0.739807,-0.582405 1.558288,-1.558296 1.794678,-1.574028 -0.346283,0.535202 0.06293,0.251839 -0.204621,0.724053 0.739777,-1.196266 -0.314789,-0.487946 0.771271,-2.061974 l 0.409271,0.550934 c -0.157409,-0.991623 1.227722,-2.203651 1.08606,-3.761917 0.314819,-0.472214 0.346313,0.519463 0.01602,1.621254 0.472198,-1.227738 0.125915,-1.416618 0.236084,-2.440003 0.125946,0.346291 0.299072,0.708321 0.393524,1.054589 -0.299042,-1.180535 0.314819,-1.999016 0.456482,-2.675843 -0.15741,-0.06293 -0.472199,0.519471 -0.535187,-0.881469 0.01599,-0.613861 0.173157,-0.314797 0.236114,-0.472214 -0.125946,-0.06293 -0.424987,-0.535194 -0.613891,-1.432373 0.141662,-0.204613 0.36203,0.550934 0.550934,0.566666 C 30.504074,11.931229 30.299484,11.39608 30.299484,10.844879 29.74852,9.695549 30.11058,11.002296 29.654129,10.356934 29.071732,8.5310669 30.142075,9.9319458 30.205063,9.1134644 31.086533,10.38813 31.590225,12.387436 31.826309,13.205948 31.653183,12.198563 31.369858,11.222664 31.007828,10.293999 31.275375,10.404182 30.58284,8.2320251 31.354111,9.6646652 30.519882,6.5953293 27.780777,3.714798 25.26265,2.3766632 25.577438,2.659996 25.955185,3.0059967 25.813583,3.0691986 24.554367,2.3294144 24.774734,2.266449 24.601578,1.9518661 c -1.023133,-0.4092559 -1.08609,0.031464 -1.762665,0 C 20.918594,0.92874908 20.540817,1.0389328 18.777908,0.39356995 l 0.07868,0.37776184 c -1.274659,-0.4249878 -1.479584,0.15741729 -2.864746,0 -0.07866,-0.0629349 0.440734,-0.23610688 0.881469,-0.29906464 -1.227737,0.15740967 -1.180526,-0.23610687 -2.3768,0.0471954 C 14.795578,0.31484985 15.110382,0.173172 15.425171,0 14.417786,0.06293488 13.017181,0.58239746 13.457626,0.11018372 11.820648,0.84997559 8.9086914,1.8728561 7.2716827,3.3999176 L 7.2244873,3.053627 C 6.4691772,3.9508286 3.9662476,5.745224 3.7619019,6.909996 L 3.5572815,6.9571991 C 3.1637573,7.6185303 2.9119568,8.358078 2.612854,9.0506668 2.1091766,9.9163742 1.8730621,9.3812027 1.9360504,9.5228806 0.92866516,11.553383 0.4407196,13.269066 0,14.669945 c 0.29907227,0.456482 0,2.754562 0.12591553,4.596161 -0.50367737,9.09787 6.37483217,17.928184 13.91467247,19.958671 1.101807,0.393509 2.738816,0.377762 4.139725,0.424988 -1.65271,-0.472214 -1.85733,-0.251846 -3.462845,-0.80275 -1.149338,-0.550933 -1.41661,-1.164802 -2.235122,-1.873069 l 0.330535,0.566665 c -1.605514,-0.566665 -0.928665,-0.70832 -2.235122,-1.117332 l 0.346298,-0.456482 c -0.51947,-0.0472 -1.3851471,-0.881462 -1.6212616,-1.337914 l -0.5666656,0.016 C 8.0593414,33.794907 7.6815491,33.19677 7.7130127,32.724564 L 7.4611816,33.007896 C 7.2565613,32.645866 4.9427185,29.844101 6.1389923,30.489441 5.9186096,30.284828 5.6195221,30.158905 5.3047485,29.576508 L 5.540863,29.293175 C 4.9584503,28.553383 4.4862671,27.593224 4.5177307,27.278427 4.8325348,27.687675 5.0372009,27.766373 5.2575226,27.845093 3.7936859,24.224823 3.7149658,27.64048 2.6131439,24.161896 l 0.2361145,-0.01601 C 2.6761017,23.878319 2.565918,23.579224 2.4242706,23.295921 l 0.094452,-1.007385 C 1.4641418,21.07653 2.2196503,17.141464 2.3770752,14.96933 2.4872589,14.087868 3.2585297,13.159195 3.8409119,11.679596 l -0.3620301,-0.06293 c 0.6768036,-1.196266 3.903595,-4.7850726 5.383194,-4.5961612 0.7240601,-0.9129333 -0.1416473,0 -0.2833252,-0.2361069 1.5897524,-1.6369857 2.0777134,-1.1648025 3.1480564,-1.4481048 1.149322,-0.6768036 -0.991639,0.2675705 -0.44072,-0.2675781 1.999008,-0.5036774 1.416611,-1.1648026 4.013779,-1.4166108 0.267578,0.1574097 -0.629334,0.2361069 -0.865708,0.4407196 1.652726,-0.8185043 5.257264,-0.6293335 7.586823,0.456482 2.707336,1.259201 5.745209,5.0054092 5.871124,8.5311962 l 0.141663,0.03146 c -0.06293,1.400887 0.220367,3.02214 -0.283325,4.501739 l 0.330535,-0.676803" /></g><g
           class=""
           transform="translate(2.0787551,0.56700897)"
           id="g1249"><path
             style="fill:#d70751;stroke:none;stroke-width:0.02666667"
             inkscape:connector-curvature="0"
             id="path1247"
             d="m 11.945217,22.004906 -0.09445,0.456482 c 0.440719,0.598137 0.787017,1.227737 1.337921,1.684211 -0.409256,-0.771278 -0.708313,-1.086074 -1.243469,-2.140663 m 1.023117,-0.04726 c -0.2361,-0.251839 -0.362015,-0.566666 -0.519455,-0.8657 0.141647,0.535194 0.440719,0.991623 0.724044,1.463837 L 12.968318,21.95768 m 18.180085,-3.950821 -0.09445,0.251839 c -0.173157,1.259201 -0.566681,2.518455 -1.149353,3.683197 0.645355,-1.22773 1.070343,-2.565682 1.243469,-3.935067 M 16.777492,0.20462036 C 17.218196,0.04720306 17.879299,0.11016083 18.351528,0 17.737636,0.04720306 17.123775,0.07866669 16.509914,0.1574173 l 0.267578,0.0472031 M 1.0841478,8.5469666 C 1.1943468,9.5071259 0.36010298,9.8691483 1.2730363,9.2394943 1.7452501,8.1691513 1.068416,8.9561615 1.0841478,8.5469666 M 0.02956709,12.969978 c 0.20462036,-0.629333 0.25184631,-1.023117 0.33053589,-1.385147 -0.58239746,0.724053 -0.26757813,0.881462 -0.33053589,1.385147" /></g><g
           class=""
           transform="translate(39.008255,9.8506927)"
           id="g1253"><path
             style="fill:#000000;stroke:none;stroke-width:0.02666667"
             inkscape:connector-curvature="0"
             id="path1251"
             d="m 0,13.140236 c 0,7.879814 4.1868286,7.879814 4.8095093,7.879814 1.7391357,0 2.8556213,-0.944717 3.3280029,-2.597969 l 0.064392,2.490608 c 0.5368042,-0.02146 1.0735474,-0.08586 1.9323728,-0.08586 0.300598,0 0.558258,0 0.77298,0.02147 0.214691,0 0.450867,0.02146 0.708527,0.06439 -0.450898,-0.901787 -0.77298,-2.898552 -0.77298,-7.278663 0,-4.2511982 0,-11.4440007 0.365021,-13.634026 C 10.1987,0.47237396 9.3398132,0.7946701 7.4289551,0.94471741 8.1804199,1.7606125 8.1804199,2.1685562 8.1804199,5.8615189 7.6436157,5.6897888 6.9777527,5.4965057 5.8400879,5.4965057 0.81591797,5.5391769 0,9.898056 0,13.140137 M 8.1160278,9.8547974 c -0.021484,0.021469 -0.021484,4.5303496 -0.085876,5.7112506 -0.064392,0.944725 -0.1502991,2.984459 -2.1470948,2.984459 -2.0611877,0 -2.576538,-2.383278 -2.7482605,-3.413865 -0.1932373,-1.137977 -0.1932373,-2.104164 -0.1932373,-2.512107 0,-1.352669 0.085876,-5.0886158 3.2421265,-5.0886158 0.9447327,0 1.4815064,0.2791214 1.9109497,0.493866 z M 22.716217,12.001999 c 0,-3.2635728 -0.644134,-6.4842149 -4.787994,-6.4842149 -5.711243,0 -5.711243,6.3124539 -5.711243,7.6651229 0,5.66832 2.555023,7.922775 6.827728,7.922775 1.910919,0 2.834137,-0.279121 3.328003,-0.429412 -0.02148,-1.009125 0.107361,-1.653252 0.279114,-2.512108 -0.579742,0.365013 -1.352661,0.837333 -3.027374,0.837333 -4.358582,0 -4.423035,-3.972107 -4.423035,-5.346267 H 22.6521 l 0.06442,-1.653252 m -7.536011,-0.279121 c 0.02149,-2.3188557 0.493866,-4.4015507 2.490632,-4.4015507 2.190033,0 2.340301,2.404747 2.297363,4.4015507 z m 8.609253,4.530662 c 0,2.061203 0,3.242134 -0.343536,4.143898 1.137939,0.450882 2.576538,0.708534 4.272736,0.708534 1.095001,0 4.25119,0 5.968902,-3.499733 0.815888,-1.63179 1.095001,-3.800354 1.095001,-5.453338 0,-1.009117 -0.10736,-3.2206347 -0.923248,-4.6159975 C 33.08667,6.22715 31.819611,5.5615463 30.467224,5.5615463 c -2.683868,0 -3.478302,2.2329636 -3.886261,3.3924027 0,-1.4170685 0.02148,-6.3983231 0.25766,-8.95333864844 C 25.013611,0.83794403 23.897095,0.98826599 22.694733,1.0956268 c 1.095031,0.450882 1.095031,2.2973862 1.095031,8.309227 v 6.8492282 m 8.030121,-3.048859 c 0,2.597977 -0.472351,6.097733 -3.714477,6.097733 -0.450898,0 -1.009125,-0.08586 -1.374146,-0.17173 -0.06442,-1.009118 -0.06442,-2.748269 -0.06442,-4.745064 0,-2.404724 0.25766,-3.671524 0.450866,-4.272721 0.579743,-1.9753337 1.91095,-2.0182719 2.147095,-2.0182719 2.147095,0 2.555054,2.9200589 2.555054,5.1100849 z m 8.352143,7.729233 c -0.558228,-0.08587 -0.944703,-0.150299 -1.76059,-0.150299 -0.901794,0 -1.50296,0.06443 -2.147064,0.150299 0.279114,-0.536804 0.386474,-0.79467 0.47232,-2.597977 0.107361,-2.490616 0.150299,-9.1466139 -0.06439,-10.5422133 -0.150299,-1.0735473 -0.386474,-1.2238388 -0.772949,-1.5029296 2.297333,-0.2147217 2.941498,-0.3864823 3.993591,-0.9017868 -0.214721,1.2238388 -0.25766,1.8465042 -0.25766,3.7144775 -0.06442,9.6404262 -0.08585,10.6710362 0.536805,11.8304522 m 1.266662,-4.487999 c 0,1.760612 0.536804,3.521225 2.104157,4.27272 0.708526,0.300583 1.395599,0.300583 1.631775,0.300583 2.576538,0 3.435333,-1.910927 3.972107,-3.070343 -0.02145,1.223839 0,1.975334 0.08588,2.962982 0.493866,-0.02146 1.009094,-0.08586 1.846497,-0.08586 0.472351,0 0.923248,0.06442 1.395599,0.08586 C 52.17417,20.440079 52.002417,20.160957 51.91654,19.065918 51.85209,18.01384 51.85209,16.940582 51.85209,15.458801 l 0.02148,-5.7112043 c 0,-2.1256485 -0.558258,-4.2297821 -4.766541,-4.2297821 -2.769745,0 -4.40155,0.8373337 -5.195953,1.2667694 0.343567,0.6226655 0.62268,1.1379776 0.858825,2.3403244 1.095032,-0.944725 2.512116,-1.459999 3.972107,-1.459999 2.318879,0 2.318879,1.5458603 2.318879,3.7144776 -0.536805,-0.02147 -0.987671,-0.08587 -1.739167,-0.08587 -3.542663,0.04267 -5.882995,1.417069 -5.882995,5.153015 m 7.68658,-3.435332 c -0.06442,1.760612 -0.08588,2.984451 -0.558258,3.972107 -0.579712,1.266769 -1.567383,1.63179 -2.297394,1.63179 -1.674713,0 -2.039978,-1.395607 -2.039978,-2.769737 0,-2.619469 2.340302,-2.834137 3.413849,-2.834137 z m 16.124726,5.152931 c 0.02145,0.944725 0.02145,1.953873 0.429412,2.76976 -0.62268,-0.06442 -0.987671,-0.150291 -2.125366,-0.150291 -0.665588,0 -1.030609,0.06443 -1.567383,0.150291 0.107361,-0.365013 0.171753,-0.493866 0.214722,-0.987648 0.08588,-0.644134 0.150299,-2.791206 0.150299,-3.542671 v -3.027466 c 0,-1.30973 0,-3.220642 -0.08585,-3.8862378 -0.06445,-0.4723511 -0.193237,-1.7606125 -1.825073,-1.7606125 -1.588867,0 -2.125336,1.1809006 -2.318848,2.125328 -0.214721,0.9876553 -0.214721,2.0400013 -0.214721,6.1836323 0.02145,3.585594 0.02145,3.90773 0.300567,4.895355 -0.472351,-0.06442 -1.052063,-0.107353 -1.910919,-0.107353 -0.665619,0 -1.116486,0.02146 -1.674744,0.107353 0.193238,-0.450882 0.300598,-0.665596 0.365021,-2.232956 0.06442,-1.545868 0.171753,-9.103653 -0.08585,-10.8857346 C 54.772483,6.7198639 54.471885,6.4622116 54.171287,6.1830902 56.447197,6.0757294 57.155723,5.7107468 57.86428,5.3457565 v 2.9635468 c 0.343293,-0.8588257 1.030365,-2.7909317 3.843018,-2.7909317 3.499756,0 3.52124,2.5550384 3.542694,4.2297592 v 8.4165882" /></g><g
           class=""
           transform="translate(74.778793,8.9489594)"
           id="g1257"><path
             style="fill:#d70751;stroke:none;stroke-width:0.02666667"
             inkscape:connector-curvature="0"
             id="path1255"
             d="M 4.6377258,2.3188553 2.3188477,4.6377029 0,2.3188553 2.3188477,0 4.6377258,2.3188553" /></g></g></g></g></g><g
   id="g10-3-6"
   transform="matrix(2.8301887,0,0,2.8301887,229.25549,248.83268)"><title
     id="title6-6">debian-ar21</title><g
     id="use8-7"
     transform="matrix(2.1226416,0,0,-2.1226416,0.5,774.4232)"><title
       id="title1288">debian-ar21</title><g
       v:size="106,41,0.5,0.5"
       v:abox="{&quot;x&quot;:0,&quot;y&quot;:0,&quot;width&quot;:104.68769836425781,&quot;height&quot;:39.6497650146484}"
       class="Group.cls"
       id="g1308"><g
         id="g1306"
         class="Prim.cls"><g
           class=""
           id="g1292"><path
             style="fill:#d70751;stroke:none;stroke-width:0.02666667"
             inkscape:connector-curvature="0"
             id="path1290"
             d="m 21.233047,21.658989 c -0.661346,0.016 0.125916,0.346291 0.991608,0.472214 0.236115,-0.188881 0.456482,-0.377762 0.645355,-0.550934 -0.535217,0.125915 -1.08609,0.125915 -1.636993,0.07866 m 3.557342,-0.881409 c 0.393525,-0.550934 0.676789,-1.133331 0.787018,-1.7472 -0.09448,0.44072 -0.330536,0.818505 -0.550934,1.211998 -1.243469,0.771286 -0.110198,-0.456474 0,-0.928665 -1.337921,1.66848 -0.188903,0.991631 -0.236114,1.463844 m 1.306457,-3.415626 c 0.07864,-1.196274 -0.236114,-0.818512 -0.346313,-0.36203 0.125916,0.07867 0.220398,0.849975 0.346313,0.36203 M 18.730331,1.0864029 c 0.346283,0.062927 0.771271,0.1101837 0.708313,0.1888733 0.377747,-0.078667 0.472199,-0.1574097 -0.708313,-0.1888733 m 0.708313,0.2046356 -0.251831,0.047203 0.236084,-0.015999 0.01602,-0.031471 m 8.641144,15.6461335 c 0.04718,1.070351 -0.314819,1.58976 -0.629334,2.50267 l -0.566681,0.283333 c -0.472198,0.912933 0.04721,0.582397 -0.283325,1.30645 -0.72406,0.645332 -2.219391,2.03051 -2.691589,2.156425 -0.346314,0 0.236084,-0.409248 0.314789,-0.566665 -0.975891,0.676803 -0.787018,1.007385 -2.282349,1.41661 l -0.04721,-0.09445 c -3.683197,1.731468 -8.814514,-1.700211 -8.736114,-6.390557 -0.03148,0.299065 -0.110199,0.220375 -0.188889,0.346291 -0.188873,-2.407997 1.11734,-4.832001 3.321198,-5.823921 2.156418,-1.070343 4.674881,-0.629334 6.217422,0.802749 -0.849975,-1.101814 -2.534179,-2.282348 -4.533203,-2.172157 -1.951782,0.03146 -3.793411,1.274666 -4.391556,2.628639 -1.007385,0.629334 -1.117324,2.439995 -1.558288,2.770294 -0.582398,4.312851 1.101822,6.185944 3.966568,8.373864 0.456482,0.299064 0.125915,0.34629 0.188873,0.582397 -0.944427,-0.44072 -1.825867,-1.117332 -2.53418,-1.93605 0.377762,0.550933 0.787003,1.101814 1.322175,1.526802 -0.897187,-0.299065 -2.093461,-2.172165 -2.439988,-2.250855 1.542557,2.770294 6.280381,4.863999 8.751603,3.824875 -1.149354,0.0472 -2.597168,0.01601 -3.887848,-0.456474 -0.535187,-0.283333 -1.274674,-0.849976 -1.149338,-0.96016 3.38417,1.259202 6.862778,0.96016 9.790451,-1.385147 0.739807,-0.582405 1.558288,-1.558296 1.794678,-1.574028 -0.346283,0.535202 0.06293,0.251839 -0.204621,0.724053 0.739777,-1.196266 -0.314789,-0.487946 0.771271,-2.061974 l 0.409271,0.550934 c -0.157409,-0.991623 1.227722,-2.203651 1.08606,-3.761917 0.314819,-0.472214 0.346313,0.519463 0.01602,1.621254 0.472198,-1.227738 0.125915,-1.416618 0.236084,-2.440003 0.125946,0.346291 0.299072,0.708321 0.393524,1.054589 -0.299042,-1.180535 0.314819,-1.999016 0.456482,-2.675843 -0.15741,-0.06293 -0.472199,0.519471 -0.535187,-0.881469 0.01599,-0.613861 0.173157,-0.314797 0.236114,-0.472214 -0.125946,-0.06293 -0.424987,-0.535194 -0.613891,-1.432373 0.141662,-0.204613 0.36203,0.550934 0.550934,0.566666 C 30.504074,11.931229 30.299484,11.39608 30.299484,10.844879 29.74852,9.695549 30.11058,11.002296 29.654129,10.356934 29.071732,8.5310669 30.142075,9.9319458 30.205063,9.1134644 31.086533,10.38813 31.590225,12.387436 31.826309,13.205948 31.653183,12.198563 31.369858,11.222664 31.007828,10.293999 31.275375,10.404182 30.58284,8.2320251 31.354111,9.6646652 30.519882,6.5953293 27.780777,3.714798 25.26265,2.3766632 25.577438,2.659996 25.955185,3.0059967 25.813583,3.0691986 24.554367,2.3294144 24.774734,2.266449 24.601578,1.9518661 c -1.023133,-0.4092559 -1.08609,0.031464 -1.762665,0 C 20.918594,0.92874908 20.540817,1.0389328 18.777908,0.39356995 l 0.07868,0.37776184 c -1.274659,-0.4249878 -1.479584,0.15741729 -2.864746,0 -0.07866,-0.0629349 0.440734,-0.23610688 0.881469,-0.29906464 -1.227737,0.15740967 -1.180526,-0.23610687 -2.3768,0.0471954 C 14.795578,0.31484985 15.110382,0.173172 15.425171,0 14.417786,0.06293488 13.017181,0.58239746 13.457626,0.11018372 11.820648,0.84997559 8.9086914,1.8728561 7.2716827,3.3999176 L 7.2244873,3.053627 C 6.4691772,3.9508286 3.9662476,5.745224 3.7619019,6.909996 L 3.5572815,6.9571991 C 3.1637573,7.6185303 2.9119568,8.358078 2.612854,9.0506668 2.1091766,9.9163742 1.8730621,9.3812027 1.9360504,9.5228806 0.92866516,11.553383 0.4407196,13.269066 0,14.669945 c 0.29907227,0.456482 0,2.754562 0.12591553,4.596161 -0.50367737,9.09787 6.37483217,17.928184 13.91467247,19.958671 1.101807,0.393509 2.738816,0.377762 4.139725,0.424988 -1.65271,-0.472214 -1.85733,-0.251846 -3.462845,-0.80275 -1.149338,-0.550933 -1.41661,-1.164802 -2.235122,-1.873069 l 0.330535,0.566665 c -1.605514,-0.566665 -0.928665,-0.70832 -2.235122,-1.117332 l 0.346298,-0.456482 c -0.51947,-0.0472 -1.3851471,-0.881462 -1.6212616,-1.337914 l -0.5666656,0.016 C 8.0593414,33.794907 7.6815491,33.19677 7.7130127,32.724564 L 7.4611816,33.007896 C 7.2565613,32.645866 4.9427185,29.844101 6.1389923,30.489441 5.9186096,30.284828 5.6195221,30.158905 5.3047485,29.576508 L 5.540863,29.293175 C 4.9584503,28.553383 4.4862671,27.593224 4.5177307,27.278427 4.8325348,27.687675 5.0372009,27.766373 5.2575226,27.845093 3.7936859,24.224823 3.7149658,27.64048 2.6131439,24.161896 l 0.2361145,-0.01601 C 2.6761017,23.878319 2.565918,23.579224 2.4242706,23.295921 l 0.094452,-1.007385 C 1.4641418,21.07653 2.2196503,17.141464 2.3770752,14.96933 2.4872589,14.087868 3.2585297,13.159195 3.8409119,11.679596 l -0.3620301,-0.06293 c 0.6768036,-1.196266 3.903595,-4.7850726 5.383194,-4.5961612 0.7240601,-0.9129333 -0.1416473,0 -0.2833252,-0.2361069 1.5897524,-1.6369857 2.0777134,-1.1648025 3.1480564,-1.4481048 1.149322,-0.6768036 -0.991639,0.2675705 -0.44072,-0.2675781 1.999008,-0.5036774 1.416611,-1.1648026 4.013779,-1.4166108 0.267578,0.1574097 -0.629334,0.2361069 -0.865708,0.4407196 1.652726,-0.8185043 5.257264,-0.6293335 7.586823,0.456482 2.707336,1.259201 5.745209,5.0054092 5.871124,8.5311962 l 0.141663,0.03146 c -0.06293,1.400887 0.220367,3.02214 -0.283325,4.501739 l 0.330535,-0.676803" /></g><g
           class=""
           transform="translate(2.0787551,0.56700897)"
           id="g1296"><path
             style="fill:#d70751;stroke:none;stroke-width:0.02666667"
             inkscape:connector-curvature="0"
             id="path1294"
             d="m 11.945217,22.004906 -0.09445,0.456482 c 0.440719,0.598137 0.787017,1.227737 1.337921,1.684211 -0.409256,-0.771278 -0.708313,-1.086074 -1.243469,-2.140663 m 1.023117,-0.04726 c -0.2361,-0.251839 -0.362015,-0.566666 -0.519455,-0.8657 0.141647,0.535194 0.440719,0.991623 0.724044,1.463837 L 12.968318,21.95768 m 18.180085,-3.950821 -0.09445,0.251839 c -0.173157,1.259201 -0.566681,2.518455 -1.149353,3.683197 0.645355,-1.22773 1.070343,-2.565682 1.243469,-3.935067 M 16.777492,0.20462036 C 17.218196,0.04720306 17.879299,0.11016083 18.351528,0 17.737636,0.04720306 17.123775,0.07866669 16.509914,0.1574173 l 0.267578,0.0472031 M 1.0841478,8.5469666 C 1.1943468,9.5071259 0.36010298,9.8691483 1.2730363,9.2394943 1.7452501,8.1691513 1.068416,8.9561615 1.0841478,8.5469666 M 0.02956709,12.969978 c 0.20462036,-0.629333 0.25184631,-1.023117 0.33053589,-1.385147 -0.58239746,0.724053 -0.26757813,0.881462 -0.33053589,1.385147" /></g><g
           class=""
           transform="translate(39.008255,9.8506927)"
           id="g1300"><path
             style="fill:#000000;stroke:none;stroke-width:0.02666667"
             inkscape:connector-curvature="0"
             id="path1298"
             d="m 0,13.140236 c 0,7.879814 4.1868286,7.879814 4.8095093,7.879814 1.7391357,0 2.8556213,-0.944717 3.3280029,-2.597969 l 0.064392,2.490608 c 0.5368042,-0.02146 1.0735474,-0.08586 1.9323728,-0.08586 0.300598,0 0.558258,0 0.77298,0.02147 0.214691,0 0.450867,0.02146 0.708527,0.06439 -0.450898,-0.901787 -0.77298,-2.898552 -0.77298,-7.278663 0,-4.2511982 0,-11.4440007 0.365021,-13.634026 C 10.1987,0.47237396 9.3398132,0.7946701 7.4289551,0.94471741 8.1804199,1.7606125 8.1804199,2.1685562 8.1804199,5.8615189 7.6436157,5.6897888 6.9777527,5.4965057 5.8400879,5.4965057 0.81591797,5.5391769 0,9.898056 0,13.140137 M 8.1160278,9.8547974 c -0.021484,0.021469 -0.021484,4.5303496 -0.085876,5.7112506 -0.064392,0.944725 -0.1502991,2.984459 -2.1470948,2.984459 -2.0611877,0 -2.576538,-2.383278 -2.7482605,-3.413865 -0.1932373,-1.137977 -0.1932373,-2.104164 -0.1932373,-2.512107 0,-1.352669 0.085876,-5.0886158 3.2421265,-5.0886158 0.9447327,0 1.4815064,0.2791214 1.9109497,0.493866 z M 22.716217,12.001999 c 0,-3.2635728 -0.644134,-6.4842149 -4.787994,-6.4842149 -5.711243,0 -5.711243,6.3124539 -5.711243,7.6651229 0,5.66832 2.555023,7.922775 6.827728,7.922775 1.910919,0 2.834137,-0.279121 3.328003,-0.429412 -0.02148,-1.009125 0.107361,-1.653252 0.279114,-2.512108 -0.579742,0.365013 -1.352661,0.837333 -3.027374,0.837333 -4.358582,0 -4.423035,-3.972107 -4.423035,-5.346267 H 22.6521 l 0.06442,-1.653252 m -7.536011,-0.279121 c 0.02149,-2.3188557 0.493866,-4.4015507 2.490632,-4.4015507 2.190033,0 2.340301,2.404747 2.297363,4.4015507 z m 8.609253,4.530662 c 0,2.061203 0,3.242134 -0.343536,4.143898 1.137939,0.450882 2.576538,0.708534 4.272736,0.708534 1.095001,0 4.25119,0 5.968902,-3.499733 0.815888,-1.63179 1.095001,-3.800354 1.095001,-5.453338 0,-1.009117 -0.10736,-3.2206347 -0.923248,-4.6159975 C 33.08667,6.22715 31.819611,5.5615463 30.467224,5.5615463 c -2.683868,0 -3.478302,2.2329636 -3.886261,3.3924027 0,-1.4170685 0.02148,-6.3983231 0.25766,-8.95333864844 C 25.013611,0.83794403 23.897095,0.98826599 22.694733,1.0956268 c 1.095031,0.450882 1.095031,2.2973862 1.095031,8.309227 v 6.8492282 m 8.030121,-3.048859 c 0,2.597977 -0.472351,6.097733 -3.714477,6.097733 -0.450898,0 -1.009125,-0.08586 -1.374146,-0.17173 -0.06442,-1.009118 -0.06442,-2.748269 -0.06442,-4.745064 0,-2.404724 0.25766,-3.671524 0.450866,-4.272721 0.579743,-1.9753337 1.91095,-2.0182719 2.147095,-2.0182719 2.147095,0 2.555054,2.9200589 2.555054,5.1100849 z m 8.352143,7.729233 c -0.558228,-0.08587 -0.944703,-0.150299 -1.76059,-0.150299 -0.901794,0 -1.50296,0.06443 -2.147064,0.150299 0.279114,-0.536804 0.386474,-0.79467 0.47232,-2.597977 0.107361,-2.490616 0.150299,-9.1466139 -0.06439,-10.5422133 -0.150299,-1.0735473 -0.386474,-1.2238388 -0.772949,-1.5029296 2.297333,-0.2147217 2.941498,-0.3864823 3.993591,-0.9017868 -0.214721,1.2238388 -0.25766,1.8465042 -0.25766,3.7144775 -0.06442,9.6404262 -0.08585,10.6710362 0.536805,11.8304522 m 1.266662,-4.487999 c 0,1.760612 0.536804,3.521225 2.104157,4.27272 0.708526,0.300583 1.395599,0.300583 1.631775,0.300583 2.576538,0 3.435333,-1.910927 3.972107,-3.070343 -0.02145,1.223839 0,1.975334 0.08588,2.962982 0.493866,-0.02146 1.009094,-0.08586 1.846497,-0.08586 0.472351,0 0.923248,0.06442 1.395599,0.08586 C 52.17417,20.440079 52.002417,20.160957 51.91654,19.065918 51.85209,18.01384 51.85209,16.940582 51.85209,15.458801 l 0.02148,-5.7112043 c 0,-2.1256485 -0.558258,-4.2297821 -4.766541,-4.2297821 -2.769745,0 -4.40155,0.8373337 -5.195953,1.2667694 0.343567,0.6226655 0.62268,1.1379776 0.858825,2.3403244 1.095032,-0.944725 2.512116,-1.459999 3.972107,-1.459999 2.318879,0 2.318879,1.5458603 2.318879,3.7144776 -0.536805,-0.02147 -0.987671,-0.08587 -1.739167,-0.08587 -3.542663,0.04267 -5.882995,1.417069 -5.882995,5.153015 m 7.68658,-3.435332 c -0.06442,1.760612 -0.08588,2.984451 -0.558258,3.972107 -0.579712,1.266769 -1.567383,1.63179 -2.297394,1.63179 -1.674713,0 -2.039978,-1.395607 -2.039978,-2.769737 0,-2.619469 2.340302,-2.834137 3.413849,-2.834137 z m 16.124726,5.152931 c 0.02145,0.944725 0.02145,1.953873 0.429412,2.76976 -0.62268,-0.06442 -0.987671,-0.150291 -2.125366,-0.150291 -0.665588,0 -1.030609,0.06443 -1.567383,0.150291 0.107361,-0.365013 0.171753,-0.493866 0.214722,-0.987648 0.08588,-0.644134 0.150299,-2.791206 0.150299,-3.542671 v -3.027466 c 0,-1.30973 0,-3.220642 -0.08585,-3.8862378 -0.06445,-0.4723511 -0.193237,-1.7606125 -1.825073,-1.7606125 -1.588867,0 -2.125336,1.1809006 -2.318848,2.125328 -0.214721,0.9876553 -0.214721,2.0400013 -0.214721,6.1836323 0.02145,3.585594 0.02145,3.90773 0.300567,4.895355 -0.472351,-0.06442 -1.052063,-0.107353 -1.910919,-0.107353 -0.665619,0 -1.116486,0.02146 -1.674744,0.107353 0.193238,-0.450882 0.300598,-0.665596 0.365021,-2.232956 0.06442,-1.545868 0.171753,-9.103653 -0.08585,-10.8857346 C 54.772483,6.7198639 54.471885,6.4622116 54.171287,6.1830902 56.447197,6.0757294 57.155723,5.7107468 57.86428,5.3457565 v 2.9635468 c 0.343293,-0.8588257 1.030365,-2.7909317 3.843018,-2.7909317 3.499756,0 3.52124,2.5550384 3.542694,4.2297592 v 8.4165882" /></g><g
           class=""
           transform="translate(74.778793,8.9489594)"
           id="g1304"><path
             style="fill:#d70751;stroke:none;stroke-width:0.02666667"
             inkscape:connector-curvature="0"
             id="path1302"
             d="M 4.6377258,2.3188553 2.3188477,4.6377029 0,2.3188553 2.3188477,0 4.6377258,2.3188553" /></g><g
           transform="matrix(1.6311352,0,0,1.6311352,189.90307,-120.25672)"
           id="g10-7"><title
             id="title6-5">debian-ar21</title><g
             id="use8-3"
             transform="matrix(0.35333333,0,0,0.35333333,-37.897253,277.93318)"><title
               id="title2140">debian-ar21</title><g
               v:size="106,41,0.5,0.5"
               v:abox="{&quot;x&quot;:0,&quot;y&quot;:0,&quot;width&quot;:104.68769836425781,&quot;height&quot;:39.6497650146484}"
               class="Group.cls"
               id="g2160"><g
                 id="g2158"
                 class="Prim.cls"><g
                   id="g2172"
                   transform="matrix(1.1758739,0,0,1.2160384,-204.22128,-27.597142)"><g
                     id="g2233"><g
                       id="g631"
                       transform="matrix(0.81505233,0,0,0.81505233,-69.620616,95.2456)"><g
                         transform="translate(0,-1.3970227)"
                         id="g619"><g
                           class=""
                           id="g2144"
                           style="fill:#a80030;fill-opacity:1"><path
                             style="fill:#a80030;fill-opacity:1;stroke:none;stroke-width:0.02666667"
                             inkscape:connector-curvature="0"
                             id="path2142"
                             d="m 21.233047,21.658989 c -0.661346,0.016 0.125916,0.346291 0.991608,0.472214 0.236115,-0.188881 0.456482,-0.377762 0.645355,-0.550934 -0.535217,0.125915 -1.08609,0.125915 -1.636993,0.07866 m 3.557342,-0.881409 c 0.393525,-0.550934 0.676789,-1.133331 0.787018,-1.7472 -0.09448,0.44072 -0.330536,0.818505 -0.550934,1.211998 -1.243469,0.771286 -0.110198,-0.456474 0,-0.928665 -1.337921,1.66848 -0.188903,0.991631 -0.236114,1.463844 m 1.306457,-3.415626 c 0.07864,-1.196274 -0.236114,-0.818512 -0.346313,-0.36203 0.125916,0.07867 0.220398,0.849975 0.346313,0.36203 M 18.730331,1.0864029 c 0.346283,0.062927 0.771271,0.1101837 0.708313,0.1888733 0.377747,-0.078667 0.472199,-0.1574097 -0.708313,-0.1888733 m 0.708313,0.2046356 -0.251831,0.047203 0.236084,-0.015999 0.01602,-0.031471 m 8.641144,15.6461335 c 0.04718,1.070351 -0.314819,1.58976 -0.629334,2.50267 l -0.566681,0.283333 c -0.472198,0.912933 0.04721,0.582397 -0.283325,1.30645 -0.72406,0.645332 -2.219391,2.03051 -2.691589,2.156425 -0.346314,0 0.236084,-0.409248 0.314789,-0.566665 -0.975891,0.676803 -0.787018,1.007385 -2.282349,1.41661 l -0.04721,-0.09445 c -3.683197,1.731468 -8.814514,-1.700211 -8.736114,-6.390557 -0.03148,0.299065 -0.110199,0.220375 -0.188889,0.346291 -0.188873,-2.407997 1.11734,-4.832001 3.321198,-5.823921 2.156418,-1.070343 4.674881,-0.629334 6.217422,0.802749 -0.849975,-1.101814 -2.534179,-2.282348 -4.533203,-2.172157 -1.951782,0.03146 -3.793411,1.274666 -4.391556,2.628639 -1.007385,0.629334 -1.117324,2.439995 -1.558288,2.770294 -0.582398,4.312851 1.101822,6.185944 3.966568,8.373864 0.456482,0.299064 0.125915,0.34629 0.188873,0.582397 -0.944427,-0.44072 -1.825867,-1.117332 -2.53418,-1.93605 0.377762,0.550933 0.787003,1.101814 1.322175,1.526802 -0.897187,-0.299065 -2.093461,-2.172165 -2.439988,-2.250855 1.542557,2.770294 6.280381,4.863999 8.751603,3.824875 -1.149354,0.0472 -2.597168,0.01601 -3.887848,-0.456474 -0.535187,-0.283333 -1.274674,-0.849976 -1.149338,-0.96016 3.38417,1.259202 6.862778,0.96016 9.790451,-1.385147 0.739807,-0.582405 1.558288,-1.558296 1.794678,-1.574028 -0.346283,0.535202 0.06293,0.251839 -0.204621,0.724053 0.739777,-1.196266 -0.314789,-0.487946 0.771271,-2.061974 l 0.409271,0.550934 c -0.157409,-0.991623 1.227722,-2.203651 1.08606,-3.761917 0.314819,-0.472214 0.346313,0.519463 0.01602,1.621254 0.472198,-1.227738 0.125915,-1.416618 0.236084,-2.440003 0.125946,0.346291 0.299072,0.708321 0.393524,1.054589 -0.299042,-1.180535 0.314819,-1.999016 0.456482,-2.675843 -0.15741,-0.06293 -0.472199,0.519471 -0.535187,-0.881469 0.01599,-0.613861 0.173157,-0.314797 0.236114,-0.472214 -0.125946,-0.06293 -0.424987,-0.535194 -0.613891,-1.432373 0.141662,-0.204613 0.36203,0.550934 0.550934,0.566666 C 30.504074,11.931229 30.299484,11.39608 30.299484,10.844879 29.74852,9.695549 30.11058,11.002296 29.654129,10.356934 29.071732,8.5310669 30.142075,9.9319458 30.205063,9.1134644 31.086533,10.38813 31.590225,12.387436 31.826309,13.205948 31.653183,12.198563 31.369858,11.222664 31.007828,10.293999 31.275375,10.404182 30.58284,8.2320251 31.354111,9.6646652 30.519882,6.5953293 27.780777,3.714798 25.26265,2.3766632 25.577438,2.659996 25.955185,3.0059967 25.813583,3.0691986 24.554367,2.3294144 24.774734,2.266449 24.601578,1.9518661 c -1.023133,-0.4092559 -1.08609,0.031464 -1.762665,0 C 20.918594,0.92874908 20.540817,1.0389328 18.777908,0.39356995 l 0.07868,0.37776184 c -1.274659,-0.4249878 -1.479584,0.15741729 -2.864746,0 -0.07866,-0.0629349 0.440734,-0.23610688 0.881469,-0.29906464 -1.227737,0.15740967 -1.180526,-0.23610687 -2.3768,0.0471954 C 14.795578,0.31484985 15.110382,0.173172 15.425171,0 14.417786,0.06293488 13.017181,0.58239746 13.457626,0.11018372 11.820648,0.84997559 8.9086914,1.8728561 7.2716827,3.3999176 L 7.2244873,3.053627 C 6.4691772,3.9508286 3.9662476,5.745224 3.7619019,6.909996 L 3.5572815,6.9571991 C 3.1637573,7.6185303 2.9119568,8.358078 2.612854,9.0506668 2.1091766,9.9163742 1.8730621,9.3812027 1.9360504,9.5228806 0.92866516,11.553383 0.4407196,13.269066 0,14.669945 c 0.29907227,0.456482 0,2.754562 0.12591553,4.596161 -0.50367737,9.09787 6.37483217,17.928184 13.91467247,19.958671 1.101807,0.393509 2.738816,0.377762 4.139725,0.424988 -1.65271,-0.472214 -1.85733,-0.251846 -3.462845,-0.80275 -1.149338,-0.550933 -1.41661,-1.164802 -2.235122,-1.873069 l 0.330535,0.566665 c -1.605514,-0.566665 -0.928665,-0.70832 -2.235122,-1.117332 l 0.346298,-0.456482 c -0.51947,-0.0472 -1.3851471,-0.881462 -1.6212616,-1.337914 l -0.5666656,0.016 C 8.0593414,33.794907 7.6815491,33.19677 7.7130127,32.724564 L 7.4611816,33.007896 C 7.2565613,32.645866 4.9427185,29.844101 6.1389923,30.489441 5.9186096,30.284828 5.6195221,30.158905 5.3047485,29.576508 L 5.540863,29.293175 C 4.9584503,28.553383 4.4862671,27.593224 4.5177307,27.278427 4.8325348,27.687675 5.0372009,27.766373 5.2575226,27.845093 3.7936859,24.224823 3.7149658,27.64048 2.6131439,24.161896 l 0.2361145,-0.01601 C 2.6761017,23.878319 2.565918,23.579224 2.4242706,23.295921 l 0.094452,-1.007385 C 1.4641418,21.07653 2.2196503,17.141464 2.3770752,14.96933 2.4872589,14.087868 3.2585297,13.159195 3.8409119,11.679596 l -0.3620301,-0.06293 c 0.6768036,-1.196266 3.903595,-4.7850726 5.383194,-4.5961612 0.7240601,-0.9129333 -0.1416473,0 -0.2833252,-0.2361069 1.5897524,-1.6369857 2.0777134,-1.1648025 3.1480564,-1.4481048 1.149322,-0.6768036 -0.991639,0.2675705 -0.44072,-0.2675781 1.999008,-0.5036774 1.416611,-1.1648026 4.013779,-1.4166108 0.267578,0.1574097 -0.629334,0.2361069 -0.865708,0.4407196 1.652726,-0.8185043 5.257264,-0.6293335 7.586823,0.456482 2.707336,1.259201 5.745209,5.0054092 5.871124,8.5311962 l 0.141663,0.03146 c -0.06293,1.400887 0.220367,3.02214 -0.283325,4.501739 l 0.330535,-0.676803" /></g><g
                           class=""
                           transform="translate(2.0787551,0.56700897)"
                           id="g2148"
                           style="fill:#a80030;fill-opacity:1"><path
                             style="fill:#a80030;fill-opacity:1;stroke:none;stroke-width:0.02666667"
                             inkscape:connector-curvature="0"
                             id="path2146"
                             d="m 11.945217,22.004906 -0.09445,0.456482 c 0.440719,0.598137 0.787017,1.227737 1.337921,1.684211 -0.409256,-0.771278 -0.708313,-1.086074 -1.243469,-2.140663 m 1.023117,-0.04726 c -0.2361,-0.251839 -0.362015,-0.566666 -0.519455,-0.8657 0.141647,0.535194 0.440719,0.991623 0.724044,1.463837 L 12.968318,21.95768 m 18.180085,-3.950821 -0.09445,0.251839 c -0.173157,1.259201 -0.566681,2.518455 -1.149353,3.683197 0.645355,-1.22773 1.070343,-2.565682 1.243469,-3.935067 M 16.777492,0.20462036 C 17.218196,0.04720306 17.879299,0.11016083 18.351528,0 17.737636,0.04720306 17.123775,0.07866669 16.509914,0.1574173 l 0.267578,0.0472031 M 1.0841478,8.5469666 C 1.1943468,9.5071259 0.36010298,9.8691483 1.2730363,9.2394943 1.7452501,8.1691513 1.068416,8.9561615 1.0841478,8.5469666 M 0.02956709,12.969978 c 0.20462036,-0.629333 0.25184631,-1.023117 0.33053589,-1.385147 -0.58239746,0.724053 -0.26757813,0.881462 -0.33053589,1.385147" /></g></g><g
                         id="g612"><g
                           class=""
                           transform="matrix(1.1385825,0,0,1.1385825,39.008255,6.9257766)"
                           id="g2152"><path
                             style="fill:#000000;stroke:none;stroke-width:0.02666667"
                             inkscape:connector-curvature="0"
                             id="path2150"
                             d="m 0,13.140236 c 0,7.879814 4.1868286,7.879814 4.8095093,7.879814 1.7391357,0 2.8556213,-0.944717 3.3280029,-2.597969 l 0.064392,2.490608 c 0.5368042,-0.02146 1.0735474,-0.08586 1.9323728,-0.08586 0.300598,0 0.558258,0 0.77298,0.02147 0.214691,0 0.450867,0.02146 0.708527,0.06439 -0.450898,-0.901787 -0.77298,-2.898552 -0.77298,-7.278663 0,-4.2511982 0,-11.4440007 0.365021,-13.634026 C 10.1987,0.47237396 9.3398132,0.7946701 7.4289551,0.94471741 8.1804199,1.7606125 8.1804199,2.1685562 8.1804199,5.8615189 7.6436157,5.6897888 6.9777527,5.4965057 5.8400879,5.4965057 0.81591797,5.5391769 0,9.898056 0,13.140137 M 8.1160278,9.8547974 c -0.021484,0.021469 -0.021484,4.5303496 -0.085876,5.7112506 -0.064392,0.944725 -0.1502991,2.984459 -2.1470948,2.984459 -2.0611877,0 -2.576538,-2.383278 -2.7482605,-3.413865 -0.1932373,-1.137977 -0.1932373,-2.104164 -0.1932373,-2.512107 0,-1.352669 0.085876,-5.0886158 3.2421265,-5.0886158 0.9447327,0 1.4815064,0.2791214 1.9109497,0.493866 z M 22.716217,12.001999 c 0,-3.2635728 -0.644134,-6.4842149 -4.787994,-6.4842149 -5.711243,0 -5.711243,6.3124539 -5.711243,7.6651229 0,5.66832 2.555023,7.922775 6.827728,7.922775 1.910919,0 2.834137,-0.279121 3.328003,-0.429412 -0.02148,-1.009125 0.107361,-1.653252 0.279114,-2.512108 -0.579742,0.365013 -1.352661,0.837333 -3.027374,0.837333 -4.358582,0 -4.423035,-3.972107 -4.423035,-5.346267 H 22.6521 l 0.06442,-1.653252 m -7.536011,-0.279121 c 0.02149,-2.3188557 0.493866,-4.4015507 2.490632,-4.4015507 2.190033,0 2.340301,2.404747 2.297363,4.4015507 z m 8.609253,4.530662 c 0,2.061203 0,3.242134 -0.343536,4.143898 1.137939,0.450882 2.576538,0.708534 4.272736,0.708534 1.095001,0 4.25119,0 5.968902,-3.499733 0.815888,-1.63179 1.095001,-3.800354 1.095001,-5.453338 0,-1.009117 -0.10736,-3.2206347 -0.923248,-4.6159975 C 33.08667,6.22715 31.819611,5.5615463 30.467224,5.5615463 c -2.683868,0 -3.478302,2.2329636 -3.886261,3.3924027 0,-1.4170685 0.02148,-6.3983231 0.25766,-8.95333864844 C 25.013611,0.83794403 23.897095,0.98826599 22.694733,1.0956268 c 1.095031,0.450882 1.095031,2.2973862 1.095031,8.309227 v 6.8492282 m 8.030121,-3.048859 c 0,2.597977 -0.472351,6.097733 -3.714477,6.097733 -0.450898,0 -1.009125,-0.08586 -1.374146,-0.17173 -0.06442,-1.009118 -0.06442,-2.748269 -0.06442,-4.745064 0,-2.404724 0.25766,-3.671524 0.450866,-4.272721 0.579743,-1.9753337 1.91095,-2.0182719 2.147095,-2.0182719 2.147095,0 2.555054,2.9200589 2.555054,5.1100849 z m 8.352143,7.729233 c -0.558228,-0.08587 -0.944703,-0.150299 -1.76059,-0.150299 -0.901794,0 -1.50296,0.06443 -2.147064,0.150299 0.279114,-0.536804 0.386474,-0.79467 0.47232,-2.597977 0.107361,-2.490616 0.150299,-9.1466139 -0.06439,-10.5422133 -0.150299,-1.0735473 -0.386474,-1.2238388 -0.772949,-1.5029296 2.297333,-0.2147217 2.941498,-0.3864823 3.993591,-0.9017868 -0.214721,1.2238388 -0.25766,1.8465042 -0.25766,3.7144775 -0.06442,9.6404262 -0.08585,10.6710362 0.536805,11.8304522 m 1.266662,-4.487999 c 0,1.760612 0.536804,3.521225 2.104157,4.27272 0.708526,0.300583 1.395599,0.300583 1.631775,0.300583 2.576538,0 3.435333,-1.910927 3.972107,-3.070343 -0.02145,1.223839 0,1.975334 0.08588,2.962982 0.493866,-0.02146 1.009094,-0.08586 1.846497,-0.08586 0.472351,0 0.923248,0.06442 1.395599,0.08586 C 52.17417,20.440079 52.002417,20.160957 51.91654,19.065918 51.85209,18.01384 51.85209,16.940582 51.85209,15.458801 l 0.02148,-5.7112043 c 0,-2.1256485 -0.558258,-4.2297821 -4.766541,-4.2297821 -2.769745,0 -4.40155,0.8373337 -5.195953,1.2667694 0.343567,0.6226655 0.62268,1.1379776 0.858825,2.3403244 1.095032,-0.944725 2.512116,-1.459999 3.972107,-1.459999 2.318879,0 2.318879,1.5458603 2.318879,3.7144776 -0.536805,-0.02147 -0.987671,-0.08587 -1.739167,-0.08587 -3.542663,0.04267 -5.882995,1.417069 -5.882995,5.153015 m 7.68658,-3.435332 c -0.06442,1.760612 -0.08588,2.984451 -0.558258,3.972107 -0.579712,1.266769 -1.567383,1.63179 -2.297394,1.63179 -1.674713,0 -2.039978,-1.395607 -2.039978,-2.769737 0,-2.619469 2.340302,-2.834137 3.413849,-2.834137 z m 16.124726,5.152931 c 0.02145,0.944725 0.02145,1.953873 0.429412,2.76976 -0.62268,-0.06442 -0.987671,-0.150291 -2.125366,-0.150291 -0.665588,0 -1.030609,0.06443 -1.567383,0.150291 0.107361,-0.365013 0.171753,-0.493866 0.214722,-0.987648 0.08588,-0.644134 0.150299,-2.791206 0.150299,-3.542671 v -3.027466 c 0,-1.30973 0,-3.220642 -0.08585,-3.8862378 -0.06445,-0.4723511 -0.193237,-1.7606125 -1.825073,-1.7606125 -1.588867,0 -2.125336,1.1809006 -2.318848,2.125328 -0.214721,0.9876553 -0.214721,2.0400013 -0.214721,6.1836323 0.02145,3.585594 0.02145,3.90773 0.300567,4.895355 -0.472351,-0.06442 -1.052063,-0.107353 -1.910919,-0.107353 -0.665619,0 -1.116486,0.02146 -1.674744,0.107353 0.193238,-0.450882 0.300598,-0.665596 0.365021,-2.232956 0.06442,-1.545868 0.171753,-9.103653 -0.08585,-10.8857346 C 54.772483,6.7198639 54.471885,6.4622116 54.171287,6.1830902 56.447197,6.0757294 57.155723,5.7107468 57.86428,5.3457565 v 2.9635468 c 0.343293,-0.8588257 1.030365,-2.7909317 3.843018,-2.7909317 3.499756,0 3.52124,2.5550384 3.542694,4.2297592 v 8.4165882" /></g><g
                           class=""
                           transform="matrix(1.1385825,0,0,1.1385825,79.735965,5.8990788)"
                           id="g2156"
                           style="fill:#a80030;fill-opacity:1"><path
                             style="fill:#a80030;fill-opacity:1;stroke:none;stroke-width:0.02666667"
                             inkscape:connector-curvature="0"
                             id="path2154"
                             d="M 4.6377258,2.3188553 2.3188477,4.6377029 0,2.3188553 2.3188477,0 4.6377258,2.3188553" /></g></g></g></g></g></g></g></g></g></g></g></g></g></g></svg>