<?xml version="1.0" encoding="UTF-8" standalone="no"?>
<!-- Created with Inkscape (http://www.inkscape.org/) -->
<svg xmlns:i="http://ns.adobe.com/AdobeIllustrator/10.0/" xmlns:dc="http://purl.org/dc/elements/1.1/" xmlns:cc="http://creativecommons.org/ns#" xmlns:rdf="http://www.w3.org/1999/02/22-rdf-syntax-ns#" xmlns:svg="http://www.w3.org/2000/svg" xmlns="http://www.w3.org/2000/svg" xmlns:sodipodi="http://sodipodi.sourceforge.net/DTD/sodipodi-0.dtd" xmlns:inkscape="http://www.inkscape.org/namespaces/inkscape" width="297mm" height="210mm" viewBox="0 0 297 210" version="1.1" id="svg91" inkscape:version="0.92.3 (2405546, 2018-03-11)" sodipodi:docname="DebConf_opção02.svg">
  <defs id="defs85"/>
  <sodipodi:namedview id="base" pagecolor="#ffffff" bordercolor="#666666" borderopacity="1.0" inkscape:pageopacity="0.0" inkscape:pageshadow="2" inkscape:zoom="0.35" inkscape:cx="400" inkscape:cy="560" inkscape:document-units="mm" inkscape:current-layer="layer1" showgrid="false" inkscape:window-width="1366" inkscape:window-height="704" inkscape:window-x="0" inkscape:window-y="27" inkscape:window-maximized="1"/>
  <metadata id="metadata88">
    <rdf:RDF>
      <cc:Work rdf:about="">
        <dc:format>image/svg+xml</dc:format>
        <dc:type rdf:resource="http://purl.org/dc/dcmitype/StillImage"/>
        <dc:title/>
      </cc:Work>
    </rdf:RDF>
  </metadata>
  <g inkscape:label="Camada 1" inkscape:groupmode="layer" id="layer1" transform="translate(0,-87)">
    <g transform="matrix(0.93355528,0,0,0.93355528,-540.84734,302.07635)" id="g2076">
      <path sodipodi:nodetypes="cccccccccc" inkscape:connector-curvature="0" id="path1344" d="m 692.54879,-171.06748 c -13.20657,0.0119 -24.18411,10.17602 -25.20981,23.34269 h -0.0984 v 1.96554 28.50263 h 50.61646 v -28.50263 -1.96554 h -0.0846 c -1.02612,-13.17195 -12.01173,-23.33838 -25.22359,-23.34269 z" style="opacity:1;fill:#0088aa;fill-opacity:1;stroke:none;stroke-width:0.692976;stroke-miterlimit:4;stroke-dasharray:none;stroke-dashoffset:0;stroke-opacity:1"/>
      <path sodipodi:nodetypes="cccccccccc" inkscape:connector-curvature="0" id="circle1348" d="m 736.57845,-189.49579 c -13.20643,0.0119 -24.18394,10.17582 -25.2098,23.34236 h -0.0984 v 1.96587 46.93094 h 50.61645 v -46.93094 -1.96587 h -0.0847 c -1.02627,-13.17183 -12.01184,-23.33806 -25.22358,-23.34236 z" style="opacity:1;fill:#0088aa;fill-opacity:1;stroke:none;stroke-width:0.692976;stroke-miterlimit:4;stroke-dasharray:none;stroke-dashoffset:0;stroke-opacity:1"/>
      <path sodipodi:nodetypes="cccccccccc" inkscape:connector-curvature="0" id="circle1352" d="m 778.34946,-171.06748 c -13.20669,0.0119 -24.18443,10.17588 -25.21015,23.34269 h -0.0984 v 1.96554 28.50263 h 50.6168 v -28.50263 -1.96554 h -0.0845 c -1.02612,-13.17195 -12.01172,-23.33838 -25.22358,-23.34269 z" style="opacity:1;fill:#0088aa;fill-opacity:1;stroke:none;stroke-width:0.692976;stroke-miterlimit:4;stroke-dasharray:none;stroke-dashoffset:0;stroke-opacity:1"/>
      <path sodipodi:nodetypes="cccccccccc" style="opacity:0.43600003;fill:#ff00ff;fill-opacity:1;stroke:none;stroke-width:0.76663756;stroke-miterlimit:4;stroke-dasharray:none;stroke-dashoffset:0;stroke-opacity:1" d="m 781.20832,-173.96362 c -14.61052,0.0119 -26.75518,11.25754 -27.88992,25.82394 h -0.1089 v 2.17448 28.61507 h 55.99723 v -28.61507 -2.17448 h -0.0936 c -1.13518,-14.5721 -13.28854,-25.81918 -27.90479,-25.82394 z" id="path1359" inkscape:connector-curvature="0"/>
      <path sodipodi:nodetypes="cccccccccc" style="opacity:1;fill:#ff00ff;fill-opacity:0.43529412;stroke:none;stroke-width:0.68801171;stroke-miterlimit:4;stroke-dasharray:none;stroke-dashoffset:0;stroke-opacity:1" d="m 740.60337,-186.41503 c -13.11182,0.0119 -24.01067,10.10291 -25.0292,23.17514 h -0.0977 v 1.9518 43.94981 h 50.25385 v -43.94981 -1.9518 h -0.084 c -1.01892,-13.07746 -11.9258,-23.17087 -25.04289,-23.17514 z" id="path1361" inkscape:connector-curvature="0"/>
      <path sodipodi:nodetypes="cccccccccc" style="opacity:1;fill:#ff00ff;fill-opacity:0.43529412;stroke:none;stroke-width:0.71374142;stroke-miterlimit:4;stroke-dasharray:none;stroke-dashoffset:0;stroke-opacity:1" d="m 697.99826,-174.30762 c -13.60231,0.0119 -24.90881,10.48095 -25.96524,24.04216 h -0.1013 v 2.02445 30.85405 h 52.13322 v -30.85405 -2.02445 h -0.0872 c -1.05686,-13.56666 -12.37168,-24.03772 -25.97942,-24.04216 z" id="path1363" inkscape:connector-curvature="0"/>
      <path sodipodi:nodetypes="ccccccccccscccccssccccssscccccccccccccscscssccsscccccccccsccscsccscccccscccccsscccccccccscscccccccsscscscscccsscccccccccssscscccccscsscccccc" inkscape:connector-curvature="0" id="path1393" d="m 691.90272,-74.745525 c -3.81004,-1.247104 -7.88894,-4.960612 -9.70759,-8.837955 -4.92695,-10.50431 -0.49714,-23.88906 9.40694,-28.42331 2.49134,-1.14056 3.28941,-1.2554 7.45735,-1.07312 3.91951,0.17146 5.1443,0.44416 7.64312,1.70186 3.93246,1.9793 4.94288,3.44901 5.2054,7.57166 0.23213,3.6456 -0.54026,4.485858 -1.36796,1.48814 -1.66149,-6.01739 -6.00802,-9.15167 -12.088,-8.71666 -5.5897,0.39995 -9.22775,3.08862 -11.27102,8.32979 -1.53847,3.946295 -1.70615,13.193581 -0.31173,17.190721 2.12172,6.081908 6.49718,9.453341 12.26858,9.453341 4.54245,0 7.25114,-1.227104 10.53261,-4.771509 2.84382,-3.071645 4.21216,-3.265453 2.39755,-0.339574 -2.81428,4.537729 -7.16151,6.934827 -13.15551,7.254056 -2.93906,0.156536 -4.60407,-0.04003 -7.00974,-0.82744 z m -61.51253,-0.194474 c -6.03526,-2.246146 -9.14317,-9.834205 -7.17667,-17.522126 1.65993,-6.489339 5.09407,-9.349745 11.15925,-9.294855 6.73775,0.061 9.99806,3.447777 10.71555,11.131284 l 0.30344,3.249377 h -8.67018 -8.67018 v 1.694519 c 0,8.288695 7.65355,12.0107 13.61767,6.622472 2.09874,-1.89608 2.56502,-2.092428 2.56502,-1.080182 0,0.897983 -2.87768,3.781869 -4.72907,4.739264 -2.13909,1.106152 -6.75328,1.339148 -9.11483,0.460247 z m 9.28141,-16.861262 c -0.0292,-6.330488 -4.9215,-10.099579 -8.78379,-6.767253 -1.4587,1.25854 -2.81292,4.623404 -2.8253,7.020102 l -0.0119,2.149276 h 5.81565 5.81566 l -0.0119,-2.402125 z m 21.09097,16.840719 c -1.06143,-0.378563 -2.3925,-1.106951 -2.95792,-1.618646 -1.00497,-0.909484 -1.05286,-0.899206 -2.13479,0.457615 -0.71791,0.900363 -1.58865,1.387989 -2.47842,1.387989 h -1.37172 v -16.721653 c 0,-19.078153 -0.10877,-19.661813 -3.66639,-19.681633 -0.76488,-0.004 -1.39069,-0.23532 -1.39069,-0.51345 0,-0.29151 1.58271,-0.50572 3.73678,-0.50572 5.54459,0 6.07536,0.57138 6.29979,6.78184 0.0963,2.66719 0.21016,4.847 0.25284,4.84398 0.0427,-0.004 1.19472,-0.34434 2.5601,-0.75856 8.87739,-2.69305 14.96446,2.648473 14.96446,13.131602 0,2.009919 -0.32217,4.724889 -0.71593,6.033253 -1.88018,6.247355 -7.32188,9.223432 -13.09811,7.163383 z m 5.55922,-2.891267 c 2.01623,-1.89414 2.94654,-5.241 2.92862,-10.535919 -0.0191,-5.517078 -1.16737,-8.869722 -3.58082,-10.450802 -1.74719,-1.144621 -4.92129,-1.137094 -7.14923,0.01729 l -1.64356,0.851349 v 9.139724 9.139725 l 1.53556,1.434423 c 2.42527,2.265548 5.74759,2.435474 7.90943,0.404545 z m 59.7153,2.904364 c -2.92281,-1.043163 -4.36518,-2.178037 -5.95565,-4.685942 -4.23523,-6.678267 -2.57744,-16.609117 3.40607,-20.403743 6.75209,-4.28203 15.8276,-0.98414 18.0461,6.557679 1.1118,3.779542 1.02484,8.014158 -0.23362,11.377733 -2.2831,6.102108 -9.16831,9.329438 -15.2629,7.154273 z m 7.20175,-2.743067 c 0.69535,-0.488638 1.82795,-2.014454 2.5169,-3.390702 1.06349,-2.124449 1.2488,-3.189473 1.22733,-7.053651 -0.0362,-6.516081 -1.80817,-10.155349 -5.5452,-11.388691 -2.52037,-0.831784 -4.84369,0.353418 -6.62141,3.377804 -1.34588,2.28976 -1.43894,2.807879 -1.43894,8.010887 0,4.994147 0.12952,5.795431 1.26698,7.838486 2.12224,3.811841 5.4447,4.819234 8.59434,2.605867 z m -147.77408,-14.224427 -0.14582,-17.297191 -1.19388,-0.96625 c -0.65664,-0.53143 -1.73756,-0.96624 -2.40211,-0.96624 -0.66454,0 -1.20825,-0.25298 -1.20825,-0.56219 0,-0.40193 3.06349,-0.49757 10.74633,-0.33548 12.23873,0.25818 15.35388,0.94337 19.90309,4.37762 8.74084,6.59862 8.18476,22.789886 -0.99997,29.115641 -4.15831,2.863954 -6.55799,3.413573 -16.10241,3.688136 l -8.45127,0.243142 z m 17.91056,13.502727 c 4.86283,-2.849806 7.42624,-7.261343 7.85511,-13.518298 0.50222,-7.327099 -2.34266,-13.31062 -7.87479,-16.56269 -2.07282,-1.21852 -2.88221,-1.38714 -6.65818,-1.38714 -2.36418,0 -4.69678,0.16361 -5.18351,0.3634 -0.8164,0.33525 -0.88499,1.59665 -0.88499,16.273942 v 15.910529 l 1.13784,0.247664 c 0.62581,0.13627 2.97936,0.194699 5.23009,0.129914 3.38285,-0.09733 4.48857,-0.349892 6.37843,-1.457415 z m 146.4591,-8.250997 c -0.15884,-11.83806 -0.16915,-11.937033 -1.35393,-12.895571 -0.65661,-0.53127 -1.73757,-0.96595 -2.40211,-0.96595 -0.66453,0 -1.20824,-0.22757 -1.20824,-0.50571 0,-0.81419 6.43553,-0.60341 8.11647,0.26583 0.82058,0.42436 1.492,0.996517 1.492,1.271453 0,0.274936 0.95055,-0.129251 2.11233,-0.897973 1.80703,-1.19585 2.62931,-1.39788 5.68922,-1.39788 4.49441,0 6.64694,1.11891 8.25472,4.290825 1.06881,2.108692 1.13783,2.867132 1.13783,12.504722 v 10.259879 h -2.52856 -2.52852 v -10.139285 c 0,-11.183366 -0.27682,-12.455948 -3.01772,-13.873324 -2.12387,-1.098307 -4.65314,-0.949629 -6.64241,0.390449 l -1.71834,1.157587 -0.13608,11.232287 -0.13608,11.232286 h -2.48527 -2.48523 z m 30.94105,-0.207386 v -12.137011 h -2.02283 c -1.6857,0 -2.02286,-0.168569 -2.02286,-1.011424 0,-0.83684 0.33716,-1.01141 1.95323,-1.01141 h 1.95319 l 0.33203,-2.82496 c 0.57247,-4.87095 2.49265,-7.31867 6.53597,-8.3317 3.60213,-0.90247 7.40294,-0.32272 8.85888,1.3513 1.03273,1.18742 1.08512,1.44069 0.43287,2.09294 -0.65222,0.65224 -0.92695,0.60531 -2.27027,-0.38787 -0.95844,-0.70859 -2.31702,-1.15056 -3.6436,-1.18536 -2.64679,-0.0694 -4.32147,1.642 -4.81278,4.91827 -0.59505,3.96806 -0.47723,4.09551 3.94082,4.26223 3.4983,0.13204 3.91378,0.25281 3.91378,1.137838 0,0.900549 -0.36611,0.990146 -4.04567,0.990146 h -4.04567 v 12.137011 12.137011 h -2.52855 -2.52854 z" style="fill:#4d4d4d;stroke-width:0.50570881"/>
      <g id="text1423" style="font-style:normal;font-weight:normal;font-size:23.99965286px;line-height:1.25;font-family:sans-serif;letter-spacing:0px;word-spacing:0px;fill:#008066;fill-opacity:1;stroke:none;stroke-width:0.59999132" aria-label="CURITIBA">
        <path id="path1599" style="font-style:normal;font-variant:normal;font-weight:normal;font-stretch:normal;font-family:Antipasto;-inkscape-font-specification:Antipasto;letter-spacing:12.84266853px;fill:#008066;fill-opacity:1;stroke-width:0.59999132" d="m 681.39535,-64.825658 q -0.86399,-0.743989 -2.01597,-1.343981 -1.15198,-0.599991 -2.47197,-0.599991 -1.27198,0 -2.39996,0.479993 -1.12798,0.479993 -1.96797,1.319981 -0.81599,0.839988 -1.29598,1.967972 -0.48,1.127983 -0.48,2.399965 0,1.271981 0.48,2.399965 0.47999,1.127984 1.29598,1.967972 0.83999,0.815988 1.96797,1.295981 1.12798,0.479993 2.39996,0.479993 1.34399,0 2.49597,-0.503993 1.17598,-0.527992 2.01597,-1.439979 0.12,-0.143998 0.288,-0.215997 0.19199,-0.072 0.38399,-0.072 0.312,0 0.45599,0.215997 0.168,0.215997 0.168,0.479993 0,0.383995 -0.216,0.599992 -1.05598,1.151983 -2.49596,1.799973 -1.43998,0.623991 -3.09596,0.623991 -1.58397,0 -2.97595,-0.599991 -1.39198,-0.599991 -2.42397,-1.631976 -1.03198,-1.031985 -1.63197,-2.423965 -0.59999,-1.39198 -0.59999,-2.975957 0,-1.583977 0.59999,-2.975957 0.59999,-1.39198 1.63197,-2.423965 1.03199,-1.055985 2.42397,-1.655976 1.39198,-0.599991 2.97595,-0.599991 1.60798,0 2.99996,0.623991 1.41598,0.623991 2.47197,1.703975 0.11999,0.119998 0.21599,0.311995 0.096,0.191998 0.096,0.383995 0,0.311995 -0.216,0.479993 -0.21599,0.167997 -0.50399,0.167997 -0.35999,0 -0.57599,-0.239996 z" inkscape:connector-curvature="0"/>
        <path id="path1601" style="font-style:normal;font-variant:normal;font-weight:normal;font-stretch:normal;font-family:Antipasto;-inkscape-font-specification:Antipasto;letter-spacing:12.84266853px;fill:#008066;fill-opacity:1;stroke-width:0.59999132" d="m 697.63697,-67.537619 q 0,-0.263996 0.216,-0.503993 0.21599,-0.263996 0.55199,-0.263996 0.33599,0 0.52799,0.239997 0.192,0.239996 0.192,0.551992 v 9.215867 q 0,0.791988 0.28799,1.487978 0.312,0.69599 0.81599,1.223982 0.52799,0.503993 1.22398,0.815988 0.71999,0.311996 1.51198,0.311996 0.79199,0 1.48798,-0.311996 0.69599,-0.311995 1.22398,-0.815988 0.52799,-0.527992 0.83999,-1.223982 0.312,-0.69599 0.312,-1.487978 v -9.239867 q 0,-0.263996 0.21599,-0.503993 0.216,-0.263996 0.55199,-0.263996 0.336,0 0.528,0.263996 0.19199,0.263997 0.19199,0.527993 v 9.215867 q 0,1.103984 -0.43199,2.087969 -0.43199,0.959986 -1.15198,1.679976 -0.71999,0.71999 -1.70398,1.151983 -0.95998,0.407994 -2.06397,0.407994 -1.10398,0 -2.08797,-0.407994 -0.95998,-0.431993 -1.67997,-1.151983 -0.71999,-0.71999 -1.15199,-1.679976 -0.40799,-0.983985 -0.40799,-2.087969 z" inkscape:connector-curvature="0"/>
        <path id="path1603" style="font-style:normal;font-variant:normal;font-weight:normal;font-stretch:normal;font-family:Antipasto;-inkscape-font-specification:Antipasto;letter-spacing:12.84266853px;fill:#008066;fill-opacity:1;stroke-width:0.59999132" d="m 723.3232,-67.537619 q 0,-0.311995 0.216,-0.527992 0.216,-0.239997 0.52799,-0.239997 h 3.93594 q 0.86399,0 1.60798,0.335995 0.74399,0.311996 1.29598,0.887988 0.57599,0.551992 0.88799,1.295981 0.33599,0.743989 0.33599,1.583977 0,0.767989 -0.26399,1.439979 -0.264,0.67199 -0.71999,1.223982 -0.45599,0.527993 -1.10399,0.911987 -0.62399,0.359995 -1.34398,0.479993 l 3.64795,5.927914 q 0.072,0.119999 0.12,0.263997 0.072,0.143998 0.072,0.311995 0,0.191997 -0.192,0.431994 -0.168,0.239996 -0.50399,0.239996 -0.216,0 -0.408,-0.119998 -0.16799,-0.119998 -0.28799,-0.311995 l -4.10394,-6.695903 h -2.23197 v 6.383907 q 0,0.311996 -0.216,0.527993 -0.21599,0.215996 -0.52799,0.215996 -0.31199,0 -0.52799,-0.215996 -0.216,-0.215997 -0.216,-0.527993 z m 1.48798,0.71999 v 5.231924 h 3.19195 q 0.528,0 1.00799,-0.191997 0.47999,-0.215997 0.83999,-0.575992 0.35999,-0.359995 0.55199,-0.815988 0.216,-0.479993 0.216,-1.031985 0,-0.527992 -0.216,-1.007986 -0.192,-0.479993 -0.55199,-0.839987 -0.36,-0.359995 -0.83999,-0.551992 -0.47999,-0.215997 -1.00799,-0.215997 z" inkscape:connector-curvature="0"/>
        <path id="path1605" style="font-style:normal;font-variant:normal;font-weight:normal;font-stretch:normal;font-family:Antipasto;-inkscape-font-specification:Antipasto;letter-spacing:12.84266853px;fill:#008066;fill-opacity:1;stroke-width:0.59999132" d="m 747.37108,-67.561618 q 0,-0.311996 0.216,-0.527993 0.216,-0.215997 0.52799,-0.215997 0.312,0 0.52799,0.215997 0.216,0.215997 0.216,0.527993 v 13.847799 q 0,0.311996 -0.216,0.527993 -0.21599,0.215996 -0.52799,0.215996 -0.31199,0 -0.52799,-0.215996 -0.216,-0.215997 -0.216,-0.527993 z" inkscape:connector-curvature="0"/>
        <path id="path1607" style="font-style:normal;font-variant:normal;font-weight:normal;font-stretch:normal;font-family:Antipasto;-inkscape-font-specification:Antipasto;letter-spacing:12.84266853px;fill:#008066;fill-opacity:1;stroke-width:0.59999132" d="m 764.24944,-66.817629 q -0.31199,0 -0.52799,-0.215997 -0.216,-0.215997 -0.216,-0.527992 0,-0.311996 0.216,-0.527993 0.216,-0.215997 0.52799,-0.215997 h 8.32788 q 0.312,0 0.52799,0.215997 0.216,0.215997 0.216,0.527993 0,0.311995 -0.216,0.527992 -0.21599,0.215997 -0.52799,0.215997 h -3.40795 v 13.10381 q 0,0.311996 -0.216,0.527993 -0.21599,0.215996 -0.52799,0.215996 -0.31199,0 -0.52799,-0.215996 -0.216,-0.215997 -0.216,-0.527993 v -13.10381 z" inkscape:connector-curvature="0"/>
        <path id="path1609" style="font-style:normal;font-variant:normal;font-weight:normal;font-stretch:normal;font-family:Antipasto;-inkscape-font-specification:Antipasto;letter-spacing:12.84266853px;fill:#008066;fill-opacity:1;stroke-width:0.59999132" d="m 787.96245,-67.561618 q 0,-0.311996 0.216,-0.527993 0.216,-0.215997 0.52799,-0.215997 0.312,0 0.52799,0.215997 0.216,0.215997 0.216,0.527993 v 13.847799 q 0,0.311996 -0.216,0.527993 -0.21599,0.215996 -0.52799,0.215996 -0.31199,0 -0.52799,-0.215996 -0.216,-0.215997 -0.216,-0.527993 z" inkscape:connector-curvature="0"/>
        <path id="path1611" style="font-style:normal;font-variant:normal;font-weight:normal;font-stretch:normal;font-family:Antipasto;-inkscape-font-specification:Antipasto;letter-spacing:12.84266853px;fill:#008066;fill-opacity:1;stroke-width:0.59999132" d="m 804.50482,-67.561618 q 0,-0.311996 0.216,-0.527993 0.216,-0.215997 0.52799,-0.215997 h 4.27194 q 0.76799,0 1.43998,0.287996 0.67199,0.287996 1.17598,0.791989 0.504,0.503992 0.79199,1.199982 0.312,0.671991 0.312,1.439979 0,0.863988 -0.384,1.607977 -0.38399,0.743989 -1.00798,1.271982 1.05598,0.599991 1.67997,1.679975 0.64799,1.055985 0.64799,2.375966 0,0.959986 -0.35999,1.823974 -0.36,0.839988 -1.00799,1.487978 -0.62399,0.623991 -1.48797,1.007986 -0.83999,0.359994 -1.79998,0.359994 h -4.27194 q -0.31199,0 -0.52799,-0.215996 -0.216,-0.215997 -0.216,-0.527993 z m 1.48798,6.719902 v 6.383908 h 3.52795 q 0.64799,0 1.22398,-0.263996 0.576,-0.263996 1.00799,-0.69599 0.43199,-0.431994 0.67199,-1.007986 0.264,-0.575991 0.264,-1.223982 0,-0.64799 -0.264,-1.223982 -0.24,-0.599991 -0.67199,-1.031985 -0.43199,-0.431994 -1.00799,-0.671991 -0.57599,-0.263996 -1.22398,-0.263996 z m 0,-5.975913 v 4.487935 h 3.52795 q 0.456,0 0.86399,-0.191997 0.40799,-0.191998 0.69599,-0.503993 0.31199,-0.311996 0.47999,-0.71999 0.168,-0.407994 0.168,-0.839988 0,-0.455993 -0.168,-0.839987 -0.168,-0.407994 -0.47999,-0.71999 -0.288,-0.311995 -0.69599,-0.479993 -0.40799,-0.191997 -0.86399,-0.191997 z" inkscape:connector-curvature="0"/>
        <path id="path1613" style="font-style:normal;font-variant:normal;font-weight:normal;font-stretch:normal;font-family:Antipasto;-inkscape-font-specification:Antipasto;letter-spacing:12.84266853px;fill:#008066;fill-opacity:1;stroke-width:0.59999132" d="m 833.02302,-67.753616 q 0.072,-0.191997 0.264,-0.359995 0.19199,-0.191997 0.43199,-0.191997 0.24,0 0.43199,0.167998 0.192,0.167997 0.288,0.383994 l 5.92791,13.751801 q 0.048,0.096 0.048,0.287996 0,0.287996 -0.19199,0.503993 -0.192,0.215997 -0.528,0.215997 -0.50399,0 -0.69599,-0.455994 l -1.91997,-4.391936 h -6.7439 l -1.91997,4.391936 q -0.096,0.215997 -0.288,0.335996 -0.192,0.119998 -0.40799,0.119998 -0.336,0 -0.552,-0.215997 -0.19199,-0.215997 -0.19199,-0.503993 0,-0.143998 0.072,-0.287996 z m 0.69599,2.231968 -2.73596,6.19191 h 5.44792 z" inkscape:connector-curvature="0"/>
      </g>
      <path inkscape:connector-curvature="0" id="path1533" d="m 859.11815,-74.892873 c -4.20452,-0.914445 -7.24563,-2.282009 -9.34679,-4.203235 -1.87812,-1.717337 -1.81013,-4.800657 0.22675,-10.296605 l 1.61802,-4.36509 -2.47514,-2.402111 c -3.22455,-3.129382 -5.00321,-7.928826 -5.48453,-14.800586 -1.16389,-16.61263 5.36095,-27.38723 17.99956,-29.72363 10.05921,-1.85954 19.17997,0.33874 24.55865,5.91904 5.01356,5.2015 7.07232,13.40721 6.48981,25.86471 -0.80961,17.309205 -5.3694,27.752107 -14.03082,32.132875 -5.48751,2.77554 -12.37684,3.435939 -19.55571,1.874632 z m -52.14727,-1.089597 c -2.91143,-1.507759 -3.08433,-2.678669 -3.09415,-20.942587 v -17.081703 l -3.73674,-0.27031 c -3.03108,-0.21918 -4.05289,-0.58652 -5.40954,-1.9445 -1.57629,-1.57773 -1.67281,-2.00309 -1.67281,-7.3774 0,-4.92606 0.20797,-6.06487 1.52022,-8.35795 0.83606,-1.46015 2.77102,-3.48327 4.29965,-4.49585 4.93544,-3.26914 7.82816,-3.82638 21.44773,-4.13186 14.38523,-0.32266 15.77362,0.006 16.9468,4.02189 0.45844,1.56949 0.61548,11.31621 0.48744,30.27316 l -0.18924,27.958388 -1.40683,1.407736 c -1.36413,1.364879 -1.80619,1.412709 -14.52852,1.571386 -9.7484,0.121538 -13.5158,-0.04042 -14.65508,-0.6304 z" style="fill:#ff00ff;fill-opacity:0.43529412;stroke-width:0.61823428"/>
      <g style="fill:#ffcd00;fill-opacity:1" transform="matrix(0.95394872,0,0,0.95394872,209.71906,56.566129)" id="g1952">
        <path style="fill:#ffcd00;fill-opacity:1;stroke-width:0.82980144" inkscape:connector-curvature="0" i:knockout="Off" d="m 558.18121,-217.73295 c -1.23972,0.0166 0.23318,0.63729 1.85212,0.88706 0.44892,-0.35018 0.85221,-0.70201 1.214,-1.04555 -1.00655,0.24645 -2.03218,0.25226 -3.06612,0.15849" id="path1767"/>
        <path style="fill:#ffcd00;fill-opacity:1;stroke-width:0.82980144" inkscape:connector-curvature="0" i:knockout="Off" d="m 564.83373,-219.39172 c 0.74101,-1.01983 1.27873,-2.13508 1.46875,-3.28851 -0.16679,0.82151 -0.61073,1.53099 -1.03227,2.28113 -2.31764,1.45962 -0.21907,-0.86632 -0.002,-1.75171 -2.49107,3.13914 -0.34354,1.88199 -0.43482,2.75909" id="path1769"/>
        <path style="fill:#ffcd00;fill-opacity:1;stroke-width:0.82980144" inkscape:connector-curvature="0" i:knockout="Off" d="m 567.29243,-225.78451 c 0.15103,-2.233 -0.43896,-1.52601 -0.63728,-0.67546 0.23068,0.12115 0.41407,1.57496 0.63728,0.67546" id="path1771"/>
        <path style="fill:#ffcd00;fill-opacity:1;stroke-width:0.82980144" inkscape:connector-curvature="0" i:knockout="Off" d="m 553.4779,-256.30378 c 0.66218,0.11783 1.43058,0.20911 1.32021,0.3676 0.72691,-0.16015 0.89038,-0.30454 -1.32021,-0.3676" id="path1773"/>
        <path style="fill:#ffcd00;fill-opacity:1;stroke-width:0.82980144" inkscape:connector-curvature="0" i:knockout="Off" d="m 554.79894,-255.93618 -0.46552,0.0971 0.43399,-0.0398 0.0315,-0.0573" id="path1775"/>
        <path style="fill:#ffcd00;fill-opacity:1;stroke-width:0.82980144" inkscape:connector-curvature="0" i:knockout="Off" d="m 575.43528,-224.93812 c 0.0747,2.0048 -0.58501,2.97899 -1.18164,4.70166 l -1.07294,0.53356 c -0.8771,1.70441 0.0871,1.08206 -0.54103,2.43713 -1.37083,1.21732 -4.15398,3.80796 -5.04519,4.04528 -0.65139,-0.0141 0.44063,-0.7684 0.58335,-1.06298 -1.83303,1.25798 -1.47124,1.88863 -4.27514,2.65454 l -0.0813,-0.18339 c -6.91224,3.25282 -16.5147,-3.19224 -16.38857,-11.98482 -0.073,0.55763 -0.20994,0.41822 -0.36263,0.64227 -0.35681,-4.52325 2.08944,-9.06641 6.21522,-10.92434 4.03532,-1.9965 8.76602,-1.17832 11.65456,1.51771 -1.58658,-2.07948 -4.7473,-4.28427 -8.49053,-4.08014 -3.66855,0.0598 -7.10144,2.39066 -8.24657,4.92239 -1.87867,1.18246 -2.09774,4.56059 -2.91592,5.17962 -1.10281,8.09886 2.07201,11.59647 7.44332,15.71312 0.84308,0.56924 0.23732,0.65637 0.35017,1.08953 -1.78407,-0.83478 -3.41712,-2.09608 -4.7614,-3.64034 0.71363,1.04306 1.48286,2.05708 2.47779,2.85368 -1.68367,-0.56841 -3.9316,-4.07681 -4.58631,-4.21954 2.90015,5.1929 11.76492,9.10708 16.40932,7.16451 -2.14918,0.0797 -4.8784,0.044 -7.29146,-0.84806 -1.01651,-0.52194 -2.39315,-1.60151 -2.1467,-1.80316 6.33636,2.36577 12.88018,1.79072 18.36185,-2.60308 1.39572,-1.08704 2.91924,-2.93501 3.35986,-2.9599 -0.66301,0.99742 0.11369,0.47962 -0.39581,1.36004 1.38743,-2.24129 -0.60493,-0.91278 1.43555,-3.87019 l 0.75346,1.03725 c -0.28213,-1.86208 2.311,-4.1208 2.04712,-7.06327 0.59497,-0.89951 0.66302,0.96921 0.0324,3.03873 0.87544,-2.29606 0.23151,-2.66532 0.45556,-4.56059 0.24147,0.63729 0.5626,1.31358 0.72607,1.98655 -0.5709,-2.21972 0.58335,-3.7366 0.87046,-5.02694 -0.28379,-0.12447 -0.88041,0.98082 -1.01816,-1.63969 0.0207,-1.13849 0.31781,-0.59663 0.4315,-0.8771 -0.22239,-0.12862 -0.80906,-1.00157 -1.16505,-2.67528 0.25641,-0.39415 0.6904,1.01983 1.04223,1.07708 -0.22653,-1.33017 -0.61571,-2.34501 -0.6323,-3.3665 -1.02896,-2.14919 -0.36429,0.28711 -1.19741,-0.92274 -1.09534,-3.4138 0.90781,-0.79246 1.04389,-2.34253 1.65795,2.40228 2.60309,6.12808 3.03874,7.67069 -0.33193,-1.88116 -0.86715,-3.70424 -1.52186,-5.46757 0.50535,0.21326 -0.81238,-3.86936 0.65637,-1.16587 -1.56749,-5.76297 -6.70313,-11.14838 -11.42885,-13.67429 0.57671,0.52858 1.3061,1.19242 1.04555,1.29697 -2.35166,-1.39821 -1.93842,-1.50857 -2.27532,-2.09939 -1.91269,-0.77919 -2.04048,0.0639 -3.30593,0.002 -3.60963,-1.91519 -4.30501,-1.71188 -7.6267,-2.91012 l 0.15102,0.70699 c -2.39066,-0.79661 -2.78564,0.30039 -5.36881,0.002 -0.15684,-0.12198 0.82814,-0.44477 1.63968,-0.56177 -2.31182,0.30536 -2.20395,-0.45639 -4.46599,0.0838 0.5568,-0.39084 1.14762,-0.65057 1.74176,-0.98249 -1.88448,0.11452 -4.50085,1.097 -3.69345,0.20247 -3.07441,1.3725 -8.53534,3.29847 -11.59979,6.17207 l -0.0963,-0.64393 c -1.40403,1.68533 -6.12311,5.03358 -6.49901,7.21844 l -0.3759,0.0871 c -0.72939,1.23724 -1.20321,2.63877 -1.78241,3.91086 -0.9551,1.6289 -1.4007,0.62733 -1.26462,0.88291 -1.8795,3.81044 -2.81468,7.01182 -3.62042,9.63897 0.57422,0.85884 0.0141,5.17132 0.23068,8.62247 -0.94265,17.04744 11.96408,33.59783 26.07236,37.41823 2.06787,0.74102 5.14228,0.71446 7.75782,0.78748 -3.0852,-0.8829 -3.48351,-0.46717 -6.49071,-1.51521 -2.16827,-1.02232 -2.64292,-2.18819 -4.17971,-3.52168 l 0.60825,1.07459 c -3.01218,-1.06629 -1.75171,-1.31938 -4.20295,-2.09525 l 0.64974,-0.84722 c -0.97668,-0.0747 -2.58649,-1.64467 -3.02629,-2.51679 l -1.06878,0.0423 c -1.28288,-1.5816 -1.96746,-2.72424 -1.91684,-3.60964 l -0.3452,0.61572 c -0.39084,-0.67131 -4.7224,-5.93972 -2.4753,-4.71328 -0.41739,-0.38005 -0.97253,-0.61986 -1.57413,-1.71437 l 0.45722,-0.52194 c -1.07957,-1.39158 -1.98987,-3.17482 -1.92016,-3.76896 0.57671,0.77835 0.97667,0.9244 1.37332,1.058 -2.73088,-6.7745 -2.88439,-0.37258 -4.95143,-6.89565 l 0.43648,-0.0348 c -0.33441,-0.50701 -0.53937,-1.05385 -0.80823,-1.59239 l 0.19086,-1.8961 c -1.96497,-2.27034 -0.54933,-9.66304 -0.26471,-13.71662 0.195,-1.64798 1.64052,-3.40301 2.73834,-6.15546 l -0.66882,-0.11452 c 1.27956,-2.2305 7.30392,-8.96102 10.09537,-8.61583 1.35175,-1.69777 -0.26886,-0.007 -0.53356,-0.43315 2.96986,-3.07276 3.90338,-2.17076 5.90735,-2.72424 2.15998,-1.28204 -1.8546,0.5012 -0.83063,-0.48875 3.7366,-0.95345 2.64707,-2.1691 7.52049,-2.65288 0.51448,0.29209 -1.19242,0.45141 -1.6206,0.83063 3.11176,-1.52351 9.84891,-1.17583 14.22695,0.84474 5.07589,2.37406 10.78244,9.38837 11.00814,15.98779 l 0.25641,0.0689 c -0.12945,2.62383 0.40162,5.65841 -0.52029,8.44489 l 0.62319,-1.32022" id="path1777"/>
        <path style="fill:#ffcd00;fill-opacity:1;stroke-width:0.82980144" inkscape:connector-curvature="0" i:knockout="Off" d="m 544.64632,-216.03186 -0.17509,0.8688 c 0.8157,1.10779 1.46294,2.30768 2.50269,3.17068 -0.74849,-1.45962 -1.30362,-2.06289 -2.3276,-4.03948" id="path1779"/>
        <path style="fill:#ffcd00;fill-opacity:1;stroke-width:0.82980144" inkscape:connector-curvature="0" i:knockout="Off" d="m 546.57229,-216.10654 c -0.43149,-0.47797 -0.68541,-1.05219 -0.97253,-1.62309 0.27384,1.00489 0.83478,1.86871 1.35507,2.7483 l -0.38254,-1.12521" id="path1781"/>
        <path style="fill:#ffcd00;fill-opacity:1;stroke-width:0.82980144" inkscape:connector-curvature="0" i:knockout="Off" d="m 580.66385,-223.51667 -0.18172,0.45805 c -0.33358,2.37158 -1.05634,4.71825 -2.16164,6.89482 1.22147,-2.29606 2.00895,-4.80787 2.34336,-7.35287" id="path1783"/>
        <path style="fill:#ffcd00;fill-opacity:1;stroke-width:0.82980144" inkscape:connector-curvature="0" i:knockout="Off" d="m 553.72435,-256.89875 c 0.83727,-0.3062 2.05957,-0.16845 2.95077,-0.37009 -1.16006,0.0971 -2.31431,0.15517 -3.45363,0.30039 l 0.50286,0.0697" id="path1785"/>
        <path style="fill:#ffcd00;fill-opacity:1;stroke-width:0.82980144" inkscape:connector-curvature="0" i:knockout="Off" d="m 524.29046,-241.24703 c 0.19335,1.78739 -1.34427,2.48193 0.34022,1.30195 0.90449,-2.03633 -0.35183,-0.56177 -0.34022,-1.30195" id="path1787"/>
        <path style="fill:#ffcd00;fill-opacity:1;stroke-width:0.82980144" inkscape:connector-curvature="0" i:knockout="Off" d="m 522.3089,-232.97059 c 0.38917,-1.19243 0.45888,-1.90772 0.60741,-2.59894 -1.07293,1.37249 -0.49456,1.66541 -0.60741,2.59894" id="path1789"/>
      </g>
    </g>
  </g>
</svg>