\relax 
\@writefile{lof}{\addvspace {10pt}}
\@writefile{lot}{\addvspace {10pt}}
\@writefile{toc}{\contentsline {chapter}{\chapternumberline {4}Custom Debian Distributions}{48}{chapter.4}}
\@writefile{toc}{\contentsline {section}{\numberline {4.1}Symbiosis between experts and developers}{49}{section.4.1}}
\@writefile{toc}{\contentsline {section}{\numberline {4.2}Attracting people by providing interesting technical base}{50}{section.4.2}}
\@writefile{toc}{\contentsline {section}{\numberline {4.3}CDD is more than packaging specific software}{51}{section.4.3}}
\@writefile{toc}{\contentsline {section}{\numberline {4.4}Techniques}{52}{section.4.4}}
\@writefile{toc}{\contentsline {subsection}{\numberline {4.4.1}Building metapackages and tasksel descriptions}{52}{subsection.4.4.1}}
\@writefile{toc}{\contentsline {subsection}{\numberline {4.4.2}Web pages based on common scripts}{52}{subsection.4.4.2}}
\@setckpt{cdd}{
\setcounter{page}{54}
\setcounter{equation}{0}
\setcounter{enumi}{6}
\setcounter{enumii}{2}
\setcounter{enumiii}{0}
\setcounter{enumiv}{0}
\setcounter{footnote}{0}
\setcounter{mpfootnote}{0}
\setcounter{storedpagenumber}{1}
\setcounter{part}{0}
\setcounter{chapter}{4}
\setcounter{section}{4}
\setcounter{subsection}{2}
\setcounter{subsubsection}{0}
\setcounter{paragraph}{0}
\setcounter{subparagraph}{0}
\setcounter{@ppsavesec}{0}
\setcounter{@ppsaveapp}{0}
\setcounter{vslineno}{0}
\setcounter{poemline}{0}
\setcounter{modulo@vs}{0}
\setcounter{verse}{0}
\setcounter{chrsinstr}{0}
\setcounter{poem}{0}
\setcounter{newflo@tctr}{4}
\setcounter{@contsubnum}{0}
\setcounter{maxsecnumdepth}{2}
\setcounter{sheetsequence}{62}
\setcounter{lastsheet}{84}
\setcounter{lastpage}{76}
\setcounter{bvlinectr}{0}
\setcounter{cp@cntr}{0}
\setcounter{ism@mctr}{0}
\setcounter{xsm@mctr}{0}
\setcounter{csm@mctr}{0}
\setcounter{ksm@mctr}{0}
\setcounter{xksm@mctr}{0}
\setcounter{cksm@mctr}{0}
\setcounter{msm@mctr}{0}
\setcounter{xmsm@mctr}{0}
\setcounter{cmsm@mctr}{0}
\setcounter{bsm@mctr}{0}
\setcounter{workm@mctr}{0}
\setcounter{figure}{0}
\setcounter{lofdepth}{1}
\setcounter{lofdepth}{1}
\setcounter{table}{0}
\setcounter{lotdepth}{1}
\setcounter{lotdepth}{1}
\setcounter{book}{0}
\setcounter{pagenote}{0}
\setcounter{lofdepth}{1}
\setcounter{lotdepth}{1}
\setcounter{Item}{28}
\setcounter{memhycontfloat}{0}
\setcounter{r@tfl@t}{2}
\setcounter{definition}{6}
\setcounter{theorem}{1}
\setcounter{section@level}{2}
}
