\relax 
\@writefile{lof}{\addvspace {10pt}}
\@writefile{lot}{\addvspace {10pt}}
\@writefile{toc}{\contentsline {chapter}{\chapternumberline {6}DebConf9 Caceres}{58}{chapter.6}}
\@writefile{toc}{\contentsline {section}{\numberline {6.1}Introduction}{58}{section.6.1}}
\@writefile{toc}{\contentsline {section}{\numberline {6.2}Information Society Project in Extremadura}{59}{section.6.2}}
\@writefile{toc}{\contentsline {section}{\numberline {6.3}gnuLinEx}{60}{section.6.3}}
\@writefile{toc}{\contentsline {subsection}{\numberline {6.3.1}Educational System}{60}{subsection.6.3.1}}
\@writefile{toc}{\contentsline {subsection}{\numberline {6.3.2}Public Administration}{61}{subsection.6.3.2}}
\@writefile{toc}{\contentsline {subsection}{\numberline {6.3.3}Health and Care System}{61}{subsection.6.3.3}}
\@writefile{toc}{\contentsline {section}{\numberline {6.4}Network in Extremadura}{62}{section.6.4}}
\@writefile{toc}{\contentsline {subsection}{\numberline {6.4.1}Regional Intranet}{62}{subsection.6.4.1}}
\@writefile{toc}{\contentsline {subsection}{\numberline {6.4.2}Broadband Internet access for 100\% of population}{62}{subsection.6.4.2}}
\@writefile{toc}{\contentsline {section}{\numberline {6.5}Why C\IeC {\'a}ceres?}{63}{section.6.5}}
\@writefile{toc}{\contentsline {subsection}{\numberline {6.5.1}Overview of C\IeC {\'a}ceres}{63}{subsection.6.5.1}}
\@writefile{toc}{\contentsline {subsection}{\numberline {6.5.2}History}{63}{subsection.6.5.2}}
\@writefile{toc}{\contentsline {subsection}{\numberline {6.5.3}Monuments}{64}{subsection.6.5.3}}
\@writefile{toc}{\contentsline {subsection}{\numberline {6.5.4}Natural Parks and rural tourism}{65}{subsection.6.5.4}}
\@setckpt{debconf9}{
\setcounter{page}{66}
\setcounter{equation}{0}
\setcounter{enumi}{6}
\setcounter{enumii}{2}
\setcounter{enumiii}{0}
\setcounter{enumiv}{0}
\setcounter{footnote}{0}
\setcounter{mpfootnote}{0}
\setcounter{storedpagenumber}{1}
\setcounter{part}{0}
\setcounter{chapter}{6}
\setcounter{section}{5}
\setcounter{subsection}{4}
\setcounter{subsubsection}{0}
\setcounter{paragraph}{0}
\setcounter{subparagraph}{0}
\setcounter{@ppsavesec}{0}
\setcounter{@ppsaveapp}{0}
\setcounter{vslineno}{0}
\setcounter{poemline}{0}
\setcounter{modulo@vs}{0}
\setcounter{verse}{0}
\setcounter{chrsinstr}{0}
\setcounter{poem}{0}
\setcounter{newflo@tctr}{4}
\setcounter{@contsubnum}{0}
\setcounter{maxsecnumdepth}{2}
\setcounter{sheetsequence}{74}
\setcounter{lastsheet}{84}
\setcounter{lastpage}{76}
\setcounter{bvlinectr}{0}
\setcounter{cp@cntr}{0}
\setcounter{ism@mctr}{0}
\setcounter{xsm@mctr}{0}
\setcounter{csm@mctr}{0}
\setcounter{ksm@mctr}{0}
\setcounter{xksm@mctr}{0}
\setcounter{cksm@mctr}{0}
\setcounter{msm@mctr}{0}
\setcounter{xmsm@mctr}{0}
\setcounter{cmsm@mctr}{0}
\setcounter{bsm@mctr}{0}
\setcounter{workm@mctr}{0}
\setcounter{figure}{0}
\setcounter{lofdepth}{1}
\setcounter{lofdepth}{1}
\setcounter{table}{0}
\setcounter{lotdepth}{1}
\setcounter{lotdepth}{1}
\setcounter{book}{0}
\setcounter{pagenote}{0}
\setcounter{lofdepth}{1}
\setcounter{lotdepth}{1}
\setcounter{Item}{28}
\setcounter{memhycontfloat}{0}
\setcounter{r@tfl@t}{2}
\setcounter{definition}{6}
\setcounter{theorem}{1}
\setcounter{section@level}{2}
}
