\relax 
\ifx\hyper@anchor\@undefined
\global \let \oldcontentsline\contentsline
\gdef \contentsline#1#2#3#4{\oldcontentsline{#1}{#2}{#3}}
\global \let \oldnewlabel\newlabel
\gdef \newlabel#1#2{\newlabelxx{#1}#2}
\gdef \newlabelxx#1#2#3#4#5#6{\oldnewlabel{#1}{{#2}{#3}}}
\AtEndDocument{\let \contentsline\oldcontentsline
\let \newlabel\oldnewlabel}
\else
\global \let \hyper@last\relax 
\fi

\@input{preface.aux}
\@writefile{toc}{\contentsline {chapter}{Contents}{ii}{section*.2}}
\@input{freebeer.aux}
\@input{mancoosi.aux}
\bibcite{edos-wp2d1}{{EDO}05}
\bibcite{edos-wp2d2}{{EDO}06}
\bibcite{eenss03}{ES04}
\bibcite{edos2006ase}{MBC{$^{+}$}06}
\@input{bestpractices.aux}
\@input{cdd.aux}
\@input{videoteam.aux}
\@input{debconf9.aux}
\@input{abstracts.aux}
\setcounter{lastsheet}{84}
\setcounter{lastpage}{76}
