\relax 
\@writefile{lof}{\addvspace {10pt}}
\@writefile{lot}{\addvspace {10pt}}
\@writefile{toc}{\contentsline {chapter}{\chapternumberline {2}Solving Package Dependencies}{18}{chapter.2}}
\@writefile{toc}{\contentsline {section}{\numberline {2.1}Introduction}{19}{section.2.1}}
\newlabel{sec:mancoosi:introduction}{{\M@TitleReference {2.1}{Introduction}}{19}{Introduction\relax }{section.2.1}{}}
\@writefile{toc}{\contentsline {section}{\numberline {2.2}The Past: EDOS}{20}{section.2.2}}
\newlabel{sec:mancoosi:edos}{{\M@TitleReference {2.2}{The Past: EDOS}}{20}{The Past: EDOS\relax }{section.2.2}{}}
\@writefile{toc}{\contentsline {subsection}{\numberline {2.2.1}Formalization of Inter-Package Relations}{20}{subsection.2.2.1}}
\newlabel{sec:mancoosi:edos-formalisation}{{\M@TitleReference {2.2.1}{Formalization of Inter-Package Relations}}{20}{Formalization of Inter-Package Relations\relax }{subsection.2.2.1}{}}
\@writefile{lof}{\contentsline {figure}{\numberline {2.1}{\ignorespaces A distribution (to the left) and its expansion (to the right).}}{21}{figure.2.1}}
\newlabel{fig:mancoosi:expansion}{{\M@TitleReference {2.1}{Formalization of Inter-Package Relations}}{21}{\label {fig:mancoosi:expansion}A distribution (to the left) and its expansion (to the right)}{figure.2.1}{}}
\@writefile{lof}{\contentsline {figure}{\numberline {2.2}{\ignorespaces A distribution involving virtual packages (to the left) and its expansion (to the right). Version numbers are omitted.}}{22}{figure.2.2}}
\newlabel{fig:mancoosi:expansion-virtual}{{\M@TitleReference {2.2}{Formalization of Inter-Package Relations}}{22}{\label {fig:mancoosi:expansion-virtual}A distribution involving virtual packages (to the left) and its expansion (to the right). Version numbers are omitted}{figure.2.2}{}}
\newlabel{def:mancoosi:repository}{{\M@TitleReference {2}{Formalization of Inter-Package Relations}}{22}{Formalization of Inter-Package Relations\relax }{definition.2}{}}
\newlabel{def:mancoosi:installation}{{\M@TitleReference {3}{Formalization of Inter-Package Relations}}{23}{Formalization of Inter-Package Relations\relax }{definition.3}{}}
\citation{edos-wp2d1}
\citation{edos2006ase}
\citation{edos-wp2d2}
\@writefile{toc}{\contentsline {subsection}{\numberline {2.2.2}Results, Tools, and Applications}{24}{subsection.2.2.2}}
\@writefile{toc}{\contentsline {subsubsection}{Result: Installability is NP-complete}{24}{section*.22}}
\newlabel{sec:mancoosi:npcomplete}{{\M@TitleReference {2.2.2}{Result: Installability is NP-complete}}{24}{Result: Installability is NP-complete\relax }{section*.22}{}}
\citation{eenss03}
\@writefile{toc}{\contentsline {subsubsection}{Tools: edos-debcheck, pkglab and ceve}{25}{section*.23}}
\newlabel{sec:mancoosi:edos-debcheck}{{\M@TitleReference {2.2.2}{Tools: edos-debcheck, pkglab and ceve}}{25}{Tools: edos-debcheck, pkglab and ceve\relax }{section*.23}{}}
\@writefile{toc}{\contentsline {subsubsection}{Application: Finding Uninstallable Packages in Debian}{26}{section*.24}}
\newlabel{sec:mancoosi:edos.debian.net}{{\M@TitleReference {2.2.2}{Application: Finding Uninstallable Packages in Debian}}{26}{Application: Finding Uninstallable Packages in Debian\relax }{section*.24}{}}
\@writefile{toc}{\contentsline {subsubsection}{Application: Debian Weather}{27}{section*.25}}
\newlabel{RF1}{{2.2.2}{28}}
\@writefile{lof}{\contentsline {figure}{\numberline {2.3}{\ignorespaces Result of edos-debcheck on unstable/main}}{28}{figure.2.3}}
\newlabel{fig:mancoosi:uninstallable-sid}{{\M@TitleReference {2.3}{Application: Finding Uninstallable Packages in Debian}}{28}{Result of edos-debcheck on unstable/main\relax }{figure.2.3}{}}
\newlabel{RF2}{{2.2.2}{29}}
\@writefile{lof}{\contentsline {figure}{\numberline {2.4}{\ignorespaces Result of edos-debcheck on testing/main and stable/main}}{29}{figure.2.4}}
\newlabel{fig:mancoosi:uninstallable-testing-satble}{{\M@TitleReference {2.4}{Application: Finding Uninstallable Packages in Debian}}{29}{Result of edos-debcheck on testing/main and stable/main\relax }{figure.2.4}{}}
\@writefile{lof}{\contentsline {figure}{\numberline {2.5}{\ignorespaces Listing of uninstallable packages with explanation}}{30}{figure.2.5}}
\newlabel{fig:mancoosi:uninstallable-detail}{{\M@TitleReference {2.5}{Application: Finding Uninstallable Packages in Debian}}{30}{Listing of uninstallable packages with explanation\relax }{figure.2.5}{}}
\@writefile{lof}{\contentsline {figure}{\numberline {2.6}{\ignorespaces The Debian weather for June 27, 2008: Mostly sunny in stable and testing, at places overcast and rainy in unstable.}}{31}{figure.2.6}}
\newlabel{fig:mancoosi:weather}{{\M@TitleReference {2.6}{Application: Debian Weather}}{31}{\label {fig:mancoosi:weather}The Debian weather for June 27, 2008: Mostly sunny in stable and testing, at places overcast and rainy in unstable}{figure.2.6}{}}
\@writefile{toc}{\contentsline {subsubsection}{Application: Finding File Conflicts in Debian}{31}{section*.26}}
\newlabel{sec:mancoosi:overwrite}{{\M@TitleReference {2.2.2}{Application: Finding File Conflicts in Debian}}{31}{Application: Finding File Conflicts in Debian\relax }{section*.26}{}}
\@writefile{toc}{\contentsline {section}{\numberline {2.3}Present and Future: Mancoosi}{33}{section.2.3}}
\newlabel{sec:mancoosi:mancoosi}{{\M@TitleReference {2.3}{Present and Future: Mancoosi}}{33}{Present and Future: Mancoosi\relax }{section.2.3}{}}
\@writefile{toc}{\contentsline {subsection}{\numberline {2.3.1}An Overview of the Mancoosi Project}{33}{subsection.2.3.1}}
\@writefile{toc}{\contentsline {subsection}{\numberline {2.3.2}Dependency solving}{35}{subsection.2.3.2}}
\@writefile{toc}{\contentsline {subsubsection}{Completeness}{35}{section*.27}}
\citation{edos-wp2d2}
\@writefile{toc}{\contentsline {subsubsection}{Optimality}{36}{section*.28}}
\newlabel{sec:mancoosi:dep-optimality}{{\M@TitleReference {2.3.2}{Optimality}}{36}{Optimality\relax }{section*.28}{}}
\@writefile{toc}{\contentsline {subsubsection}{Efficiency}{37}{section*.29}}
\@writefile{toc}{\contentsline {subsection}{\numberline {2.3.3}A solver competition}{37}{subsection.2.3.3}}
\@writefile{toc}{\contentsline {paragraph}{Upgrade problem database}{38}{section*.30}}
\@writefile{lof}{\contentsline {figure}{\numberline {2.7}{\ignorespaces  Data flow of UPDB submissions, from users to the corpus of problems for the competition}}{39}{figure.2.7}}
\newlabel{fig:mancoosi:updb-dataflow}{{\M@TitleReference {2.7}{Upgrade problem database}}{39}{\label {fig:mancoosi:updb-dataflow} Data flow of UPDB submissions, from users to the corpus of problems for the competition\relax }{figure.2.7}{}}
\@writefile{toc}{\contentsline {paragraph}{Types of competitions}{39}{section*.31}}
\@writefile{toc}{\contentsline {paragraph}{Upgrade Description Formats}{39}{section*.32}}
\@writefile{toc}{\contentsline {subsection}{\numberline {2.3.4}Debian and Mancoosi}{41}{subsection.2.3.4}}
\@setckpt{mancoosi}{
\setcounter{page}{43}
\setcounter{equation}{0}
\setcounter{enumi}{6}
\setcounter{enumii}{2}
\setcounter{enumiii}{0}
\setcounter{enumiv}{0}
\setcounter{footnote}{6}
\setcounter{mpfootnote}{0}
\setcounter{storedpagenumber}{1}
\setcounter{part}{0}
\setcounter{chapter}{2}
\setcounter{section}{3}
\setcounter{subsection}{4}
\setcounter{subsubsection}{0}
\setcounter{paragraph}{0}
\setcounter{subparagraph}{0}
\setcounter{@ppsavesec}{0}
\setcounter{@ppsaveapp}{0}
\setcounter{vslineno}{0}
\setcounter{poemline}{0}
\setcounter{modulo@vs}{0}
\setcounter{verse}{0}
\setcounter{chrsinstr}{0}
\setcounter{poem}{0}
\setcounter{newflo@tctr}{4}
\setcounter{@contsubnum}{0}
\setcounter{maxsecnumdepth}{2}
\setcounter{sheetsequence}{51}
\setcounter{lastsheet}{84}
\setcounter{lastpage}{76}
\setcounter{bvlinectr}{0}
\setcounter{cp@cntr}{0}
\setcounter{ism@mctr}{0}
\setcounter{xsm@mctr}{0}
\setcounter{csm@mctr}{0}
\setcounter{ksm@mctr}{0}
\setcounter{xksm@mctr}{0}
\setcounter{cksm@mctr}{0}
\setcounter{msm@mctr}{0}
\setcounter{xmsm@mctr}{0}
\setcounter{cmsm@mctr}{0}
\setcounter{bsm@mctr}{0}
\setcounter{workm@mctr}{0}
\setcounter{figure}{7}
\setcounter{lofdepth}{1}
\setcounter{lofdepth}{1}
\setcounter{table}{0}
\setcounter{lotdepth}{1}
\setcounter{lotdepth}{1}
\setcounter{book}{0}
\setcounter{pagenote}{0}
\setcounter{lofdepth}{1}
\setcounter{lotdepth}{1}
\setcounter{Item}{28}
\setcounter{memhycontfloat}{0}
\setcounter{r@tfl@t}{2}
\setcounter{definition}{6}
\setcounter{theorem}{1}
\setcounter{section@level}{2}
}
