\relax 
\@writefile{lof}{\addvspace {10pt}}
\@writefile{lot}{\addvspace {10pt}}
\@writefile{toc}{\contentsline {chapter}{\chapternumberline {5}The Debian Videoteam --- Behind the Scenes}{54}{chapter.5}}
\@writefile{toc}{\contentsline {section}{\numberline {5.1}Introduction}{54}{section.5.1}}
\@writefile{toc}{\contentsline {paragraph}{People}{54}{section*.42}}
\@writefile{toc}{\contentsline {paragraph}{Hardware}{54}{section*.43}}
\@writefile{toc}{\contentsline {paragraph}{Software}{54}{section*.44}}
\@writefile{toc}{\contentsline {paragraph}{TODO}{54}{section*.45}}
\@writefile{toc}{\contentsline {paragraph}{Caveats}{55}{section*.46}}
\@writefile{toc}{\contentsline {section}{\numberline {5.2}What the software does}{55}{section.5.2}}
\@writefile{toc}{\contentsline {section}{\numberline {5.3}Live demo}{55}{section.5.3}}
\@setckpt{videoteam}{
\setcounter{page}{57}
\setcounter{equation}{0}
\setcounter{enumi}{6}
\setcounter{enumii}{2}
\setcounter{enumiii}{0}
\setcounter{enumiv}{0}
\setcounter{footnote}{0}
\setcounter{mpfootnote}{0}
\setcounter{storedpagenumber}{1}
\setcounter{part}{0}
\setcounter{chapter}{5}
\setcounter{section}{3}
\setcounter{subsection}{0}
\setcounter{subsubsection}{0}
\setcounter{paragraph}{0}
\setcounter{subparagraph}{0}
\setcounter{@ppsavesec}{0}
\setcounter{@ppsaveapp}{0}
\setcounter{vslineno}{0}
\setcounter{poemline}{0}
\setcounter{modulo@vs}{0}
\setcounter{verse}{0}
\setcounter{chrsinstr}{0}
\setcounter{poem}{0}
\setcounter{newflo@tctr}{4}
\setcounter{@contsubnum}{0}
\setcounter{maxsecnumdepth}{2}
\setcounter{sheetsequence}{65}
\setcounter{lastsheet}{84}
\setcounter{lastpage}{76}
\setcounter{bvlinectr}{0}
\setcounter{cp@cntr}{0}
\setcounter{ism@mctr}{0}
\setcounter{xsm@mctr}{0}
\setcounter{csm@mctr}{0}
\setcounter{ksm@mctr}{0}
\setcounter{xksm@mctr}{0}
\setcounter{cksm@mctr}{0}
\setcounter{msm@mctr}{0}
\setcounter{xmsm@mctr}{0}
\setcounter{cmsm@mctr}{0}
\setcounter{bsm@mctr}{0}
\setcounter{workm@mctr}{0}
\setcounter{figure}{0}
\setcounter{lofdepth}{1}
\setcounter{lofdepth}{1}
\setcounter{table}{0}
\setcounter{lotdepth}{1}
\setcounter{lotdepth}{1}
\setcounter{book}{0}
\setcounter{pagenote}{0}
\setcounter{lofdepth}{1}
\setcounter{lotdepth}{1}
\setcounter{Item}{28}
\setcounter{memhycontfloat}{0}
\setcounter{r@tfl@t}{2}
\setcounter{definition}{6}
\setcounter{theorem}{1}
\setcounter{section@level}{1}
}
