\relax 
\@writefile{lof}{\addvspace {10pt}}
\@writefile{lot}{\addvspace {10pt}}
\@writefile{toc}{\contentsline {chapter}{\chapternumberline {1}Knowledge, Power and free Beer}{2}{chapter.1}}
\@writefile{toc}{\contentsline {section}{\numberline {1.1}Free Beer}{2}{section.1.1}}
\@writefile{toc}{\contentsline {subsection}{\numberline {1.1.1}Hard and soft Ware}{2}{subsection.1.1.1}}
\@writefile{toc}{\contentsline {subsubsection}{Hard Ware}{2}{section*.3}}
\@writefile{toc}{\contentsline {subsubsection}{Soft Ware}{3}{section*.4}}
\@writefile{toc}{\contentsline {subsubsection}{Fresh fish}{4}{section*.5}}
\@writefile{toc}{\contentsline {subsection}{\numberline {1.1.2}Patent recipes}{4}{subsection.1.1.2}}
\@writefile{toc}{\contentsline {subsubsection}{The progress}{4}{section*.6}}
\@writefile{toc}{\contentsline {subsubsection}{EU: Council versus Parliament}{5}{section*.7}}
\@writefile{toc}{\contentsline {subsection}{\numberline {1.1.3}Free of charge}{6}{subsection.1.1.3}}
\@writefile{toc}{\contentsline {subsubsection}{Soft ware is not for sale}{6}{section*.8}}
\@writefile{toc}{\contentsline {subsubsection}{The catch: Free $\not =$ free of charge}{6}{section*.9}}
\@writefile{toc}{\contentsline {section}{\numberline {1.2}Knowledge}{7}{section.1.2}}
\@writefile{toc}{\contentsline {subsection}{\numberline {1.2.1}Alternatives}{7}{subsection.1.2.1}}
\@writefile{toc}{\contentsline {subsubsection}{WikiPedia}{7}{section*.10}}
\@writefile{toc}{\contentsline {subsubsection}{WikiPedia is taken honestly}{7}{section*.11}}
\@writefile{lof}{\contentsline {figure}{\numberline {1.1}{\ignorespaces Spam mail referring WikiPedia}}{8}{figure.1.1}}
\newlabel{fig:freebeer:spam}{{\M@TitleReference {1.1}{Spam mail referring WikiPedia}}{8}{Spam mail referring WikiPedia\relax }{figure.1.1}{}}
\@writefile{lof}{\contentsline {figure}{\numberline {1.2}{\ignorespaces SpamAssassin handled spam mail}}{9}{figure.1.2}}
\newlabel{fig:freebeer:spamassassin}{{\M@TitleReference {1.2}{SpamAssassin handled spam mail}}{9}{SpamAssassin handled spam mail\relax }{figure.1.2}{}}
\@writefile{toc}{\contentsline {subsection}{\numberline {1.2.2}Free Software in general}{9}{subsection.1.2.2}}
\newlabel{sec:freebeer:userbase}{{\M@TitleReference {1.2.2}{As You Like it}}{9}{\label {sec:freebeer:userbase}As You Like it\relax }{section*.12}{}}
\@writefile{toc}{\contentsline {subsubsection}{As You Like it}{9}{section*.12}}
\@writefile{toc}{\contentsline {subsubsection}{Get the facts}{11}{section*.13}}
\@writefile{toc}{\contentsline {section}{\numberline {1.3}Power}{11}{section.1.3}}
\@writefile{toc}{\contentsline {subsection}{\numberline {1.3.1}Distribution}{11}{subsection.1.3.1}}
\@writefile{toc}{\contentsline {subsubsection}{Linux from scratch}{11}{section*.14}}
\@writefile{toc}{\contentsline {subsubsection}{Distributions on the market}{12}{section*.15}}
\@writefile{toc}{\contentsline {subsubsection}{The missing link}{14}{section*.16}}
\@writefile{toc}{\contentsline {subsection}{\numberline {1.3.2}Debian - a distribution builded by a community}{14}{subsection.1.3.2}}
\@writefile{toc}{\contentsline {subsubsection}{Maintainers are experts}{14}{section*.17}}
\@writefile{toc}{\contentsline {subsubsection}{Special applications}{15}{section*.18}}
\@writefile{toc}{\contentsline {subsubsection}{Lost in the jungle of applications}{15}{section*.19}}
\@writefile{toc}{\contentsline {subsubsection}{Custom Debian Distributions}{16}{section*.20}}
\@setckpt{freebeer}{
\setcounter{page}{17}
\setcounter{equation}{0}
\setcounter{enumi}{2}
\setcounter{enumii}{0}
\setcounter{enumiii}{0}
\setcounter{enumiv}{0}
\setcounter{footnote}{0}
\setcounter{mpfootnote}{0}
\setcounter{storedpagenumber}{1}
\setcounter{part}{0}
\setcounter{chapter}{1}
\setcounter{section}{3}
\setcounter{subsection}{2}
\setcounter{subsubsection}{0}
\setcounter{paragraph}{0}
\setcounter{subparagraph}{0}
\setcounter{@ppsavesec}{0}
\setcounter{@ppsaveapp}{0}
\setcounter{vslineno}{0}
\setcounter{poemline}{0}
\setcounter{modulo@vs}{0}
\setcounter{verse}{0}
\setcounter{chrsinstr}{0}
\setcounter{poem}{0}
\setcounter{newflo@tctr}{4}
\setcounter{@contsubnum}{0}
\setcounter{maxsecnumdepth}{2}
\setcounter{sheetsequence}{25}
\setcounter{lastsheet}{84}
\setcounter{lastpage}{76}
\setcounter{bvlinectr}{0}
\setcounter{cp@cntr}{0}
\setcounter{ism@mctr}{0}
\setcounter{xsm@mctr}{0}
\setcounter{csm@mctr}{0}
\setcounter{ksm@mctr}{0}
\setcounter{xksm@mctr}{0}
\setcounter{cksm@mctr}{0}
\setcounter{msm@mctr}{0}
\setcounter{xmsm@mctr}{0}
\setcounter{cmsm@mctr}{0}
\setcounter{bsm@mctr}{0}
\setcounter{workm@mctr}{0}
\setcounter{figure}{2}
\setcounter{lofdepth}{1}
\setcounter{lofdepth}{1}
\setcounter{table}{0}
\setcounter{lotdepth}{1}
\setcounter{lotdepth}{1}
\setcounter{book}{0}
\setcounter{pagenote}{0}
\setcounter{lofdepth}{1}
\setcounter{lotdepth}{1}
\setcounter{Item}{7}
\setcounter{memhycontfloat}{0}
\setcounter{r@tfl@t}{0}
\setcounter{definition}{0}
\setcounter{theorem}{0}
\setcounter{section@level}{3}
}
