\relax 
\@writefile{lof}{\addvspace {10pt}}
\@writefile{lot}{\addvspace {10pt}}
\@writefile{toc}{\contentsline {chapter}{\chapternumberline {7}Abstracts}{66}{chapter.7}}
\@writefile{toc}{\contentsline {section}{\numberline {7.1}Debian Webservices Development}{66}{section.7.1}}
\@writefile{toc}{\contentsline {section}{\numberline {7.2}dak discussion / hacking session}{66}{section.7.2}}
\@writefile{toc}{\contentsline {section}{\numberline {7.3}Emdebian update}{66}{section.7.3}}
\@writefile{toc}{\contentsline {section}{\numberline {7.4}Virtualisation in Debian}{67}{section.7.4}}
\@writefile{toc}{\contentsline {section}{\numberline {7.5}Debian on the Neo1973/Freerunner}{67}{section.7.5}}
\@writefile{toc}{\contentsline {section}{\numberline {7.6}Debian Edu 100\% in main}{67}{section.7.6}}
\@writefile{toc}{\contentsline {section}{\numberline {7.7}SPI BOF}{67}{section.7.7}}
\@writefile{toc}{\contentsline {section}{\numberline {7.8}Managing 666 packages, or how to tame the beast}{67}{section.7.8}}
\@writefile{toc}{\contentsline {section}{\numberline {7.9}dh\_make\_webapp: yeah right!}{68}{section.7.9}}
\@writefile{toc}{\contentsline {section}{\numberline {7.10}Locating bugs to kill with SOAP}{68}{section.7.10}}
\@writefile{toc}{\contentsline {section}{\numberline {7.11}Ruby packaging in Debian}{68}{section.7.11}}
\@writefile{toc}{\contentsline {section}{\numberline {7.12}Organizing better in-person meetings}{68}{section.7.12}}
\@writefile{toc}{\contentsline {section}{\numberline {7.13}Debian Derivers Roundtable}{69}{section.7.13}}
\@writefile{toc}{\contentsline {section}{\numberline {7.14}Debian and LiMux}{69}{section.7.14}}
\@writefile{toc}{\contentsline {section}{\numberline {7.15}Debian-Science}{69}{section.7.15}}
\@writefile{toc}{\contentsline {section}{\numberline {7.16}Synfig - Animation in the free world}{69}{section.7.16}}
\@writefile{toc}{\contentsline {section}{\numberline {7.17}Packaging with version control systems}{70}{section.7.17}}
\@writefile{toc}{\contentsline {section}{\numberline {7.18}Debian and Ubuntu}{70}{section.7.18}}
\@writefile{toc}{\contentsline {section}{\numberline {7.19}Herding Wild Cats}{70}{section.7.19}}
\@writefile{toc}{\contentsline {section}{\numberline {7.20}LaTeX Beamer Debian Theme BOF}{70}{section.7.20}}
\@writefile{toc}{\contentsline {section}{\numberline {7.21}Quality Assurance in lenny$+1$}{70}{section.7.21}}
\@writefile{toc}{\contentsline {section}{\numberline {7.22}Healthy CDDs}{71}{section.7.22}}
\@writefile{toc}{\contentsline {section}{\numberline {7.23}Debian-Med BOF}{71}{section.7.23}}
\@writefile{toc}{\contentsline {section}{\numberline {7.24}Method diffusion in large volunteer projects}{71}{section.7.24}}
\@writefile{toc}{\contentsline {section}{\numberline {7.25}Best practises in team-maintaining packages}{71}{section.7.25}}
\@writefile{toc}{\contentsline {section}{\numberline {7.26}netconf}{72}{section.7.26}}
\@writefile{toc}{\contentsline {section}{\numberline {7.27}Bringing closer Debian and Rails}{72}{section.7.27}}
\@writefile{toc}{\contentsline {section}{\numberline {7.28}Internationalization in Debian}{72}{section.7.28}}
\@writefile{toc}{\contentsline {section}{\numberline {7.29}Redesigning DEHS (a.k.a. changing the watch files atmosphere)}{73}{section.7.29}}
\@writefile{toc}{\contentsline {section}{\numberline {7.30}Debian-HPC: making Debian "the" distro for clusters and supercomputers}{73}{section.7.30}}
\@writefile{toc}{\contentsline {section}{\numberline {7.31}Bits from NMs and users}{73}{section.7.31}}
\@writefile{toc}{\contentsline {section}{\numberline {7.32}Multi winner voting in Debian}{73}{section.7.32}}
\@writefile{toc}{\contentsline {section}{\numberline {7.33}Debian technical policy update}{73}{section.7.33}}
\@writefile{toc}{\contentsline {section}{\numberline {7.34}Debian Wiki}{74}{section.7.34}}
\@writefile{toc}{\contentsline {section}{\numberline {7.35}Debian: casos de \IeC {\'e}xito en implementaciones empresariales}{74}{section.7.35}}
\@writefile{toc}{\contentsline {section}{\numberline {7.36}Internacionalizaci\IeC {\'o}n en Debian}{74}{section.7.36}}
\@writefile{toc}{\contentsline {section}{\numberline {7.37}Proyecto gnuLinEx}{75}{section.7.37}}
\@writefile{toc}{\contentsline {section}{\numberline {7.38}\IeC {\textquestiondown }Qu\IeC {\'e} es el Software Libre?}{75}{section.7.38}}
\@writefile{toc}{\contentsline {section}{\numberline {7.39}Hosting Caseros}{75}{section.7.39}}
\@setckpt{abstracts}{
\setcounter{page}{77}
\setcounter{equation}{0}
\setcounter{enumi}{6}
\setcounter{enumii}{2}
\setcounter{enumiii}{0}
\setcounter{enumiv}{0}
\setcounter{footnote}{0}
\setcounter{mpfootnote}{0}
\setcounter{storedpagenumber}{1}
\setcounter{part}{0}
\setcounter{chapter}{7}
\setcounter{section}{39}
\setcounter{subsection}{0}
\setcounter{subsubsection}{0}
\setcounter{paragraph}{0}
\setcounter{subparagraph}{0}
\setcounter{@ppsavesec}{0}
\setcounter{@ppsaveapp}{0}
\setcounter{vslineno}{0}
\setcounter{poemline}{0}
\setcounter{modulo@vs}{0}
\setcounter{verse}{0}
\setcounter{chrsinstr}{0}
\setcounter{poem}{0}
\setcounter{newflo@tctr}{4}
\setcounter{@contsubnum}{0}
\setcounter{maxsecnumdepth}{2}
\setcounter{sheetsequence}{85}
\setcounter{lastsheet}{84}
\setcounter{lastpage}{76}
\setcounter{bvlinectr}{0}
\setcounter{cp@cntr}{0}
\setcounter{ism@mctr}{0}
\setcounter{xsm@mctr}{0}
\setcounter{csm@mctr}{0}
\setcounter{ksm@mctr}{0}
\setcounter{xksm@mctr}{0}
\setcounter{cksm@mctr}{0}
\setcounter{msm@mctr}{0}
\setcounter{xmsm@mctr}{0}
\setcounter{cmsm@mctr}{0}
\setcounter{bsm@mctr}{0}
\setcounter{workm@mctr}{0}
\setcounter{figure}{0}
\setcounter{lofdepth}{1}
\setcounter{lofdepth}{1}
\setcounter{table}{0}
\setcounter{lotdepth}{1}
\setcounter{lotdepth}{1}
\setcounter{book}{0}
\setcounter{pagenote}{0}
\setcounter{lofdepth}{1}
\setcounter{lotdepth}{1}
\setcounter{Item}{28}
\setcounter{memhycontfloat}{0}
\setcounter{r@tfl@t}{2}
\setcounter{definition}{6}
\setcounter{theorem}{1}
\setcounter{section@level}{1}
}
