\relax 
\@writefile{lof}{\addvspace {10pt}}
\@writefile{lot}{\addvspace {10pt}}
\@writefile{toc}{\contentsline {chapter}{\chapternumberline {3}Best practises in team package maintenance}{44}{chapter.3}}
\@writefile{toc}{\contentsline {section}{\numberline {3.1}Introduction}{44}{section.3.1}}
\@writefile{toc}{\contentsline {section}{\numberline {3.2}Questions}{45}{section.3.2}}
\@writefile{toc}{\contentsline {subsection}{\numberline {3.2.1}Basics}{45}{subsection.3.2.1}}
\@writefile{toc}{\contentsline {subsection}{\numberline {3.2.2}Work flow}{45}{subsection.3.2.2}}
\@writefile{toc}{\contentsline {paragraph}{Communication}{45}{section*.34}}
\@writefile{toc}{\contentsline {paragraph}{Members}{45}{section*.35}}
\@writefile{toc}{\contentsline {paragraph}{Review/uploads/sponsoring}{45}{section*.36}}
\@writefile{toc}{\contentsline {paragraph}{Infrastructure}{45}{section*.37}}
\@writefile{toc}{\contentsline {paragraph}{Policy/rules}{45}{section*.38}}
\@writefile{toc}{\contentsline {paragraph}{Tools}{45}{section*.39}}
\@writefile{toc}{\contentsline {subsection}{\numberline {3.2.3}Experiences}{46}{subsection.3.2.3}}
\@writefile{toc}{\contentsline {paragraph}{Best practises/successes}{46}{section*.40}}
\@writefile{toc}{\contentsline {paragraph}{Challenges/failures}{46}{section*.41}}
\@writefile{toc}{\contentsline {subsection}{\numberline {3.2.4}Other teams/Debian}{46}{subsection.3.2.4}}
\@setckpt{bestpractices}{
\setcounter{page}{47}
\setcounter{equation}{0}
\setcounter{enumi}{6}
\setcounter{enumii}{2}
\setcounter{enumiii}{0}
\setcounter{enumiv}{0}
\setcounter{footnote}{0}
\setcounter{mpfootnote}{0}
\setcounter{storedpagenumber}{1}
\setcounter{part}{0}
\setcounter{chapter}{3}
\setcounter{section}{2}
\setcounter{subsection}{4}
\setcounter{subsubsection}{0}
\setcounter{paragraph}{0}
\setcounter{subparagraph}{0}
\setcounter{@ppsavesec}{0}
\setcounter{@ppsaveapp}{0}
\setcounter{vslineno}{0}
\setcounter{poemline}{0}
\setcounter{modulo@vs}{0}
\setcounter{verse}{0}
\setcounter{chrsinstr}{0}
\setcounter{poem}{0}
\setcounter{newflo@tctr}{4}
\setcounter{@contsubnum}{0}
\setcounter{maxsecnumdepth}{2}
\setcounter{sheetsequence}{55}
\setcounter{lastsheet}{84}
\setcounter{lastpage}{76}
\setcounter{bvlinectr}{0}
\setcounter{cp@cntr}{0}
\setcounter{ism@mctr}{0}
\setcounter{xsm@mctr}{0}
\setcounter{csm@mctr}{0}
\setcounter{ksm@mctr}{0}
\setcounter{xksm@mctr}{0}
\setcounter{cksm@mctr}{0}
\setcounter{msm@mctr}{0}
\setcounter{xmsm@mctr}{0}
\setcounter{cmsm@mctr}{0}
\setcounter{bsm@mctr}{0}
\setcounter{workm@mctr}{0}
\setcounter{figure}{0}
\setcounter{lofdepth}{1}
\setcounter{lofdepth}{1}
\setcounter{table}{0}
\setcounter{lotdepth}{1}
\setcounter{lotdepth}{1}
\setcounter{book}{0}
\setcounter{pagenote}{0}
\setcounter{lofdepth}{1}
\setcounter{lotdepth}{1}
\setcounter{Item}{28}
\setcounter{memhycontfloat}{0}
\setcounter{r@tfl@t}{2}
\setcounter{definition}{6}
\setcounter{theorem}{1}
\setcounter{section@level}{2}
}
