<?xml version="1.0" encoding="UTF-8" standalone="no"?>
<!-- Created with Inkscape (http://www.inkscape.org/) -->

<svg
   xmlns:dc="http://purl.org/dc/elements/1.1/"
   xmlns:cc="http://creativecommons.org/ns#"
   xmlns:rdf="http://www.w3.org/1999/02/22-rdf-syntax-ns#"
   xmlns:svg="http://www.w3.org/2000/svg"
   xmlns="http://www.w3.org/2000/svg"
   xmlns:sodipodi="http://sodipodi.sourceforge.net/DTD/sodipodi-0.dtd"
   xmlns:inkscape="http://www.inkscape.org/namespaces/inkscape"
   width="297mm"
   height="420mm"
   viewBox="0 0 297 420"
   version="1.1"
   id="svg8"
   inkscape:version="0.92.3 (2405546, 2018-03-11)"
   sodipodi:docname="nodrinking.svg">
  <defs
     id="defs2">
    <inkscape:path-effect
       fuse_tolerance="0"
       vertical_pattern="false"
       prop_units="false"
       tang_offset="0"
       normal_offset="0"
       spacing="0"
       scale_y_rel="false"
       prop_scale="0.31402648"
       copytype="single_stretched"
       pattern="m 127.32607,-52.210949 c 0,-2.76 2.24,-5 5,-5 2.76,0 5,2.24 5,5 0,2.76 -2.24,5 -5,5 -2.76,0 -5,-2.24 -5,-5 z"
       is_visible="true"
       id="path-effect2801"
       effect="skeletal" />
    <inkscape:path-effect
       fuse_tolerance="0"
       vertical_pattern="false"
       prop_units="false"
       tang_offset="0"
       normal_offset="0"
       spacing="0"
       scale_y_rel="false"
       prop_scale="0.22413702"
       copytype="single_stretched"
       pattern="m -44.813526,45.698248 h 1"
       is_visible="true"
       id="path-effect2805"
       effect="skeletal" />
    <inkscape:path-effect
       fuse_tolerance="0"
       vertical_pattern="false"
       prop_units="false"
       tang_offset="0"
       normal_offset="0"
       spacing="0"
       scale_y_rel="false"
       prop_scale="0.22413702"
       copytype="single_stretched"
       pattern="m -11.813526,14.555391 c 0,-2.76 2.2399996,-4.9999998 4.9999996,-4.9999998 2.76,0 5,2.2399998 5,4.9999998 0,2.76 -2.24,5 -5,5 -2.76,0 -4.9999996,-2.24 -4.9999996,-5 z"
       is_visible="true"
       id="path-effect2809"
       effect="skeletal" />
    <inkscape:path-effect
       fuse_tolerance="0"
       vertical_pattern="false"
       prop_units="false"
       tang_offset="0"
       normal_offset="0"
       spacing="0"
       scale_y_rel="false"
       prop_scale="0.22413702"
       copytype="single_stretched"
       pattern="m -11.813526,14.555391 c 0,-2.76 2.2399996,-4.9999998 4.9999996,-4.9999998 2.76,0 5,2.2399998 5,4.9999998 0,2.76 -2.24,5 -5,5 -2.76,0 -4.9999996,-2.24 -4.9999996,-5 z"
       is_visible="true"
       id="path-effect2813"
       effect="skeletal" />
  </defs>
  <sodipodi:namedview
     id="base"
     pagecolor="#ffffff"
     bordercolor="#666666"
     borderopacity="1.0"
     inkscape:pageopacity="0.0"
     inkscape:pageshadow="2"
     inkscape:zoom="0.24748738"
     inkscape:cx="444.25147"
     inkscape:cy="1068.964"
     inkscape:document-units="mm"
     inkscape:current-layer="layer1"
     showgrid="false"
     borderlayer="true"
     inkscape:window-width="1920"
     inkscape:window-height="1045"
     inkscape:window-x="0"
     inkscape:window-y="0"
     inkscape:window-maximized="1"
     showguides="true"
     inkscape:guide-bbox="true"
     inkscape:snap-global="true"
     inkscape:snap-grids="true"
     inkscape:snap-to-guides="true"
     inkscape:object-nodes="false"
     inkscape:lockguides="true">
    <sodipodi:guide
       position="25.390605,215.15196"
       orientation="1,0"
       id="guide1253"
       inkscape:locked="true" />
    <sodipodi:guide
       position="169.18161,162.76715"
       orientation="1,0"
       id="guide1255"
       inkscape:locked="true" />
    <sodipodi:guide
       position="273.14945,284.1075"
       orientation="1,0"
       id="guide1356"
       inkscape:locked="true" />
    <sodipodi:guide
       position="178.78273,185.20834"
       orientation="1,0"
       id="guide1358"
       inkscape:locked="true" />
    <sodipodi:guide
       position="160.09444,360.27931"
       orientation="0,1"
       id="guide983"
       inkscape:locked="true" />
    <sodipodi:guide
       position="-41.694046,286.51292"
       orientation="1,0"
       id="guide1026"
       inkscape:locked="true" />
  </sodipodi:namedview>
  <metadata
     id="metadata5">
    <rdf:RDF>
      <cc:Work
         rdf:about="">
        <dc:format>image/svg+xml</dc:format>
        <dc:type
           rdf:resource="http://purl.org/dc/dcmitype/StillImage" />
        <dc:title></dc:title>
      </cc:Work>
    </rdf:RDF>
  </metadata>
  <g
     inkscape:label="Camada 1"
     inkscape:groupmode="layer"
     id="layer1"
     transform="translate(0,123)">
    <rect
       style="fill:#ffffff;stroke-width:0.31274995"
       id="rect122"
       width="300.8924"
       height="425.15015"
       x="-0.0028603023"
       y="-124.12872" />
    <rect
       y="-93.594154"
       x="-310.2872"
       height="132.09015"
       width="321.78622"
       id="rect716-7"
       style="fill:#cd0000;fill-opacity:1;stroke:none;stroke-width:17.31124496;stroke-miterlimit:4;stroke-dasharray:none;stroke-opacity:1;paint-order:stroke fill markers"
       transform="scale(-1)" />
    <path
       style="fill:#cd0000;fill-opacity:1;stroke:none;stroke-width:0.26849198px;stroke-linecap:butt;stroke-linejoin:miter;stroke-opacity:1"
       d="m -71.596244,84.396237 c 0,0 54.215898,24.422393 104.827727,31.878833 50.61183,7.45643 91.617957,-13.89596 130.075107,-18.020318 38.45714,-4.124316 89.24433,10.688868 123.91062,22.028278 34.66624,11.3394 82.77026,-4.19428 85.61055,-5.84546 2.84029,-1.65123 -0.70838,-108.5683776 -0.70838,-108.5683776 L -75.141357,4.1658146 Z"
       id="path1606"
       inkscape:connector-curvature="0"
       sodipodi:nodetypes="cssscccc" />
    <text
       xml:space="preserve"
       style="font-style:normal;font-weight:normal;font-size:10.58333302px;line-height:1.25;font-family:sans-serif;letter-spacing:0px;word-spacing:0px;fill:#000000;fill-opacity:1;stroke:none;stroke-width:0.26458332"
       x="-115.99497"
       y="144.12183"
       id="text20"><tspan
         sodipodi:role="line"
         id="tspan18"
         x="-115.99497"
         y="153.4856"
         style="stroke-width:0.26458332" /></text>
    <g
       id="g2967"
       transform="matrix(0.26182456,0,0,0.26182456,109.58689,-2.875797)"
       style="fill:#cd0000;fill-opacity:1;enable-background:new">
      <g
         transform="translate(-813.40476,55.03257)"
         id="g2928"
         style="fill:#cd0000;fill-opacity:1">
        <g
           id="g1299"
           transform="matrix(0.93527709,0,0,0.93527709,149.03663,146.57791)">
          <path
             inkscape:connector-curvature="0"
             id="ellipse2795"
             d="m 1222.6376,876.23248 a 2.1710489,1.557906 0 0 1 -2.171,1.55791 2.1710489,1.557906 0 0 1 -2.1711,-1.55791 2.1710489,1.557906 0 0 1 2.1711,-1.5579 2.1710489,1.557906 0 0 1 2.171,1.5579 z"
             style="fill:#cd0000;fill-opacity:1;stroke:#cd0000;stroke-width:0.36084729;stroke-miterlimit:4;stroke-dasharray:none;stroke-opacity:1"
             transform="matrix(0.99488428,0.10102113,-0.34408388,0.93893891,0,0)" />
          <ellipse
             style="fill:#cd0000;fill-opacity:1;stroke:#ffffff;stroke-width:0.6398797;stroke-miterlimit:4;stroke-dasharray:none;stroke-opacity:1"
             id="ellipse2797"
             cx="961.29718"
             cy="1139.5833"
             rx="0.50109422"
             ry="0.21848945"
             transform="matrix(0.97957504,-0.20107896,-0.02467264,0.99969558,0,0)" />
          <path
             style="fill:#cd0000;fill-opacity:1;fill-rule:evenodd;stroke:none;stroke-width:0.3140265px;stroke-linecap:butt;stroke-linejoin:miter;stroke-opacity:1"
             d="m 946.99389,952.84052 c -0.0669,-0.17221 0.77457,-0.54501 2.42426,-0.12824 0.58666,0.1286 1.6207,0.45467 2.33119,0.34281 0.217,-0.0263 0.44091,-0.0532 0.67162,-0.0805 1.32808,-0.14424 2.3389,-0.78778 4.03877,-1.66601 0,0 10e-6,0 10e-6,0 7.09014,-3.7652 21.92465,-12.60118 29.60388,-28.09525 4.16395,-8.36014 6.34829,-19.09787 4.02348,-29.85066 -0.90898,-4.21371 -2.48315,-8.40747 -4.85044,-12.19279 -2.05524,-3.27804 -4.70522,-6.28526 -7.95167,-8.46569 -0.94678,-0.63664 -1.94803,-1.20327 -2.9896,-1.6849 -2.21573,-1.02457 -4.57378,-1.64619 -6.93432,-1.76592 -3.87918,-0.22575 -7.78192,0.92119 -11.15896,2.77695 -3.68009,2.04782 -6.71175,5.04098 -8.39409,8.59743 -4.88386,10.46933 -1.93725,22.81428 6.10753,26.17097 0,0 10e-6,0 10e-6,0 4.19977,1.82263 8.4467,2.60848 11.85539,1.08171 3.04493,-1.24499 5.09134,-4.20842 6.15798,-6.96843 1.73465,-4.50414 0.37958,-9.10219 -1.45924,-11.8867 -3.78258,-5.71755 -8.13734,-6.88649 -8.0546,-7.11399 -0.10455,0.28745 4.45842,0.0159 9.16082,6.3358 2.20324,2.96113 3.96589,7.98483 2.18024,13.31867 -1.05669,3.17493 -3.32392,6.62206 -7.0718,8.38053 -4.23562,1.85313 -9.2244,1.22821 -13.79883,-0.80166 0,-10e-6 -1e-5,-10e-6 -1e-5,-10e-6 -9.50999,-4.35185 -13.43995,-18.01668 -7.79075,-29.80117 1.98965,-4.20121 5.42097,-7.68289 9.60409,-10.01311 3.78075,-2.12951 8.23464,-3.42629 12.82709,-3.20564 2.79005,0.15168 5.53374,0.86388 8.08685,2.04067 1.2002,0.5532 2.34798,1.20437 3.42941,1.93816 3.67559,2.4967 6.61598,5.82503 8.83528,9.42514 2.56266,4.14745 4.24064,8.68014 5.17592,13.20817 2.38706,11.58136 -0.0688,22.91838 -4.63509,31.67729 -8.5053,16.23997 -23.92595,24.67576 -31.38551,28.06035 0,0 0,0 0,0 -1.67936,0.78273 -2.97168,1.39464 -4.53837,1.47065 -0.2322,0.008 -0.45759,0.0149 -0.67609,0.0215 -1.03729,0.018 -2.04567,-0.43265 -2.58354,-0.6392 -1.47402,-0.50832 -2.20111,-0.38438 -2.24091,-0.48691 z"
             id="path2799"
             inkscape:path-effect="#path-effect2801"
             inkscape:original-d="m 946.99389,952.84052 c 1.37013,-0.5319 3.25345,0.78668 4.78995,0.67034 l 0.67386,-0.051 c 1.55441,-0.11769 3.06964,-0.96921 4.28857,-1.56833 61.84963,-30.39995 31.44624,-99.44107 -1.29579,-81.2112 -3.07875,1.71417 -6.71,4.4692 -8.99909,9.30527 -6.11073,12.90994 -1.76878,24.15824 6.94914,27.98607 10.71077,4.70284 17.01421,0.0526 19.44201,-6.73279 3.52338,-9.84738 -4.90021,-17.31725 -10.42744,-19.32758"
             inkscape:connector-curvature="0"
             sodipodi:nodetypes="csssssssc" />
          <path
             style="fill:#cd0000;fill-opacity:1;fill-rule:evenodd;stroke:#cd0000;stroke-width:1.18792605;stroke-linecap:butt;stroke-linejoin:miter;stroke-miterlimit:4;stroke-dasharray:none;stroke-opacity:1"
             d="m 904.98553,941.82484 c -0.44974,-1.1618 -1.07325,-2.57589 -0.37175,-3.60542 0.34036,-0.49952 1.09505,-0.49756 1.64587,-0.24865 l 0,0 c 1.03794,0.46901 1.7952,1.38818 2.55426,2.23737 0.35157,0.39331 0.6934,0.79576 1.06142,1.17373 0.20977,0.21544 0.41325,0.50652 0.71292,0.53138"
             id="path2803"
             inkscape:path-effect="#path-effect2805"
             inkscape:original-d="m 904.98553,941.82484 c -1.52956,-3.95125 0.11352,-4.37852 1.27412,-3.85407 1.68989,0.76361 3.6786,3.88855 4.3286,3.94248"
             inkscape:connector-curvature="0"
             sodipodi:nodetypes="csc" />
          <path
             style="fill:#cd0000;fill-opacity:1;fill-rule:evenodd;stroke:none;stroke-width:0.22413702px;stroke-linecap:butt;stroke-linejoin:miter;stroke-opacity:1"
             d="m 889.26543,949.90658 c -0.11404,-0.11436 0.84853,-1.59137 3.31798,-3.37425 2.55453,-1.84431 6.31109,-3.68007 11.53777,-4.77178 4.87233,-1.03262 10.30831,-1.3676 16.35989,-0.89324 0.96226,0.0754 1.91258,0.16913 2.84843,0.27804 6.9216,0.7979 12.76077,2.3727 17.56864,4.30126 2.67784,1.0727 4.75418,2.15473 6.45779,3.28073 2.90491,1.90494 3.962,3.61871 3.7579,3.78216 -0.17399,0.13935 -1.48326,-1.22049 -4.373,-2.73946 -1.76115,-0.91632 -3.77068,-1.77403 -6.44961,-2.68523 -4.79514,-1.62844 -10.43541,-2.97382 -17.21193,-3.72021 -0.91273,-0.0995 -1.83801,-0.18714 -2.77308,-0.26001 -5.89412,-0.45932 -11.0885,-0.24539 -15.81393,0.57639 -5.0767,0.89864 -8.6326,2.32138 -11.29339,3.81274 -2.51484,1.40955 -3.78523,2.56151 -3.93346,2.41286 z"
             id="path2807"
             inkscape:path-effect="#path-effect2809"
             inkscape:original-d="m 889.26543,949.90658 c 15.10026,-15.05819 54.78751,-6.21374 61.8484,2.60292"
             inkscape:connector-curvature="0"
             sodipodi:nodetypes="cc" />
          <path
             style="fill:#cd0000;fill-opacity:1;fill-rule:evenodd;stroke:none;stroke-width:0.22413702px;stroke-linecap:butt;stroke-linejoin:miter;stroke-opacity:1"
             d="m 949.72548,955.96082 c -0.0802,0.43564 -7.23871,-1.13267 -17.16273,0.56044 -3.97944,0.67498 -8.21424,1.93397 -12.56768,3.94418 -0.46247,0.21354 -0.91924,0.43234 -1.37015,0.65588 0,0 0,0 0,0 -6.87001,3.39418 -13.16068,8.33031 -17.07301,11.37268 -4.19074,3.25887 -6.77292,5.25501 -6.99245,5.00281 -0.17272,-0.19843 2.04048,-2.60536 5.99402,-6.1908 3.75944,-3.40941 9.84089,-8.55352 17.07288,-12.18822 0,0 0,-10e-6 0,-10e-6 0.46951,-0.23519 0.94576,-0.4646 1.42858,-0.68768 4.54314,-2.09911 9.02015,-3.34058 13.20591,-3.90224 10.6541,-1.41951 17.48171,1.34015 17.46463,1.43296 z"
             id="path2811"
             inkscape:path-effect="#path-effect2813"
             inkscape:original-d="m 949.72548,955.96082 c -25.55618,-4.70324 -40.32139,8.61453 -55.16601,21.53599"
             inkscape:connector-curvature="0"
             sodipodi:nodetypes="cc" />
          <path
             inkscape:connector-curvature="0"
             id="path2815"
             d="m 946.98633,952.49023 a 0.34559865,0.34559865 0 0 0 -0.25781,0.57227 c 0.48253,0.57874 1.29112,0.85521 1.87695,1.2168 0.29291,0.18079 0.52235,0.37064 0.64062,0.5625 0.11828,0.19186 0.15937,0.38084 0.0586,0.70508 a 0.3456341,0.3456341 0 1 0 0.66015,0.20507 c 0.14871,-0.47847 0.0803,-0.92897 -0.13086,-1.27148 -0.21114,-0.34251 -0.53074,-0.58261 -0.86523,-0.78906 -0.66899,-0.41291 -1.43009,-0.73777 -1.70898,-1.07227 a 0.34559865,0.34559865 0 0 0 -0.27344,-0.12891 z"
             style="color:#000000;font-style:normal;font-variant:normal;font-weight:normal;font-stretch:normal;font-size:medium;line-height:normal;font-family:sans-serif;font-variant-ligatures:normal;font-variant-position:normal;font-variant-caps:normal;font-variant-numeric:normal;font-variant-alternates:normal;font-feature-settings:normal;text-indent:0;text-align:start;text-decoration:none;text-decoration-line:none;text-decoration-style:solid;text-decoration-color:#000000;letter-spacing:normal;word-spacing:normal;text-transform:none;writing-mode:lr-tb;direction:ltr;text-orientation:mixed;dominant-baseline:auto;baseline-shift:baseline;text-anchor:start;white-space:normal;shape-padding:0;clip-rule:nonzero;display:inline;overflow:visible;visibility:visible;opacity:1;isolation:auto;mix-blend-mode:normal;color-interpolation:sRGB;color-interpolation-filters:linearRGB;solid-color:#000000;solid-opacity:1;vector-effect:none;fill:#cd0000;fill-opacity:1;fill-rule:evenodd;stroke:none;stroke-width:0.69112819;stroke-linecap:round;stroke-linejoin:miter;stroke-miterlimit:4;stroke-dasharray:none;stroke-dashoffset:0;stroke-opacity:1;color-rendering:auto;image-rendering:auto;shape-rendering:auto;text-rendering:auto;enable-background:accumulate" />
          <path
             inkscape:connector-curvature="0"
             id="path2817"
             d="m 948.28906,952.13281 c -0.39663,0.0676 -0.74709,0.15016 -1.00195,0.21485 -0.12743,0.0323 -0.23055,0.0603 -0.30273,0.0801 -0.0361,0.01 -0.0645,0.0168 -0.082,0.0215 a 0.34531762,0.34531762 0 0 0 -0.006,0.002 0.34531762,0.34531762 0 0 0 0.0625,0.68555 c 7.7e-4,-10e-6 0.0566,-0.004 0.0664,-0.006 0.01,-0.002 0.0157,-0.004 0.0215,-0.006 0.0116,-0.003 0.0217,-0.005 0.0332,-0.008 0.0229,-0.006 0.0524,-0.0137 0.0879,-0.0234 0.0709,-0.0194 0.16776,-0.0473 0.28906,-0.0781 0.24261,-0.0616 0.57698,-0.13776 0.94922,-0.20117 0.74449,-0.12681 1.65142,-0.18455 2.25391,0.006 a 0.34531762,0.34531762 0 1 0 0.20703,-0.6582 c -0.81235,-0.25674 -1.78487,-0.16442 -2.57813,-0.0293 z"
             style="color:#000000;font-style:normal;font-variant:normal;font-weight:normal;font-stretch:normal;font-size:medium;line-height:normal;font-family:sans-serif;font-variant-ligatures:normal;font-variant-position:normal;font-variant-caps:normal;font-variant-numeric:normal;font-variant-alternates:normal;font-feature-settings:normal;text-indent:0;text-align:start;text-decoration:none;text-decoration-line:none;text-decoration-style:solid;text-decoration-color:#000000;letter-spacing:normal;word-spacing:normal;text-transform:none;writing-mode:lr-tb;direction:ltr;text-orientation:mixed;dominant-baseline:auto;baseline-shift:baseline;text-anchor:start;white-space:normal;shape-padding:0;clip-rule:nonzero;display:inline;overflow:visible;visibility:visible;opacity:1;isolation:auto;mix-blend-mode:normal;color-interpolation:sRGB;color-interpolation-filters:linearRGB;solid-color:#000000;solid-opacity:1;vector-effect:none;fill:#cd0000;fill-opacity:1;fill-rule:evenodd;stroke:none;stroke-width:0.69056618;stroke-linecap:round;stroke-linejoin:round;stroke-miterlimit:4;stroke-dasharray:none;stroke-dashoffset:0;stroke-opacity:1;color-rendering:auto;image-rendering:auto;shape-rendering:auto;text-rendering:auto;enable-background:accumulate" />
          <path
             sodipodi:nodetypes="csccccccccc"
             inkscape:connector-curvature="0"
             id="path2819"
             d="m 900.55273,939.24609 c -0.57536,0.10755 -1.1539,0.44137 -1.54687,1.00586 -0.78594,1.12898 -0.88206,2.95283 -0.0234,5.86133 6.24824,-1.52276 4.27155,-0.95633 8.50196,-1.91797 -0.12715,-0.3981 -0.3633,-0.74269 -0.68165,-1.14648 -0.31834,-0.4038 -0.72352,-0.84118 -1.19335,-1.28125 -0.93967,-0.88014 -2.12826,-1.76821 -3.38868,-2.32813 l -0.0137,-0.006 -0.0117,-0.006 c -0.49892,-0.19955 -1.06721,-0.28918 -1.64258,-0.18164 z"
             style="color:#000000;font-style:normal;font-variant:normal;font-weight:normal;font-stretch:normal;font-size:medium;line-height:normal;font-family:sans-serif;font-variant-ligatures:normal;font-variant-position:normal;font-variant-caps:normal;font-variant-numeric:normal;font-variant-alternates:normal;font-feature-settings:normal;text-indent:0;text-align:start;text-decoration:none;text-decoration-line:none;text-decoration-style:solid;text-decoration-color:#000000;letter-spacing:normal;word-spacing:normal;text-transform:none;writing-mode:lr-tb;direction:ltr;text-orientation:mixed;dominant-baseline:auto;baseline-shift:baseline;text-anchor:start;white-space:normal;shape-padding:0;clip-rule:nonzero;display:inline;overflow:visible;visibility:visible;opacity:1;isolation:auto;mix-blend-mode:normal;color-interpolation:sRGB;color-interpolation-filters:linearRGB;solid-color:#000000;solid-opacity:1;vector-effect:none;fill:#cd0000;fill-opacity:1;fill-rule:evenodd;stroke:none;stroke-width:1.41206324;stroke-linecap:butt;stroke-linejoin:miter;stroke-miterlimit:4;stroke-dasharray:none;stroke-dashoffset:0;stroke-opacity:1;color-rendering:auto;image-rendering:auto;shape-rendering:auto;text-rendering:auto;enable-background:accumulate" />
          <path
             style="opacity:0.98999999;fill:#cd0000;fill-opacity:1;stroke:none;stroke-width:0.0224137;stroke-linecap:round;stroke-linejoin:round;stroke-miterlimit:4;stroke-dasharray:none;stroke-opacity:1"
             d="m 925.31092,946.0813 c 0,0 6.30623,-1.66695 13.79576,1.14864 2.53785,0.95407 3.64945,0.62472 5.30024,1.32244 1.91918,0.81118 4.49526,2.3145 5.35263,2.97891 l 0.83293,0.69999 -1.36179,-0.12184 c -0.61684,-0.0552 -1.34066,0.19219 -1.61089,0.27996 -0.48225,0.15661 -0.48939,0.16613 -0.38625,0.51453 0.10295,0.34768 0.41532,0.57948 1.92044,1.42505 0.34845,0.19575 0.51099,0.39036 0.59217,0.70903 l -0.11416,0.82676 -1.36576,-0.26939 c -0.71264,-0.14056 -1.91854,-1.00323 -3.10732,-1.18959 -4.89805,-0.76785 -20.00438,-1.8139 -20.00438,-1.8139 -0.34199,-0.26411 -8.46971,-3.78036 -2.6205,-6.18535 z m 20.68514,5.08498 c 0.10942,-0.0644 0.41166,-0.0965 0.67163,-0.0713 0.40585,0.0394 0.49836,0.10096 0.65432,0.43584 0.20918,0.44914 0.60929,0.50234 0.72594,0.0965 0.22295,-0.77563 -1.13176,-1.6239 -2.05723,-1.28817 -0.27984,0.10152 -0.53607,0.27943 -0.56939,0.39535 -0.08,0.27842 0.3221,0.58053 0.57473,0.43179 z"
             id="path2823"
             inkscape:connector-curvature="0"
             sodipodi:nodetypes="cssscssssccssccccssssscc" />
          <path
             d="m 756.2677,927.28605 c -2.24934,2.13362 -4.93037,3.38535 -8.06582,3.75518 0.11361,-4.23881 0.22721,-9.01813 0.29538,-14.36642 l 0.15904,-14.36642 c 0.13632,-12.60262 0.29537,-22.18972 0.47713,-28.73284 0.0227,-0.14224 0.0227,-0.28448 0,-0.42673 2.61287,-0.22758 4.83949,0.17069 6.72531,1.16639 2.29478,1.22327 2.29485,4.06285 2.5675,6.82234 0.29537,2.84483 1.81757,10.33202 1.90845,14.14409 0.0227,1.39397 -0.0227,-1.96293 0,0 l 0.0454,5.00692 0.0454,4.43794 0.0227,4.43794 c 0,3.35691 -1.55249,9.28419 -1.66609,11.84454 -0.18176,3.72674 -0.038,3.85896 -2.5145,6.27707 z m 3.05205,-56.62777 c -2.61287,-1.50777 -7.16448,-2.31723 -10.64073,-2.0043 -0.59074,0.0285 -1.34052,0.14224 -2.22662,0.34138 -0.72706,0.14224 -0.74642,1.25407 -0.88274,2.07908 -0.1136,0.79655 -0.52594,1.8468 -0.0715,2.50111 -0.11361,0.25603 0.0227,-0.36983 0,0 -0.11361,4.3526 -0.22721,9.27416 -0.3181,14.73625 l -0.15904,14.73624 c -0.15904,13.0578 -0.31809,22.87248 -0.49985,29.44406 0,0.25603 0.0227,0.51207 0.0682,0.73966 -0.0227,0.6543 0.37866,0.82375 0.67403,1.27892 0.31809,0.54052 0.50744,1.16763 1.07546,1.19608 4.15787,0.11379 7.86133,-1.19483 11.11038,-3.92587 3.49897,-2.93018 5.58927,-6.85605 6.27088,-11.77762 0.13633,-0.99569 0.22721,-2.16208 0.27265,-3.55605 l 0.0227,-1.79225 v -1.79224 c 0.0454,-3.30001 0.0454,-7.14054 0.0227,-11.55003 l -0.0227,-2.75949 -0.0227,-2.78794 c -0.0227,-2.13363 -0.0454,-3.98277 -0.0909,-5.54743 -0.1136,-4.18191 -0.34081,-7.8802 -0.68162,-11.06641 -0.43169,-3.95433 -0.74229,-6.64401 -3.90046,-8.49315 z"
             style="font-style:normal;font-variant:normal;font-weight:normal;font-stretch:normal;font-size:80px;line-height:1.25;font-family:'Papaya Sunrise';-inkscape-font-specification:'Papaya Sunrise';letter-spacing:0px;word-spacing:0px;fill:#cd0000;fill-opacity:1;stroke:none;stroke-width:0.65084654px;stroke-linecap:butt;stroke-linejoin:miter;stroke-opacity:1"
             id="path2829"
             inkscape:connector-curvature="0"
             sodipodi:nodetypes="ccccccccccccccccccccccccccccccccccccccc" />
          <path
             d="m 771.05882,932.29296 c 0,0.48362 0.0909,0.91034 0.29537,1.25172 0.0227,0.59742 0.18177,1.10949 0.47713,1.50777 0.31809,0.42672 0.74979,0.65431 1.29508,0.65431 1.06787,0 2.29478,-0.0569 3.70346,-0.14224 l 3.70346,-0.25603 c 3.09,-0.19914 5.56655,-0.25604 7.40692,-0.1707 0.56802,0.0285 0.99971,-0.17068 1.3178,-0.62586 0.29536,-0.42673 -0.12872,-0.83277 -0.12872,-1.43019 0,-0.59741 0.42408,-1.24396 0.12872,-1.67068 -0.31809,-0.48363 -0.74978,-0.73966 -1.3178,-0.7681 -1.74949,-0.0854 -3.95339,-0.0285 -6.6117,0.14224 l -3.31721,0.19914 c 0,0 -1.37068,-0.0815 -2.2795,-0.053 0,-11.91987 -1.08313,-20.91343 -1.17403,-27.45656 h 9.02008 c 0.5453,0 0.97699,-0.22758 1.3178,-0.7112 0.29536,-0.42673 0.008,-0.9388 0.008,-1.53622 0,-0.62586 0.28776,-1.13793 -0.008,-1.56465 -0.34081,-0.45518 -0.7725,-0.68276 -1.3178,-0.68276 h -9.08824 c -0.15905,-9.13193 0.81787,-16.46396 0.38617,-24.14502 l 12.33737,-1.06023 c 0.56593,-0.0486 0.99971,-0.22759 1.3178,-0.71121 0.29536,-0.42672 -0.0757,-0.88578 -0.0757,-1.4832 0,-0.62586 0.37107,-1.19094 0.0757,-1.61767 -0.31809,-0.45517 -0.74978,-0.68276 -1.3178,-0.68276 h -15.5409 c -0.56802,0 -1.02243,0.25603 -1.36323,0.73966 -0.34081,0.39827 -0.49986,0.93879 -0.47714,1.62155 0.81794,13.51297 1.22691,33.71131 1.22691,60.6519 z"
             style="font-style:normal;font-variant:normal;font-weight:normal;font-stretch:normal;font-size:80px;line-height:1.25;font-family:'Papaya Sunrise';-inkscape-font-specification:'Papaya Sunrise';letter-spacing:0px;word-spacing:0px;fill:#cd0000;fill-opacity:1;stroke:none;stroke-width:0.65084654px;stroke-linecap:butt;stroke-linejoin:miter;stroke-opacity:1"
             id="path2831"
             inkscape:connector-curvature="0"
             sodipodi:nodetypes="sccsccccsccccccscscsccscscssccss" />
          <path
             d="m 810.18372,888.53939 c -0.20448,2.19052 -4.61228,6.9414 -5.52111,8.30692 -0.93154,1.33706 1.63589,-0.65432 0,0 -1.24963,0.48362 -2.55987,-0.89982 -4.3548,-0.78603 -0.18176,-10.09917 -0.48469,-16.65282 -0.48469,-22.9968 2.72647,0.28448 4.83949,0.85345 6.31633,1.7069 2.06758,1.22328 3.36265,3.86898 3.88523,7.96554 0.27265,2.13363 0.31808,4.06812 0.15904,5.80347 z m -0.45441,38.63286 c -2.06757,2.19053 -5.11214,3.49915 -9.17913,3.86898 -0.0227,-6.42933 0.0136,-14.95514 -0.21359,-27.33017 l 0.96337,-0.60611 1.09059,0.25603 c 0.8861,0.19914 1.61316,0.39828 2.22662,0.56897 1.6586,0.48362 3.72615,1.47667 4.8849,2.15943 2.65831,1.53622 3.49901,4.12765 3.79438,8.62249 0.36353,5.3483 -0.81794,9.50175 -3.56714,12.46038 z M 796.52863,902.1377 c 0.24993,13.1147 -0.0606,24.83779 -0.0606,31.38091 0,0.65432 -0.26239,1.16203 0.66155,0.84673 0.6032,0.57332 0.30782,0.0897 0.6032,0.57332 0.34081,0.54051 0.79523,0.79655 1.40868,0.7681 5.47567,-0.25603 9.76986,-1.90604 12.83715,-5.00691 3.5217,-3.49914 5.1803,-8.61985 4.99853,-15.33366 -0.15904,-5.86037 -1.84036,-10.12762 -5.08941,-12.83021 -1.13603,-0.9388 -2.54471,-1.73535 -4.20332,-2.36122 1.2042,-0.73965 2.27207,-1.67845 3.15817,-2.78793 2.49927,-3.12933 3.45353,-8.02244 2.84008,-14.70781 -0.47713,-5.26294 -2.11302,-9.01813 -4.88494,-11.26555 -1.40867,-1.16638 -3.24905,-1.96293 -5.49838,-2.44656 -0.84067,-0.17069 -1.81765,-0.31293 -2.9764,-0.42672 l -1.45412,0.12015 -1.39392,0.008 c -0.86338,-0.0854 -1.44616,-0.0425 -1.69609,0.95319 -0.24993,0.93879 -0.13631,2.30431 0.38627,3.01552 -0.0227,0.17069 0,-0.19914 0,0 0,6.57157 0.1136,16.38626 0.36353,29.50095 z"
             style="font-style:normal;font-variant:normal;font-weight:normal;font-stretch:normal;font-size:80px;line-height:1.25;font-family:'Papaya Sunrise';-inkscape-font-specification:'Papaya Sunrise';letter-spacing:0px;word-spacing:0px;fill:#cd0000;fill-opacity:1;stroke:none;stroke-width:0.65084654px;stroke-linecap:butt;stroke-linejoin:miter;stroke-opacity:1"
             id="path2833"
             inkscape:connector-curvature="0"
             sodipodi:nodetypes="ccccccccccccccccccsccccccccccccccccscc" />
          <path
             sodipodi:nodetypes="ccccccccscccccsccccccccccccccsccccccccccccsccccccccc"
             inkscape:connector-curvature="0"
             id="path2835"
             style="font-style:normal;font-variant:normal;font-weight:normal;font-stretch:normal;font-size:80px;line-height:1.25;font-family:'Papaya Sunrise';-inkscape-font-specification:'Papaya Sunrise';letter-spacing:0px;word-spacing:0px;fill:#cd0000;fill-opacity:1;stroke:none;stroke-width:0.64118052px;stroke-linecap:butt;stroke-linejoin:miter;stroke-opacity:1"
             d="m 839.42184,927.70784 c -0.12946,-0.52331 0.40997,0.3198 0,0 -0.40996,-0.3198 -1.61829,-1.68622 -2.07141,-1.599 -0.4747,0.0872 -0.86309,0.4361 -1.1436,1.04662 l -0.53943,1.10476 -0.53943,1.10476 c -0.40997,0.81404 -2.63242,2.61654 -3.02081,3.16892 -0.43155,0.61053 0.77678,-0.14536 0,0 -0.2805,0.0581 -0.62574,0.0872 -1.03571,0.0872 h -0.51785 l -0.49628,-0.0291 c -1.33778,-0.0291 -2.43823,-0.29073 -3.30131,-0.75589 -1.1436,-0.61053 -1.92038,-1.62807 -2.35192,-3.02356 -0.36682,-1.19198 -0.58259,-2.61654 -0.6689,-4.30276 -0.0431,-0.61052 -0.0647,-1.36641 -0.0647,-2.20952 v -1.10476 l 0.0216,-1.10476 v -7.32632 l -0.0216,-7.29723 c -0.0216,-3.86667 0,-10.69875 0.0431,-17.12381 v 0 l -0.0431,-1.77343 c -0.0216,-1.48271 0,-2.67469 0.0216,-3.57595 0.0863,-2.79097 0.4747,-5.02957 1.1436,-6.74486 0.60416,-1.54085 1.72988,-1.7875 2.95979,-2.36895 1.16516,-0.55239 2.17558,-1.35235 3.42707,-0.82907 1.18674,0.49424 2.2656,1.68622 3.23658,3.60502 0.92782,1.83158 1.4241,3.60501 1.48883,5.3203 0.0216,0.69774 0.23735,1.25012 0.60416,1.68621 0.32366,0.37794 0.53572,-0.38091 1.01042,-0.38091 0.45312,0 1.03942,0.75885 1.36308,0.38091 0.34523,-0.40702 0.49627,-0.9594 0.47469,-1.68621 -0.0647,-2.3549 -0.561,-4.56442 -1.48883,-6.65765 -0.88466,-2.03508 -2.02825,-3.69222 -3.43078,-5.0005 -1.44567,-1.30827 -2.99923,-2.06416 -4.61752,-2.2386 -1.74776,-0.17443 -3.40921,0.34888 -4.98434,1.599 -1.55356,1.22105 -2.69716,3.05263 -3.43078,5.49474 -0.58258,1.88972 -0.9494,4.27368 -1.12202,7.18095 -0.15104,2.76191 -0.23735,6.13434 -0.21577,10.17543 l 0.0431,5.11679 c 0.0216,2.15138 0.0431,3.8376 0.0431,5.08772 l 0.0216,9.18697 v 9.21603 c 0,2.52933 0.0863,4.53534 0.2805,6.04712 0.28051,2.2386 0.84152,4.09925 1.63987,5.58195 1.6183,3.05264 4.57438,4.53534 8.9114,4.50627 1.92037,-0.0291 3.47394,-0.61052 4.61753,-1.77343 0.64732,-0.66867 1.29463,-1.599 1.94195,-2.79098 0.23735,-0.40702 0.49627,-0.93032 0.81993,-1.599 l 0.75521,-1.599 c 0.30208,-0.61052 0.38838,-1.19197 0.23735,-1.8025 z" />
          <path
             inkscape:connector-curvature="0"
             id="path2837"
             style="font-style:normal;font-variant:normal;font-weight:normal;font-stretch:normal;font-size:80px;line-height:1.25;font-family:'Papaya Sunrise';-inkscape-font-specification:'Papaya Sunrise';letter-spacing:0px;word-spacing:0px;fill:#cd0000;fill-opacity:1;stroke:none;stroke-width:0.64118052px;stroke-linecap:butt;stroke-linejoin:miter;stroke-opacity:1"
             d="m 848.54901,912.82263 -0.0216,-4.01203 -0.0431,-4.01203 0.30208,-17.18195 v -1.51178 l -0.0216,-1.56992 c 0.0216,-1.25012 0.0863,-2.26767 0.19419,-3.08171 0.36681,-2.52932 1.20833,-4.70976 2.52454,-6.4832 1.48883,-2.03509 3.10712,-2.73283 4.85488,-2.09324 2.09299,0.7559 3.4092,2.99449 3.94863,6.68672 0.1942,1.30827 0.30208,2.90727 0.32366,4.79699 0.0216,0.61053 0.0216,1.39549 0,2.29675 v 1.07568 c -0.0216,0.40702 -0.0216,0.7559 -0.0216,1.01755 0,2.61654 0,6.36692 0.0216,11.2802 l 0.0216,5.64009 v 5.6401 c 0,0.9594 0.0216,2.35489 0.0647,4.1574 l 0.0431,2.1223 0.0216,2.1223 c 0.0216,3.37243 -0.17262,6.16341 -0.53943,8.34386 -0.3884,2.2386 -1.4241,3.77945 -3.12871,4.62256 -1.48882,0.75589 -3.12869,0.84311 -4.87645,0.23258 -1.57513,-0.55238 -2.61084,-2.20952 -3.10712,-5.0005 -0.17262,-0.98847 -0.30208,-2.20952 -0.36681,-3.66316 -0.0216,-0.46516 -0.0216,-1.04661 -0.0431,-1.77343 l -0.0216,-0.81403 -0.0216,-0.78497 c -0.0647,-2.00601 -0.10789,-4.6807 -0.10789,-8.05313 z m 13.03264,21.42656 c 1.07887,-1.54085 1.79092,-3.54686 2.15773,-5.98897 0.32366,-2.2386 0.4747,-5.05864 0.4747,-8.43107 l -0.0431,-2.15138 -0.0216,-2.15138 c -0.0431,-1.83158 -0.0647,-3.22707 -0.0647,-4.21554 v -5.6401 l -0.0216,-5.64009 c -0.0216,-5.0005 -0.0216,-8.75088 0,-11.2802 v -2.29675 l -0.0216,-2.32581 c -0.0431,-1.74436 -0.15104,-3.28521 -0.30208,-4.59348 -0.40997,-3.40151 -1.33779,-6.10526 -2.78346,-8.16943 -1.31621,-1.83157 -2.91293,-2.93633 -4.79015,-3.25613 -1.87722,-0.34888 -3.62497,0.11629 -5.24327,1.39548 -1.35936,1.0757 -2.56769,2.79098 -3.62497,5.14587 -1.01413,2.26767 -1.61829,4.50626 -1.81249,6.71578 -0.0863,0.84312 -0.12946,1.88973 -0.15104,3.13985 v 1.56993 1.54085 l -0.30208,17.18195 0.0431,3.8376 0.0216,3.86666 c 0,3.31429 0.0216,5.87269 0.0863,7.70426 l 0.0216,0.90125 v 0.90126 c 0.0216,0.72681 0.0431,1.33734 0.0647,1.83158 0.0647,1.45363 0.15104,2.70376 0.2805,3.77944 0.34524,2.8782 1.05729,5.11679 2.11457,6.71579 2.09299,3.16892 5.28642,4.21554 9.58029,3.0817 1.76934,-0.46516 3.21501,-1.51178 4.33702,-3.16892 z" />
          <path
             sodipodi:nodetypes="cccccccscccscsccccccccccscccscscccc"
             inkscape:connector-curvature="0"
             id="path2839"
             style="font-style:normal;font-variant:normal;font-weight:normal;font-stretch:normal;font-size:80px;line-height:1.25;font-family:'Papaya Sunrise';-inkscape-font-specification:'Papaya Sunrise';letter-spacing:0px;word-spacing:0px;fill:#cd0000;fill-opacity:1;stroke:none;stroke-width:0.64118052px;stroke-linecap:butt;stroke-linejoin:miter;stroke-opacity:1"
             d="m 885.48923,894.56499 0.25892,13.05363 c 0.10789,5.14586 -0.12424,4.57369 -0.0595,8.14963 l -12.00216,-44.89749 -0.62575,-2.61654 c -0.15104,-0.58145 -0.40996,-1.01754 -0.79835,-1.30827 -0.34524,-0.26165 -1.76934,0.29072 -2.1793,0.34887 -0.40997,0.0581 0.2805,-0.37794 0,0 -0.30209,0.40702 -0.45312,0.93033 -0.43155,1.56993 0.10789,8.86716 0.15104,19.91478 0.10789,33.14285 l -0.0647,16.54235 c -0.0216,6.65764 -0.0431,12.18145 -0.0431,16.57143 0,0.72681 0.17262,1.27919 0.53943,1.68621 0.32366,0.37794 0.73363,-0.48516 1.18675,-0.48516 0.4747,0 0.86309,0.8631 1.18675,0.48516 0.36681,-0.40702 0.53943,-0.9594 0.53943,-1.68621 l 0.0431,-12.85013 0.0431,-12.82105 c 0.0431,-10.72781 0.16369,-15.67537 0.14209,-22.07136 l 12.1785,46.23076 0.64731,2.58746 c 0.15105,0.61053 0.40997,1.04662 0.77678,1.33734 0.36682,0.26166 1.76934,-0.26165 2.1793,-0.34887 0.40997,-0.0581 -0.2805,0.37795 0,0 0.28051,-0.43608 0.43155,-0.9594 0.43155,-1.59899 0,-7.47168 -0.15104,-18.66466 -0.43155,-33.57894 l -0.17261,-8.402 -0.12946,-8.40201 c -0.10789,-6.22155 -0.15105,-11.83257 -0.15105,-16.804 0,-0.69775 -0.17261,-1.25013 -0.53943,-1.68622 -0.32366,-0.37795 -0.73362,0.38091 -1.18675,0.38091 -0.47469,0 -0.88466,-0.75886 -1.20832,-0.38091 -0.36681,0.43609 -0.53943,0.98847 -0.53943,1.68622 0.0216,6.89022 0.10789,15.61202 0.30208,26.1654 z" />
          <path
             sodipodi:nodetypes="csccccccccccsccccccccccscscsccccccc"
             inkscape:connector-curvature="0"
             id="path2841"
             style="font-style:normal;font-variant:normal;font-weight:normal;font-stretch:normal;font-size:80px;line-height:1.25;font-family:'Papaya Sunrise';-inkscape-font-specification:'Papaya Sunrise';letter-spacing:0px;word-spacing:0px;fill:#cd0000;fill-opacity:1;stroke:none;stroke-width:0.64118052px;stroke-linecap:butt;stroke-linejoin:miter;stroke-opacity:1"
             d="m 910.32462,900.00158 c 0.3251,-0.46516 0.49487,-1.01754 -0.16217,-1.65714 -0.36729,-0.35755 0.44267,-1.13383 0.16217,-1.56992 -0.30208,-0.4361 -0.71205,-0.63961 -1.25148,-0.61053 l -2.41665,0.23258 -2.43823,0.23258 c -1.96352,0.20351 -3.58181,0.34888 -4.85487,0.37795 -0.0647,-10.20451 -0.0863,-18.31579 -0.0863,-24.33383 0.97097,-0.0581 2.09299,-0.14537 3.36605,-0.29073 l 3.38762,-0.34887 c 2.78347,-0.29072 5.04908,-0.43609 6.75368,-0.46516 0.51785,0 0.92781,-0.23259 1.25147,-0.72682 0.28051,-0.43609 -0.0848,-0.98847 -0.0848,-1.62807 0,-0.61052 0.3653,-1.16291 0.0848,-1.599 -0.32366,-0.49423 -0.73362,-0.72681 -1.25147,-0.69774 -1.79091,0 -4.44491,0.20351 -7.962,0.58145 l -2.00669,0.20351 -1.9851,0.17443 c -1.46725,0.14537 -2.80504,0.20351 -3.99179,0.20351 -0.86309,0.0291 -1.40252,0.58146 -1.59672,1.68622 -0.21576,1.07569 0.57212,1.78547 1.15473,2.39599 l -0.55057,15.74536 0.0863,15.61203 c 0.0647,13.80952 0.10789,24.18846 0.10789,31.19497 0,0.72682 0.17261,1.2792 0.53942,1.71529 0.32366,0.37795 0.83258,-0.64755 1.28571,-0.64755 0.47469,0 0.76413,1.0255 1.08779,0.64755 0.36681,-0.43609 0.53943,-0.98847 0.53943,-1.71529 0,-4.79698 0,-10.3208 -0.0216,-16.51327 l -0.0863,-16.51328 c 1.27305,-0.0581 2.89135,-0.17444 4.85488,-0.37795 l 2.41665,-0.26165 2.41665,-0.23258 c 0.53943,-0.0291 0.94939,-0.3198 1.25147,-0.81404 z" />
          <path
             sodipodi:nodetypes="ccccccccccccccsccccccc"
             inkscape:connector-curvature="0"
             id="path2843"
             style="font-style:normal;font-variant:normal;font-weight:normal;font-stretch:normal;font-size:209.04190063px;line-height:1.25;font-family:'Papaya Sunrise';-inkscape-font-specification:'Papaya Sunrise';letter-spacing:0px;word-spacing:0px;fill:#cd0000;fill-opacity:1;stroke:none;stroke-width:0.37844059px;stroke-linecap:butt;stroke-linejoin:miter;stroke-opacity:1"
             d="m 936.05912,867.61262 c -0.0914,-0.94666 -0.84468,-1.24837 -1.89599,-1.80331 -1.18845,-0.55494 -2.47562,-1.04188 -3.75548,-0.48694 -3.06254,1.27309 -5.85082,2.15446 -8.41055,2.7094 -1.05132,0.2285 -1.35127,0.99359 -1.76266,1.64646 -0.41138,0.62023 -0.24505,1.12688 -0.0165,1.81239 0.27425,0.68551 0.0879,0.98066 0.86497,1.33973 0.82277,0.39173 1.78267,0.45701 2.83399,0.22851 1.64554,-0.35908 3.33679,-0.78344 5.02805,-1.33838 0.22854,7.93235 0.31996,18.96583 0.18283,33.03515 l -0.0914,8.25878 -0.0457,8.25879 c -0.0457,6.23489 0,11.71899 0.0914,16.51757 0,0.81609 0.36568,1.43632 1.14274,1.92597 0.68564,0.42436 1.66014,0.24164 2.66575,0.24164 0.9599,0 1.72236,0.18272 2.40801,-0.24164 0.77706,-0.48965 1.14273,-1.10988 1.09702,-1.92597 -0.0914,-4.99444 -0.13713,-10.73968 -0.0914,-17.30101 l 0.0914,-8.65051 0.0914,-8.65051 c 0.13713,-14.52632 0,-26.0821 -0.31997,-34.60203 0,-0.35908 0.12063,-0.6803 -0.10792,-0.97409 z" />
          <path
             sodipodi:nodetypes="csccccccscccccsccccccccccccccsccccccccccccsccccccccc"
             inkscape:connector-curvature="0"
             id="path2845"
             style="font-style:normal;font-variant:normal;font-weight:normal;font-stretch:normal;font-size:40px;line-height:1.25;font-family:'Papaya Sunrise';-inkscape-font-specification:'Papaya Sunrise';text-align:center;letter-spacing:0px;word-spacing:0px;text-anchor:middle;fill:#cd0000;fill-opacity:1;stroke:none;stroke-width:0.42383268px;stroke-linecap:butt;stroke-linejoin:miter;stroke-opacity:1"
             d="m 753.83848,963.49966 c -0.0523,-0.14147 -0.26827,-0.0826 -0.43393,-0.16907 -0.16566,-0.0864 -0.22,-0.28676 -0.4031,-0.26318 -0.19182,0.0236 -0.34876,0.11788 -0.46211,0.28293 l -0.21798,0.29865 -0.21797,0.29865 c -0.16567,0.22005 -0.33133,0.40867 -0.48827,0.558 -0.17439,0.16504 -0.41852,0.25936 -0.73241,0.29865 -0.11334,0.0157 -0.25285,0.0236 -0.41851,0.0236 h -0.20926 l -0.20054,-0.008 c -0.54058,-0.008 -0.98525,-0.0786 -1.33402,-0.20434 -0.4621,-0.16504 -0.77599,-0.44011 -0.95037,-0.81735 -0.14823,-0.32223 -0.23542,-0.70733 -0.27029,-1.16316 -0.0175,-0.16505 -0.0262,-0.36939 -0.0262,-0.59731 v -0.29865 l 0.009,-0.29864 v -1.98053 l -0.009,-1.97266 c -0.009,-1.04527 0,-2.43635 0.0174,-4.17324 v -0.45583 l -0.0174,-0.47941 c -0.009,-0.40082 0,-0.72305 0.009,-0.96669 0.0349,-0.75448 0.19182,-1.35964 0.46211,-1.82333 0.24414,-0.41654 0.61906,-0.69947 1.11604,-0.85665 0.47084,-0.14933 0.9591,-0.14933 1.46481,-0.008 0.47955,0.13361 0.9155,0.45584 1.30786,0.97454 0.37492,0.49513 0.57546,0.97454 0.60161,1.43824 0.009,0.18862 0.0959,0.33794 0.24414,0.45583 0.13079,0.10217 0.37994,-0.0533 0.57176,-0.0533 0.1831,0 0.25655,0.15549 0.38734,0.0533 0.1395,-0.11003 0.20054,-0.25935 0.19181,-0.45583 -0.0262,-0.6366 -0.22669,-1.2339 -0.60161,-1.79976 -0.35748,-0.55015 -0.81959,-0.99812 -1.38633,-1.35178 -0.58418,-0.35367 -1.21195,-0.55801 -1.86588,-0.60516 -0.70625,-0.0472 -1.37762,0.0943 -2.01411,0.43225 -0.62777,0.33009 -1.08988,0.82522 -1.38633,1.4854 -0.23541,0.51084 -0.38364,1.1553 -0.45339,1.94122 -0.061,0.74662 -0.0959,1.65829 -0.0872,2.75072 l 0.0174,1.38322 c 0.009,0.58158 0.0175,1.03742 0.0175,1.37536 l 0.009,2.48351 v 2.49137 c 0,0.68375 0.0349,1.22604 0.11335,1.63472 0.11335,0.60516 0.34005,1.10815 0.66265,1.50897 0.65393,0.82521 1.84845,1.22603 3.60098,1.21818 0.776,-0.008 1.40377,-0.16505 1.86588,-0.47942 0.26157,-0.18076 0.52314,-0.43226 0.78472,-0.75448 0.0959,-0.11003 0.20053,-0.2515 0.33132,-0.43226 l 0.30517,-0.43226 c 0.12207,-0.16504 0.15694,-0.32222 0.0959,-0.48727 z" />
          <path
             sodipodi:nodetypes="ccccscccccsccccccccccccccccccccccccccccccc"
             inkscape:connector-curvature="0"
             id="path2847"
             style="font-style:normal;font-variant:normal;font-weight:normal;font-stretch:normal;font-size:40px;line-height:1.25;font-family:'Papaya Sunrise';-inkscape-font-specification:'Papaya Sunrise';text-align:center;letter-spacing:0px;word-spacing:0px;text-anchor:middle;fill:#cd0000;fill-opacity:1;stroke:none;stroke-width:0.42383268px;stroke-linecap:butt;stroke-linejoin:miter;stroke-opacity:1"
             d="m 762.95862,950.82276 -0.0262,-0.99026 c -0.0262,-0.77806 -0.0785,-1.43038 -0.1395,-1.97266 -0.0262,-0.18862 -0.11335,-0.33795 -0.27029,-0.45584 -0.14823,-0.10217 -0.29997,0.0196 -0.48307,0.0196 -0.19182,0 -0.36268,-0.12172 -0.47603,-0.0196 -0.13079,0.11003 -0.19182,0.25936 -0.16566,0.45584 0.0872,0.7309 0.14822,1.61899 0.17438,2.67213 l 0.0349,1.33606 c 0.009,0.57373 0.0262,1.0217 0.0349,1.33607 0.11335,3.63881 0.16566,6.41311 0.16566,8.3229 0,0.33009 -0.009,0.60516 -0.0262,0.82522 -0.0262,0.31436 -0.0697,0.58944 -0.14822,0.83307 -0.1831,0.61302 -0.53186,1.03742 -1.05501,1.28105 -0.51442,0.2515 -1.0986,0.29866 -1.75253,0.14933 -0.27029,-0.055 -0.49699,-0.2122 -0.68881,-0.45583 -0.13078,-0.18077 -0.25285,-0.4244 -0.35748,-0.72305 -0.20054,-0.5973 -0.28773,-1.35964 -0.27901,-2.27917 l 0.0175,-0.58944 0.0262,-0.58158 c 0.0262,-0.49513 0.0349,-0.88023 0.0349,-1.13959 l -0.009,-2.10627 -0.0175,-1.54826 c -0.0174,-1.32035 -0.0262,-2.35776 -0.0262,-3.10439 0.009,-1.50111 0.061,-2.91576 0.16567,-4.22825 0.009,-0.19648 -0.0523,-0.34581 -0.19182,-0.45584 -0.12207,-0.10217 -0.2651,0.0792 -0.4482,0.0792 -0.19182,0.008 -0.3714,-0.18141 -0.5109,-0.0792 -0.14823,0.11003 -0.23542,0.25936 -0.25285,0.45584 -0.12207,1.61113 -0.17439,3.68596 -0.14823,6.20877 l 0.0175,1.55612 0.0175,2.10627 c 0.009,1.21032 0.009,2.24773 -0.009,3.10439 -0.0262,1.67401 0.17438,2.90791 0.61033,3.7174 0.30517,0.55801 0.776,0.95097 1.42121,1.17889 0.58418,0.19648 1.22939,0.24363 1.95307,0.14146 1.35146,-0.18862 2.24952,-0.88809 2.68548,-2.09841 0.16566,-0.46369 0.27901,-1.02955 0.33132,-1.69758 0.0174,-0.25936 0.0262,-0.55801 0.0349,-0.88024 v -0.85665 c -0.0262,-2.5621 -0.10463,-5.40714 -0.21797,-8.5351 z" />
          <path
             sodipodi:nodetypes="ccccccccccccccccccccccccccccccccccccscscccccc"
             inkscape:connector-curvature="0"
             id="path2849"
             style="font-style:normal;font-variant:normal;font-weight:normal;font-stretch:normal;font-size:40px;line-height:1.25;font-family:'Papaya Sunrise';-inkscape-font-specification:'Papaya Sunrise';text-align:center;letter-spacing:0px;word-spacing:0px;text-anchor:middle;fill:#cd0000;fill-opacity:1;stroke:none;stroke-width:0.42383268px;stroke-linecap:butt;stroke-linejoin:miter;stroke-opacity:1"
             d="m 769.72462,955.27107 c -0.52314,0.53443 -1.41248,1.0217 -2.65931,1.45395 0.0175,-3.34016 0.0262,-5.98872 0.0349,-7.9378 1.08988,0.18076 1.94436,0.44012 2.54597,0.78592 0.44467,0.2515 0.75856,0.6366 0.93294,1.14745 0.13078,0.3851 0.19182,0.87237 0.1831,1.45395 -0.0262,1.38322 -0.37492,2.41278 -1.03757,3.09653 z m -0.81087,4.03963 0.27029,0.85666 0.27901,0.85665 c 0.10463,0.29865 0.23542,0.64445 0.39236,1.04528 l 0.20926,0.5187 0.20926,0.51871 c 0.34876,0.8488 0.59289,1.54827 0.72368,2.10627 0.0436,0.18862 0.15694,0.32223 0.3226,0.39296 0.14823,0.0707 0.27215,-0.0227 0.45525,-0.0699 0.1831,-0.0471 0.36435,-0.0323 0.46897,-0.15803 0.11335,-0.14932 0.14823,-0.31437 0.10464,-0.50299 -0.13951,-0.56586 -0.37492,-1.26533 -0.71497,-2.10626 l -0.20926,-0.51871 -0.20925,-0.51871 c -0.16567,-0.40082 -0.29645,-0.74663 -0.40108,-1.03741 -0.0872,-0.25936 -0.19182,-0.56587 -0.30517,-0.92739 l -0.29645,-0.91953 c -0.23541,-0.74662 -0.45339,-1.35964 -0.66265,-1.82334 0.49699,-0.29078 0.90679,-0.60515 1.24683,-0.95096 0.82831,-0.85665 1.2817,-2.15342 1.36017,-3.89817 0.0785,-1.55612 -0.40979,-2.71142 -1.45608,-3.46591 -0.53186,-0.37724 -1.21195,-0.67589 -2.04026,-0.88809 -0.32261,-0.0865 -0.69753,-0.16504 -1.12476,-0.23578 -0.25286,-0.0393 -0.62777,-0.0943 -1.12476,-0.16504 -0.34876,-0.0471 -0.38769,0.20583 -0.55335,0.49662 -0.16567,0.2908 -0.37087,0.39147 -0.16161,0.57224 l -0.009,4.21253 -0.0262,4.20468 c -0.0262,3.7174 -0.0349,6.51528 -0.0349,8.40935 0,0.19648 0.0697,0.34581 0.21797,0.4637 0.13079,0.10216 0.29645,0.0311 0.47955,0.0311 0.19182,0 0.34876,0.071 0.47955,-0.0311 0.14822,-0.11789 0.21798,-0.26722 0.21798,-0.4637 0.009,-1.69759 0.0174,-4.11822 0.0349,-7.25405 0.48827,-0.16504 0.90679,-0.31437 1.25555,-0.44797 0.1831,0.44797 0.38364,1.01383 0.60162,1.69759 z" />
          <path
             sodipodi:nodetypes="csccccccscccccc"
             inkscape:connector-curvature="0"
             id="path2851"
             style="font-style:normal;font-variant:normal;font-weight:normal;font-stretch:normal;font-size:40px;line-height:1.25;font-family:'Papaya Sunrise';-inkscape-font-specification:'Papaya Sunrise';text-align:center;letter-spacing:0px;word-spacing:0px;text-anchor:middle;fill:#cd0000;fill-opacity:1;stroke:none;stroke-width:0.42383268px;stroke-linecap:butt;stroke-linejoin:miter;stroke-opacity:1"
             d="m 775.81054,947.04248 c -0.13079,-0.10217 -0.26806,-0.0538 -0.45987,-0.0538 -0.18311,0 -0.36844,-0.0484 -0.49923,0.0538 -0.14822,0.11789 -0.21798,0.26721 -0.2267,0.45583 -0.0262,2.57782 -0.009,5.50931 0.0349,8.79446 l 0.0785,4.3933 0.0959,4.39329 c 0,0.19648 0.0785,0.34581 0.2267,0.4637 0.13078,0.10217 0.29644,0.0299 0.47955,0.0299 0.19181,0 0.34876,0.0723 0.47955,-0.0299 0.14822,-0.11789 0.21797,-0.26722 0.20925,-0.4637 l -0.0872,-4.39329 -0.0785,-4.3933 c -0.0436,-3.28515 -0.061,-6.21664 -0.0349,-8.79446 0,-0.18862 -0.0697,-0.33794 -0.21797,-0.45583 z" />
          <path
             sodipodi:nodetypes="csccccccccsccccscccccccc"
             inkscape:connector-curvature="0"
             id="path2853"
             style="font-style:normal;font-variant:normal;font-weight:normal;font-stretch:normal;font-size:40px;line-height:1.25;font-family:'Papaya Sunrise';-inkscape-font-specification:'Papaya Sunrise';text-align:center;letter-spacing:0px;word-spacing:0px;text-anchor:middle;fill:#cd0000;fill-opacity:1;stroke:none;stroke-width:0.42383268px;stroke-linecap:butt;stroke-linejoin:miter;stroke-opacity:1"
             d="m 782.13186,965.77883 c 0.13079,0.10217 0.31613,0.006 0.49923,0.006 0.19182,0 0.32908,0.0961 0.45987,-0.006 0.14822,-0.11789 0.21798,-0.26721 0.20926,-0.46369 l -0.061,-3.89031 -0.0697,-4.99846 c -0.0436,-3.02579 -0.0523,-5.61933 -0.009,-7.78847 v -0.0236 c 0.9155,-0.0236 1.66534,-0.0472 2.24951,-0.0707 0.20926,-0.008 0.37493,-0.0786 0.50571,-0.2122 0.11335,-0.12574 0.008,-0.25119 0.008,-0.41623 0,-0.1729 0.10512,-0.33825 -0.008,-0.45614 -0.13078,-0.12575 -0.29645,-0.18076 -0.50571,-0.1729 -1.88331,0.0707 -3.98461,0.11789 -6.30388,0.14932 -0.21798,0 -0.38364,0.0629 -0.51443,0.19648 -0.11334,0.11789 -0.008,0.2911 -0.008,0.464 0,0.16505 -0.10512,0.29049 0.008,0.40838 0.13079,0.12574 0.29645,0.18862 0.51443,0.18862 0.88062,-0.008 1.76997,-0.0236 2.65931,-0.0472 -0.0436,2.177 -0.0436,4.77054 0,7.78848 l 0.0698,4.99059 0.0697,3.89031 c 0,0.19648 0.0785,0.34581 0.22669,0.4637 z" />
          <path
             sodipodi:nodetypes="csccccccscccccc"
             inkscape:connector-curvature="0"
             id="path2855"
             style="font-style:normal;font-variant:normal;font-weight:normal;font-stretch:normal;font-size:40px;line-height:1.25;font-family:'Papaya Sunrise';-inkscape-font-specification:'Papaya Sunrise';text-align:center;letter-spacing:0px;word-spacing:0px;text-anchor:middle;fill:#cd0000;fill-opacity:1;stroke:none;stroke-width:0.42383268px;stroke-linecap:butt;stroke-linejoin:miter;stroke-opacity:1"
             d="m 789.48204,947.04248 c -0.13079,-0.10217 -0.26806,0.0417 -0.45987,0.0417 -0.1831,0 -0.36844,-0.1439 -0.49923,-0.0417 -0.14822,0.11789 -0.21798,0.26721 -0.22669,0.45583 -0.0262,2.57782 -0.009,5.50931 0.0349,8.79446 l 0.0785,4.3933 0.0959,4.39329 c 0,0.19648 0.0785,0.34581 0.2267,0.4637 0.13079,0.10217 0.33581,-0.0179 0.51891,-0.0179 0.19182,0 0.3094,0.12003 0.44019,0.0179 0.14822,-0.11789 0.21797,-0.26722 0.20926,-0.4637 l -0.0872,-4.39329 -0.0785,-4.3933 c -0.0436,-3.28515 -0.061,-6.21664 -0.0349,-8.79446 0,-0.18862 -0.0698,-0.33794 -0.21798,-0.45583 z" />
          <path
             sodipodi:nodetypes="cccccccccccccccccccccccsccccccccscccccccc"
             inkscape:connector-curvature="0"
             id="path2857"
             style="font-style:normal;font-variant:normal;font-weight:normal;font-stretch:normal;font-size:40px;line-height:1.25;font-family:'Papaya Sunrise';-inkscape-font-specification:'Papaya Sunrise';text-align:center;letter-spacing:0px;word-spacing:0px;text-anchor:middle;fill:#cd0000;fill-opacity:1;stroke:none;stroke-width:0.42383268px;stroke-linecap:butt;stroke-linejoin:miter;stroke-opacity:1"
             d="m 796.08237,964.19127 c -0.64521,0.36938 -1.33401,0.54229 -2.0577,0.53443 -0.009,-2.01982 2.5e-4,-4.69798 -0.1131,-8.32893 1.08989,0.11003 1.8482,0.16321 2.43238,0.44614 0.84575,0.40868 1.32529,1.24176 1.44736,2.49137 0.0349,0.36938 0.061,0.65232 0.0698,0.85666 0.0262,0.32222 0.0262,0.61301 0.0174,0.87237 -0.0262,0.65231 -0.14822,1.21032 -0.37492,1.68187 -0.28773,0.58944 -0.75856,1.07671 -1.42121,1.44609 z m 0.75856,-10.96359 c -0.49698,0.9038 -1.41872,1.20696 -2.95328,1.44274 -0.0959,-2.76644 -0.24662,-4.74361 -0.26405,-6.45692 0.75856,0 1.37761,0.0707 1.86588,0.2122 0.76728,0.22006 1.29914,0.84093 1.60431,1.86263 0.3226,1.08457 0.24413,2.06697 -0.25286,2.93935 z m 0.55802,2.72714 c -0.28773,-0.20434 -0.63649,-0.37724 -1.04629,-0.51085 0.56674,-0.29865 1.03757,-0.68375 1.39506,-1.14744 0.77599,-0.99812 1.055,-2.27131 0.81959,-3.80386 -0.0959,-0.6366 -0.30517,-1.21032 -0.62777,-1.72117 -0.35748,-0.558 -0.8196,-0.9824 -1.38634,-1.2889 -0.47955,-0.25936 -1.07244,-0.41654 -1.79613,-0.48728 -0.28772,-0.0314 -0.60161,-0.0471 -0.95909,-0.0471 h -0.47083 l -0.47083,0.008 c -0.27901,0.008 -0.36147,0.14963 -0.48354,0.36183 -0.10463,0.20434 -0.22271,0.3848 -0.11808,0.58914 -0.0262,0.0629 -0.0349,0.13361 -0.0349,0.20434 0.0175,1.26533 0.0523,2.71143 0.0959,4.33828 l 0.061,2.16914 0.0697,2.16915 c 0.12207,3.70168 0.1831,6.60173 0.1831,8.68442 0,0.27507 0.21822,0.31254 0.48852,0.41471 0.25285,0.0865 0.40955,0.21403 0.62752,0.0883 0.89807,0.0865 1.78741,-0.0865 2.66804,-0.50299 0.82831,-0.40082 1.5084,-0.95882 2.03154,-1.65829 0.42723,-0.57373 0.68881,-1.30463 0.78472,-2.177 0.061,-0.57372 0.0523,-1.34393 -0.0436,-2.30275 -0.13951,-1.52469 -0.73241,-2.64855 -1.78742,-3.37946 z" />
          <path
             sodipodi:nodetypes="cccccccccccccccccccccccccccccccccccc"
             inkscape:connector-curvature="0"
             id="path2859"
             style="font-style:normal;font-variant:normal;font-weight:normal;font-stretch:normal;font-size:40px;line-height:1.25;font-family:'Papaya Sunrise';-inkscape-font-specification:'Papaya Sunrise';text-align:center;letter-spacing:0px;word-spacing:0px;text-anchor:middle;fill:#cd0000;fill-opacity:1;stroke:none;stroke-width:0.42383268px;stroke-linecap:butt;stroke-linejoin:miter;stroke-opacity:1"
             d="m 805.72566,950.70487 c 0.14823,0.69161 0.33133,1.55612 0.53187,2.6014 l 0.26157,1.29677 0.26157,1.29677 0.82831,4.1025 c -0.40979,-0.008 -1.02013,-0.008 -1.82228,0.0157 l -0.9155,0.0236 c -0.34005,0.008 -0.6365,0 -0.90679,-0.008 0.44468,-2.35776 1.02885,-5.47001 1.76125,-9.32888 z m 3.40044,9.62753 -0.9591,-4.77054 -0.41851,-2.11412 -0.42724,-2.11413 c -0.34004,-1.62686 -0.66264,-3.0258 -0.98525,-4.20468 -0.0785,-0.29865 -0.31388,-0.12148 -0.70624,-0.12934 -0.39236,-0.008 -0.61906,-0.18503 -0.68009,0.12934 l -0.85447,4.51119 -0.85447,4.50332 c -0.65393,3.45805 -1.21195,6.46813 -1.67406,9.02237 -0.0349,0.19648 0.009,0.36153 0.1395,0.51085 0.11335,0.13361 0.34029,0.0846 0.52339,0.13178 0.19182,0.0471 0.27877,0.17472 0.42699,0.10398 0.16567,-0.0786 0.27029,-0.2122 0.30517,-0.40082 l 0.76728,-4.19682 c 0.30516,0.0157 0.64521,0.0236 1.02885,0.0157 l 1.03757,-0.0236 c 0.9155,-0.0236 1.6043,-0.0236 2.06642,0 l 0.86318,4.30684 c 0.0436,0.18862 0.14823,0.32223 0.31389,0.40082 0.14823,0.0707 0.24389,-0.0886 0.42699,-0.13575 0.19182,-0.0393 0.41876,0.0336 0.52339,-0.10004 0.12207,-0.14932 0.16566,-0.31437 0.13078,-0.51085 l -0.85446,-4.25183 c 0.0872,-0.24363 0.0436,-0.47155 -0.13951,-0.68375 z" />
          <path
             sodipodi:nodetypes="ccccc"
             inkscape:connector-curvature="0"
             id="path2861"
             style="font-style:normal;font-variant:normal;font-weight:normal;font-stretch:normal;font-size:40px;line-height:1.25;font-family:'Papaya Sunrise';-inkscape-font-specification:'Papaya Sunrise';text-align:center;letter-spacing:0px;word-spacing:0px;text-anchor:middle;fill:#cd0000;fill-opacity:1;stroke:none;stroke-width:0.42383268px;stroke-linecap:butt;stroke-linejoin:miter;stroke-opacity:1"
             d="m 818.77909,960.82997 4.22728,-0.0239 0.15743,1.12173 -4.42406,-0.0955 z" />
          <path
             sodipodi:nodetypes="ccccccccccccccccccsccccccccccccccccscc"
             inkscape:connector-curvature="0"
             id="path2863"
             style="font-style:normal;font-variant:normal;font-weight:normal;font-stretch:normal;font-size:40px;line-height:1.25;font-family:'Papaya Sunrise';-inkscape-font-specification:'Papaya Sunrise';text-align:center;letter-spacing:0px;word-spacing:0px;text-anchor:middle;fill:#cd0000;fill-opacity:1;stroke:none;stroke-width:0.42383268px;stroke-linecap:butt;stroke-linejoin:miter;stroke-opacity:1"
             d="m 840.54958,953.37779 c -0.0785,0.60516 -0.29645,1.09243 -0.64521,1.46968 -0.35748,0.36938 -0.84575,0.64445 -1.47352,0.82521 -0.47955,0.13361 -0.86694,-0.18594 -1.55574,-0.1545 -0.0697,-2.79003 -0.30143,-4.66319 -0.30143,-6.4158 1.04629,0.0786 1.85717,0.23578 2.42391,0.47156 0.79343,0.33794 1.29042,1.06885 1.49096,2.20057 0.10463,0.58944 0.12206,1.12387 0.061,1.60328 z m -0.17438,10.67281 c -0.79344,0.60516 -1.74532,0.65621 -3.30603,0.75838 -0.009,-1.77618 -0.26879,-4.05925 -0.35598,-7.47801 l 0.42723,0.0707 0.41852,0.0707 c 0.34004,0.055 0.61905,0.11003 0.85447,0.15718 0.63649,0.13361 1.18579,0.2908 1.63046,0.47942 1.02013,0.42439 1.58688,1.25747 1.70022,2.49922 0.13951,1.47754 -0.31388,2.62498 -1.36889,3.44234 z m -5.06578,-6.91611 c 0.0959,3.6231 0.1395,6.33453 0.1395,8.14215 0,0.18075 0.061,0.32222 0.19182,0.44011 -0.0262,0.18076 0.0175,0.34581 0.13079,0.47941 0.13078,0.14933 0.30517,0.22006 0.54058,0.2122 2.1013,-0.0707 3.7492,-0.52657 4.92628,-1.38322 1.35145,-0.96668 1.98794,-2.38134 1.91819,-4.23611 -0.061,-1.619 -0.70624,-2.79788 -1.95307,-3.54451 -0.43595,-0.25935 -0.97654,-0.47941 -1.61303,-0.65231 0.46211,-0.20434 0.87191,-0.46369 1.21195,-0.7702 0.9591,-0.86452 1.3253,-2.2163 1.08988,-4.06321 -0.18309,-1.45396 -0.81087,-2.49137 -1.8746,-3.11225 -0.54057,-0.32223 -1.24682,-0.54229 -2.11001,-0.67589 -0.3226,-0.0472 -0.69753,-0.0865 -1.1422,-0.11789 l -0.55802,-0.0393 -0.5493,-0.0393 c -0.33132,-0.0236 -0.38315,0.22158 -0.47906,0.49665 -0.0959,0.25936 -0.1923,0.36786 0.008,0.56434 -0.009,0.0472 -0.0175,0.0943 -0.0175,0.14933 0,1.81547 0.0436,4.5269 0.13951,8.15 z" />
          <path
             sodipodi:nodetypes="ccccccccccccccccccccccccccccccccscccscscccccc"
             inkscape:connector-curvature="0"
             id="path2865"
             style="font-style:normal;font-variant:normal;font-weight:normal;font-stretch:normal;font-size:40px;line-height:1.25;font-family:'Papaya Sunrise';-inkscape-font-specification:'Papaya Sunrise';text-align:center;letter-spacing:0px;word-spacing:0px;text-anchor:middle;fill:#cd0000;fill-opacity:1;stroke:none;stroke-width:0.42383268px;stroke-linecap:butt;stroke-linejoin:miter;stroke-opacity:1"
             d="m 849.7918,955.75127 c -0.52315,0.53443 -1.17635,0.49629 -2.42317,0.92855 0.0175,-3.34017 -0.20999,-5.46331 -0.20129,-7.41239 1.08989,0.18076 1.94435,0.44011 2.54597,0.78592 0.44467,0.25149 0.75856,0.6366 0.93294,1.14744 0.13079,0.3851 0.19182,0.87238 0.1831,1.45396 -0.0262,1.38322 -0.37492,2.41277 -1.03757,3.09652 z m -0.81088,4.03964 0.27029,0.85665 0.27901,0.85666 c 0.10463,0.29864 0.23542,0.64445 0.39236,1.04527 l 0.20926,0.51871 0.20925,0.51871 c 0.34877,0.84879 0.5929,1.54826 0.72369,2.10626 0.0436,0.18862 0.15694,0.32223 0.3226,0.39296 0.14823,0.0707 0.29421,-0.0886 0.47731,-0.13575 0.1831,-0.0472 0.34229,0.0336 0.44692,-0.0922 0.11334,-0.14932 0.14822,-0.31436 0.10462,-0.50298 -0.1395,-0.56587 -0.37492,-1.26534 -0.71496,-2.10627 l -0.20926,-0.51871 -0.20925,-0.51871 c -0.16567,-0.40082 -0.29645,-0.74662 -0.40108,-1.03742 -0.0872,-0.25935 -0.19182,-0.56586 -0.30517,-0.92738 l -0.29645,-0.91953 c -0.23541,-0.74662 -0.45339,-1.35964 -0.66265,-1.82333 0.49699,-0.2908 0.90679,-0.60517 1.24683,-0.95097 0.82831,-0.85665 1.2817,-2.15342 1.36017,-3.89817 0.0785,-1.55612 -0.40979,-2.71142 -1.45608,-3.46591 -0.53186,-0.37724 -1.21195,-0.67589 -2.04026,-0.88809 -0.32261,-0.0865 -0.69753,-0.16504 -1.12476,-0.23577 -0.25285,-0.0393 -0.62778,-0.0943 -1.12476,-0.16505 -0.34877,-0.0471 -0.88861,0.0355 -0.776,0.36153 0.15404,0.44598 -0.14822,0.52656 0.061,0.70732 l -0.009,4.21254 -0.0262,4.20468 c -0.0262,3.7174 -0.0349,6.51528 -0.0349,8.40935 0,0.19648 0.0698,0.3458 0.21798,0.46369 0.13079,0.10217 0.29645,-0.0179 0.47955,-0.0179 0.19182,0 0.34876,0.12002 0.47955,0.0179 0.14822,-0.11789 0.21798,-0.26721 0.21798,-0.46369 0.009,-1.69759 0.0175,-4.11823 0.0349,-7.25405 0.48827,-0.16504 0.90678,-0.31437 1.25555,-0.44798 0.1831,0.44798 0.38364,1.01384 0.60161,1.69759 z" />
          <path
             sodipodi:nodetypes="cccccccccccccccccccccccccccccccccccc"
             inkscape:connector-curvature="0"
             id="path2867"
             style="font-style:normal;font-variant:normal;font-weight:normal;font-stretch:normal;font-size:40px;line-height:1.25;font-family:'Papaya Sunrise';-inkscape-font-specification:'Papaya Sunrise';text-align:center;letter-spacing:0px;word-spacing:0px;text-anchor:middle;fill:#cd0000;fill-opacity:1;stroke:none;stroke-width:0.42383268px;stroke-linecap:butt;stroke-linejoin:miter;stroke-opacity:1"
             d="m 858.86835,951.18507 c 0.14822,0.69161 0.33132,1.55613 0.53186,2.6014 l 0.26157,1.29677 0.26157,1.29677 0.69056,4.03086 c -1.01306,-0.3739 -0.88238,0.0638 -1.68453,0.0874 l -0.91551,0.0236 c -0.34003,0.008 -0.47905,-0.19106 -0.74935,-0.19891 0.44468,-2.35776 0.87142,-5.27895 1.60383,-9.13782 z m 3.40043,9.62754 -0.95909,-4.77054 -0.41852,-2.11413 -0.42723,-2.11413 c -0.34005,-1.62685 -0.66265,-3.0258 -0.98526,-4.20467 -0.0785,-0.29866 -0.29421,-0.2409 -0.68657,-0.24876 -0.39235,-0.008 -0.63873,-0.0656 -0.69976,0.24876 l -0.85447,4.51118 -0.85447,4.50333 c -0.65393,3.45805 -1.21195,6.46813 -1.67406,9.02237 -0.0349,0.19648 0.009,0.36152 0.1395,0.51085 0.11335,0.1336 0.26158,0.0846 0.44468,0.13177 0.19182,0.0472 0.35748,0.17473 0.5057,0.10399 0.16567,-0.0786 0.2703,-0.2122 0.30517,-0.40082 l 0.76728,-4.19682 c 0.30516,0.0157 0.64521,0.0236 1.02885,0.0157 l 1.03757,-0.0236 c 0.9155,-0.0236 1.60431,-0.0236 2.06642,0 l 0.86319,4.30685 c 0.0436,0.18862 0.12854,0.20282 0.2942,0.28141 0.14823,0.0707 0.32261,0.0786 0.50571,0.0314 0.19182,-0.0393 0.35972,-0.0142 0.46435,-0.14781 0.12207,-0.14932 0.16566,-0.31437 0.13079,-0.51085 l -0.85447,-4.25183 c 0.0872,-0.24363 0.0436,-0.47155 -0.13951,-0.68375 z" />
          <path
             sodipodi:nodetypes="cccccsccccccccsscscscccccc"
             inkscape:connector-curvature="0"
             id="path2869"
             style="font-style:normal;font-variant:normal;font-weight:normal;font-stretch:normal;font-size:40px;line-height:1.25;font-family:'Papaya Sunrise';-inkscape-font-specification:'Papaya Sunrise';text-align:center;letter-spacing:0px;word-spacing:0px;text-anchor:middle;fill:#cd0000;fill-opacity:1;stroke:none;stroke-width:0.42383268px;stroke-linecap:butt;stroke-linejoin:miter;stroke-opacity:1"
             d="m 871.02273,948.26145 c -0.52315,-0.008 -1.29914,-0.0314 -2.32799,-0.0786 l -1.16836,-0.055 c -0.42723,-0.0157 -0.81959,-0.0236 -1.16835,-0.0314 -0.20926,0 -0.37492,0.0629 -0.50571,0.19647 -0.11335,0.11789 -0.087,0.23548 -0.087,0.40838 0,0.1729 -0.0264,0.33825 0.087,0.45614 0.13079,0.1336 0.29645,0.19648 0.50571,0.20434 0.5057,0 1.19451,0.0236 2.0577,0.0629 l 1.02013,0.055 0.7927,0.15083 -4.62037,15.68546 -0.0175,0.055 c -0.061,0.19647 -0.0175,0.3851 0.12207,0.55014 0.1395,0.16504 0.3226,0.2515 0.55802,0.2515 h 4.65598 c 0.21798,0 0.38364,-0.0629 0.51443,-0.19648 0.11335,-0.11789 -0.0114,-0.26722 -0.0114,-0.43226 0,-0.1729 0.1248,-0.31437 0.0114,-0.43226 -0.13079,-0.1336 -0.29645,-0.20434 -0.51443,-0.20434 l -3.42561,-0.21494 4.55037,-15.62136 0.0175,-0.055 c 0.0785,-0.26721 0.009,-0.47941 -0.2267,-0.64445 -0.21797,-0.14933 -0.46211,-0.18076 -0.71496,-0.10217 z" />
          <path
             sodipodi:nodetypes="csccccccscccccc"
             inkscape:connector-curvature="0"
             id="path2871"
             style="font-style:normal;font-variant:normal;font-weight:normal;font-stretch:normal;font-size:40px;line-height:1.25;font-family:'Papaya Sunrise';-inkscape-font-specification:'Papaya Sunrise';text-align:center;letter-spacing:0px;word-spacing:0px;text-anchor:middle;fill:#cd0000;fill-opacity:1;stroke:none;stroke-width:0.42383268px;stroke-linecap:butt;stroke-linejoin:miter;stroke-opacity:1"
             d="m 875.5828,947.52268 c -0.13078,-0.10217 -0.28773,0.11338 -0.47955,0.11338 -0.1831,0 -0.34876,-0.21555 -0.47954,-0.11338 -0.14823,0.11789 -0.21798,0.26721 -0.2267,0.45583 -0.0262,2.57782 -0.009,5.50931 0.0349,8.79446 l 0.0785,4.3933 0.0959,4.3933 c 0,0.19648 0.0785,0.3458 0.2267,0.46369 0.13078,0.10217 0.33581,-0.0417 0.51891,-0.0417 0.19182,0 0.3094,0.1439 0.44019,0.0417 0.14822,-0.11789 0.21797,-0.26721 0.20925,-0.46369 l -0.0872,-4.3933 -0.0785,-4.3933 c -0.0436,-3.28515 -0.061,-6.21664 -0.0349,-8.79446 0,-0.18862 -0.0697,-0.33794 -0.21798,-0.45583 z" />
          <path
             sodipodi:nodetypes="ccscccccccccscscccccsccc"
             inkscape:connector-curvature="0"
             id="path2873"
             style="font-style:normal;font-variant:normal;font-weight:normal;font-stretch:normal;font-size:40px;line-height:1.25;font-family:'Papaya Sunrise';-inkscape-font-specification:'Papaya Sunrise';text-align:center;letter-spacing:0px;word-spacing:0px;text-anchor:middle;fill:#cd0000;fill-opacity:1;stroke:none;stroke-width:0.42383268px;stroke-linecap:butt;stroke-linejoin:miter;stroke-opacity:1"
             d="m 884.03158,966.72273 c 0.20926,0.008 0.37492,-0.055 0.50571,-0.18076 0.11334,-0.11789 0.008,-0.23547 0.008,-0.40838 0,-0.16504 0.10512,-0.33825 -0.008,-0.45614 -0.13079,-0.1336 -0.29645,-0.21219 -0.50571,-0.22006 l -4.15627,-0.34854 c 0.0436,-0.51085 -0.0986,-0.90107 -0.0812,-1.61626 l 0.009,-0.91166 0.009,-0.91167 0.0785,-4.3933 c 0.0523,-3.38732 0.0785,-6.41312 0.0872,-9.08524 0,-0.19648 -0.0698,-0.34581 -0.21798,-0.4637 -0.13079,-0.10217 -0.31613,0.0895 -0.50795,0.0895 -0.18309,0 -0.32908,-0.19167 -0.45987,-0.0895 -0.14822,0.11789 -0.21797,0.26722 -0.21797,0.4637 0,2.53852 -0.0262,5.48572 -0.0785,8.8416 l -0.0785,4.3933 -0.009,1.12387 -0.0175,1.13172 c -0.0262,0.87238 -0.0785,1.619 -0.15694,2.24774 -0.0221,0.13901 0.0184,0.27541 0.13282,0.37888 0.0677,0.0612 0.043,0.0414 0.0677,0.0612 0.14822,0.11788 0.31389,0.18076 0.49698,0.18862 z" />
          <path
             sodipodi:nodetypes="cccccccccccccccccccccccccccccccccccc"
             inkscape:connector-curvature="0"
             id="path5015-1-3-4"
             d="m 933.33402,951.08971 c -0.88432,0 -1.98694,0.09 -3.26493,0.293 -2.14929,0.3169 -4.78182,0.8737 -7.74888,1.3276 v 0 0 c -3.58248,0.5596 -7.33613,1.7718 -11.19674,3.7341 -5.32602,2.8424 -10.42392,6.4474 -14.30301,10.9389 -1.50474,1.7453 -2.46589,3.3021 -3.01223,4.4638 -0.27323,0.581 -0.44323,1.0597 -0.52554,1.4392 -0.0412,0.1897 -0.0637,0.3518 -0.0512,0.5224 0.006,0.085 0.0193,0.1751 0.0687,0.2806 0.0493,0.1055 0.15518,0.2371 0.31057,0.2992 0.17568,0.07 0.34568,0.028 0.4408,-0.016 0.0951,-0.043 0.15195,-0.09 0.20568,-0.1374 0.10748,-0.094 0.1973,-0.1996 0.30488,-0.3318 0.21516,-0.2643 0.48546,-0.6325 0.84183,-1.096 0.71241,-0.9269 1.7591,-2.227 3.25871,-3.6965 v 0 0 c 1.83071,-1.777 4.03196,-3.6128 6.90811,-5.595 v 0 c 2.10667,-1.4441 4.46702,-2.9162 7.00474,-4.2116 3.61474,-1.8452 7.0045,-3.0344 10.25882,-3.6923 v 0 0 c 2.69753,-0.5482 6.04158,-1.4833 7.70186,-1.9291 h 0.003 0.005 c 1.59406,-0.4046 2.82554,-0.6135 3.67678,-0.7545 0.42635,-0.071 0.75518,-0.1229 1.00873,-0.1808 0.12679,-0.029 0.23331,-0.056 0.34726,-0.107 0.11396,-0.051 0.30965,-0.1311 0.37465,-0.4201 0.0625,-0.2781 -0.11125,-0.5753 -0.28368,-0.7059 -0.17246,-0.1306 -0.35737,-0.1965 -0.57621,-0.2537 -0.43765,-0.1145 -1.01907,-0.1681 -1.75752,-0.1664 z"
             style="color:#000000;font-style:normal;font-variant:normal;font-weight:normal;font-stretch:normal;font-size:medium;line-height:normal;font-family:sans-serif;font-variant-ligatures:normal;font-variant-position:normal;font-variant-caps:normal;font-variant-numeric:normal;font-variant-alternates:normal;font-feature-settings:normal;text-indent:0;text-align:start;text-decoration:none;text-decoration-line:none;text-decoration-style:solid;text-decoration-color:#000000;letter-spacing:normal;word-spacing:normal;text-transform:none;writing-mode:lr-tb;direction:ltr;text-orientation:mixed;dominant-baseline:auto;baseline-shift:baseline;text-anchor:start;white-space:normal;shape-padding:0;clip-rule:nonzero;display:inline;overflow:visible;visibility:visible;opacity:1;isolation:auto;mix-blend-mode:normal;color-interpolation:sRGB;color-interpolation-filters:linearRGB;solid-color:#000000;solid-opacity:1;vector-effect:none;fill:#cd0000;fill-opacity:1;fill-rule:evenodd;stroke:none;stroke-width:0.96020287;stroke-linecap:butt;stroke-linejoin:miter;stroke-miterlimit:4;stroke-dasharray:none;stroke-dashoffset:0;stroke-opacity:1;color-rendering:auto;image-rendering:auto;shape-rendering:auto;text-rendering:auto;enable-background:accumulate" />
        </g>
      </g>
    </g>
    <text
       xml:space="preserve"
       style="font-style:normal;font-variant:normal;font-weight:normal;font-stretch:normal;font-size:25.88010979px;line-height:1.25;font-family:'Caveat Brush';-inkscape-font-specification:'Caveat Brush';font-variant-ligatures:normal;font-variant-position:normal;font-variant-caps:normal;font-variant-numeric:normal;font-variant-alternates:normal;font-feature-settings:normal;text-indent:0;text-align:start;text-decoration:none;text-decoration-line:none;text-decoration-style:solid;text-decoration-color:#000000;letter-spacing:0px;word-spacing:0px;text-transform:none;writing-mode:lr-tb;direction:ltr;text-orientation:mixed;dominant-baseline:auto;baseline-shift:baseline;text-anchor:start;white-space:normal;shape-padding:0;opacity:1;vector-effect:none;fill:#ffffff;fill-opacity:1;stroke:none;stroke-width:0.6470027;stroke-linecap:butt;stroke-linejoin:miter;stroke-miterlimit:4;stroke-dasharray:none;stroke-dashoffset:0;stroke-opacity:1"
       x="23.3262"
       y="4.8170857"
       id="text120"><tspan
         sodipodi:role="line"
         id="tspan118"
         x="23.3262"
         y="4.8170857"
         style="font-style:normal;font-variant:normal;font-weight:normal;font-stretch:normal;font-size:25.88010979px;line-height:1.25;font-family:'Caveat Brush';-inkscape-font-specification:'Caveat Brush';font-variant-ligatures:normal;font-variant-position:normal;font-variant-caps:normal;font-variant-numeric:normal;font-variant-alternates:normal;font-feature-settings:normal;text-indent:0;text-align:start;text-decoration:none;text-decoration-line:none;text-decoration-style:solid;text-decoration-color:#000000;letter-spacing:0px;word-spacing:0px;text-transform:none;writing-mode:lr-tb;direction:ltr;text-orientation:mixed;dominant-baseline:auto;baseline-shift:baseline;text-anchor:start;white-space:normal;shape-padding:0;vector-effect:none;fill:#ffffff;fill-opacity:1;stroke:none;stroke-width:0.6470027;stroke-linecap:butt;stroke-linejoin:miter;stroke-miterlimit:4;stroke-dasharray:none;stroke-dashoffset:0;stroke-opacity:1">NO DRINKING IN CAMPUS!</tspan></text>
    <g
       id="g998">
      <g
         transform="matrix(0.2458523,0,0,0.2458523,152.80615,-36.423446)"
         id="g981">
        <path
           style="stroke-width:0.35277775"
           inkscape:connector-curvature="0"
           d="m -326.12522,-214.05679 c -2.9738,-6.77719 -4.5048,-14.09733 -4.49653,-21.49739 v -13.5916 c 1.55856,0 2.82222,-1.26366 2.82222,-2.82222 v -11.28889 c 0,-1.55856 -1.26366,-2.82222 -2.82222,-2.82222 h -22.57778 c -1.55856,0 -2.82222,1.26366 -2.82222,2.82222 v 11.28889 c 0,1.55856 1.26366,2.82222 2.82222,2.82222 v 13.5916 c 0.008,7.40006 -1.52273,14.7202 -4.49516,21.49739 l -7.92234,18.11293 c -4.85345,11.05187 -7.35321,22.99257 -7.33806,35.06281 v 61.313052 c 0,1.558559 1.26367,2.82222 2.82223,2.82222 h 56.44444 c 1.55856,0 2.82222,-1.263661 2.82222,-2.82222 v -61.313052 c 0.0152,-12.07024 -2.48322,-24.01094 -7.33805,-35.06281 z m -24.25209,-46.37788 h 16.93334 v 5.64445 h -16.93334 z m 33.86667,158.04445 h -50.8 v -58.49083 c -0.0138,-11.29302 2.32337,-22.46478 6.86401,-32.80558 l 7.92234,-18.11293 c 3.28524,-7.48688 4.97747,-15.57734 4.9692,-23.75462 v -13.5916 h 11.28889 v 13.5916 c -0.008,8.17728 1.68397,16.26774 4.97059,23.75462 l 7.92096,18.11293 c 4.54063,10.3408 6.87779,21.51256 6.86401,32.80558 z m 0,0"
           id="path2" />
        <path
           style="stroke-width:0.35277775"
           inkscape:connector-curvature="0"
           d="m -336.06638,-194.52447 2.34818,5.36194 c 1.21267,2.77951 2.2462,5.63204 3.09645,8.54246 0.35278,1.20303 1.4552,2.02985 2.70922,2.02985 0.26872,0 0.53606,-0.0386 0.79375,-0.113 1.49655,-0.43683 2.35369,-2.00642 1.91547,-3.50159 -0.92191,-3.14055 -2.04363,-6.21909 -3.35552,-9.2177 l -2.34817,-5.36195 c -0.38172,-0.95636 -1.25402,-1.62746 -2.27515,-1.75286 -1.0225,-0.1254 -2.02985,0.31557 -2.63343,1.14928 -0.6022,0.83509 -0.70142,1.93063 -0.26182,2.86081 z m 0,0"
           id="path4" />
        <path
           style="stroke-width:0.35277775"
           inkscape:connector-curvature="0"
           d="m -339.70578,-202.8616 c 0.44786,1.02939 1.46485,1.6936 2.58796,1.6936 0.3886,0.001 0.77307,-0.0799 1.12861,-0.23702 1.42627,-0.62563 2.0767,-2.28754 1.45245,-3.71381 l -1.93201,-4.42488 c -0.65319,-1.37804 -2.28341,-1.98851 -3.68074,-1.37804 -1.39733,0.60909 -2.05741,2.22002 -1.48966,3.63527 z m 0,0"
           id="path6-3" />
        <path
           style="stroke-width:0.35277775"
           inkscape:connector-curvature="0"
           d="m -358.84397,-167.30133 c -1.55857,0 -2.82223,1.26366 -2.82223,2.82222 v 47.97778 c 0,1.55856 1.26366,2.82222 2.82223,2.82222 h 33.86666 c 1.55856,0 2.82222,-1.26366 2.82222,-2.82222 v -47.97778 c 0,-1.55856 -1.26366,-2.82222 -2.82222,-2.82222 z m 31.04444,47.97778 h -28.22222 v -42.33334 h 28.22222 z m 0,0"
           id="path8" />
      </g>
      <path
         id="path10"
         d="m 154.22306,-64.493375 c -1.37347,-1.02553 -3.00916,-1.64145 -4.71804,-1.77629 v -9.77692 c 3.92696,-0.36183 6.93341,-3.65355 6.9385,-7.59711 0,-0.0329 -0.002,-0.0661 -0.007,-0.0986 l -0.36521,-2.55755 v -0.005 l -1.02249,-7.1516 c -0.0491,-0.34151 -0.34184,-0.59527 -0.68707,-0.59527 h -11.10147 c -0.34524,0 -0.63795,0.25376 -0.68674,0.59527 l -1.3877,9.71389 c -0.005,0.0325 -0.007,0.0657 -0.007,0.0986 0.005,3.94356 3.01153,7.23528 6.93849,7.59711 v 9.77759 c -1.70888,0.13484 -3.34457,0.75044 -4.71804,1.7763 l -0.55527,0.41638 c -0.23818,0.17922 -0.33542,0.49091 -0.24089,0.7738 0.0945,0.2829 0.35912,0.47397 0.65726,0.47431 h 11.10159 c 0.29882,0 0.56376,-0.19108 0.65828,-0.47431 0.0945,-0.28357 -0.003,-0.59525 -0.2419,-0.77448 z m -10.36099,-28.17037 h 9.8982 l 0.83276,5.82827 -1.33552,0.14941 c -1.51747,0.16974 -3.05356,0.042 -4.52188,-0.37708 l -0.0827,-0.024 c -1.70481,-0.48413 -3.48992,-0.61863 -5.24826,-0.39571 l -0.28797,0.0356 z m -1.29554,9.06782 0.34692,-2.42848 0.662,-0.081 c 1.56964,-0.20158 3.164,-0.0837 4.68687,0.34693 l 0.0813,0.024 c 1.64552,0.47159 3.36727,0.61592 5.06835,0.42484 l 1.37753,-0.15415 0.2663,1.86777 c 0,3.44892 -2.79573,6.24464 -6.24465,6.24464 -3.44892,0 -6.24464,-2.79572 -6.24464,-6.24464 z m 3.06947,19.38003 c 2.01988,-0.9056 4.33046,-0.9056 6.35035,0 z m 0,0"
         inkscape:connector-curvature="0"
         style="stroke-width:0.08673122" />
      <g
         id="g8-6"
         transform="matrix(1.6387947,0,0,1.6387947,213.50932,-96.835583)">
        <g
           id="g6-7">
          <path
             id="path2-5"
             d="m 16.197,8.55 h -0.911 c -0.188,0 -0.37,0.019 -0.548,0.052 V 6.545 C 14.738,6.433 14.725,6.324 14.705,6.218 15.304,5.775 15.696,5.07 15.696,4.27 15.696,2.78 14.324,1.585 12.813,1.884 12.313,1.358 11.6,1.061 10.867,1.098 10.399,0.42 9.62,0 8.789,0 8.114,0 7.476,0.268 7.006,0.734 6.881,0.683 6.753,0.642 6.623,0.612 L 6.459,0.58 C 6.333,0.56 6.207,0.549 6.078,0.547 5.889,0.532 5.707,0.533 5.528,0.548 H 5.479 V 0.552 C 4.405,0.66 3.5,1.296 3.145,2.183 2.09,2.383 1.29,3.312 1.29,4.422 1.29,5.197 1.68,5.88 2.272,6.292 2.26,6.375 2.247,6.458 2.247,6.545 v 12.309 c 0,0.905 0.736,1.642 1.641,1.642 h 9.208 c 0.905,0 1.642,-0.736 1.642,-1.642 V 16.34 c 0.178,0.033 0.36,0.053 0.548,0.053 h 0.911 c 1.659,0 3.009,-1.351 3.009,-3.01 v -1.822 c 0,-1.66 -1.35,-3.011 -3.009,-3.011 z m -2.554,10.304 c 0,0.302 -0.244,0.547 -0.547,0.547 H 3.888 c -0.302,0 -0.547,-0.245 -0.547,-0.547 V 6.545 c 0,-0.302 0.245,-0.547 0.547,-0.547 h 9.208 c 0.303,0 0.547,0.245 0.547,0.547 z M 14.13,5.28 v 0 C 13.848,5.048 13.49,4.903 13.096,4.903 H 3.888 C 3.471,4.903 3.095,5.064 2.805,5.32 2.549,5.103 2.384,4.783 2.384,4.422 2.384,3.771 2.913,3.24 3.565,3.238 L 4.013,3.236 4.1,2.797 C 4.202,2.283 4.735,1.74 5.552,1.645 H 6.155 C 6.4,1.662 6.636,1.742 6.844,1.879 L 7.296,2.178 7.599,1.729 C 7.867,1.332 8.312,1.094 8.79,1.094 c 0.556,0 1.05,0.315 1.292,0.823 l 0.184,0.387 0.42,-0.086 c 0.571,-0.115 1.154,0.124 1.478,0.597 l 0.239,0.352 0.4,-0.147 c 0.161,-0.059 0.312,-0.088 0.461,-0.088 0.737,0 1.338,0.6 1.338,1.338 0,0.405 -0.186,0.765 -0.472,1.01 z m 3.435,8.103 c 0,0.754 -0.613,1.368 -1.368,1.368 h -0.911 c -0.195,0 -0.38,-0.042 -0.548,-0.116 v -4.326 c 0.168,-0.074 0.353,-0.116 0.548,-0.116 h 0.911 c 0.754,0 1.368,0.613 1.368,1.368 z"
             inkscape:connector-curvature="0" />
          <rect
             id="rect4-3"
             height="10.851"
             width="9.21"
             y="8.0030003"
             x="3.888" />
        </g>
      </g>
      <path
         sodipodi:nodetypes="sssssscccssccssc"
         style="fill:#cd0000;fill-opacity:1;stroke-width:0.11173604"
         id="path2-1"
         d="m 148.49999,-108.49672 c -15.75019,0 -28.60442,12.855121 -28.60442,28.604425 0,15.750203 12.85524,28.604432 28.60442,28.604432 15.75021,0 28.60444,-12.855235 28.60444,-28.604432 0,-15.750199 -12.85524,-28.604425 -28.60444,-28.604425 z m -25.25233,28.604425 c 0,-6.360238 2.36455,-12.177889 6.25945,-16.622637 l 11.59451,11.594516 c 8.68132,8.90043 12.52343,12.523442 24.02101,24.021124 -4.44475,3.894901 -10.26239,6.259346 -16.62264,6.259346 -13.9242,0 -25.25233,-11.328137 -25.25233,-25.252349 z m 44.24523,16.622753 c -23.23373,-24.026836 -23.19791,-23.977273 -35.61552,-35.615644 4.44475,-3.894894 10.26239,-6.259454 16.62262,-6.259454 13.92421,0 25.25236,11.328136 25.25236,25.252345 0,6.360239 -2.36456,12.178 -6.25946,16.622753 z"
         inkscape:connector-curvature="0" />
      <path
         sodipodi:nodetypes="sssssscccssccssc"
         style="fill:#cd0000;fill-opacity:1;stroke-width:0.11173604"
         id="path2-1-8"
         d="m 228.00539,-108.49672 c -15.75018,0 -28.6044,12.855124 -28.6044,28.604428 0,15.750203 12.85523,28.604432 28.6044,28.604432 15.75022,0 28.60445,-12.855235 28.60445,-28.604432 0,-15.750198 -12.85524,-28.604428 -28.60445,-28.604428 z m -25.25232,28.604428 c 0,-6.360238 2.36456,-12.177889 6.25945,-16.622636 l 11.59451,11.594514 c 8.68132,8.900431 12.52342,12.523443 24.021,24.021125 -4.44474,3.894901 -10.26238,6.259346 -16.62264,6.259346 -13.92419,0 -25.25232,-11.328137 -25.25232,-25.252349 z m 44.24522,16.622752 c -23.23372,-24.026835 -23.1979,-23.977272 -35.61551,-35.615641 4.44475,-3.894899 10.26239,-6.259449 16.62261,-6.259449 13.92422,0 25.25236,11.328129 25.25236,25.252338 0,6.360239 -2.36456,12.178 -6.25946,16.622752 z"
         inkscape:connector-curvature="0" />
      <path
         sodipodi:nodetypes="sssssscccssccssc"
         style="fill:#cd0000;fill-opacity:1;stroke-width:0.11173604"
         id="path2-1-9"
         d="m 68.994577,-108.49671 c -15.750199,0 -28.604418,12.855114 -28.604418,28.60442 0,15.750203 12.855229,28.604432 28.604418,28.604432 15.750212,0 28.604433,-12.855235 28.604433,-28.604432 0,-15.750199 -12.855231,-28.60442 -28.604433,-28.60442 z m -25.252335,28.60442 c 0,-6.360238 2.364557,-12.177889 6.259451,-16.622637 L 61.5962,-84.920412 c 8.681328,8.900431 12.523432,12.523443 24.021017,24.021125 -4.444749,3.894901 -10.262389,6.259346 -16.62264,6.259346 -13.92421,0 -25.252335,-11.328137 -25.252335,-25.252349 z m 44.245232,16.622752 C 64.753736,-87.296373 64.789562,-87.24681 52.37195,-98.885181 c 4.444749,-3.894899 10.262389,-6.259449 16.622627,-6.259449 13.92421,0 25.252353,11.328129 25.252353,25.25234 0,6.360239 -2.364558,12.178 -6.259456,16.622752 z"
         inkscape:connector-curvature="0" />
    </g>
    <text
       xml:space="preserve"
       style="font-style:normal;font-variant:normal;font-weight:normal;font-stretch:normal;font-size:22.8772831px;line-height:1.25;font-family:'Caveat Brush';-inkscape-font-specification:'Caveat Brush';font-variant-ligatures:normal;font-variant-position:normal;font-variant-caps:normal;font-variant-numeric:normal;font-variant-alternates:normal;font-feature-settings:normal;text-indent:0;text-align:start;text-decoration:none;text-decoration-line:none;text-decoration-style:solid;text-decoration-color:#000000;letter-spacing:0px;word-spacing:0px;text-transform:none;writing-mode:lr-tb;direction:ltr;text-orientation:mixed;dominant-baseline:auto;baseline-shift:baseline;text-anchor:start;white-space:normal;shape-padding:0;opacity:1;vector-effect:none;fill:#ffffff;fill-opacity:1;stroke:none;stroke-width:0.57193202;stroke-linecap:butt;stroke-linejoin:miter;stroke-miterlimit:4;stroke-dasharray:none;stroke-dashoffset:0;stroke-opacity:1"
       x="24.831125"
       y="63.46653"
       id="text120-2-2"
       inkscape:transform-center-y="-13.476485"
       inkscape:transform-center-x="1.261039e-05"><tspan
         sodipodi:role="line"
         id="tspan118-0-3"
         x="24.831125"
         y="63.46653"
         style="font-style:normal;font-variant:normal;font-weight:normal;font-stretch:normal;font-size:22.8772831px;line-height:1.25;font-family:'Caveat Brush';-inkscape-font-specification:'Caveat Brush';font-variant-ligatures:normal;font-variant-position:normal;font-variant-caps:normal;font-variant-numeric:normal;font-variant-alternates:normal;font-feature-settings:normal;text-indent:0;text-align:start;text-decoration:none;text-decoration-line:none;text-decoration-style:solid;text-decoration-color:#000000;letter-spacing:0px;word-spacing:0px;text-transform:none;writing-mode:lr-tb;direction:ltr;text-orientation:mixed;dominant-baseline:auto;baseline-shift:baseline;text-anchor:start;white-space:normal;shape-padding:0;vector-effect:none;fill:#ffffff;fill-opacity:1;stroke:none;stroke-width:0.57193202;stroke-linecap:butt;stroke-linejoin:miter;stroke-miterlimit:4;stroke-dasharray:none;stroke-dashoffset:0;stroke-opacity:1">PROIBIDO BEBER NO CAMPUS!</tspan></text>
    <flowRoot
       xml:space="preserve"
       id="flowRoot24"
       style="font-style:normal;font-weight:normal;font-size:40px;line-height:0.5;font-family:sans-serif;letter-spacing:0px;word-spacing:0px;fill:#cd0000;fill-opacity:1;stroke:none"
       transform="matrix(0.37883159,0,0,0.37883159,-50.732061,131.23689)"><flowRegion
         id="flowRegion26"
         style="line-height:0.5;fill:#cd0000;fill-opacity:1"><rect
           id="rect28"
           width="558.10455"
           height="205.8987"
           x="246.47722"
           y="167.92552"
           style="line-height:0.5;fill:#cd0000;fill-opacity:1" /></flowRegion><flowPara
         style="font-style:normal;font-variant:normal;font-weight:normal;font-stretch:normal;font-size:24px;line-height:0.5;font-family:'Patrick Hand';-inkscape-font-specification:'Patrick Hand';text-align:center;text-anchor:middle;fill:#cd0000;fill-opacity:1"
         id="flowPara1354">Resolução no. 30/15 - COGEP -</flowPara><flowPara
         style="font-style:normal;font-variant:normal;font-weight:normal;font-stretch:normal;font-size:24px;line-height:0.5;font-family:'Patrick Hand';-inkscape-font-specification:'Patrick Hand';text-align:center;text-anchor:middle;fill:#cd0000;fill-opacity:1"
         id="flowPara910">Universidade Tecnológica Federal do Paraná - UTFPR</flowPara><flowPara
         style="font-style:normal;font-variant:normal;font-weight:normal;font-stretch:normal;font-size:18.66666603px;line-height:0.5;font-family:'Patrick Hand';-inkscape-font-specification:'Patrick Hand';text-align:center;text-anchor:middle;fill:#cd0000;fill-opacity:1"
         id="flowPara898">CAPÍTULO IV - PROIBIÇÕES E RESPONSABILIDADES</flowPara><flowPara
         style="font-style:normal;font-variant:normal;font-weight:normal;font-stretch:normal;font-size:18.66666603px;line-height:0.5;font-family:'Patrick Hand';-inkscape-font-specification:'Patrick Hand';text-align:center;text-anchor:middle;fill:#cd0000;fill-opacity:1"
         id="flowPara900">II - Portar, comercializar ou fazer uso de bebidas alcoólicas, substâncias tóxicas ou</flowPara><flowPara
         style="font-style:normal;font-variant:normal;font-weight:normal;font-stretch:normal;font-size:18.66666603px;line-height:0.5;font-family:'Patrick Hand';-inkscape-font-specification:'Patrick Hand';text-align:center;text-anchor:middle;fill:#cd0000;fill-opacity:1"
         id="flowPara902">entorpecentes que alteram a personalidade e / ou seu estado de consciência.</flowPara><flowPara
         style="font-style:normal;font-variant:normal;font-weight:normal;font-stretch:normal;font-size:18.66666603px;line-height:0.5;font-family:'Patrick Hand';-inkscape-font-specification:'Patrick Hand';text-align:center;text-anchor:middle;fill:#cd0000;fill-opacity:1"
         id="flowPara904">III - Permanecer, nos ambientes da UTFPR, sob efeito de bebidas alcoólicas ou</flowPara><flowPara
         style="font-style:normal;font-variant:normal;font-weight:normal;font-stretch:normal;font-size:18.66666603px;line-height:0.5;font-family:'Patrick Hand';-inkscape-font-specification:'Patrick Hand';text-align:center;text-anchor:middle;fill:#cd0000;fill-opacity:1"
         id="flowPara906">substâncias tóxicas.</flowPara></flowRoot>    <flowRoot
       xml:space="preserve"
       id="flowRoot24-9"
       style="font-style:normal;font-weight:normal;font-size:40px;line-height:0.5;font-family:sans-serif;letter-spacing:0px;word-spacing:0px;fill:#cd0000;fill-opacity:1;stroke:none"
       transform="matrix(0.37883159,0,0,0.37883159,-50.732065,63.604612)"><flowRegion
         id="flowRegion26-7"
         style="line-height:0.5;fill:#cd0000;fill-opacity:1"><rect
           id="rect28-3"
           width="558.10455"
           height="205.8987"
           x="246.47722"
           y="167.92552"
           style="line-height:0.5;fill:#cd0000;fill-opacity:1" /></flowRegion><flowPara
         style="font-style:normal;font-variant:normal;font-weight:normal;font-stretch:normal;font-size:24px;line-height:0.5;font-family:'Patrick Hand';-inkscape-font-specification:'Patrick Hand';text-align:center;text-anchor:middle;fill:#cd0000;fill-opacity:1"
         id="flowPara1354-1">Resolution no. 30/15 - COGEP - </flowPara><flowPara
         style="font-style:normal;font-variant:normal;font-weight:normal;font-stretch:normal;font-size:24px;line-height:0.5;font-family:'Patrick Hand';-inkscape-font-specification:'Patrick Hand';text-align:center;text-anchor:middle;fill:#cd0000;fill-opacity:1"
         id="flowPara924">Federal Technological University of Paraná - UTFPR</flowPara><flowPara
         style="font-style:normal;font-variant:normal;font-weight:normal;font-stretch:normal;font-size:18.66666603px;line-height:0.5;font-family:'Patrick Hand';-inkscape-font-specification:'Patrick Hand';text-align:center;text-anchor:middle;fill:#cd0000;fill-opacity:1"
         id="flowPara912">CHAPTER IV - PROHIBITIONS AND RESPONSIBILITIES</flowPara><flowPara
         style="font-style:normal;font-variant:normal;font-weight:normal;font-stretch:normal;font-size:18.66666603px;line-height:0.5;font-family:'Patrick Hand';-inkscape-font-specification:'Patrick Hand';text-align:center;text-anchor:middle;fill:#cd0000;fill-opacity:1"
         id="flowPara914">II - Porting, marketing or making use of alcoholic beverages, toxic substances or</flowPara><flowPara
         style="font-style:normal;font-variant:normal;font-weight:normal;font-stretch:normal;font-size:18.66666603px;line-height:0.5;font-family:'Patrick Hand';-inkscape-font-specification:'Patrick Hand';text-align:center;text-anchor:middle;fill:#cd0000;fill-opacity:1"
         id="flowPara916">narcotics that alter the personality and / or their state of consciousness.</flowPara><flowPara
         style="font-style:normal;font-variant:normal;font-weight:normal;font-stretch:normal;font-size:18.66666603px;line-height:0.5;font-family:'Patrick Hand';-inkscape-font-specification:'Patrick Hand';text-align:center;text-anchor:middle;fill:#cd0000;fill-opacity:1"
         id="flowPara918">III - To remain, in UTFPR environments, under the influence of alcoholic drinks or</flowPara><flowPara
         style="font-style:normal;font-variant:normal;font-weight:normal;font-stretch:normal;font-size:18.66666603px;line-height:0.5;font-family:'Patrick Hand';-inkscape-font-specification:'Patrick Hand';text-align:center;text-anchor:middle;fill:#cd0000;fill-opacity:1"
         id="flowPara920">toxic substances.</flowPara></flowRoot>    <text
       xml:space="preserve"
       style="font-style:normal;font-variant:normal;font-weight:normal;font-stretch:normal;font-size:7.95818043px;line-height:1.25;font-family:'Caveat Brush';-inkscape-font-specification:'Caveat Brush';font-variant-ligatures:normal;font-variant-position:normal;font-variant-caps:normal;font-variant-numeric:normal;font-variant-alternates:normal;font-feature-settings:normal;text-indent:0;text-align:start;text-decoration:none;text-decoration-line:none;text-decoration-style:solid;text-decoration-color:#000000;letter-spacing:0px;word-spacing:0px;text-transform:none;writing-mode:lr-tb;direction:ltr;text-orientation:mixed;dominant-baseline:auto;baseline-shift:baseline;text-anchor:start;white-space:normal;shape-padding:0;opacity:1;vector-effect:none;fill:#ffffff;fill-opacity:1;stroke:none;stroke-width:0.19895452;stroke-linecap:butt;stroke-linejoin:miter;stroke-miterlimit:4;stroke-dasharray:none;stroke-dashoffset:0;stroke-opacity:1"
       x="148.42421"
       y="15.309391"
       id="text120-5"><tspan
         sodipodi:role="line"
         x="148.42421"
         y="15.309391"
         style="font-style:normal;font-variant:normal;font-weight:normal;font-stretch:normal;font-size:11.99444485px;line-height:1.25;font-family:'Caveat Brush';-inkscape-font-specification:'Caveat Brush';font-variant-ligatures:normal;font-variant-position:normal;font-variant-caps:normal;font-variant-numeric:normal;font-variant-alternates:normal;font-feature-settings:normal;text-indent:0;text-align:center;text-decoration:none;text-decoration-line:none;text-decoration-style:solid;text-decoration-color:#000000;letter-spacing:0px;word-spacing:0px;text-transform:none;writing-mode:lr-tb;direction:ltr;text-orientation:mixed;dominant-baseline:auto;baseline-shift:baseline;text-anchor:middle;white-space:normal;shape-padding:0;vector-effect:none;fill:#ffffff;fill-opacity:1;stroke:none;stroke-width:0.19895452;stroke-linecap:butt;stroke-linejoin:miter;stroke-miterlimit:4;stroke-dasharray:none;stroke-dashoffset:0;stroke-opacity:1"
         id="tspan1028">You are welcome to consume alcohol drinks at bars around</tspan><tspan
         sodipodi:role="line"
         x="148.42421"
         y="30.302446"
         style="font-style:normal;font-variant:normal;font-weight:normal;font-stretch:normal;font-size:11.99444485px;line-height:1.25;font-family:'Caveat Brush';-inkscape-font-specification:'Caveat Brush';font-variant-ligatures:normal;font-variant-position:normal;font-variant-caps:normal;font-variant-numeric:normal;font-variant-alternates:normal;font-feature-settings:normal;text-indent:0;text-align:center;text-decoration:none;text-decoration-line:none;text-decoration-style:solid;text-decoration-color:#000000;letter-spacing:0px;word-spacing:0px;text-transform:none;writing-mode:lr-tb;direction:ltr;text-orientation:mixed;dominant-baseline:auto;baseline-shift:baseline;text-anchor:middle;white-space:normal;shape-padding:0;vector-effect:none;fill:#ffffff;fill-opacity:1;stroke:none;stroke-width:0.19895452;stroke-linecap:butt;stroke-linejoin:miter;stroke-miterlimit:4;stroke-dasharray:none;stroke-dashoffset:0;stroke-opacity:1"
         id="tspan1060">the venue or at Estação Mall.</tspan></text>
    <text
       xml:space="preserve"
       style="font-style:normal;font-variant:normal;font-weight:normal;font-stretch:normal;font-size:12.27826977px;line-height:1;font-family:'Caveat Brush';-inkscape-font-specification:'Caveat Brush';font-variant-ligatures:normal;font-variant-position:normal;font-variant-caps:normal;font-variant-numeric:normal;font-variant-alternates:normal;font-feature-settings:normal;text-indent:0;text-align:start;text-decoration:none;text-decoration-line:none;text-decoration-style:solid;text-decoration-color:#000000;letter-spacing:0px;word-spacing:0px;text-transform:none;writing-mode:lr-tb;direction:ltr;text-orientation:mixed;dominant-baseline:auto;baseline-shift:baseline;text-anchor:start;white-space:normal;shape-padding:0;opacity:1;vector-effect:none;fill:#ffffff;fill-opacity:1;stroke:none;stroke-width:0.3069568;stroke-linecap:butt;stroke-linejoin:miter;stroke-miterlimit:4;stroke-dasharray:none;stroke-dashoffset:0;stroke-opacity:1"
       x="149.23114"
       y="75.985352"
       id="text120-5-1"><tspan
         sodipodi:role="line"
         x="149.23114"
         y="75.985352"
         style="font-style:normal;font-variant:normal;font-weight:normal;font-stretch:normal;font-size:12.27826977px;line-height:1;font-family:'Caveat Brush';-inkscape-font-specification:'Caveat Brush';font-variant-ligatures:normal;font-variant-position:normal;font-variant-caps:normal;font-variant-numeric:normal;font-variant-alternates:normal;font-feature-settings:normal;text-indent:0;text-align:center;text-decoration:none;text-decoration-line:none;text-decoration-style:solid;text-decoration-color:#000000;letter-spacing:0px;word-spacing:0px;text-transform:none;writing-mode:lr-tb;direction:ltr;text-orientation:mixed;dominant-baseline:auto;baseline-shift:baseline;text-anchor:middle;white-space:normal;shape-padding:0;vector-effect:none;fill:#ffffff;fill-opacity:1;stroke:none;stroke-width:0.3069568;stroke-linecap:butt;stroke-linejoin:miter;stroke-miterlimit:4;stroke-dasharray:none;stroke-dashoffset:0;stroke-opacity:1"
         id="tspan1028-2">O consumo de bebidas alcoólicas pode ser feito nos bares</tspan><tspan
         sodipodi:role="line"
         x="149.23114"
         y="88.263618"
         style="font-style:normal;font-variant:normal;font-weight:normal;font-stretch:normal;font-size:12.27826977px;line-height:1;font-family:'Caveat Brush';-inkscape-font-specification:'Caveat Brush';font-variant-ligatures:normal;font-variant-position:normal;font-variant-caps:normal;font-variant-numeric:normal;font-variant-alternates:normal;font-feature-settings:normal;text-indent:0;text-align:center;text-decoration:none;text-decoration-line:none;text-decoration-style:solid;text-decoration-color:#000000;letter-spacing:0px;word-spacing:0px;text-transform:none;writing-mode:lr-tb;direction:ltr;text-orientation:mixed;dominant-baseline:auto;baseline-shift:baseline;text-anchor:middle;white-space:normal;shape-padding:0;vector-effect:none;fill:#ffffff;fill-opacity:1;stroke:none;stroke-width:0.3069568;stroke-linecap:butt;stroke-linejoin:miter;stroke-miterlimit:4;stroke-dasharray:none;stroke-dashoffset:0;stroke-opacity:1"
         id="tspan1056">ou Shopping Estação que ficam em torno da universidade.</tspan></text>
  </g>
</svg>
