<?xml version="1.0" encoding="UTF-8" standalone="no"?>
<!-- Created with Inkscape (http://www.inkscape.org/) -->

<svg
   xmlns:dc="http://purl.org/dc/elements/1.1/"
   xmlns:cc="http://creativecommons.org/ns#"
   xmlns:rdf="http://www.w3.org/1999/02/22-rdf-syntax-ns#"
   xmlns:svg="http://www.w3.org/2000/svg"
   xmlns="http://www.w3.org/2000/svg"
   xmlns:sodipodi="http://sodipodi.sourceforge.net/DTD/sodipodi-0.dtd"
   xmlns:inkscape="http://www.inkscape.org/namespaces/inkscape"
   width="210mm"
   height="297mm"
   viewBox="0 0 744.09448819 1052.3622047"
   id="svg2"
   version="1.1"
   inkscape:version="0.92.3 (2405546, 2018-03-11)"
   sodipodi:docname="logo-vertical.svg"
   inkscape:export-filename="/home/mulin/Documentos/DebConf19/debconf19-3.png"
   inkscape:export-xdpi="529.1861"
   inkscape:export-ydpi="529.1861">
  <defs
     id="defs4">
    <inkscape:path-effect
       effect="skeletal"
       id="path-effect5017"
       is_visible="true"
       pattern="m -5,3.5714286 c 0,-2.76000003 2.24,-5 5,-5 2.76,0 5,2.23999997 5,5 0,2.76 -2.24,5 -5,5 -2.76,0 -5,-2.24 -5,-5 z"
       copytype="single_stretched"
       prop_scale="1"
       scale_y_rel="false"
       spacing="0"
       normal_offset="0"
       tang_offset="0"
       prop_units="false"
       vertical_pattern="false"
       fuse_tolerance="0" />
    <inkscape:path-effect
       effect="skeletal"
       id="path-effect5008"
       is_visible="true"
       pattern="m 4.3140888,75.05952 c 0,0 50.1355702,-41.02065 81.7675402,-60.05131 C 96.925569,8.4842 96.289989,7.30372 104.29591,5.09639 113.60347,2.53018 127.72302,0 132.73613,0 l 3.45387,0 -3.74914,3.75 c -2.06203,2.0625 -4.35356,4.6729 -5.09231,5.80088 -1.31833,2.01296 -1.31749,2.07008 0.0457,3.08907 1.36036,1.01685 3.15778,0.97783 11.05009,-0.23987 1.82714,-0.28191 2.97183,-0.0213 4.17059,0.94935 l 1.65224,1.3379 -5.67236,2.34196 c -3.1198,1.28807 -9.65728,4.62414 -14.52773,7.4135 C 103.99985,35.93547 21.434629,87.16188 21.434629,87.16188 19.437599,87.16488 -10.589901,100.80113 3.9696188,74.4678 Z M 117.95407,9.68448 c 0.21734,-0.56639 1.23059,-1.5772 2.25166,-2.24623 1.59402,-1.04444 2.10641,-1.08266 3.62425,-0.27033 2.03568,1.08946 3.64795,0.11449 2.92522,-1.76894 -1.38137,-3.5998 -8.73184,-2.83476 -11.16228,1.16177 -0.73491,1.20846 -1.16729,2.63738 -0.96085,3.17537 0.49587,1.29222 2.82017,1.25609 3.322,-0.0516 z"
       copytype="single_stretched"
       prop_scale="1"
       scale_y_rel="false"
       spacing="0"
       normal_offset="0"
       tang_offset="0"
       prop_units="false"
       vertical_pattern="false"
       fuse_tolerance="0" />
    <inkscape:path-effect
       effect="skeletal"
       id="path-effect4999"
       is_visible="true"
       pattern="m 4.3140888,75.05952 c 0,0 50.1355702,-41.02065 81.7675402,-60.05131 C 96.925569,8.4842 96.289989,7.30372 104.29591,5.09639 113.60347,2.53018 127.72302,0 132.73613,0 l 3.45387,0 -3.74914,3.75 c -2.06203,2.0625 -4.35356,4.6729 -5.09231,5.80088 -1.31833,2.01296 -1.31749,2.07008 0.0457,3.08907 1.36036,1.01685 3.15778,0.97783 11.05009,-0.23987 1.82714,-0.28191 2.97183,-0.0213 4.17059,0.94935 l 1.65224,1.3379 -5.67236,2.34196 c -3.1198,1.28807 -9.65728,4.62414 -14.52773,7.4135 C 103.99985,35.93547 21.434629,87.16188 21.434629,87.16188 19.437599,87.16488 -10.589901,100.80113 3.9696188,74.4678 Z M 117.95407,9.68448 c 0.21734,-0.56639 1.23059,-1.5772 2.25166,-2.24623 1.59402,-1.04444 2.10641,-1.08266 3.62425,-0.27033 2.03568,1.08946 3.64795,0.11449 2.92522,-1.76894 -1.38137,-3.5998 -8.73184,-2.83476 -11.16228,1.16177 -0.73491,1.20846 -1.16729,2.63738 -0.96085,3.17537 0.49587,1.29222 2.82017,1.25609 3.322,-0.0516 z"
       copytype="single_stretched"
       prop_scale="1"
       scale_y_rel="false"
       spacing="0"
       normal_offset="0"
       tang_offset="0"
       prop_units="false"
       vertical_pattern="false"
       fuse_tolerance="0" />
    <inkscape:path-effect
       effect="skeletal"
       id="path-effect4990"
       is_visible="true"
       pattern="m 4.3140888,75.05952 c 0,0 50.1355702,-41.02065 81.7675402,-60.05131 C 96.925569,8.4842 96.289989,7.30372 104.29591,5.09639 113.60347,2.53018 127.72302,0 132.73613,0 l 3.45387,0 -3.74914,3.75 c -2.06203,2.0625 -4.35356,4.6729 -5.09231,5.80088 -1.31833,2.01296 -1.31749,2.07008 0.0457,3.08907 1.36036,1.01685 3.15778,0.97783 11.05009,-0.23987 1.82714,-0.28191 2.97183,-0.0213 4.17059,0.94935 l 1.65224,1.3379 -5.67236,2.34196 c -3.1198,1.28807 -9.65728,4.62414 -14.52773,7.4135 C 103.99985,35.93547 21.434629,87.16188 21.434629,87.16188 19.437599,87.16488 -10.589901,100.80113 3.9696188,74.4678 Z M 117.95407,9.68448 c 0.21734,-0.56639 1.23059,-1.5772 2.25166,-2.24623 1.59402,-1.04444 2.10641,-1.08266 3.62425,-0.27033 2.03568,1.08946 3.64795,0.11449 2.92522,-1.76894 -1.38137,-3.5998 -8.73184,-2.83476 -11.16228,1.16177 -0.73491,1.20846 -1.16729,2.63738 -0.96085,3.17537 0.49587,1.29222 2.82017,1.25609 3.322,-0.0516 z"
       copytype="single_stretched"
       prop_scale="1"
       scale_y_rel="false"
       spacing="0"
       normal_offset="0"
       tang_offset="0"
       prop_units="false"
       vertical_pattern="false"
       fuse_tolerance="0" />
    <inkscape:path-effect
       effect="skeletal"
       id="path-effect4959"
       is_visible="true"
       pattern="M 11.171689,17.495927 C 8.0771941,15.631834 5.0347118,13.585734 2.6196579,10.899052 1.3190385,9.4521486 0.12629261,7.7390229 0.00737277,5.7971168 -0.0729904,4.4848234 0.50948633,3.1767496 1.4673532,2.276159 c 4e-7,-2e-7 8e-7,-4e-7 1.2e-6,-6e-7 C 2.4757138,1.3280945 3.7860613,0.74430786 5.132119,0.42221683 7.4513909,-0.13275071 9.8764795,-0.04918479 12.252293,0.1570265 c 2.686894,0.23321196 5.34973,0.68644232 8.002132,1.1748598 10e-7,3e-7 2e-6,4e-7 3e-6,5e-7 2.314711,0.4262346 4.620094,0.9112919 6.950873,1.2384528 0.821351,0.1152893 1.647686,0.2164269 2.477081,0.2129304 0.511656,-0.00216 1.060345,-0.00844 1.489307,-0.2873432"
       copytype="single_stretched"
       prop_scale="1"
       scale_y_rel="false"
       spacing="0"
       normal_offset="0"
       tang_offset="0"
       prop_units="false"
       vertical_pattern="false"
       fuse_tolerance="0" />
    <inkscape:path-effect
       effect="skeletal"
       id="path-effect4949"
       is_visible="true"
       pattern="M 11.171689,17.495927 C 8.0771941,15.631834 5.0347118,13.585734 2.6196579,10.899052 1.3190385,9.4521486 0.12629261,7.7390229 0.00737277,5.7971168 -0.0729904,4.4848234 0.50948633,3.1767496 1.4673532,2.276159 c 4e-7,-2e-7 8e-7,-4e-7 1.2e-6,-6e-7 C 2.4757138,1.3280945 3.7860613,0.74430786 5.132119,0.42221683 7.4513909,-0.13275071 9.8764795,-0.04918479 12.252293,0.1570265 c 2.686894,0.23321196 5.34973,0.68644232 8.002132,1.1748598 10e-7,3e-7 2e-6,4e-7 3e-6,5e-7 2.314711,0.4262346 4.620094,0.9112919 6.950873,1.2384528 0.821351,0.1152893 1.647686,0.2164269 2.477081,0.2129304 0.511656,-0.00216 1.060345,-0.00844 1.489307,-0.2873432"
       copytype="single_stretched"
       prop_scale="1"
       scale_y_rel="false"
       spacing="0"
       normal_offset="0"
       tang_offset="0"
       prop_units="false"
       vertical_pattern="false"
       fuse_tolerance="0" />
    <inkscape:path-effect
       effect="skeletal"
       id="path-effect4939"
       is_visible="true"
       pattern="M 11.171689,17.495927 C 8.0771941,15.631834 5.0347118,13.585734 2.6196579,10.899052 1.3190385,9.4521486 0.12629261,7.7390229 0.00737277,5.7971168 -0.0729904,4.4848234 0.50948633,3.1767496 1.4673532,2.276159 c 4e-7,-2e-7 8e-7,-4e-7 1.2e-6,-6e-7 C 2.4757138,1.3280945 3.7860613,0.74430786 5.132119,0.42221683 7.4513909,-0.13275071 9.8764795,-0.04918479 12.252293,0.1570265 c 2.686894,0.23321196 5.34973,0.68644232 8.002132,1.1748598 10e-7,3e-7 2e-6,4e-7 3e-6,5e-7 2.314711,0.4262346 4.620094,0.9112919 6.950873,1.2384528 0.821351,0.1152893 1.647686,0.2164269 2.477081,0.2129304 0.511656,-0.00216 1.060345,-0.00844 1.489307,-0.2873432"
       copytype="single_stretched"
       prop_scale="1"
       scale_y_rel="false"
       spacing="0"
       normal_offset="0"
       tang_offset="0"
       prop_units="false"
       vertical_pattern="false"
       fuse_tolerance="0" />
    <inkscape:path-effect
       effect="skeletal"
       id="path-effect4929"
       is_visible="true"
       pattern="M 11.171689,17.495927 C 8.0771941,15.631834 5.0347118,13.585734 2.6196579,10.899052 1.3190385,9.4521486 0.12629261,7.7390229 0.00737277,5.7971168 -0.0729904,4.4848234 0.50948633,3.1767496 1.4673532,2.276159 c 4e-7,-2e-7 8e-7,-4e-7 1.2e-6,-6e-7 C 2.4757138,1.3280945 3.7860613,0.74430786 5.132119,0.42221683 7.4513909,-0.13275071 9.8764795,-0.04918479 12.252293,0.1570265 c 2.686894,0.23321196 5.34973,0.68644232 8.002132,1.1748598 10e-7,3e-7 2e-6,4e-7 3e-6,5e-7 2.314711,0.4262346 4.620094,0.9112919 6.950873,1.2384528 0.821351,0.1152893 1.647686,0.2164269 2.477081,0.2129304 0.511656,-0.00216 1.060345,-0.00844 1.489307,-0.2873432"
       copytype="single_stretched"
       prop_scale="1"
       scale_y_rel="false"
       spacing="0"
       normal_offset="0"
       tang_offset="0"
       prop_units="false"
       vertical_pattern="false"
       fuse_tolerance="0" />
    <inkscape:path-effect
       effect="skeletal"
       id="path-effect4885"
       is_visible="true"
       pattern="M 0,5 C 0,2.24 2.24,0 5,0 7.76,0 10,2.24 10,5 10,7.76 7.76,10 5,10 2.24,10 0,7.76 0,5 Z"
       copytype="single_stretched"
       prop_scale="1"
       scale_y_rel="false"
       spacing="0"
       normal_offset="0"
       tang_offset="0"
       prop_units="false"
       vertical_pattern="false"
       fuse_tolerance="0" />
    <inkscape:path-effect
       effect="skeletal"
       id="path-effect4881"
       is_visible="true"
       pattern="M 0,5 C 0,2.24 2.24,0 5,0 7.76,0 10,2.24 10,5 10,7.76 7.76,10 5,10 2.24,10 0,7.76 0,5 Z"
       copytype="single_stretched"
       prop_scale="1"
       scale_y_rel="false"
       spacing="0"
       normal_offset="0"
       tang_offset="0"
       prop_units="false"
       vertical_pattern="false"
       fuse_tolerance="0" />
    <inkscape:path-effect
       effect="skeletal"
       id="path-effect4829"
       is_visible="true"
       pattern="m -174.42857,126.14286 1,0"
       copytype="single_stretched"
       prop_scale="1"
       scale_y_rel="false"
       spacing="0"
       normal_offset="0"
       tang_offset="0"
       prop_units="false"
       vertical_pattern="false"
       fuse_tolerance="0" />
    <inkscape:path-effect
       effect="skeletal"
       id="path-effect4811"
       is_visible="true"
       pattern="M 0,5 C 0,2.24 2.24,0 5,0 7.76,0 10,2.24 10,5 10,7.76 7.76,10 5,10 2.24,10 0,7.76 0,5 Z"
       copytype="single_stretched"
       prop_scale="1"
       scale_y_rel="false"
       spacing="0"
       normal_offset="0"
       tang_offset="0"
       prop_units="false"
       vertical_pattern="false"
       fuse_tolerance="0" />
    <inkscape:path-effect
       effect="skeletal"
       id="path-effect4803"
       is_visible="true"
       pattern="m -141.42857,95 c 0,-2.76 2.24,-5 5,-5 2.76,0 5,2.24 5,5 0,2.76 -2.24,5 -5,5 -2.76,0 -5,-2.24 -5,-5 z"
       copytype="single_stretched"
       prop_scale="1"
       scale_y_rel="false"
       spacing="0"
       normal_offset="0"
       tang_offset="0"
       prop_units="false"
       vertical_pattern="false"
       fuse_tolerance="0" />
    <inkscape:path-effect
       effect="skeletal"
       id="path-effect4795"
       is_visible="true"
       pattern="m -141.42857,95 c 0,-2.76 2.24,-5 5,-5 2.76,0 5,2.24 5,5 0,2.76 -2.24,5 -5,5 -2.76,0 -5,-2.24 -5,-5 z"
       copytype="single_stretched"
       prop_scale="1"
       scale_y_rel="false"
       spacing="0"
       normal_offset="0"
       tang_offset="0"
       prop_units="false"
       vertical_pattern="false"
       fuse_tolerance="0" />
    <inkscape:path-effect
       effect="skeletal"
       id="path-effect4791"
       is_visible="true"
       pattern="M 0,0 1,0"
       copytype="single_stretched"
       prop_scale="1"
       scale_y_rel="false"
       spacing="0"
       normal_offset="0"
       tang_offset="0"
       prop_units="false"
       vertical_pattern="false"
       fuse_tolerance="0" />
    <inkscape:path-effect
       effect="skeletal"
       id="path-effect4786"
       is_visible="true"
       pattern="M 0,0 1,0"
       copytype="single_stretched"
       prop_scale="1"
       scale_y_rel="false"
       spacing="0"
       normal_offset="0"
       tang_offset="0"
       prop_units="false"
       vertical_pattern="false"
       fuse_tolerance="0" />
    <inkscape:path-effect
       effect="skeletal"
       id="path-effect4782"
       is_visible="true"
       pattern="M 0,0 1,0"
       copytype="single_stretched"
       prop_scale="1"
       scale_y_rel="false"
       spacing="0"
       normal_offset="0"
       tang_offset="0"
       prop_units="false"
       vertical_pattern="false"
       fuse_tolerance="0" />
    <inkscape:path-effect
       effect="skeletal"
       id="path-effect4778"
       is_visible="true"
       pattern="M 0,0 1,0"
       copytype="single_stretched"
       prop_scale="1"
       scale_y_rel="false"
       spacing="0"
       normal_offset="0"
       tang_offset="0"
       prop_units="false"
       vertical_pattern="false"
       fuse_tolerance="0" />
    <inkscape:path-effect
       effect="skeletal"
       id="path-effect4774"
       is_visible="true"
       pattern="M 0,0 1,0"
       copytype="single_stretched"
       prop_scale="1"
       scale_y_rel="false"
       spacing="0"
       normal_offset="0"
       tang_offset="0"
       prop_units="false"
       vertical_pattern="false"
       fuse_tolerance="0" />
    <inkscape:path-effect
       effect="skeletal"
       id="path-effect4770"
       is_visible="true"
       pattern="M 0,0 1,0"
       copytype="single_stretched"
       prop_scale="1"
       scale_y_rel="false"
       spacing="0"
       normal_offset="0"
       tang_offset="0"
       prop_units="false"
       vertical_pattern="false"
       fuse_tolerance="0" />
    <inkscape:path-effect
       effect="skeletal"
       id="path-effect4766"
       is_visible="true"
       pattern="M 0,0 1,0"
       copytype="single_stretched"
       prop_scale="1"
       scale_y_rel="false"
       spacing="0"
       normal_offset="0"
       tang_offset="0"
       prop_units="false"
       vertical_pattern="false"
       fuse_tolerance="0" />
    <inkscape:path-effect
       effect="skeletal"
       id="path-effect4762"
       is_visible="true"
       pattern="M 0,0 1,0"
       copytype="single_stretched"
       prop_scale="1"
       scale_y_rel="false"
       spacing="0"
       normal_offset="0"
       tang_offset="0"
       prop_units="false"
       vertical_pattern="false"
       fuse_tolerance="0" />
    <inkscape:path-effect
       effect="skeletal"
       id="path-effect4758"
       is_visible="true"
       pattern="M 0,0 1,0"
       copytype="single_stretched"
       prop_scale="1"
       scale_y_rel="false"
       spacing="0"
       normal_offset="0"
       tang_offset="0"
       prop_units="false"
       vertical_pattern="false"
       fuse_tolerance="0" />
    <inkscape:path-effect
       effect="skeletal"
       id="path-effect4754"
       is_visible="true"
       pattern="M 0,0 1,0"
       copytype="single_stretched"
       prop_scale="1"
       scale_y_rel="false"
       spacing="0"
       normal_offset="0"
       tang_offset="0"
       prop_units="false"
       vertical_pattern="false"
       fuse_tolerance="0" />
    <inkscape:path-effect
       effect="skeletal"
       id="path-effect4750"
       is_visible="true"
       pattern="M 0,0 1,0"
       copytype="single_stretched"
       prop_scale="1"
       scale_y_rel="false"
       spacing="0"
       normal_offset="0"
       tang_offset="0"
       prop_units="false"
       vertical_pattern="false"
       fuse_tolerance="0" />
    <inkscape:path-effect
       effect="skeletal"
       id="path-effect4746"
       is_visible="true"
       pattern="M 0,0 1,0"
       copytype="single_stretched"
       prop_scale="1"
       scale_y_rel="false"
       spacing="0"
       normal_offset="0"
       tang_offset="0"
       prop_units="false"
       vertical_pattern="false"
       fuse_tolerance="0" />
    <inkscape:path-effect
       effect="skeletal"
       id="path-effect4742"
       is_visible="true"
       pattern="M 0,0 1,0"
       copytype="single_stretched"
       prop_scale="1"
       scale_y_rel="false"
       spacing="0"
       normal_offset="0"
       tang_offset="0"
       prop_units="false"
       vertical_pattern="false"
       fuse_tolerance="0" />
    <inkscape:path-effect
       effect="skeletal"
       id="path-effect4738"
       is_visible="true"
       pattern="M 0,5 C 0,2.24 2.24,0 5,0 7.76,0 10,2.24 10,5 10,7.76 7.76,10 5,10 2.24,10 0,7.76 0,5 Z"
       copytype="single_stretched"
       prop_scale="1"
       scale_y_rel="false"
       spacing="0"
       normal_offset="0"
       tang_offset="0"
       prop_units="false"
       vertical_pattern="false"
       fuse_tolerance="0" />
    <inkscape:path-effect
       effect="skeletal"
       id="path-effect4734"
       is_visible="true"
       pattern="M 0,5 C 0,2.24 2.24,0 5,0 7.76,0 10,2.24 10,5 10,7.76 7.76,10 5,10 2.24,10 0,7.76 0,5 Z"
       copytype="single_stretched"
       prop_scale="1"
       scale_y_rel="false"
       spacing="0"
       normal_offset="0"
       tang_offset="0"
       prop_units="false"
       vertical_pattern="false"
       fuse_tolerance="0" />
    <inkscape:path-effect
       effect="skeletal"
       id="path-effect4730"
       is_visible="true"
       pattern="M 0,5 C 0,2.24 2.24,0 5,0 7.76,0 10,2.24 10,5 10,7.76 7.76,10 5,10 2.24,10 0,7.76 0,5 Z"
       copytype="single_stretched"
       prop_scale="1"
       scale_y_rel="false"
       spacing="0"
       normal_offset="0"
       tang_offset="0"
       prop_units="false"
       vertical_pattern="false"
       fuse_tolerance="0" />
    <inkscape:path-effect
       effect="powerstroke"
       id="path-effect4726"
       is_visible="true"
       offset_points="0,0.5"
       sort_points="true"
       interpolator_type="CubicBezierJohan"
       interpolator_beta="0.2"
       start_linecap_type="zerowidth"
       linejoin_type="round"
       miter_limit="4"
       end_linecap_type="zerowidth"
       cusp_linecap_type="round" />
    <inkscape:path-effect
       effect="powerstroke"
       id="path-effect4722"
       is_visible="true"
       offset_points="0,0.5"
       sort_points="true"
       interpolator_type="CubicBezierJohan"
       interpolator_beta="0.2"
       start_linecap_type="zerowidth"
       linejoin_type="round"
       miter_limit="4"
       end_linecap_type="zerowidth"
       cusp_linecap_type="round" />
    <inkscape:path-effect
       effect="skeletal"
       id="path-effect4714"
       is_visible="true"
       pattern="M 0,5 C 0,2.24 2.24,0 5,0 7.76,0 10,2.24 10,5 10,7.76 7.76,10 5,10 2.24,10 0,7.76 0,5 Z"
       copytype="single_stretched"
       prop_scale="1"
       scale_y_rel="false"
       spacing="0"
       normal_offset="0"
       tang_offset="0"
       prop_units="false"
       vertical_pattern="false"
       fuse_tolerance="0" />
    <inkscape:path-effect
       effect="skeletal"
       id="path-effect4710"
       is_visible="true"
       pattern="M 0,5 C 0,2.24 2.24,0 5,0 7.76,0 10,2.24 10,5 10,7.76 7.76,10 5,10 2.24,10 0,7.76 0,5 Z"
       copytype="single_stretched"
       prop_scale="1"
       scale_y_rel="false"
       spacing="0"
       normal_offset="0"
       tang_offset="0"
       prop_units="false"
       vertical_pattern="false"
       fuse_tolerance="0" />
    <inkscape:path-effect
       effect="skeletal"
       id="path-effect4706"
       is_visible="true"
       pattern="M 0,5 C 0,2.24 2.24,0 5,0 7.76,0 10,2.24 10,5 10,7.76 7.76,10 5,10 2.24,10 0,7.76 0,5 Z"
       copytype="single_stretched"
       prop_scale="1"
       scale_y_rel="false"
       spacing="0"
       normal_offset="0"
       tang_offset="0"
       prop_units="false"
       vertical_pattern="false"
       fuse_tolerance="0" />
    <inkscape:path-effect
       effect="spiro"
       id="path-effect4704"
       is_visible="true" />
    <inkscape:path-effect
       effect="skeletal"
       id="path-effect4694"
       is_visible="true"
       pattern="M 0,5 C 0,2.24 2.24,0 5,0 7.76,0 10,2.24 10,5 10,7.76 7.76,10 5,10 2.24,10 0,7.76 0,5 Z"
       copytype="single_stretched"
       prop_scale="1"
       scale_y_rel="false"
       spacing="0"
       normal_offset="0"
       tang_offset="0"
       prop_units="false"
       vertical_pattern="false"
       fuse_tolerance="0" />
    <inkscape:path-effect
       effect="spiro"
       id="path-effect4692"
       is_visible="true" />
    <inkscape:path-effect
       effect="skeletal"
       id="path-effect4829-3"
       is_visible="true"
       pattern="m -171.00661,161.39989 1,0"
       copytype="single_stretched"
       prop_scale="1"
       scale_y_rel="false"
       spacing="0"
       normal_offset="0"
       tang_offset="0"
       prop_units="false"
       vertical_pattern="false"
       fuse_tolerance="0" />
  </defs>
  <sodipodi:namedview
     id="base"
     pagecolor="#ffffff"
     bordercolor="#666666"
     borderopacity="1.0"
     inkscape:pageopacity="0.0"
     inkscape:pageshadow="2"
     inkscape:zoom="0.7"
     inkscape:cx="22.441136"
     inkscape:cy="758.38329"
     inkscape:document-units="px"
     inkscape:current-layer="layer4"
     showgrid="false"
     showguides="true"
     inkscape:window-width="1920"
     inkscape:window-height="1019"
     inkscape:window-x="0"
     inkscape:window-y="0"
     inkscape:window-maximized="1" />
  <metadata
     id="metadata7">
    <rdf:RDF>
      <cc:Work
         rdf:about="">
        <dc:format>image/svg+xml</dc:format>
        <dc:type
           rdf:resource="http://purl.org/dc/dcmitype/StillImage" />
        <dc:title></dc:title>
      </cc:Work>
    </rdf:RDF>
  </metadata>
  <g
     inkscape:groupmode="layer"
     id="layer2"
     inkscape:label="Lingua">
    <ellipse
       style="fill:#000000;stroke:#000000;stroke-width:1.60994077;stroke-miterlimit:4;stroke-dasharray:none;stroke-opacity:1"
       id="path4875"
       cx="192.68025"
       cy="511.85025"
       rx="9.6862574"
       ry="6.9506869"
       transform="matrix(0.84827027,-0.52956354,0.30316937,0.95293669,0,0)" />
    <ellipse
       style="fill:#ffffff;fill-opacity:1;stroke:#ffffff;stroke-width:2.85485983;stroke-miterlimit:4;stroke-dasharray:none;stroke-opacity:1"
       id="path4877"
       cx="32.39175"
       cy="506.36234"
       rx="2.2356603"
       ry="0.97480303"
       transform="matrix(0.65111862,-0.75897598,0.59285911,0.8053062,0,0)" />
    <path
       style="fill:#cd0000;fill-opacity:1;fill-rule:evenodd;stroke:none;stroke-width:1px;stroke-linecap:butt;stroke-linejoin:miter;stroke-opacity:1"
       d="m 459.28571,315.21935 c -0.4388,-1.13005 30.40828,-10.37528 69.99795,-42.16571 14.66159,-11.77351 30.6972,-27.59443 43.30408,-47.74893 9.04278,-14.44621 16.50433,-31.42396 20.31609,-50.10934 0,-1e-5 0,-1e-5 0,-2e-5 3.09402,-15.1485 3.82977,-31.47083 1.31586,-47.83568 -2.14493,-13.93147 -6.6057,-27.954099 -13.8714,-40.701449 -6.27905,-10.987972 -14.64325,-21.1505 -25.11421,-28.578118 -4.6672,-3.31515 -9.78443,-6.088446 -15.17649,-8.133999 -5.57966,-2.116724 -11.37717,-3.425201 -17.19156,-3.784944 -12.82098,-0.891779 -25.76228,2.886424 -36.92948,9.024102 -11.71369,6.521548 -21.3652,16.053494 -26.72016,27.379412 -8.13636,17.261436 -11.35027,35.880476 -6.67118,52.124436 3.98142,14.20045 14.06514,25.83392 26.11346,31.20561 7.24127,3.23655 14.42002,5.46378 21.54021,5.92246 5.76163,0.37462 11.35401,-0.39592 16.19328,-2.47731 4.6263,-1.94877 8.64404,-5.09651 11.79147,-8.72988 3.4857,-4.01565 6.01222,-8.74084 7.80804,-13.45317 2.64351,-7.00334 3.31694,-14.10256 2.3189,-20.43048 0,0 -10e-6,0 -10e-6,-10e-6 -1.02763,-6.70566 -3.85236,-12.68654 -6.9599,-17.41518 -3.88575,-5.90254 -8.51209,-10.391523 -12.34486,-13.559898 -8.00944,-6.602015 -13.4695,-8.614102 -13.29151,-9.103336 0.10311,-0.283437 6.01132,0.4752 15.08846,6.714139 4.29528,2.944491 9.51074,7.324445 14.09012,13.457875 3.68318,4.92669 7.12262,11.35454 8.6684,18.96242 0,0 10e-6,1e-5 10e-6,1e-5 1.43791,7.22199 1.03669,15.37079 -1.72108,23.46655 -1.79753,5.33317 -4.51191,10.7974 -8.46786,15.69377 -3.61305,4.46287 -8.35704,8.38887 -14.05708,11.00689 -5.98799,2.70688 -12.71702,3.86835 -19.54531,3.53899 -8.32422,-0.40493 -16.50711,-2.67927 -24.40594,-6.092 -14.46857,-6.27397 -26.50362,-19.4901 -31.42458,-36.23141 -5.43016,-18.89207 -2.34444,-39.837507 6.61386,-58.700054 6.33815,-13.383604 17.26732,-24.472068 30.58718,-31.891855 12.4686,-7.025274 27.20535,-11.277854 42.36385,-10.37755 6.86444,0.452349 13.62978,1.96387 20.08878,4.398274 6.24219,2.35269 12.11452,5.535775 17.44419,9.358464 11.84893,8.508939 21.12476,19.766473 27.89687,31.848608 7.85779,13.985913 12.59362,29.159683 14.75211,44.150053 2.54223,17.61566 1.56987,35.02943 -1.94586,51.11429 0,1e-5 0,2e-5 -10e-6,2e-5 -4.34259,19.84675 -12.51226,37.63231 -22.32846,52.61279 -13.69672,20.88819 -30.7195,36.826 -46.22098,48.41916 -42.43243,31.73407 -74.26188,36.20355 -73.90525,37.122 z"
       id="path4879"
       inkscape:path-effect="#path-effect4881"
       inkscape:original-d="m 459.28571,315.21935 c 231.4553,-89.87391 132.90649,-324.8499835 24.2528,-264.340098 -9.80294,5.459317 -21.36509,14.233624 -28.65367,29.635633 -19.45699,41.115935 -5.63191,76.939795 22.12652,89.130765 34.10377,14.97772 54.17432,0.16738 61.90457,-21.44277 11.21868,-31.36219 -15.60258,-55.1524 -33.20164,-61.554963"
       inkscape:connector-curvature="0"
       sodipodi:nodetypes="cssssc" />
    <path
       style="fill:#ff9955;fill-rule:evenodd;stroke:#000000;stroke-width:5.3;stroke-linecap:butt;stroke-linejoin:miter;stroke-opacity:1;fill-opacity:0.99215686;stroke-miterlimit:4;stroke-dasharray:none"
       d="m 279.85714,392.07649 c -3.09449,-1.86409 -6.13698,-3.91019 -8.55203,-6.59687 -1.30062,-1.44691 -2.49337,-3.16003 -2.61229,-5.10194 -0.0804,-1.31229 0.50212,-2.62037 1.45998,-3.52096 l 10e-6,0 c 1.00835,-0.94806 2.3187,-1.53185 3.66476,-1.85394 2.31927,-0.55497 4.74436,-0.4714 7.12017,-0.26519 2.6869,0.23321 5.34973,0.68644 8.00214,1.17486 l 0,0 c 2.31471,0.42623 4.62009,0.91129 6.95087,1.23845 0.82135,0.11529 1.64769,0.21643 2.47708,0.21293 0.51166,-0.002 1.06035,-0.008 1.48931,-0.28734"
       id="path4827"
       inkscape:path-effect="#path-effect4829"
       inkscape:original-d="m 279.85714,392.07649 c -16.19253,-9.75422 -11.56579,-15.75137 -6.03957,-17.07371 8.04638,-1.92538 23.59992,3.65993 26.03957,2.07371"
       inkscape:connector-curvature="0"
       sodipodi:nodetypes="csc" />
  </g>
  <g
     inkscape:groupmode="layer"
     id="layer1"
     inkscape:label="Layer 1">
    <path
       style="fill:#000000;fill-rule:evenodd;stroke:none;stroke-width:1px;stroke-linecap:butt;stroke-linejoin:miter;stroke-opacity:1"
       d="m 246.50593,463.53897 c -0.80148,-0.10276 -1.91015,-14.41692 8.22107,-35.95507 4.92348,-10.47654 11.99183,-21.66572 21.90626,-33.37193 0,-1e-5 0,-1e-5 10e-6,-1e-5 14.36052,-16.95728 32.61539,-32.99471 55.25306,-47.86032 3.5996,-2.36378 7.20705,-4.63047 10.805,-6.80398 12.72848,-7.70258 25.31799,-14.17522 37.49679,-19.57142 12.92196,-5.72777 24.95773,-10.06393 36.21516,-13.27353 12.37517,-3.53536 22.65464,-5.39396 31.7398,-6.07887 7.81849,-0.61786 13.39251,-0.25182 17.6907,0.65081 4.05218,0.85097 6.00353,1.97933 5.89811,2.4172 -0.23279,0.96692 -8.56632,-0.25049 -22.90841,2.29015 -8.71503,1.5816 -18.14581,4.04871 -30.08349,8.15661 -10.76768,3.71257 -22.20656,8.36166 -34.67248,14.28858 -11.72175,5.57538 -23.85002,12.0643 -36.19351,19.63059 -3.49074,2.1435 -6.99329,4.36316 -10.49005,6.66167 -22.04123,14.4883 -39.77491,29.43855 -54.1936,45.25084 0,0 -1e-5,1e-5 -1e-5,1e-5 -9.93554,10.89595 -17.17052,21.0141 -22.6217,30.6294 -10.88502,19.21363 -12.8149,33.09925 -14.06271,32.93927 z"
       id="path4793"
       inkscape:path-effect="#path-effect4795"
       inkscape:original-d="M 246.50593,463.53897 C 258.60518,369.16751 422.73598,291.89614 471.73188,303.69185"
       inkscape:connector-curvature="0"
       sodipodi:nodetypes="cc" />
    <path
       style="fill:#000000;fill-rule:evenodd;stroke:none;stroke-width:1px;stroke-linecap:butt;stroke-linejoin:miter;stroke-opacity:1"
       d="m 476.26791,319.65737 c 0.50501,0.97651 -6.2698,5.1212 -17.34123,12.95924 -10.83818,7.67292 -26.61724,19.53865 -41.65262,35.92149 -12.18906,13.25582 -23.68265,29.26908 -33.54161,48.25578 -1.04732,2.01697 -2.06021,4.03689 -3.03945,6.05757 -10.07822,20.78109 -16.97061,42.29056 -22.08272,60.31293 -10.69631,37.74544 -15.52376,63.70144 -18.03282,63.20517 -0.86698,-0.17148 -0.45848,-6.79482 1.08987,-18.23521 1.44864,-10.70359 4.30516,-28.46933 8.69288,-47.10726 4.37444,-18.60165 10.90311,-40.73971 21.33579,-62.51225 1.013,-2.11257 2.0656,-4.2232 3.15864,-6.32944 10.28496,-19.81862 22.68063,-36.43201 35.90699,-49.85207 16.41323,-16.62261 33.37277,-27.70785 45.31547,-34.27425 12.15009,-6.68043 19.79148,-9.17385 20.19081,-8.4017 z"
       id="path4801"
       inkscape:path-effect="#path-effect4803"
       inkscape:original-d="M 476.26791,319.65737 C 373.28885,372.91401 357.61469,460.23206 340.57746,546.36954"
       inkscape:connector-curvature="0"
       sodipodi:nodetypes="cc" />
    <path
       style="fill:none;fill-rule:evenodd;stroke:#000000;stroke-width:3.08350778;stroke-linecap:round;stroke-linejoin:miter;stroke-miterlimit:4;stroke-dasharray:none;stroke-opacity:1"
       d="m 475.09537,318.80502 c -2.62788,-7.02513 -11.80708,-1.54668 -16.98812,-2.68637"
       id="path4819"
       inkscape:connector-curvature="0"
       sodipodi:nodetypes="cc" />
    <path
       style="fill:none;fill-rule:evenodd;stroke:#000000;stroke-width:3.08100009;stroke-linecap:round;stroke-linejoin:round;stroke-miterlimit:4;stroke-dasharray:none;stroke-opacity:1"
       d="m 470.44716,304.58359 c -6.2115,2.28971 -12.43387,11.32908 -12.60615,11.46563"
       id="path4821"
       inkscape:connector-curvature="0"
       sodipodi:nodetypes="cc" />
    <path
       style="fill:#ff9955;fill-opacity:0.99215686;fill-rule:evenodd;stroke:#000000;stroke-width:6.30000019;stroke-linecap:butt;stroke-linejoin:miter;stroke-miterlimit:4;stroke-dasharray:none;stroke-opacity:1"
       d="m 272.25191,421.05289 c -4.14006,-2.98359 -8.14478,-6.26537 -11.21025,-10.34518 -1.76776,-2.3527 -3.27382,-5.06186 -3.42426,-8.00083 -0.10224,-1.99748 0.58487,-4.02678 1.91379,-5.52155 l 0,0 c 1.26006,-1.41732 2.98068,-2.38542 4.8039,-2.90734 1.925,-0.55106 3.94206,-0.70097 5.9429,-0.7781 2.48379,-0.0958 4.97163,-0.0228 7.45314,0.12017 l 10e-6,0 c 4.61937,0.26621 9.22361,0.77387 13.80026,1.45486 0,0 0,0 0,0 0.88111,0.1311 1.76516,0.24123 2.64852,0.35609 0.24137,0.0314 0.48309,0.0616 0.72229,0.10659 0,0 0,0 0,0 0.11416,0.0215 0.24021,0.0293 0.33089,0.10186 0,0 1e-5,0 1e-5,0 0.0446,0.0357 -0.005,0.0987 -0.053,0.12932 -0.13229,0.0839 -0.28278,0.13421 -0.42954,0.18895 -0.64816,0.24176 -1.30724,0.45313 -1.9588,0.68557"
       id="path4827-6"
       inkscape:path-effect="#path-effect4829-3"
       inkscape:original-d="m 272.25191,421.05289 c -21.22563,-15.29651 -15.16078,-24.70122 -7.91682,-26.7749 6.29073,-1.80081 20.36662,-0.2193 27.19631,0.79693 4.6214,0.68764 4.82971,0.295 1.26032,1.56838"
       inkscape:connector-curvature="0"
       sodipodi:nodetypes="cssc" />
    <path
       style="fill:none;fill-rule:evenodd;stroke:#000000;stroke-width:3;stroke-linecap:round;stroke-linejoin:round;stroke-miterlimit:4;stroke-dasharray:none;stroke-opacity:1"
       d="m 445.71429,313.79077 c 2.78519,-5.76219 7.82276,-4.34428 8.92857,-3.21429"
       id="path4887"
       inkscape:connector-curvature="0"
       sodipodi:nodetypes="cc" />
  </g>
  <g
     inkscape:groupmode="layer"
     id="layer3"
     inkscape:label="Tinta">
    <path
       style="opacity:0.98999999;fill:#ff9955;fill-opacity:1;stroke:none;stroke-width:0.1;stroke-linecap:round;stroke-linejoin:round;stroke-miterlimit:4;stroke-dasharray:none;stroke-opacity:1"
       d="m 361.46917,352.34085 c 0,0 17.68369,-23.11304 51.79079,-33.65191 11.55729,-3.57113 14.14027,-7.15838 21.86872,-9.20925 8.98498,-2.38431 22.61518,-4.73515 27.45454,-4.73515 l 3.33417,0 -3.6192,3.48419 c -1.99057,1.91631 -4.20268,4.34168 -4.91583,5.38971 -1.27264,1.87027 -1.27182,1.92334 0.0441,2.87011 1.31321,0.94477 3.04834,0.90852 10.66712,-0.22287 1.76381,-0.26193 2.86883,-0.0198 4.02604,0.88206 l 1.59498,1.24306 -5.47577,2.17596 c -3.01167,1.19677 -9.32258,4.29637 -14.02423,6.88802 -19.37174,10.67805 -75.50399,48.27344 -75.50399,48.27344 -1.92782,0.003 -40.20034,9.81533 -26.14542,-14.65144 z m 86.84431,-38.59828 c 0.2098,-0.52625 1.18794,-1.46541 2.17362,-2.08702 1.53877,-0.97041 2.03341,-1.00592 3.49864,-0.25117 1.96513,1.01224 3.52152,0.10638 2.82384,-1.64355 -1.3335,-3.34464 -8.42921,-2.63383 -10.77542,1.07942 -0.70944,1.1228 -1.12683,2.45044 -0.92755,2.9503 0.47869,1.20062 2.72243,1.16705 3.20687,-0.048 z"
       id="path4969"
       inkscape:connector-curvature="0"
       sodipodi:nodetypes="cssscssssccssccccssssscc" />
    <path
       style="fill:#ff9955;fill-opacity:0.99215686;fill-rule:evenodd;stroke:#ff9955;stroke-width:4.28399992;stroke-linecap:butt;stroke-linejoin:miter;stroke-miterlimit:4;stroke-dasharray:none;stroke-opacity:0.99215686"
       d="m 326.91432,539.00787 c -1.66536,0.47693 -6.15258,-11.12667 -5.09608,-31.31143 0.57444,-11.87878 2.70964,-25.48232 7.11086,-41.02354 0,0 0,-1e-5 0,-1e-5 3.23889,-11.46536 7.59807,-23.52722 13.37924,-35.67111 1.1097,-2.33103 2.25181,-4.62306 3.42463,-6.87559 7.44648,-14.33343 15.85416,-26.46904 25.32878,-36.49216 9.27295,-9.76116 17.05548,-18.9392 23.69232,-25.85089 3.8185,-3.98363 6.89514,-6.89479 10.00418,-9.31436 5.42036,-4.26089 9.19776,-5.12103 9.53554,-4.40015 0.31766,0.67795 -2.47854,2.68699 -6.65783,7.4509 -2.62268,3.02635 -4.7234,5.73348 -8.18309,10.28275 -4.65071,6.12677 -13.88395,18.55642 -21.8209,27.77093 -8.43631,9.79211 -15.94426,21.34443 -23.03646,35.13456 -1.10941,2.16218 -2.19602,4.35941 -3.25893,6.59205 -5.53646,11.62931 -9.91204,23.13117 -13.40408,34.07712 0,0 0,0 0,0 -4.76081,14.95904 -7.53951,27.57951 -9.15623,38.97315 -2.58424,18.83603 -0.55504,30.28351 -1.86195,30.65778 z"
       id="path5015"
       inkscape:path-effect="#path-effect5017"
       inkscape:original-d="m 326.91432,539.00787 c -9.16791,-32.01291 10.73435,-107.80689 47.43254,-148.40425 17.72805,-19.61165 29.6406,-37.70578 39.94692,-42.53499"
       inkscape:connector-curvature="0"
       sodipodi:nodetypes="csc" />
  </g>
  <g
     inkscape:groupmode="layer"
     id="layer4"
     inkscape:label="Tipografia">
    <a
       id="a90">
      <g
         aria-label="DEB"
         transform="matrix(1.2988439,0,0,1.6262754,67.711404,-77.653753)"
         style="font-style:normal;font-weight:normal;line-height:0.01%;font-family:sans-serif;letter-spacing:0px;word-spacing:0px;fill:#008000;fill-opacity:1;stroke:none;stroke-width:1px;stroke-linecap:butt;stroke-linejoin:miter;stroke-opacity:1"
         id="flowRoot4194">
        <path
           d="m 127.33789,158.11398 c -3.86719,2.92969 -8.47656,4.64844 -13.86719,5.15625 0.19532,-5.82031 0.39063,-12.38281 0.50782,-19.72656 l 0.27343,-19.72656 c 0.23438,-17.30469 0.50782,-30.468752 0.82032,-39.453127 0.0391,-0.195313 0.0391,-0.390625 0,-0.585938 4.49218,-0.3125 8.32031,0.234375 11.5625,1.601563 3.94531,1.679687 3.94544,5.578709 4.41419,9.367772 0.50781,3.90625 3.12487,14.18692 3.28112,19.42129 0.0391,1.91406 -0.0391,-2.69531 0,0 l 0.0781,6.875 0.0781,6.09375 0.0391,6.09375 c 0,4.60938 -2.66912,12.74814 -2.86443,16.26376 -0.3125,5.11719 -0.0653,5.29874 -4.32307,8.61905 z m 5.24724,-77.75571 c -4.49218,-2.070313 -12.31755,-3.181787 -18.29411,-2.7521 -1.01563,0.03906 -2.30469,0.195313 -3.82813,0.46875 -1.25,0.195313 -1.28328,1.721967 -1.51765,2.854779 -0.19531,1.09375 -0.90422,2.535847 -0.12297,3.434284 -0.19532,0.351563 0.0391,-0.507813 0,0 -0.19532,5.976562 -0.39063,12.734375 -0.54688,20.234377 l -0.27344,20.23437 c -0.27343,17.92969 -0.54687,31.40625 -0.85937,40.42969 0,0.35156 0.0391,0.70313 0.11719,1.01563 -0.0391,0.89843 0.65101,1.13109 1.15882,1.75609 0.54688,0.74219 0.87243,1.60328 1.84899,1.64234 7.14844,0.15625 13.51562,-1.64062 19.10156,-5.39062 6.01563,-4.02344 9.60938,-9.41406 10.78125,-16.17188 0.23438,-1.36718 0.39063,-2.96875 0.46875,-4.88281 l 0.0391,-2.46094 v -2.46093 c 0.0781,-4.53125 0.0781,-9.80469 0.0391,-15.85938 l -0.0391,-3.78906 -0.0391,-3.82813 c -0.0391,-2.92968 -0.0781,-5.46875 -0.15625,-7.61718 -0.19531,-5.74219 -0.58594,-10.820317 -1.17187,-15.195317 -0.74219,-5.429688 -1.2762,-9.122901 -6.70589,-11.661963 z"
           style="font-style:normal;font-variant:normal;font-weight:normal;font-stretch:normal;font-size:80px;line-height:1.25;font-family:'Papaya Sunrise';-inkscape-font-specification:'Papaya Sunrise';fill:#008000"
           id="path3766"
           inkscape:connector-curvature="0"
           sodipodi:nodetypes="ccccccccccccccccccccccccccccccccccccccc" />
        <path
           d="m 152.76758,164.98898 c 0,0.66407 0.15625,1.25 0.50781,1.71875 0.0391,0.82032 0.3125,1.52344 0.82031,2.07032 0.54688,0.58593 1.28907,0.89843 2.22657,0.89843 1.83593,0 3.94531,-0.0781 6.36718,-0.19531 l 6.36719,-0.35156 c 5.3125,-0.27344 9.57031,-0.35156 12.73438,-0.23438 0.97656,0.0391 1.71875,-0.23437 2.26562,-0.85937 0.50781,-0.58594 -0.2213,-1.14348 -0.2213,-1.9638 0,-0.82031 0.72911,-1.70808 0.2213,-2.29401 -0.54687,-0.66407 -1.28906,-1.01563 -2.26562,-1.05469 -3.00782,-0.11719 -6.79688,-0.0391 -11.36719,0.19531 l -5.70313,0.27344 c 0,0 -2.35654,-0.11189 -3.91904,-0.0728 0,-16.36719 -1.86218,-28.71627 -2.01846,-37.70065 h 15.50782 c 0.9375,0 1.67968,-0.3125 2.26562,-0.97656 0.50781,-0.58594 0.0131,-1.28906 0.0131,-2.10938 0,-0.85937 0.49474,-1.5625 -0.0131,-2.14843 -0.58594,-0.625 -1.32812,-0.9375 -2.26562,-0.9375 h -15.625 c -0.27344,-12.53907 1.40612,-22.606697 0.66393,-33.153572 l 21.21107,-1.455808 c 0.97297,-0.06678 1.71875,-0.3125 2.26562,-0.976562 0.50781,-0.585938 -0.13015,-1.216273 -0.13015,-2.036585 0,-0.859375 0.63796,-1.63529 0.13015,-2.221228 -0.54687,-0.625 -1.28906,-0.9375 -2.26562,-0.9375 h -26.71875 c -0.97657,0 -1.75782,0.351563 -2.34375,1.015625 -0.58594,0.546875 -0.85938,1.289063 -0.82032,2.226563 1.40625,18.554687 2.10938,46.289067 2.10938,83.281247 z"
           style="font-style:normal;font-variant:normal;font-weight:normal;font-stretch:normal;font-size:80px;line-height:1.25;font-family:'Papaya Sunrise';-inkscape-font-specification:'Papaya Sunrise';fill:#008000"
           id="path3768"
           inkscape:connector-curvature="0"
           sodipodi:nodetypes="sccsccccsccccccscscsccscscssccss" />
        <path
           d="m 220.0332,104.91086 c -0.35156,3.00781 -7.92968,9.53125 -9.49218,11.40625 -1.60156,1.83593 2.8125,-0.89844 0,0 -2.14844,0.66406 -4.40107,-1.23554 -7.48701,-1.07929 -0.3125,-13.86719 -0.83331,-22.866025 -0.83331,-31.576962 4.6875,0.390625 8.32032,1.171875 10.85938,2.34375 3.55469,1.679687 5.78125,5.3125 6.67969,10.9375 0.46875,2.929687 0.54687,5.585942 0.27343,7.968752 z m -0.78125,53.04687 c -3.55468,3.00782 -8.78906,4.80469 -15.78125,5.3125 -0.0391,-8.82812 0.0234,-20.53493 -0.36722,-37.52711 l 1.65629,-0.83226 1.875,0.35156 c 1.52343,0.27344 2.77343,0.54688 3.82812,0.78125 2.85156,0.66406 6.40619,2.02763 8.39838,2.96513 4.57031,2.10938 6.01568,5.66768 6.5235,11.83956 0.625,7.34375 -1.40625,13.04687 -6.13282,17.10937 z m -22.69531,-34.375 c 0.42969,18.00782 -0.10412,34.10483 -0.10412,43.0892 0,0.89844 -0.45112,1.59559 1.13738,1.16264 1.03705,0.78723 0.52922,0.12316 1.03705,0.78723 0.58594,0.74218 1.36719,1.09375 2.42188,1.05468 9.41406,-0.35156 16.79687,-2.61718 22.07031,-6.875 6.05469,-4.80468 8.90625,-11.83593 8.59375,-21.05468 -0.27344,-8.04688 -3.16406,-13.90625 -8.75,-17.61719 -1.95312,-1.28906 -4.375,-2.38281 -7.22656,-3.24219 2.07031,-1.01562 3.90625,-2.30469 5.42969,-3.82812 4.29687,-4.29688 5.9375,-11.01563 4.88281,-20.195317 -0.82031,-7.226563 -3.63281,-12.382813 -8.39844,-15.46875 -2.42187,-1.601563 -5.58594,-2.695313 -9.45312,-3.359375 -1.44532,-0.234375 -3.125,-0.429688 -5.11719,-0.585938 l -2.5,0.164982 -2.39649,0.01057 c -1.48437,-0.117187 -2.48632,-0.05836 -2.91601,1.308823 -0.42969,1.289063 -0.23435,3.164062 0.66409,4.140625 -0.0391,0.234375 0,-0.273437 0,0 0,9.023438 0.19531,22.5 0.625,40.50781 z"
           style="font-style:normal;font-variant:normal;font-weight:normal;font-stretch:normal;font-size:80px;line-height:1.25;font-family:'Papaya Sunrise';-inkscape-font-specification:'Papaya Sunrise';fill:#008000"
           id="path3770"
           inkscape:connector-curvature="0"
           sodipodi:nodetypes="ccccccccccccccccccsccccccccccccccccscc" />
      </g>
    </a>
    <g
       aria-label="CONF"
       transform="matrix(0.93452793,0,0,0.93452793,66.693963,15.303318)"
       style="font-style:normal;font-weight:normal;line-height:0.01%;font-family:sans-serif;letter-spacing:0px;word-spacing:0px;fill:#008000;fill-opacity:1;stroke:none;stroke-width:1px;stroke-linecap:butt;stroke-linejoin:miter;stroke-opacity:1"
       id="flowRoot4202">
      <path
         d="m 183.57227,280.46164 c -0.23438,-0.70313 0.74219,0.42969 0,0 -0.74218,-0.42969 -2.92969,-2.26563 -3.75,-2.14844 -0.85938,0.11719 -1.5625,0.58594 -2.07032,1.40625 l -0.97656,1.48438 -0.97656,1.48437 c -0.74219,1.09375 -4.76563,3.51562 -5.46875,4.25781 -0.78125,0.82031 1.40625,-0.19531 0,0 -0.50781,0.0781 -1.13281,0.11719 -1.875,0.11719 h -0.9375 l -0.89844,-0.0391 c -2.42187,-0.0391 -4.41406,-0.39063 -5.97656,-1.01563 -2.07031,-0.82031 -3.47656,-2.1875 -4.25781,-4.0625 -0.66407,-1.60156 -1.05469,-3.51562 -1.21094,-5.78125 -0.0781,-0.82031 -0.11719,-1.83593 -0.11719,-2.96875 v -1.48437 l 0.0391,-1.48438 v -9.84375 l -0.0391,-9.80468 c -0.0391,-5.19532 0,-14.37501 0.0781,-23.00782 v 0 l -0.0781,-2.38281 c -0.0391,-1.99219 0,-3.59375 0.0391,-4.80469 0.15625,-3.75 0.85938,-6.75781 2.07032,-9.0625 1.09375,-2.07031 3.13171,-2.40172 5.35828,-3.18297 2.10937,-0.74219 3.93859,-1.81703 6.20422,-1.11394 2.14843,0.66406 4.10156,2.26562 5.85937,4.84375 1.67969,2.46094 2.57813,4.84375 2.69531,7.14844 0.0391,0.9375 0.42969,1.67968 1.09375,2.26562 0.58594,0.50781 0.96985,-0.51179 1.82922,-0.51179 0.82032,0 1.88172,1.0196 2.46766,0.51179 0.625,-0.54687 0.89844,-1.28906 0.85937,-2.26562 -0.11718,-3.16407 -1.01562,-6.13282 -2.69531,-8.94532 -1.60156,-2.73437 -3.67187,-4.96093 -6.21094,-6.71875 -2.61718,-1.75781 -5.42968,-2.77343 -8.35937,-3.00781 -3.16406,-0.23437 -6.17188,0.46875 -9.02344,2.14844 -2.8125,1.64062 -4.88281,4.10156 -6.21094,7.38281 -1.05468,2.53906 -1.71875,5.74219 -2.03125,9.64844 -0.27343,3.71094 -0.42968,8.24219 -0.39062,13.67187 l 0.0781,6.875 c 0.0391,2.89063 0.0781,5.15625 0.0781,6.83594 l 0.0391,12.34375 v 12.38281 c 0,3.39844 0.15625,6.09375 0.50781,8.125 0.50782,3.00782 1.52344,5.50782 2.96875,7.5 2.92969,4.10157 8.28125,6.09375 16.13282,6.05469 3.47656,-0.0391 6.28906,-0.82031 8.35937,-2.38281 1.17188,-0.89844 2.34375,-2.14844 3.51563,-3.75 0.42968,-0.54688 0.89843,-1.25 1.48437,-2.14844 l 1.36719,-2.14844 c 0.54687,-0.82031 0.70312,-1.60156 0.42969,-2.42187 z"
         style="font-style:normal;font-variant:normal;font-weight:normal;font-stretch:normal;font-size:80px;line-height:1.25;font-family:'Papaya Sunrise';-inkscape-font-specification:'Papaya Sunrise';fill:#008000"
         id="path3773"
         inkscape:connector-curvature="0"
         sodipodi:nodetypes="ccccccccscccccsccccccccccccccsccccccccccccsccccccccc" />
      <path
         d="m 200.0957,260.46164 -0.0391,-5.39063 -0.0781,-5.39062 0.54687,-23.08594 v -2.03125 l -0.0391,-2.10937 c 0.0391,-1.67969 0.15625,-3.04688 0.35156,-4.14063 0.66406,-3.39844 2.1875,-6.32812 4.57031,-8.71094 2.69532,-2.73437 5.625,-3.67187 8.78907,-2.8125 3.78906,1.01563 6.17187,4.02344 7.14843,8.98438 0.35157,1.75781 0.54688,3.90625 0.58594,6.44531 0.0391,0.82031 0.0391,1.875 0,3.08594 v 1.44531 c -0.0391,0.54688 -0.0391,1.01563 -0.0391,1.36719 0,3.51562 0,8.55469 0.0391,15.15625 l 0.0391,7.57812 v 7.57813 c 0,1.28906 0.0391,3.16406 0.11719,5.58594 l 0.0781,2.85156 0.0391,2.85156 c 0.0391,4.53125 -0.3125,8.28125 -0.97656,11.21094 -0.70313,3.00781 -2.57813,5.07812 -5.66407,6.21094 -2.69531,1.01562 -5.66406,1.13281 -8.82812,0.3125 -2.85156,-0.74219 -4.72656,-2.96875 -5.625,-6.71875 -0.3125,-1.32813 -0.54688,-2.96875 -0.66406,-4.92188 -0.0391,-0.625 -0.0391,-1.40625 -0.0781,-2.38281 l -0.0391,-1.09375 -0.0391,-1.05469 c -0.11719,-2.69531 -0.19532,-6.28906 -0.19532,-10.82031 z m 23.59375,28.78906 c 1.95313,-2.07031 3.24219,-4.76562 3.90625,-8.04687 0.58594,-3.00782 0.85938,-6.79688 0.85938,-11.32813 l -0.0781,-2.89062 -0.0391,-2.89063 c -0.0781,-2.46094 -0.11719,-4.33594 -0.11719,-5.66406 v -7.57813 l -0.0391,-7.57812 c -0.0391,-6.71875 -0.0391,-11.75781 0,-15.15625 v -3.08594 l -0.0391,-3.125 c -0.0781,-2.34375 -0.27344,-4.41406 -0.54688,-6.17187 -0.74218,-4.57032 -2.42187,-8.20313 -5.03906,-10.97657 -2.38281,-2.46093 -5.27344,-3.94531 -8.67187,-4.375 -3.39844,-0.46875 -6.5625,0.15625 -9.49219,1.875 -2.46094,1.44532 -4.64844,3.75 -6.5625,6.91407 -1.83594,3.04687 -2.92969,6.05468 -3.28125,9.02343 -0.15625,1.13282 -0.23438,2.53907 -0.27344,4.21875 v 2.10938 2.07031 l -0.54687,23.08594 0.0781,5.15625 0.0391,5.19531 c 0,4.45313 0.0391,7.89063 0.15625,10.35156 l 0.0391,1.21094 v 1.21094 c 0.0391,0.97656 0.0781,1.79687 0.11718,2.46094 0.11719,1.95312 0.27344,3.63281 0.50782,5.07812 0.625,3.86719 1.91406,6.875 3.82812,9.02344 3.78906,4.25781 9.57031,5.66406 17.34375,4.14062 3.20313,-0.625 5.82031,-2.03125 7.85156,-4.25781 z"
         style="font-style:normal;font-variant:normal;font-weight:normal;font-stretch:normal;font-size:80px;line-height:1.25;font-family:'Papaya Sunrise';-inkscape-font-specification:'Papaya Sunrise';fill:#008000"
         id="path3775" />
      <path
         d="m 266.9707,235.93039 0.46875,17.53906 c 0.19532,6.91406 -0.22492,6.14528 -0.10773,10.94997 l -21.7282,-60.32497 -1.13282,-3.51562 c -0.27343,-0.78125 -0.74218,-1.36719 -1.44531,-1.75782 -0.625,-0.35156 -3.20312,0.39062 -3.94531,0.46875 -0.74219,0.0781 0.50781,-0.50781 0,0 -0.54688,0.54688 -0.82031,1.25 -0.78125,2.10938 0.19531,11.91406 0.27344,26.75781 0.19531,44.53125 l -0.11719,22.22656 c -0.0391,8.94531 -0.0781,16.36719 -0.0781,22.26563 0,0.97656 0.3125,1.71875 0.97656,2.26562 0.58594,0.50781 1.32813,-0.65186 2.14844,-0.65186 0.85937,0 1.5625,1.15967 2.14844,0.65186 0.66406,-0.54687 0.97656,-1.28906 0.97656,-2.26562 l 0.0781,-17.26563 0.0781,-17.22656 c 0.0781,-14.41406 0.29633,-21.06168 0.25724,-29.65543 l 22.04743,62.11637 1.17187,3.47656 c 0.27344,0.82031 0.74219,1.40625 1.40625,1.79687 0.66406,0.35157 3.20313,-0.35156 3.94531,-0.46875 0.74219,-0.0781 -0.50781,0.50782 0,0 0.50782,-0.58593 0.78125,-1.28906 0.78125,-2.14843 0,-10.03907 -0.27343,-25.07813 -0.78125,-45.11719 l -0.3125,-11.28906 -0.23437,-11.28907 c -0.19531,-8.35937 -0.27344,-15.89843 -0.27344,-22.57812 0,-0.9375 -0.3125,-1.67969 -0.97656,-2.26563 -0.58594,-0.50781 -1.32813,0.5118 -2.14844,0.5118 -0.85937,0 -1.60156,-1.01961 -2.1875,-0.5118 -0.66406,0.58594 -0.97656,1.32813 -0.97656,2.26563 0.0391,9.25781 0.19531,20.97656 0.54687,35.15625 z"
         style="font-style:normal;font-variant:normal;font-weight:normal;font-stretch:normal;font-size:80px;line-height:1.25;font-family:'Papaya Sunrise';-inkscape-font-specification:'Papaya Sunrise';fill:#008000"
         id="path3777"
         inkscape:connector-curvature="0"
         sodipodi:nodetypes="cccccccscccscsccccccccccscccscscccc" />
      <path
         d="m 311.93164,243.23508 c 0.58854,-0.625 0.89589,-1.36719 -0.29359,-2.22657 -0.66492,-0.4804 0.8014,-1.52343 0.29359,-2.10937 -0.54687,-0.58594 -1.28906,-0.85938 -2.26562,-0.82031 l -4.375,0.3125 -4.41407,0.3125 c -3.55468,0.27343 -6.48437,0.46875 -8.78906,0.50781 -0.11719,-13.71094 -0.15625,-24.60938 -0.15625,-32.69531 1.75781,-0.0781 3.78906,-0.19532 6.09375,-0.39063 l 6.13281,-0.46875 c 5.03907,-0.39062 9.14063,-0.58594 12.22657,-0.625 0.9375,0 1.67968,-0.3125 2.26562,-0.97656 0.50781,-0.58594 -0.15351,-1.32813 -0.15351,-2.1875 0,-0.82031 0.66132,-1.5625 0.15351,-2.14844 -0.58594,-0.66406 -1.32812,-0.97656 -2.26562,-0.9375 -3.24219,0 -8.04688,0.27344 -14.41407,0.78125 l -3.63281,0.27344 -3.59375,0.23437 c -2.65625,0.19532 -5.07812,0.27344 -7.22656,0.27344 -1.5625,0.0391 -2.53906,0.78125 -2.89063,2.26563 -0.39062,1.44531 1.03574,2.39898 2.09047,3.21929 l -0.99674,21.15571 0.15625,20.97656 c 0.11719,18.55469 0.19532,32.5 0.19532,41.91406 0,0.97656 0.3125,1.71875 0.97656,2.30469 0.58594,0.50781 1.50726,-0.87006 2.32758,-0.87006 0.85937,0 1.38336,1.37787 1.96929,0.87006 0.66407,-0.58594 0.97657,-1.32813 0.97657,-2.30469 0,-6.44531 0,-13.86719 -0.0391,-22.1875 l -0.15625,-22.1875 c 2.30469,-0.0781 5.23438,-0.23437 8.78907,-0.50781 l 4.375,-0.35156 4.375,-0.3125 c 0.97656,-0.0391 1.71875,-0.42969 2.26562,-1.09375 z"
         style="font-style:normal;font-variant:normal;font-weight:normal;font-stretch:normal;font-size:80px;line-height:1.25;font-family:'Papaya Sunrise';-inkscape-font-specification:'Papaya Sunrise';fill:#008000"
         id="path3779"
         inkscape:connector-curvature="0"
         sodipodi:nodetypes="csccccccccccsccccccccccscscsccccccc" />
    </g>
    <g
       aria-label="1"
       transform="translate(60.178571,-0.08928579)"
       style="font-style:normal;font-weight:normal;line-height:0.01%;font-family:sans-serif;letter-spacing:0px;word-spacing:0px;fill:#cd0000;fill-opacity:1;stroke:none;stroke-width:1px;stroke-linecap:butt;stroke-linejoin:miter;stroke-opacity:1"
       id="flowRoot4210">
      <path
         d="m 357.4424,59.299232 c -0.20414,-2.960066 -1.8862,-3.903483 -4.23383,-5.638694 -2.65386,-1.735211 -5.52816,-3.25781 -8.38615,-1.522599 -6.83878,3.980779 -13.06512,6.736702 -18.78111,8.471913 -2.34764,0.714499 -3.01745,3.10682 -3.93609,5.148245 -0.91864,1.939354 -0.54722,3.523576 -0.0369,5.667072 0.61243,2.143496 0.19631,3.066372 1.93152,4.189156 1.83729,1.224855 3.98078,1.428997 6.32842,0.714498 3.67456,-1.122783 7.4512,-2.449709 11.22784,-4.18492 0.51035,24.803311 0.71449,59.303387 0.40828,103.296097 l -0.20414,25.82402 -0.10207,25.82403 c -0.10207,19.4956 0,36.64357 0.20414,51.64804 0,2.55178 0.81657,4.49114 2.55178,6.02221 1.53107,1.32692 3.70717,0.75558 5.95274,0.75558 2.1435,0 3.8461,0.57134 5.37717,-0.75558 1.73521,-1.53107 2.55178,-3.47043 2.44971,-6.02221 -0.20414,-15.6169 -0.30622,-33.58143 -0.20414,-54.09775 l 0.20414,-27.04888 0.20414,-27.04888 c 0.30621,-45.4217 0,-81.554923 -0.7145,-108.195516 0,-1.122784 0.26937,-2.127191 -0.24099,-3.045832 z"
         style="font-style:normal;font-variant:normal;font-weight:normal;font-stretch:normal;font-size:209.04190063px;line-height:1.25;font-family:'Papaya Sunrise';-inkscape-font-specification:'Papaya Sunrise';fill:#cd0000;fill-opacity:1"
         id="path3782"
         inkscape:connector-curvature="0"
         sodipodi:nodetypes="ccccccccccccccsccccccc" />
    </g>
    <flowRoot
       xml:space="preserve"
       id="flowRoot4231"
       style="font-style:normal;font-weight:normal;line-height:0.01%;font-family:sans-serif;letter-spacing:0px;word-spacing:0px;fill:#000000;fill-opacity:1;stroke:none;stroke-width:1px;stroke-linecap:butt;stroke-linejoin:miter;stroke-opacity:1"><flowRegion
         id="flowRegion4233"><rect
           id="rect4235"
           width="394.28571"
           height="44.285713"
           x="202.85715"
           y="566.64795" /></flowRegion><flowPara
         id="flowPara4237"
         style="font-size:40px;line-height:1.25">Cu</flowPara></flowRoot>    <g
       aria-label="Curitiba - PR Brazil"
       transform="matrix(1.091277,0,0,1.0351825,174.56507,-141.04742)"
       style="font-style:normal;font-weight:normal;line-height:0.01%;font-family:sans-serif;letter-spacing:0px;word-spacing:0px;fill:#000000;fill-opacity:1;stroke:none;stroke-width:1px;stroke-linecap:butt;stroke-linejoin:miter;stroke-opacity:1"
       id="flowRoot4239">
      <path
         d="m 221.81641,608.55601 c -0.11719,-0.35156 -0.60094,-0.20533 -0.97203,-0.42017 -0.37109,-0.21484 -0.49282,-0.71264 -0.90297,-0.65404 -0.42969,0.0586 -0.78125,0.29296 -1.03516,0.70312 l -0.48828,0.74219 -0.48828,0.74219 c -0.3711,0.54687 -0.74219,1.01562 -1.09375,1.38671 -0.39063,0.41016 -0.9375,0.64454 -1.64063,0.74219 -0.2539,0.0391 -0.5664,0.0586 -0.9375,0.0586 h -0.46875 l -0.44922,-0.0195 c -1.21093,-0.0195 -2.20703,-0.19531 -2.98828,-0.50781 -1.03515,-0.41015 -1.73828,-1.09375 -2.1289,-2.03125 -0.33204,-0.80078 -0.52735,-1.75781 -0.60547,-2.89062 -0.0391,-0.41016 -0.0586,-0.91797 -0.0586,-1.48438 v -0.74219 l 0.0195,-0.74218 v -4.92188 l -0.0195,-4.90234 c -0.0195,-2.59766 0,-6.05469 0.0391,-10.3711 v -1.13281 l -0.0391,-1.1914 c -0.0195,-0.9961 0,-1.79688 0.0195,-2.40235 0.0781,-1.875 0.42969,-3.3789 1.03516,-4.53125 0.54688,-1.03515 1.38672,-1.73828 2.5,-2.1289 1.05469,-0.3711 2.14844,-0.3711 3.28125,-0.0195 1.07422,0.33204 2.05078,1.13282 2.92969,2.42188 0.83984,1.23047 1.28906,2.42187 1.34765,3.57422 0.0195,0.46875 0.21485,0.83984 0.54688,1.13281 0.29297,0.25391 0.85109,-0.13252 1.28078,-0.13252 0.41016,0 0.57469,0.38643 0.86766,0.13252 0.3125,-0.27344 0.44922,-0.64453 0.42968,-1.13281 -0.0586,-1.58203 -0.50781,-3.06641 -1.34765,-4.47266 -0.80078,-1.36719 -1.83594,-2.48047 -3.10547,-3.35937 -1.30859,-0.87891 -2.71484,-1.38672 -4.17969,-1.50391 -1.58203,-0.11719 -3.08594,0.23438 -4.51172,1.07422 -1.40625,0.82031 -2.4414,2.05078 -3.10547,3.69141 -0.52734,1.26953 -0.85937,2.87109 -1.01562,4.82421 -0.13672,1.85547 -0.21484,4.1211 -0.19531,6.83594 l 0.0391,3.4375 c 0.0195,1.44531 0.0391,2.57813 0.0391,3.41797 l 0.0195,6.17188 v 6.1914 c 0,1.69922 0.0781,3.04688 0.25391,4.0625 0.25391,1.50391 0.76172,2.75391 1.48437,3.75 1.46485,2.05078 4.14063,3.04688 8.06641,3.02735 1.73828,-0.0195 3.14453,-0.41016 4.17969,-1.19141 0.58594,-0.44922 1.17187,-1.07422 1.75781,-1.875 0.21484,-0.27344 0.44922,-0.625 0.74219,-1.07422 l 0.68359,-1.07422 c 0.27344,-0.41015 0.35156,-0.80078 0.21485,-1.21094 z"
         style="font-style:normal;font-variant:normal;font-weight:normal;font-stretch:normal;font-size:40px;line-height:1.25;font-family:'Papaya Sunrise';-inkscape-font-specification:'Papaya Sunrise';text-align:center;text-anchor:middle"
         id="path3785"
         inkscape:connector-curvature="0"
         sodipodi:nodetypes="csccccccscccccsccccccccccccccsccccccccccccsccccccccc" />
      <path
         d="m 242.24609,577.05211 -0.0586,-2.46094 c -0.0586,-1.93359 -0.17578,-3.55469 -0.3125,-4.90234 -0.0586,-0.46875 -0.25391,-0.83985 -0.60547,-1.13282 -0.33203,-0.2539 -0.67195,0.0486 -1.08211,0.0486 -0.42969,0 -0.81242,-0.30248 -1.06633,-0.0486 -0.29297,0.27344 -0.42968,0.64454 -0.37109,1.13282 0.19531,1.8164 0.33203,4.02343 0.39062,6.64062 l 0.0781,3.32031 c 0.0195,1.42579 0.0586,2.53907 0.0781,3.32032 0.25391,9.04297 0.3711,15.9375 0.3711,20.68359 0,0.82031 -0.0195,1.50391 -0.0586,2.05078 -0.0586,0.78125 -0.15625,1.46485 -0.33203,2.07031 -0.41015,1.52344 -1.1914,2.57813 -2.36328,3.1836 -1.15234,0.625 -2.46094,0.74219 -3.92578,0.37109 -0.60547,-0.13672 -1.11328,-0.52734 -1.54297,-1.13281 -0.29297,-0.44922 -0.5664,-1.05469 -0.80078,-1.79688 -0.44922,-1.48437 -0.64453,-3.3789 -0.625,-5.66406 l 0.0391,-1.46484 0.0586,-1.44531 c 0.0586,-1.23047 0.0781,-2.1875 0.0781,-2.83204 l -0.0195,-5.23437 -0.0391,-3.84766 c -0.0391,-3.28125 -0.0586,-5.85937 -0.0586,-7.71484 0.0195,-3.73047 0.13672,-7.24609 0.3711,-10.50781 0.0195,-0.48828 -0.11719,-0.85938 -0.42969,-1.13282 -0.27344,-0.2539 -0.59383,0.19692 -1.00399,0.19692 -0.42968,0.0195 -0.83195,-0.45082 -1.14445,-0.19692 -0.33203,0.27344 -0.52734,0.64454 -0.5664,1.13282 -0.27344,4.0039 -0.39063,9.16015 -0.33203,15.42968 l 0.0391,3.86719 0.0391,5.23438 c 0.0195,3.00781 0.0195,5.58593 -0.0195,7.71484 -0.0586,4.16016 0.39062,7.22656 1.36719,9.23828 0.68359,1.38672 1.73828,2.36328 3.18359,2.92969 1.30859,0.48828 2.75391,0.60547 4.375,0.35156 3.02734,-0.46875 5.03906,-2.20703 6.01563,-5.21484 0.37109,-1.15235 0.625,-2.5586 0.74218,-4.21875 0.0391,-0.64453 0.0586,-1.38672 0.0781,-2.1875 v -2.12891 c -0.0586,-6.36719 -0.23438,-13.4375 -0.48828,-21.21094 z"
         style="font-style:normal;font-variant:normal;font-weight:normal;font-stretch:normal;font-size:40px;line-height:1.25;font-family:'Papaya Sunrise';-inkscape-font-specification:'Papaya Sunrise';text-align:center;text-anchor:middle"
         id="path3787"
         inkscape:connector-curvature="0"
         sodipodi:nodetypes="ccccscccccsccccccccccccccccccccccccccccccc" />
      <path
         d="m 257.40234,588.1068 c -1.17187,1.32812 -3.16406,2.53906 -5.95703,3.61328 0.0391,-8.30078 0.0586,-14.88282 0.0781,-19.72657 2.4414,0.44922 4.35547,1.09375 5.70312,1.95313 0.9961,0.625 1.69922,1.58203 2.08985,2.85156 0.29296,0.95703 0.42968,2.16797 0.41015,3.61328 -0.0586,3.4375 -0.83984,5.9961 -2.32422,7.69532 z m -1.8164,10.03906 0.60547,2.1289 0.625,2.12891 c 0.23437,0.74219 0.52734,1.60156 0.8789,2.59766 l 0.46875,1.28906 0.46875,1.28906 c 0.78125,2.10938 1.32813,3.84766 1.6211,5.23438 0.0976,0.46875 0.35156,0.80078 0.72265,0.97656 0.33203,0.17578 0.60962,-0.0565 1.01977,-0.1737 0.41016,-0.11718 0.81617,-0.0802 1.05054,-0.39273 0.25391,-0.37109 0.33204,-0.78125 0.23438,-1.25 -0.3125,-1.40625 -0.83984,-3.14453 -1.60156,-5.23437 l -0.46875,-1.28906 -0.46875,-1.28907 c -0.3711,-0.99609 -0.66407,-1.85547 -0.89844,-2.57812 -0.19531,-0.64453 -0.42969,-1.40625 -0.68359,-2.30469 l -0.66407,-2.28516 c -0.52734,-1.85546 -1.01562,-3.3789 -1.48437,-4.53125 1.11328,-0.72265 2.03125,-1.5039 2.79297,-2.36328 1.85547,-2.1289 2.87109,-5.35156 3.04687,-9.6875 0.17578,-3.86718 -0.91797,-6.73828 -3.26172,-8.61328 -1.1914,-0.9375 -2.71484,-1.67969 -4.57031,-2.20703 -0.72266,-0.21484 -1.5625,-0.41016 -2.51953,-0.58594 -0.56641,-0.0976 -1.40625,-0.23437 -2.51953,-0.41015 -0.78125,-0.11719 -0.86845,0.51152 -1.23954,1.23417 -0.3711,0.72266 -0.83077,0.97286 -0.36202,1.42208 l -0.0195,10.46875 -0.0586,10.44922 c -0.0586,9.23828 -0.0781,16.1914 -0.0781,20.89843 0,0.48828 0.15625,0.85938 0.48828,1.15235 0.29297,0.2539 0.66406,0.0773 1.07422,0.0773 0.42968,0 0.78125,0.17658 1.07421,-0.0773 0.33204,-0.29297 0.48829,-0.66407 0.48829,-1.15235 0.0195,-4.21875 0.0391,-10.23437 0.0781,-18.02734 1.09375,-0.41016 2.03125,-0.78125 2.8125,-1.11328 0.41016,1.11328 0.85938,2.51953 1.34766,4.21875 z"
         style="font-style:normal;font-variant:normal;font-weight:normal;font-stretch:normal;font-size:40px;line-height:1.25;font-family:'Papaya Sunrise';-inkscape-font-specification:'Papaya Sunrise';text-align:center;text-anchor:middle"
         id="path3789"
         inkscape:connector-curvature="0"
         sodipodi:nodetypes="ccccccccccccccccccccccccccccccccccccscscccccc" />
      <path
         d="m 271.03516,567.65758 c -0.29297,-0.25391 -0.60046,-0.1337 -1.03014,-0.1337 -0.41016,0 -0.82533,-0.12021 -1.1183,0.1337 -0.33203,0.29297 -0.48828,0.66406 -0.50781,1.13281 -0.0586,6.40625 -0.0195,13.69141 0.0781,21.85547 l 0.17578,10.91797 0.21485,10.91797 c 0,0.48828 0.17578,0.85937 0.50781,1.15234 0.29297,0.25391 0.66406,0.0743 1.07422,0.0743 0.42968,0 0.78125,0.17957 1.07422,-0.0743 0.33203,-0.29297 0.48828,-0.66406 0.46875,-1.15234 l -0.19532,-10.91797 -0.17578,-10.91797 c -0.0976,-8.16406 -0.13672,-15.44922 -0.0781,-21.85547 0,-0.46875 -0.15625,-0.83984 -0.48828,-1.13281 z"
         style="font-style:normal;font-variant:normal;font-weight:normal;font-stretch:normal;font-size:40px;line-height:1.25;font-family:'Papaya Sunrise';-inkscape-font-specification:'Papaya Sunrise';text-align:center;text-anchor:middle"
         id="path3791"
         inkscape:connector-curvature="0"
         sodipodi:nodetypes="csccccccscccccc" />
      <path
         d="m 285.19531,614.22008 c 0.29297,0.2539 0.70814,0.015 1.1183,0.015 0.42969,0 0.73717,0.23892 1.03014,-0.015 0.33203,-0.29297 0.48828,-0.66407 0.46875,-1.15235 l -0.13672,-9.66797 -0.15625,-12.42187 c -0.0977,-7.51953 -0.11719,-13.96484 -0.0195,-19.35547 v -0.0586 c 2.05078,-0.0586 3.73047,-0.11719 5.03906,-0.17578 0.46875,-0.0195 0.83985,-0.19532 1.13281,-0.52735 0.25391,-0.3125 0.0184,-0.62424 0.0184,-1.0344 0,-0.42969 0.23547,-0.8406 -0.0184,-1.13357 -0.29296,-0.3125 -0.66406,-0.44922 -1.13281,-0.42968 -4.21875,0.17578 -8.92578,0.29296 -14.12109,0.37109 -0.48828,0 -0.85938,0.15625 -1.15235,0.48828 -0.2539,0.29297 -0.0184,0.72341 -0.0184,1.1531 0,0.41016 -0.23547,0.7219 0.0184,1.01487 0.29297,0.3125 0.66407,0.46875 1.15235,0.46875 1.97265,-0.0195 3.96484,-0.0586 5.95703,-0.11719 -0.0977,5.41016 -0.0977,11.85547 0,19.35547 l 0.15625,12.40234 0.15625,9.66797 c 0,0.48828 0.17578,0.85938 0.50781,1.15235 z"
         style="font-style:normal;font-variant:normal;font-weight:normal;font-stretch:normal;font-size:40px;line-height:1.25;font-family:'Papaya Sunrise';-inkscape-font-specification:'Papaya Sunrise';text-align:center;text-anchor:middle"
         id="path3793"
         inkscape:connector-curvature="0"
         sodipodi:nodetypes="csccccccccsccccscccccccc" />
      <path
         d="m 301.66016,567.65758 c -0.29297,-0.25391 -0.60046,0.10371 -1.03014,0.10371 -0.41016,0 -0.82533,-0.35762 -1.1183,-0.10371 -0.33203,0.29297 -0.48828,0.66406 -0.50781,1.13281 -0.0586,6.40625 -0.0195,13.69141 0.0781,21.85547 l 0.17578,10.91797 0.21485,10.91797 c 0,0.48828 0.17578,0.85937 0.50781,1.15234 0.29297,0.25391 0.75223,-0.0444 1.16239,-0.0444 0.42968,0 0.69308,0.29828 0.98605,0.0444 0.33203,-0.29297 0.48828,-0.66406 0.46875,-1.15234 l -0.19532,-10.91797 -0.17578,-10.91797 c -0.0976,-8.16406 -0.13672,-15.44922 -0.0781,-21.85547 0,-0.46875 -0.15625,-0.83984 -0.48828,-1.13281 z"
         style="font-style:normal;font-variant:normal;font-weight:normal;font-stretch:normal;font-size:40px;line-height:1.25;font-family:'Papaya Sunrise';-inkscape-font-specification:'Papaya Sunrise';text-align:center;text-anchor:middle"
         id="path3795"
         inkscape:connector-curvature="0"
         sodipodi:nodetypes="csccccccscccccc" />
      <path
         d="m 316.44531,610.27476 c -1.44531,0.91797 -2.98828,1.34766 -4.60937,1.32813 -0.0195,-5.01953 5.5e-4,-11.67514 -0.25336,-20.69858 2.44141,0.27344 4.14008,0.40561 5.44867,1.10874 1.89453,1.01562 2.96875,3.08593 3.24219,6.1914 0.0781,0.91797 0.13672,1.6211 0.15625,2.12891 0.0586,0.80078 0.0586,1.52344 0.0391,2.16797 -0.0586,1.62109 -0.33203,3.00781 -0.83984,4.17968 -0.64454,1.46485 -1.69922,2.67579 -3.1836,3.59375 z m 1.69922,-27.24609 c -1.11328,2.24609 -3.17803,2.99948 -6.61553,3.58542 -0.21484,-6.875 -0.55244,-11.78854 -0.5915,-16.04636 1.69922,0 3.08594,0.17578 4.17969,0.52735 1.71875,0.54687 2.91015,2.08984 3.59375,4.6289 0.72265,2.69532 0.54687,5.13672 -0.56641,7.30469 z m 1.25,6.77734 c -0.64453,-0.50781 -1.42578,-0.9375 -2.34375,-1.26953 1.26953,-0.74218 2.32422,-1.69922 3.125,-2.85156 1.73828,-2.48047 2.36328,-5.64453 1.83594,-9.45312 -0.21485,-1.58204 -0.6836,-3.00782 -1.40625,-4.27735 -0.80078,-1.38672 -1.83594,-2.4414 -3.10547,-3.20312 -1.07422,-0.64453 -2.40234,-1.03516 -4.02344,-1.21094 -0.64453,-0.0781 -1.34765,-0.11719 -2.14844,-0.11719 h -1.05468 l -1.05469,0.0195 c -0.625,0.0195 -0.80972,0.37185 -1.08316,0.8992 -0.23437,0.50781 -0.49887,0.95627 -0.2645,1.46408 -0.0586,0.15625 -0.0781,0.33204 -0.0781,0.50782 0.0391,3.14453 0.11719,6.73828 0.21484,10.78125 l 0.13672,5.39062 0.15625,5.39063 c 0.27344,9.19922 0.41016,16.40625 0.41016,21.58203 0,0.68359 0.48883,0.7767 1.0943,1.03061 0.5664,0.21484 0.91742,0.53189 1.4057,0.21939 2.01172,0.21484 4.0039,-0.21485 5.97656,-1.25 1.85547,-0.9961 3.37891,-2.38281 4.55078,-4.1211 0.95703,-1.42578 1.54297,-3.24218 1.75781,-5.41015 0.13672,-1.42578 0.11719,-3.33985 -0.0976,-5.72266 -0.3125,-3.78906 -1.64063,-6.58203 -4.00391,-8.39844 z"
         style="font-style:normal;font-variant:normal;font-weight:normal;font-stretch:normal;font-size:40px;line-height:1.25;font-family:'Papaya Sunrise';-inkscape-font-specification:'Papaya Sunrise';text-align:center;text-anchor:middle"
         id="path3797"
         inkscape:connector-curvature="0"
         sodipodi:nodetypes="cccccccccccccccccccccccsccccccccscccccccc" />
      <path
         d="m 338.04687,576.75914 c 0.33204,1.71875 0.74219,3.86719 1.19141,6.46484 l 0.58594,3.22266 0.58594,3.22266 1.85546,10.19531 c -0.91796,-0.0195 -2.28515,-0.0195 -4.08203,0.0391 l -2.05078,0.0586 c -0.76172,0.0195 -1.42578,0 -2.03125,-0.0195 0.9961,-5.85937 2.30469,-13.59375 3.94531,-23.18359 z m 7.61719,23.92578 -2.14844,-11.85547 -0.9375,-5.2539 -0.95703,-5.25391 c -0.76172,-4.04297 -1.48437,-7.51953 -2.20703,-10.44922 -0.17578,-0.74219 -0.70312,-0.3019 -1.58203,-0.32143 -0.87891,-0.0195 -1.38672,-0.45982 -1.52344,0.32143 l -1.91406,11.21094 -1.91406,11.1914 c -1.46485,8.59375 -2.71485,16.07422 -3.75,22.42188 -0.0781,0.48828 0.0195,0.89844 0.3125,1.26953 0.2539,0.33203 0.76227,0.2103 1.17242,0.32748 0.42969,0.11719 0.62445,0.43421 0.95648,0.25841 0.3711,-0.19531 0.60547,-0.52735 0.6836,-0.9961 l 1.71875,-10.42968 c 0.68359,0.0391 1.44531,0.0586 2.30469,0.0391 l 2.32421,-0.0586 c 2.05079,-0.0586 3.59375,-0.0586 4.62891,0 l 1.93359,10.70312 c 0.0977,0.46875 0.33204,0.80078 0.70313,0.99609 0.33203,0.17579 0.54633,-0.22014 0.95648,-0.33736 0.42969,-0.0977 0.93805,0.0834 1.17243,-0.2486 0.27343,-0.3711 0.37109,-0.78125 0.29296,-1.26953 l -1.91406,-10.56641 c 0.19531,-0.60547 0.0977,-1.17188 -0.3125,-1.69922 z"
         style="font-style:normal;font-variant:normal;font-weight:normal;font-stretch:normal;font-size:40px;line-height:1.25;font-family:'Papaya Sunrise';-inkscape-font-specification:'Papaya Sunrise';text-align:center;text-anchor:middle"
         id="path3799"
         inkscape:connector-curvature="0"
         sodipodi:nodetypes="cccccccccccccccccccccccccccccccccccc" />
      <path
         d="m 221.63238,634.29463 c -0.22566,1.50391 -0.85249,2.71485 -1.85543,3.65235 -1.02801,0.91797 -2.43213,1.60156 -4.23742,2.05078 -1.37904,0.33203 -2.49305,-0.4621 -4.47385,-0.38397 -0.20058,-6.9336 -0.86681,-11.58869 -0.86681,-15.94416 3.00882,0.19532 5.34066,0.58594 6.97044,1.17188 2.28168,0.83984 3.71086,2.65625 4.28756,5.46875 0.30088,1.46484 0.35103,2.79297 0.17551,3.98437 z m -0.50146,26.52344 c -2.2817,1.50391 -5.01904,1.63078 -9.50718,1.88469 -0.025,-4.41406 -0.77296,-10.08781 -1.02369,-18.58391 l 1.2286,0.17578 1.20353,0.17578 c 0.97786,0.13672 1.78021,0.27344 2.45719,0.39063 1.83038,0.33203 3.41,0.72266 4.68875,1.19141 2.93359,1.05468 4.56338,3.125 4.88933,6.21093 0.40117,3.67188 -0.90264,6.52344 -3.93653,8.55469 z m -14.5677,-17.1875 c 0.27581,9.00391 0.40118,15.74219 0.40118,20.23438 0,0.44921 0.17551,0.80078 0.55162,1.09375 -0.0752,0.44921 0.0502,0.85937 0.3761,1.1914 0.37609,0.3711 0.87757,0.54688 1.55455,0.52735 6.0427,-0.17579 10.7816,-1.3086 14.16652,-3.4375 3.88638,-2.40235 5.71675,-5.91797 5.51616,-10.52735 -0.17551,-4.02344 -2.03095,-6.95312 -5.61646,-8.80859 -1.25367,-0.64453 -2.80823,-1.19141 -4.63859,-1.6211 1.32889,-0.50781 2.50735,-1.15234 3.48522,-1.91406 2.75807,-2.14844 3.81117,-5.50781 3.13417,-10.09765 -0.52653,-3.61329 -2.33182,-6.19141 -5.3908,-7.73438 -1.55454,-0.80078 -3.58549,-1.34766 -6.06777,-1.67969 -0.92772,-0.11718 -2.00588,-0.21484 -3.28463,-0.29297 l -1.6047,-0.0976 -1.57963,-0.0977 c -0.95279,-0.0586 -1.10183,0.55066 -1.37763,1.23425 -0.27582,0.64453 -0.55299,0.91419 0.0236,1.40247 -0.025,0.11719 -0.0502,0.23438 -0.0502,0.37109 0,4.51172 0.12542,11.25 0.40117,20.25391 z"
         style="font-style:normal;font-variant:normal;font-weight:normal;font-stretch:normal;font-size:40px;line-height:1.25;font-family:'Papaya Sunrise';-inkscape-font-specification:'Papaya Sunrise';text-align:center;text-anchor:middle;stroke-width:1.13303232px"
         id="path3807"
         inkscape:connector-curvature="0"
         sodipodi:nodetypes="ccccccccccccccccccsccccccccccccccccscc" />
      <path
         d="m 248.21028,640.19307 c -1.50442,1.32813 -3.38282,1.23334 -6.96833,2.30756 0.0502,-8.30078 -0.60387,-13.57709 -0.57883,-18.42084 3.13419,0.44922 5.59138,1.09375 7.32145,1.95312 1.27875,0.625 2.18139,1.58204 2.68287,2.85157 0.3761,0.95703 0.55162,2.16797 0.52653,3.61328 -0.0752,3.4375 -1.07815,5.99609 -2.98373,7.69531 z m -2.33184,10.03906 0.77728,2.12891 0.80235,2.12891 c 0.30087,0.74218 0.67698,1.60156 1.1283,2.59765 l 0.60176,1.28906 0.60176,1.28907 c 1.00294,2.10937 1.70501,3.84765 2.08111,5.23437 0.1253,0.46875 0.45132,0.80078 0.92771,0.97656 0.42626,0.17579 0.84607,-0.22014 1.37261,-0.33736 0.52654,-0.11719 0.9843,0.0834 1.28519,-0.22907 0.32595,-0.3711 0.42625,-0.78125 0.30088,-1.25 -0.40118,-1.40625 -1.07816,-3.14453 -2.05603,-5.23438 l -0.60176,-1.28906 -0.60176,-1.28906 c -0.47639,-0.9961 -0.8525,-1.85547 -1.15339,-2.57813 -0.25073,-0.64453 -0.55162,-1.40625 -0.87756,-2.30468 l -0.8525,-2.28516 c -0.67699,-1.85547 -1.30383,-3.37891 -1.90559,-4.53125 1.42919,-0.72266 2.60764,-1.50391 3.58551,-2.36328 2.38198,-2.12891 3.6858,-5.35156 3.91146,-9.6875 0.22567,-3.86719 -1.17845,-6.73828 -4.18726,-8.61328 -1.52949,-0.9375 -3.48523,-1.67969 -5.86721,-2.20703 -0.92771,-0.21485 -2.00588,-0.41016 -3.23447,-0.58594 -0.72713,-0.0977 -1.8053,-0.23438 -3.23448,-0.41016 -1.00294,-0.11719 -2.55537,0.0882 -2.23154,0.89844 0.44296,1.10833 -0.42625,1.30859 0.17552,1.75781 l -0.025,10.46875 -0.0752,10.44922 c -0.0752,9.23828 -0.10026,16.19141 -0.10026,20.89844 0,0.48828 0.20059,0.85937 0.62684,1.15234 0.3761,0.25391 0.85249,-0.0444 1.37904,-0.0444 0.55162,0 1.00294,0.29827 1.37904,0.0444 0.42625,-0.29297 0.62684,-0.66406 0.62684,-1.15234 0.025,-4.21875 0.0502,-10.23438 0.10026,-18.02735 1.40412,-0.41015 2.60764,-0.78125 3.61058,-1.11328 0.52655,1.11328 1.10324,2.51953 1.73008,4.21875 z"
         style="font-style:normal;font-variant:normal;font-weight:normal;font-stretch:normal;font-size:40px;line-height:1.25;font-family:'Papaya Sunrise';-inkscape-font-specification:'Papaya Sunrise';text-align:center;text-anchor:middle;stroke-width:1.13303232px"
         id="path3809"
         inkscape:connector-curvature="0"
         sodipodi:nodetypes="ccccccccccccccccccccccccccccccccscccscscccccc" />
      <path
         d="m 274.31177,628.84541 c 0.42625,1.71875 0.95278,3.86719 1.52947,6.46485 l 0.75221,3.22265 0.75221,3.22266 1.98584,10.01726 c -2.91326,-0.92919 -2.53746,0.15855 -4.84422,0.21715 l -2.63272,0.0586 c -0.97786,0.0195 -1.37763,-0.47481 -2.15491,-0.49431 1.27875,-5.85938 2.50594,-13.11894 4.61212,-22.70879 z m 9.77865,23.92579 -2.75808,-11.85547 -1.20352,-5.25391 -1.2286,-5.25391 c -0.97787,-4.04296 -1.90559,-7.51953 -2.83332,-10.44921 -0.22566,-0.74219 -0.84605,-0.59866 -1.97436,-0.61819 -1.1283,-0.0195 -1.83681,-0.16306 -2.01231,0.61819 l -2.45721,11.21093 -2.4572,11.19141 c -1.8805,8.59375 -3.48521,16.07422 -4.81411,22.42187 -0.10026,0.48829 0.025,0.89844 0.40118,1.26954 0.32596,0.33203 0.75221,0.21029 1.27874,0.32748 0.55162,0.11719 1.02803,0.43421 1.45427,0.25841 0.47639,-0.19531 0.77728,-0.52734 0.87757,-0.99609 l 2.20647,-10.42969 c 0.87756,0.0391 1.85543,0.0586 2.95867,0.0391 l 2.98375,-0.0586 c 2.63271,-0.0586 4.61352,-0.0586 5.9424,0 l 2.48228,10.70313 c 0.1253,0.46875 0.36966,0.50403 0.84606,0.69934 0.42624,0.17578 0.92772,0.19531 1.45425,0.0781 0.55162,-0.0976 1.03446,-0.0353 1.33535,-0.36731 0.35103,-0.37109 0.47639,-0.78125 0.3761,-1.26953 l -2.45721,-10.56641 c 0.25075,-0.60546 0.12542,-1.17187 -0.40117,-1.69921 z"
         style="font-style:normal;font-variant:normal;font-weight:normal;font-stretch:normal;font-size:40px;line-height:1.25;font-family:'Papaya Sunrise';-inkscape-font-specification:'Papaya Sunrise';text-align:center;text-anchor:middle;stroke-width:1.13303232px"
         id="path3811"
         inkscape:connector-curvature="0"
         sodipodi:nodetypes="cccccccccccccccccccccccccccccccccccc" />
      <path
         d="m 309.2642,621.57979 c -1.50442,-0.0195 -3.73596,-0.0781 -6.69462,-0.19531 l -3.35985,-0.13672 c -1.2286,-0.0391 -2.35691,-0.0586 -3.35985,-0.0781 -0.60176,0 -1.07815,0.15625 -1.45426,0.48828 -0.32596,0.29297 -0.25003,0.58519 -0.25003,1.01487 0,0.42969 -0.0759,0.8406 0.25003,1.13357 0.37611,0.33203 0.8525,0.48828 1.45426,0.50781 1.45426,0 3.43507,0.0586 5.91735,0.15625 l 2.93359,0.13672 2.27958,0.37485 -13.28684,38.98059 -0.0502,0.13672 c -0.17551,0.48828 -0.0502,0.95703 0.35104,1.36719 0.40117,0.41015 0.92771,0.625 1.6047,0.625 h 13.38924 c 0.62684,0 1.10323,-0.15625 1.47933,-0.48828 0.32596,-0.29297 -0.0329,-0.66407 -0.0329,-1.07422 0,-0.42969 0.35889,-0.78125 0.0329,-1.07422 -0.3761,-0.33203 -0.85249,-0.50781 -1.47933,-0.50781 l -9.85106,-0.53416 13.08554,-38.82131 0.0502,-0.13672 c 0.22566,-0.66406 0.025,-1.19141 -0.6519,-1.60156 -0.62684,-0.3711 -1.3289,-0.44922 -2.05604,-0.25391 z"
         style="font-style:normal;font-variant:normal;font-weight:normal;font-stretch:normal;font-size:40px;line-height:1.25;font-family:'Papaya Sunrise';-inkscape-font-specification:'Papaya Sunrise';text-align:center;text-anchor:middle;stroke-width:1.13303232px"
         id="path3813"
         inkscape:connector-curvature="0"
         sodipodi:nodetypes="cccccsccccccccsscscscccccc" />
      <path
         d="m 322.37762,619.74385 c -0.3761,-0.2539 -0.82742,0.28177 -1.37904,0.28177 -0.52654,0 -1.00294,-0.53567 -1.37903,-0.28177 -0.42626,0.29297 -0.62685,0.66406 -0.65192,1.13281 -0.0752,6.40625 -0.025,13.69141 0.10026,21.85547 l 0.22566,10.91797 0.2758,10.91797 c 0,0.48828 0.22566,0.85938 0.65192,1.15234 0.37609,0.25391 0.96569,-0.10371 1.49222,-0.10371 0.55162,0 0.88975,0.35762 1.26586,0.10371 0.42624,-0.29296 0.62683,-0.66406 0.60176,-1.15234 l -0.25073,-10.91797 -0.22566,-10.91797 c -0.12543,-8.16406 -0.17552,-15.44922 -0.10026,-21.85547 0,-0.46875 -0.20059,-0.83984 -0.62684,-1.13281 z"
         style="font-style:normal;font-variant:normal;font-weight:normal;font-stretch:normal;font-size:40px;line-height:1.25;font-family:'Papaya Sunrise';-inkscape-font-specification:'Papaya Sunrise';text-align:center;text-anchor:middle;stroke-width:1.13303232px"
         id="path3815"
         inkscape:connector-curvature="0"
         sodipodi:nodetypes="csccccccscccccc" />
      <path
         d="m 346.67382,667.4587 c 0.60177,0.0195 1.07817,-0.13672 1.45427,-0.44922 0.32595,-0.29297 0.0236,-0.58518 0.0236,-1.01487 0,-0.41016 0.30229,-0.8406 -0.0236,-1.13357 -0.3761,-0.33203 -0.8525,-0.52734 -1.45427,-0.54688 l -11.9522,-0.86619 c 0.12543,-1.26953 -0.28366,-2.23927 -0.2335,-4.01662 l 0.025,-2.26562 0.025,-2.26563 0.22566,-10.91797 c 0.15044,-8.41797 0.22566,-15.9375 0.25073,-22.57812 0,-0.48828 -0.20059,-0.85938 -0.62684,-1.15235 -0.3761,-0.2539 -0.90908,0.22242 -1.4607,0.22242 -0.52654,0 -0.94635,-0.47632 -1.32246,-0.22242 -0.42624,0.29297 -0.62683,0.66407 -0.62683,1.15235 0,6.30859 -0.0752,13.63281 -0.22566,21.97265 l -0.22566,10.91797 -0.025,2.79297 -0.0502,2.8125 c -0.0752,2.16797 -0.22567,4.02344 -0.45133,5.58594 -0.0634,0.34546 0.0529,0.68444 0.38196,0.94158 0.19473,0.15217 0.12349,0.10288 0.19473,0.15217 0.42625,0.29297 0.90265,0.44922 1.42919,0.46875 z"
         style="font-style:normal;font-variant:normal;font-weight:normal;font-stretch:normal;font-size:40px;line-height:1.25;font-family:'Papaya Sunrise';-inkscape-font-specification:'Papaya Sunrise';text-align:center;text-anchor:middle;stroke-width:1.13303232px"
         id="path3817"
         inkscape:connector-curvature="0"
         sodipodi:nodetypes="ccscccccccccscscccccsccc" />
    </g>
  </g>
</svg>
