﻿"before","whattodo","coming","online"
"Yes","As an online-only conference","1","Yes"
"Yes","As an online-only conference","1","Yes"
"No","As an online-only conference","1","Yes"
"No","As an online-only conference","1","No"
"No","As an online-only conference","1","Yes"
"No","As an online-only conference","1","Yes"
"No","As an in-person conference with video streaming (as usual)","3","Yes"
"Yes","As an in-person conference with video streaming (as usual)","4","Yes"
"No","As an online-only conference","1","Yes"
"No","As an online-only conference","1","Yes"
"No","As an online-only conference","1","Yes"
"Yes","As an online-only conference","1","Yes"
"No","As an online-only conference","1","Yes"
"Yes","As an online-only conference","4","Yes"
"No","Cancelled (no DebConf in 2020)","1","No"
"Yes","As an in-person conference with video streaming (as usual)","3","Yes"
"No","As an in-person conference with video streaming (as usual)","1","No"
"No","As an online-only conference","2","Yes"
"Yes","As an in-person conference with video streaming (as usual)","4","Yes"
"No","As an online-only conference","1","Yes"
"Yes","As an online-only conference","4","Yes"
"No","As an online-only conference","1","Yes"
"Yes","As an in-person conference with video streaming (as usual)","4","No"
"No","As an in-person conference with video streaming (as usual)","1","No"
"No","Cancelled (no DebConf in 2020)","1","Yes"
"Yes","Cancelled (no DebConf in 2020)","1","No"
"No","As an online-only conference","3","Yes"
"No","As an online-only conference","1","Yes"
"No","As an online-only conference","2","Yes"
"Yes","As an online-only conference","1","Yes"
"No","As an online-only conference","1","No"
"No","As an online-only conference","3","Yes"
"No","As an online-only conference","1","Yes"
"No","As an online-only conference","1","No"
"Yes","Cancelled (no DebConf in 2020)","1","Yes"
"Yes","As an online-only conference","3","Yes"
"No","As an online-only conference","1","Yes"
"Yes","As an online-only conference","2","Yes"
"No","Cancelled (no DebConf in 2020)","2","No"
"No","As an online-only conference","1","Yes"
"Yes","As an in-person conference with video streaming (as usual)","2","Yes"
"Yes","Cancelled (no DebConf in 2020)","4","No"
"No","As an online-only conference","1","No"
"No","As an online-only conference","1","Yes"
"No","As an online-only conference","1","Yes"
"No","As an online-only conference","2","Yes"
"Yes","As an in-person conference with video streaming (as usual)","5","No"
"Yes","Cancelled (no DebConf in 2020)","4","Yes"
"No","Cancelled (no DebConf in 2020)","1","No"
"No","Cancelled (no DebConf in 2020)","1","Yes"
"Yes","As an online-only conference","1","Yes"
"No","As an online-only conference","1","No"
"No","Cancelled (no DebConf in 2020)","1","Yes"
"No","As an online-only conference","1","Yes"
"Yes","Cancelled (no DebConf in 2020)","2","Yes"
"No","As an online-only conference","1","Yes"
"Yes","As an online-only conference","5","Yes"
"Yes","As an in-person conference with video streaming (as usual)","5","No"
"No","As an online-only conference","1","Yes"
"No","As an online-only conference","1","Yes"
"No","As an online-only conference","1","Yes"
"Yes","Cancelled (no DebConf in 2020)","2","No"
"No","As an online-only conference","1","Yes"
"Yes","As an online-only conference","1","Yes"
"No","As an online-only conference","1","Yes"
"No","As an online-only conference","1","No"
"No","Cancelled (no DebConf in 2020)","1","Yes"
"No","As an online-only conference","1","Yes"
"No","As an online-only conference","1","Yes"
"Yes","As an in-person conference with video streaming (as usual)","5","No"
"No","As an online-only conference","1","Yes"
"No","As an online-only conference","1","Yes"
"No","As an online-only conference","1","Yes"
"Yes","As an online-only conference","3","Yes"
"Yes","As an online-only conference","1","Yes"
"Yes","As an in-person conference with video streaming (as usual)","3","Yes"
"No","As an online-only conference","1","Yes"
"No","As an online-only conference","3","Yes"
"No","As an online-only conference","1","Yes"
"No","As an online-only conference","1","Yes"
"No","As an online-only conference","1","Yes"
"No","As an online-only conference","1","Yes"
"Yes","Cancelled (no DebConf in 2020)","2","Yes"
"No","As an online-only conference","2","Yes"
"No","Cancelled (no DebConf in 2020)","1","No"
"Yes","As an in-person conference with video streaming (as usual)","5","Yes"
"Yes","As an online-only conference","1","No"
"No","As an online-only conference","1","No"
"Yes","As an online-only conference","3","Yes"
"No","As an online-only conference","1","Yes"
"Yes","As an online-only conference","2","Yes"
"Yes","As an online-only conference","1","No"
"No","Cancelled (no DebConf in 2020)","1","No"
"No","As an online-only conference","1","Yes"
"No","As an online-only conference","1","Yes"
"Yes","As an in-person conference with video streaming (as usual)","2","Yes"
"No","As an online-only conference","1","Yes"
"No","Cancelled (no DebConf in 2020)","1","Yes"
"No","As an online-only conference","1","Yes"
"No","As an online-only conference","1","Yes"
"No","As an online-only conference","1","Yes"
"No","As an online-only conference","1","Yes"
"Yes","As an in-person conference with video streaming (as usual)","5","Yes"
"No","Cancelled (no DebConf in 2020)","2","No"
"Yes","As an online-only conference","1","Yes"
"No","As an online-only conference","2","Yes"
"No","As an online-only conference","1","Yes"
"No","As an online-only conference","1","Yes"
"No","As an online-only conference","2","Yes"
"No","As an online-only conference","1","No"
"Yes","Cancelled (no DebConf in 2020)","2","Yes"
"No","As an online-only conference","1","Yes"
"No","As an online-only conference","1","Yes"
"Yes","As an in-person conference with video streaming (as usual)","3","Yes"
"No","As an online-only conference","1","No"
"No","As an online-only conference","1","No"
"Yes","As an online-only conference","1","Yes"
"Yes","As an online-only conference","1","Yes"
"No","As an online-only conference","1","No"
"Yes","As an online-only conference","1","Yes"
"No","As an online-only conference","1","No"
"Yes","As an online-only conference","1","Yes"
"No","As an online-only conference","3","Yes"
"Yes","As an in-person conference with video streaming (as usual)","5","Yes"
"No","As an online-only conference","1","No"
"No","As an online-only conference","1","No"
"No","As an in-person conference with video streaming (as usual)","1","No"
"No","As an online-only conference","1","Yes"
"No","As an online-only conference","1","Yes"
"No","As an online-only conference","1","Yes"
"No","As an online-only conference","1","Yes"
"No","As an online-only conference","1","Yes"
"No","Cancelled (no DebConf in 2020)","1","Yes"
"No","As an online-only conference","1","Yes"
"Yes","Cancelled (no DebConf in 2020)","2","Yes"
"No","As an online-only conference","1","Yes"
"No","Cancelled (no DebConf in 2020)","1","Yes"
"Yes","Cancelled (no DebConf in 2020)","1","No"
"No","As an online-only conference","1","Yes"
"Yes","Cancelled (no DebConf in 2020)","2","No"
"Yes","As an online-only conference","5","Yes"
"No","As an online-only conference","1","Yes"
"No","As an online-only conference","1","No"
"Yes","Cancelled (no DebConf in 2020)","1","No"
"No","Cancelled (no DebConf in 2020)","1","Yes"
"No","As an online-only conference","1","Yes"
"Yes","Cancelled (no DebConf in 2020)","1","Yes"
"Yes","As an online-only conference","1","Yes"
"Yes","As an online-only conference","1","Yes"
"Yes","As an online-only conference","1","Yes"
"No","As an online-only conference","1","Yes"
"No","As an online-only conference","1","Yes"
"Yes","As an online-only conference","1","Yes"
"No","As an online-only conference","1","No"
"Yes","As an in-person conference with video streaming (as usual)","4","Yes"
"Yes","As an online-only conference","2","Yes"
"No","As an online-only conference","1","Yes"
"No","As an online-only conference","1","Yes"
"No","As an online-only conference","1","Yes"
"No","As an online-only conference","1","Yes"
"No","As an online-only conference","1","No"
"Yes","As an online-only conference","2","Yes"
"Yes","As an online-only conference","1","Yes"
"No","As an online-only conference","1","Yes"
"No","As an online-only conference","1","Yes"
"No","As an online-only conference","1","Yes"
"Yes","As an online-only conference","2","Yes"
"No","Cancelled (no DebConf in 2020)","1","No"
"No","Cancelled (no DebConf in 2020)","1","Yes"
"Yes","As an online-only conference","1","Yes"
"No","As an online-only conference","1","Yes"
"No","As an online-only conference","1","Yes"
"No","Cancelled (no DebConf in 2020)","1","No"
"No","As an online-only conference","1","Yes"
"No","As an online-only conference","1","Yes"
"No","As an online-only conference","1","Yes"
"No","As an online-only conference","1","Yes"
"No","As an online-only conference","1","Yes"
"No","As an online-only conference","1","Yes"
"No","As an online-only conference","1","No"
"Yes","As an in-person conference with video streaming (as usual)","5","Yes"
"No","As an online-only conference","1","No"
"Yes","As an online-only conference","2","Yes"
"No","Cancelled (no DebConf in 2020)","1","Yes"
"No","Cancelled (no DebConf in 2020)","1","No"
"No","Cancelled (no DebConf in 2020)","1","Yes"
"Yes","As an in-person conference with video streaming (as usual)","4","No"
"No","As an online-only conference","1","Yes"
"No","As an online-only conference","3","No"
"No","Cancelled (no DebConf in 2020)","1","Yes"
"No","As an online-only conference","1","Yes"
"No","As an online-only conference","1","No"
"No","Cancelled (no DebConf in 2020)","1","Yes"
"No","As an online-only conference","1","Yes"
"Yes","As an online-only conference","4","Yes"
"No","As an online-only conference","2","Yes"
"No","As an online-only conference","1","Yes"
"Yes","As an in-person conference with video streaming (as usual)","3","Yes"
"No","As an online-only conference","1","Yes"
"No","As an online-only conference","2","Yes"
"Yes","As an online-only conference","1","Yes"
"No","As an online-only conference","1","No"
"Yes","As an online-only conference","3","Yes"
"No","As an online-only conference","1","Yes"
"Yes","As an online-only conference","1","Yes"
"Yes","As an online-only conference","1","Yes"
"Yes","As an online-only conference","5","Yes"
"Yes","Cancelled (no DebConf in 2020)","1","Yes"
"No","Cancelled (no DebConf in 2020)","1","No"
"Yes","As an online-only conference","5","Yes"
"No","As an online-only conference","1","Yes"
"No","As an online-only conference","1","Yes"
"Yes","Cancelled (no DebConf in 2020)","2","No"
"No","As an online-only conference","1","No"
"Yes","Cancelled (no DebConf in 2020)","1","Yes"
"Yes","As an online-only conference","1","Yes"
"No","As an online-only conference","1","Yes"
"No","As an online-only conference","2","Yes"
"Yes","As an online-only conference","2","Yes"
"No","As an online-only conference","1","Yes"
"No","As an online-only conference","1","Yes"
"Yes","As an online-only conference","1","Yes"
"No","As an online-only conference","1","Yes"
"No","As an online-only conference","1","Yes"
"Yes","As an online-only conference","2","Yes"
"Yes","As an online-only conference","1","Yes"
"Yes","As an online-only conference","1","Yes"
"No","As an online-only conference","1","Yes"
"No","As an online-only conference","1","Yes"
"No","As an online-only conference","1","Yes"
"No","As an online-only conference","1","Yes"
"Yes","As an online-only conference","1","Yes"
"No","As an online-only conference","1","Yes"
"Yes","As an in-person conference with video streaming (as usual)","5","No"
"No","As an online-only conference","1","Yes"
"Yes","As an online-only conference","1","Yes"
"Yes","As an online-only conference","3","Yes"
"No","As an online-only conference","1","Yes"
"Yes","As an online-only conference","1","Yes"
"No","As an online-only conference","1","No"
"No","As an online-only conference","1","Yes"
"No","Cancelled (no DebConf in 2020)","1","No"
"No","As an online-only conference","2","Yes"
"No","Cancelled (no DebConf in 2020)","1","Yes"
"No","As an online-only conference","1","Yes"
"No","Cancelled (no DebConf in 2020)","1","No"
"No","As an online-only conference","1","Yes"
"No","As an online-only conference","1","Yes"
"Yes","As an in-person conference with video streaming (as usual)","5","No"
"No","As an online-only conference","2","Yes"
"No","As an online-only conference","1","Yes"
"Yes","As an online-only conference","2","Yes"
"No","As an online-only conference","1","Yes"
"No","As an online-only conference","1","Yes"
"No","As an online-only conference","1","Yes"
"No","As an online-only conference","1","Yes"
"No","As an online-only conference","1","Yes"
"Yes","Cancelled (no DebConf in 2020)","2","Yes"
"No","As an online-only conference","1","No"
"No","As an online-only conference","1","Yes"
"No","As an online-only conference","1","Yes"
"Yes","As an online-only conference","1","Yes"
"No","As an online-only conference","1","Yes"
"No","Cancelled (no DebConf in 2020)","1","No"
"No","As an online-only conference","1","Yes"
"Yes","As an online-only conference","1","Yes"
"Yes","As an in-person conference with video streaming (as usual)","3","Yes"
"No","As an online-only conference","1","Yes"
"No","As an online-only conference","1","No"
"No","As an in-person conference with video streaming (as usual)","1","No"
"No","As an online-only conference","1","No"
"Yes","As an online-only conference","4","Yes"
"No","As an online-only conference","1","Yes"
"No","As an online-only conference","1","Yes"
"No","As an online-only conference","1","Yes"
"Yes","As an in-person conference with video streaming (as usual)","3","Yes"
"No","As an online-only conference","1","Yes"
"No","As an online-only conference","1","Yes"
"No","As an in-person conference with video streaming (as usual)","1","Yes"
"Yes","As an online-only conference","2","No"
"Yes","As an online-only conference","1","Yes"
"No","As an in-person conference with video streaming (as usual)","3","Yes"
"No","As an in-person conference with video streaming (as usual)","1","No"
"No","As an online-only conference","1","Yes"
"No","As an online-only conference","2","Yes"
"No","As an online-only conference","1","Yes"
"No","As an online-only conference","1","Yes"
"No","As an online-only conference","1","Yes"
"Yes","As an in-person conference with video streaming (as usual)","4","No"
"Yes","As an online-only conference","1","No"
"No","As an in-person conference with video streaming (as usual)","2","No"
"Yes","As an online-only conference","1","Yes"
"No","As an online-only conference","1","Yes"
"No","As an online-only conference","1","No"
"Yes","As an in-person conference with video streaming (as usual)","5","Yes"
"Yes","As an online-only conference","2","Yes"
"No","As an in-person conference with video streaming (as usual)","1","No"
"No","As an online-only conference","1","Yes"
"No","As an online-only conference","1","No"
"No","As an online-only conference","1","Yes"
"No","As an online-only conference","1","Yes"
"No","As an online-only conference","1","Yes"
"No","As an online-only conference","1","No"
"Yes","As an online-only conference","5","Yes"
"No","As an online-only conference","1","Yes"
"No","As an online-only conference","1","Yes"
"No","As an online-only conference","1","Yes"
"No","As an online-only conference","1","No"
"Yes","As an in-person conference with video streaming (as usual)","3","Yes"
"No","As an online-only conference","1","Yes"
"Yes","As an in-person conference with video streaming (as usual)","5","No"
"No","As an online-only conference","1","No"
"Yes","As an online-only conference","1","Yes"
"No","As an online-only conference","1","Yes"
"No","As an online-only conference","1","Yes"
"No","As an online-only conference","1","Yes"
"Yes","As an online-only conference","1","Yes"
"Yes","As an online-only conference","1","Yes"
"No","Cancelled (no DebConf in 2020)","1","No"
"No","As an online-only conference","1","Yes"
"Yes","Cancelled (no DebConf in 2020)","1","Yes"
"Yes","As an online-only conference","1","Yes"
"No","As an online-only conference","1","Yes"
"Yes","As an online-only conference","2","Yes"
"Yes","As an online-only conference","1","No"
"No","As an online-only conference","1","No"
"No","As an online-only conference","1","Yes"
"No","As an online-only conference","1","Yes"
"No","As an online-only conference","1","Yes"
"No","As an online-only conference","1","Yes"
"No","As an in-person conference with video streaming (as usual)","2","No"
"Yes","As an online-only conference","1","Yes"
"No","As an online-only conference","1","Yes"
"Yes","As an in-person conference with video streaming (as usual)","1","No"
"Yes","As an online-only conference","5","Yes"
"Yes","As an in-person conference with video streaming (as usual)","5","No"
"Yes","As an online-only conference","2","Yes"
"No","As an online-only conference","1","Yes"
"No","As an online-only conference","1","Yes"
"No","As an online-only conference","1","Yes"
"No","As an online-only conference","1","Yes"
"No","Cancelled (no DebConf in 2020)","1","No"
"No","As an online-only conference","1","No"
"Yes","As an in-person conference with video streaming (as usual)","4","No"
"No","As an online-only conference","1","No"
"Yes","As an online-only conference","1","Yes"
"Yes","Cancelled (no DebConf in 2020)","1","No"
"No","As an online-only conference","2","Yes"
"No","As an online-only conference","2","Yes"
"Yes","As an online-only conference","1","Yes"
"Yes","As an online-only conference","4","Yes"
"No","As an online-only conference","1","Yes"
"No","As an online-only conference","1","Yes"
"Yes","As an online-only conference","1","Yes"
"Yes","As an online-only conference","5","Yes"
"No","Cancelled (no DebConf in 2020)","1","No"
"No","As an in-person conference with video streaming (as usual)","1","No"
"No","As an in-person conference with video streaming (as usual)","2","Yes"
"No","As an online-only conference","1","Yes"
"Yes","Cancelled (no DebConf in 2020)","3","Yes"
"No","Cancelled (no DebConf in 2020)","1","Yes"
"Yes","As an online-only conference","1","Yes"
"No","As an online-only conference","2","Yes"
"Yes","As an in-person conference with video streaming (as usual)","5","Yes"
"Yes","As an online-only conference","1","Yes"
"No","As an online-only conference","1","Yes"
"No","As an online-only conference","1","Yes"
"No","As an online-only conference","1","Yes"
"No","As an in-person conference with video streaming (as usual)","2","Yes"
"Yes","As an online-only conference","2","Yes"
"Yes","As an online-only conference","1","Yes"
"No","As an online-only conference","1","Yes"
"No","As an online-only conference","1","Yes"
"No","As an online-only conference","1","No"
"Yes","As an online-only conference","3","Yes"
"No","As an online-only conference","1","Yes"
"Yes","As an in-person conference with video streaming (as usual)","5","Yes"
"Yes","As an online-only conference","1","Yes"
"No","As an online-only conference","1","Yes"
"Yes","As an in-person conference with video streaming (as usual)","4","Yes"
"No","As an online-only conference","1","No"
"Yes","As an in-person conference with video streaming (as usual)","5","No"
"No","As an online-only conference","1","Yes"
"No","As an online-only conference","1","Yes"
"No","As an online-only conference","1","Yes"
"No","As an online-only conference","1","No"
"Yes","Cancelled (no DebConf in 2020)","1","Yes"
"No","As an online-only conference","1","Yes"
"Yes","Cancelled (no DebConf in 2020)","2","No"
"No","As an online-only conference","2","Yes"
"No","As an online-only conference","1","Yes"
"No","As an online-only conference","1","Yes"
"No","As an online-only conference","1","Yes"
"No","As an online-only conference","1","No"
"No","As an online-only conference","1","No"
"No","Cancelled (no DebConf in 2020)","1","Yes"
"Yes","As an online-only conference","1","Yes"
"No","As an online-only conference","1","Yes"
"Yes","As an online-only conference","1","Yes"
"No","As an online-only conference","1","No"
"Yes","Cancelled (no DebConf in 2020)","2","Yes"
"No","As an online-only conference","1","No"
"No","As an online-only conference","1","Yes"
"Yes","Cancelled (no DebConf in 2020)","5","No"
"No","As an online-only conference","1","Yes"
"No","As an online-only conference","1","Yes"
"No","As an online-only conference","1","Yes"
"No","As an online-only conference","1","Yes"
"No","As an in-person conference with video streaming (as usual)","1","Yes"
"No","As an online-only conference","1","Yes"
"No","As an online-only conference","1","Yes"
"No","As an online-only conference","1","Yes"
"No","As an online-only conference","1","No"
"Yes","Cancelled (no DebConf in 2020)","2","No"
"No","As an online-only conference","1","Yes"
"No","As an online-only conference","1","Yes"
"No","Cancelled (no DebConf in 2020)","1","Yes"
"No","As an online-only conference","1","Yes"
"No","As an online-only conference","1","Yes"
