<?xml version="1.0" encoding="UTF-8" standalone="no"?>
<svg
   xmlns:dc="http://purl.org/dc/elements/1.1/"
   xmlns:cc="http://creativecommons.org/ns#"
   xmlns:rdf="http://www.w3.org/1999/02/22-rdf-syntax-ns#"
   xmlns:svg="http://www.w3.org/2000/svg"
   xmlns="http://www.w3.org/2000/svg"
   xmlns:xlink="http://www.w3.org/1999/xlink"
   xmlns:sodipodi="http://sodipodi.sourceforge.net/DTD/sodipodi-0.dtd"
   xmlns:inkscape="http://www.inkscape.org/namespaces/inkscape"
   version="1.1"
   x="0px"
   y="0px"
   viewBox="0 0 1279.9999 719.99999"
   xml:space="preserve"
   id="svg885"
   sodipodi:docname="Apology.svg"
   inkscape:version="0.92.5 (2060ec1f9f, 2020-04-08)"
   width="1280"
   height="720"
   inkscape:export-filename="/home/wouter/debian/dc20-online/artwork/video/Opening.svg.png"
   inkscape:export-xdpi="96"
   inkscape:export-ydpi="96"><metadata
   id="metadata891"><rdf:RDF><cc:Work
       rdf:about=""><dc:format>image/svg+xml</dc:format><dc:type
         rdf:resource="http://purl.org/dc/dcmitype/StillImage" /><dc:title /></cc:Work></rdf:RDF></metadata><defs
   id="defs889"><style
     id="style1746">.cls-1{fill:#252f3e;}.cls-2{fill:#f90;fill-rule:evenodd;}</style></defs><sodipodi:namedview
   inkscape:document-rotation="0"
   pagecolor="#ffffff"
   bordercolor="#666666"
   borderopacity="1"
   objecttolerance="10"
   gridtolerance="10"
   guidetolerance="10"
   inkscape:pageopacity="0"
   inkscape:pageshadow="2"
   inkscape:window-width="1920"
   inkscape:window-height="1028"
   id="namedview887"
   showgrid="false"
   inkscape:zoom="0.36846893"
   inkscape:cx="279.63066"
   inkscape:cy="123.08973"
   inkscape:window-x="0"
   inkscape:window-y="29"
   inkscape:window-maximized="1"
   inkscape:current-layer="svg885"
   fit-margin-top="0"
   fit-margin-left="0"
   fit-margin-right="-0.5"
   fit-margin-bottom="0"
   showguides="true"
   inkscape:guide-bbox="true"><sodipodi:guide
     position="1251.2663,789.23865"
     orientation="1,0"
     id="guide52"
     inkscape:locked="false" /><sodipodi:guide
     position="1033.5937,651.61341"
     orientation="0,1"
     id="guide54"
     inkscape:locked="false" /><sodipodi:guide
     position="606.67453,403.04537"
     orientation="1,0"
     id="guide56"
     inkscape:locked="false" /></sodipodi:namedview>
<g
   id="Layer_0_xA0_Image_1_"
   transform="matrix(4.2650057,0,0,4.3770638,-17.763828,-5.4773628)">
	
		<image
   style="overflow:visible"
   width="1280"
   height="720"
   id="Layer_0_xA0_Image"
   xlink:href="data:image/png;base64,iVBORw0KGgoAAAANSUhEUgAABQgAAALVCAYAAACMZwwRAAAACXBIWXMAAC4jAAAuIwF4pT92AAAA GXRFWHRTb2Z0d2FyZQBBZG9iZSBJbWFnZVJlYWR5ccllPAAAFLhJREFUeNrs2LENwzAMAEErvTfy Clk38HAGZJWaIX8HEAJVsvzjAAAAAAAAAAAAAAAAAAAAQsa+zDmv9fzWnE4DAAAAAH/lWXOPMb77 58ddAAAAAKBLIAQAAACAMIEQAAAAAMIEQgAAAAAIEwgBAAAAIEwgBAAAAIAwgRAAAAAAwgRCAAAA AAgTCAEAAAAgTCAEAAAAgDCBEAAAAADCBEIAAAAACBMIAQAAACBMIAQAAACAMIEQAAAAAMIEQgAA AAAIEwgBAAAAIEwgBAAAAIAwgRAAAAAAwgRCAAAAAAgTCAEAAAAgTCAEAAAAgDCBEAAAAADCBEIA AAAACBMIAQAAACBMIAQAAACAMIEQAAAAAMIEQgAAAAAIEwgBAAAAIEwgBAAAAIAwgRAAAAAAwgRC AAAAAAgTCAEAAAAgTCAEAAAAgDCBEAAAAADCBEIAAAAACBMIAQAAACBMIAQAAACAMIEQAAAAAMIE QgAAAAAIEwgBAAAAIEwgBAAAAIAwgRAAAAAAwgRCAAAAAAgTCAEAAAAgTCAEAAAAgDCBEAAAAADC BEIAAAAACBMIAQAAACBMIAQAAACAMIEQAAAAAMIEQgAAAAAIEwgBAAAAIEwgBAAAAIAwgRAAAAAA wgRCAAAAAAgTCAEAAAAgTCAEAAAAgDCBEAAAAADCBEIAAAAACBMIAQAAACBMIAQAAACAMIEQAAAA AMIEQgAAAAAIEwgBAAAAIEwgBAAAAIAwgRAAAAAAwgRCAAAAAAgTCAEAAAAgTCAEAAAAgDCBEAAA AADCBEIAAAAACBMIAQAAACBMIAQAAACAMIEQAAAAAMIEQgAAAAAIEwgBAAAAIEwgBAAAAIAwgRAA AAAAwgRCAAAAAAgTCAEAAAAgTCAEAAAAgDCBEAAAAADCBEIAAAAACBMIAQAAACBMIAQAAACAMIEQ AAAAAMIEQgAAAAAIEwgBAAAAIEwgBAAAAIAwgRAAAAAAwgRCAAAAAAgTCAEAAAAgTCAEAAAAgDCB EAAAAADCBEIAAAAACBMIAQAAACBMIAQAAACAMIEQAAAAAMIEQgAAAAAIEwgBAAAAIEwgBAAAAIAw gRAAAAAAwgRCAAAAAAgTCAEAAAAgTCAEAAAAgDCBEAAAAADCBEIAAAAACBMIAQAAACBMIAQAAACA MIEQAAAAAMIEQgAAAAAIEwgBAAAAIEwgBAAAAIAwgRAAAAAAwgRCAAAAAAgTCAEAAAAgTCAEAAAA gDCBEAAAAADCBEIAAAAACBMIAQAAACBMIAQAAACAMIEQAAAAAMIEQgAAAAAIEwgBAAAAIEwgBAAA AIAwgRAAAAAAwgRCAAAAAAgTCAEAAAAgTCAEAAAAgDCBEAAAAADCBEIAAAAACBMIAQAAACBMIAQA AACAMIEQAAAAAMIEQgAAAAAIEwgBAAAAIEwgBAAAAIAwgRAAAAAAwgRCAAAAAAgTCAEAAAAgTCAE AAAAgDCBEAAAAADCBEIAAAAACBMIAQAAACBMIAQAAACAMIEQAAAAAMIEQgAAAAAIEwgBAAAAIEwg BAAAAIAwgRAAAAAAwgRCAAAAAAgTCAEAAAAgTCAEAAAAgDCBEAAAAADCBEIAAAAACBMIAQAAACBM IAQAAACAMIEQAAAAAMIEQgAAAAAIEwgBAAAAIEwgBAAAAIAwgRAAAAAAwgRCAAAAAAgTCAEAAAAg TCAEAAAAgDCBEAAAAADCBEIAAAAACBMIAQAAACBMIAQAAACAMIEQAAAAAMIEQgAAAAAIEwgBAAAA IEwgBAAAAIAwgRAAAAAAwgRCAAAAAAgTCAEAAAAgTCAEAAAAgDCBEAAAAADCBEIAAAAACBMIAQAA ACBMIAQAAACAMIEQAAAAAMIEQgAAAAAIEwgBAAAAIEwgBAAAAIAwgRAAAAAAwgRCAAAAAAgTCAEA AAAgTCAEAAAAgDCBEAAAAADCBEIAAAAACBMIAQAAACBMIAQAAACAMIEQAAAAAMIEQgAAAAAIEwgB AAAAIEwgBAAAAIAwgRAAAAAAwgRCAAAAAAgTCAEAAAAgTCAEAAAAgDCBEAAAAADCBEIAAAAACBMI AQAAACBMIAQAAACAMIEQAAAAAMIEQgAAAAAIEwgBAAAAIEwgBAAAAIAwgRAAAAAAwgRCAAAAAAgT CAEAAAAgTCAEAAAAgDCBEAAAAADCBEIAAAAACBMIAQAAACBMIAQAAACAMIEQAAAAAMIEQgAAAAAI EwgBAAAAIEwgBAAAAIAwgRAAAAAAwgRCAAAAAAgTCAEAAAAgTCAEAAAAgDCBEAAAAADCBEIAAAAA CBMIAQAAACBMIAQAAACAMIEQAAAAAMIEQgAAAAAIEwgBAAAAIEwgBAAAAIAwgRAAAAAAwgRCAAAA AAgTCAEAAAAgTCAEAAAAgDCBEAAAAADCBEIAAAAACBMIAQAAACBMIAQAAACAMIEQAAAAAMIEQgAA AAAIEwgBAAAAIEwgBAAAAIAwgRAAAAAAwgRCAAAAAAgTCAEAAAAgTCAEAAAAgDCBEAAAAADCBEIA AAAACBMIAQAAACBMIAQAAACAMIEQAAAAAMIEQgAAAAAIEwgBAAAAIEwgBAAAAIAwgRAAAAAAwgRC AAAAAAgTCAEAAAAgTCAEAAAAgDCBEAAAAADCBEIAAAAACBMIAQAAACBMIAQAAACAMIEQAAAAAMIE QgAAAAAIEwgBAAAAIEwgBAAAAIAwgRAAAAAAwgRCAAAAAAgTCAEAAAAgTCAEAAAAgDCBEAAAAADC BEIAAAAACBMIAQAAACBMIAQAAACAMIEQAAAAAMIEQgAAAAAIEwgBAAAAIEwgBAAAAIAwgRAAAAAA wgRCAAAAAAgTCAEAAAAgTCAEAAAAgDCBEAAAAADCBEIAAAAACBMIAQAAACBMIAQAAACAMIEQAAAA AMIEQgAAAAAIEwgBAAAAIEwgBAAAAIAwgRAAAAAAwgRCAAAAAAgTCAEAAAAgTCAEAAAAgDCBEAAA AADCBEIAAAAACBMIAQAAACBMIAQAAACAMIEQAAAAAMIEQgAAAAAIEwgBAAAAIEwgBAAAAIAwgRAA AAAAwgRCAAAAAAgTCAEAAAAgTCAEAAAAgDCBEAAAAADCBEIAAAAACBMIAQAAACBMIAQAAACAMIEQ AAAAAMIEQgAAAAAIEwgBAAAAIEwgBAAAAIAwgRAAAAAAwgRCAAAAAAgTCAEAAAAgTCAEAAAAgDCB EAAAAADCBEIAAAAACBMIAQAAACBMIAQAAACAMIEQAAAAAMIEQgAAAAAIEwgBAAAAIEwgBAAAAIAw gRAAAAAAwgRCAAAAAAgTCAEAAAAgTCAEAAAAgDCBEAAAAADCBEIAAAAACBMIAQAAACBMIAQAAACA MIEQAAAAAMIEQgAAAAAIEwgBAAAAIEwgBAAAAIAwgRAAAAAAwgRCAAAAAAgTCAEAAAAgTCAEAAAA gDCBEAAAAADCBEIAAAAACBMIAQAAACBMIAQAAACAMIEQAAAAAMIEQgAAAAAIEwgBAAAAIEwgBAAA AIAwgRAAAAAAwgRCAAAAAAgTCAEAAAAgTCAEAAAAgDCBEAAAAADCBEIAAAAACBMIAQAAACBMIAQA AACAMIEQAAAAAMIEQgAAAAAIEwgBAAAAIEwgBAAAAIAwgRAAAAAAwgRCAAAAAAgTCAEAAAAgTCAE AAAAgDCBEAAAAADCBEIAAAAACBMIAQAAACBMIAQAAACAMIEQAAAAAMIEQgAAAAAIEwgBAAAAIEwg BAAAAIAwgRAAAAAAwgRCAAAAAAgTCAEAAAAgTCAEAAAAgDCBEAAAAADCBEIAAAAACBMIAQAAACBM IAQAAACAMIEQAAAAAMIEQgAAAAAIEwgBAAAAIEwgBAAAAIAwgRAAAAAAwgRCAAAAAAgTCAEAAAAg TCAEAAAAgDCBEAAAAADCBEIAAAAACBMIAQAAACBMIAQAAACAMIEQAAAAAMIEQgAAAAAIEwgBAAAA IEwgBAAAAIAwgRAAAAAAwgRCAAAAAAgTCAEAAAAgTCAEAAAAgDCBEAAAAADCBEIAAAAACBMIAQAA ACBMIAQAAACAMIEQAAAAAMIEQgAAAAAIEwgBAAAAIEwgBAAAAIAwgRAAAAAAwgRCAAAAAAgTCAEA AAAgTCAEAAAAgDCBEAAAAADCBEIAAAAACBMIAQAAACBMIAQAAACAMIEQAAAAAMIEQgAAAAAIEwgB AAAAIEwgBAAAAIAwgRAAAAAAwgRCAAAAAAgTCAEAAAAgTCAEAAAAgDCBEAAAAADCBEIAAAAACBMI AQAAACBMIAQAAACAMIEQAAAAAMIEQgAAAAAIEwgBAAAAIEwgBAAAAIAwgRAAAAAAwgRCAAAAAAgT CAEAAAAgTCAEAAAAgDCBEAAAAADCBEIAAAAACBMIAQAAACBMIAQAAACAMIEQAAAAAMIEQgAAAAAI EwgBAAAAIEwgBAAAAIAwgRAAAAAAwgRCAAAAAAgTCAEAAAAgTCAEAAAAgDCBEAAAAADCBEIAAAAA CBMIAQAAACBMIAQAAACAMIEQAAAAAMIEQgAAAAAIEwgBAAAAIEwgBAAAAIAwgRAAAAAAwgRCAAAA AAgTCAEAAAAgTCAEAAAAgDCBEAAAAADCBEIAAAAACBMIAQAAACBMIAQAAACAMIEQAAAAAMIEQgAA AAAIEwgBAAAAIEwgBAAAAIAwgRAAAAAAwgRCAAAAAAgTCAEAAAAgTCAEAAAAgDCBEAAAAADCBEIA AAAACBMIAQAAACBMIAQAAACAMIEQAAAAAMIEQgAAAAAIEwgBAAAAIEwgBAAAAIAwgRAAAAAAwgRC AAAAAAgTCAEAAAAgTCAEAAAAgDCBEAAAAADCBEIAAAAACBMIAQAAACBMIAQAAACAMIEQAAAAAMIE QgAAAAAIEwgBAAAAIEwgBAAAAIAwgRAAAAAAwgRCAAAAAAgTCAEAAAAgTCAEAAAAgDCBEAAAAADC BEIAAAAACBMIAQAAACBMIAQAAACAMIEQAAAAAMIEQgAAAAAIEwgBAAAAIEwgBAAAAIAwgRAAAAAA wgRCAAAAAAgTCAEAAAAgTCAEAAAAgDCBEAAAAADCBEIAAAAACBMIAQAAACBMIAQAAACAMIEQAAAA AMIEQgAAAAAIEwgBAAAAIEwgBAAAAIAwgRAAAAAAwgRCAAAAAAgTCAEAAAAgTCAEAAAAgDCBEAAA AADCBEIAAAAACBMIAQAAACBMIAQAAACAMIEQAAAAAMIEQgAAAAAIEwgBAAAAIEwgBAAAAIAwgRAA AAAAwgRCAAAAAAgTCAEAAAAgTCAEAAAAgDCBEAAAAADCBEIAAAAACBMIAQAAACBMIAQAAACAMIEQ AAAAAMIEQgAAAAAIEwgBAAAAIEwgBAAAAIAwgRAAAAAAwgRCAAAAAAgTCAEAAAAgTCAEAAAAgDCB EAAAAADCBEIAAAAACBMIAQAAACBMIAQAAACAMIEQAAAAAMIEQgAAAAAIEwgBAAAAIEwgBAAAAIAw gRAAAAAAwgRCAAAAAAgTCAEAAAAgTCAEAAAAgDCBEAAAAADCBEIAAAAACBMIAQAAACBMIAQAAACA MIEQAAAAAMIEQgAAAAAIEwgBAAAAIEwgBAAAAIAwgRAAAAAAwgRCAAAAAAgTCAEAAAAgTCAEAAAA gDCBEAAAAADCBEIAAAAACBMIAQAAACBMIAQAAACAMIEQAAAAAMIEQgAAAAAIEwgBAAAAIEwgBAAA AIAwgRAAAAAAwgRCAAAAAAgTCAEAAAAgTCAEAAAAgDCBEAAAAADCBEIAAAAACBMIAQAAACBMIAQA AACAMIEQAAAAAMIEQgAAAAAIEwgBAAAAIEwgBAAAAIAwgRAAAAAAwgRCAAAAAAgTCAEAAAAgTCAE AAAAgDCBEAAAAADCBEIAAAAACBMIAQAAACBMIAQAAACAMIEQAAAAAMIEQgAAAAAIEwgBAAAAIEwg BAAAAIAwgRAAAAAAwgRCAAAAAAgTCAEAAAAgTCAEAAAAgDCBEAAAAADCBEIAAAAACBMIAQAAACBM IAQAAACAMIEQAAAAAMIEQgAAAAAIEwgBAAAAIEwgBAAAAIAwgRAAAAAAwgRCAAAAAAgTCAEAAAAg TCAEAAAAgDCBEAAAAADCBEIAAAAACBMIAQAAACBMIAQAAACAMIEQAAAAAMIEQgAAAAAIEwgBAAAA IEwgBAAAAIAwgRAAAAAAwgRCAAAAAAgTCAEAAAAgTCAEAAAAgDCBEAAAAADCBEIAAAAACBMIAQAA ACBMIAQAAACAMIEQAAAAAMIEQgAAAAAIEwgBAAAAIEwgBAAAAIAwgRAAAAAAwgRCAAAAAAgTCAEA AAAgTCAEAAAAgDCBEAAAAADCBEIAAAAACBMIAQAAACBMIAQAAACAMIEQAAAAAMIEQgAAAAAIEwgB AAAAIEwgBAAAAIAwgRAAAAAAwgRCAAAAAAgTCAEAAAAgTCAEAAAAgDCBEAAAAADCBEIAAAAACBMI AQAAACBMIAQAAACAMIEQAAAAAMIEQgAAAAAIEwgBAAAAIEwgBAAAAIAwgRAAAAAAwgRCAAAAAAgT CAEAAAAgTCAEAAAAgDCBEAAAAADCBEIAAAAACBMIAQAAACBMIAQAAACAMIEQAAAAAMIEQgAAAAAI EwgBAAAAIEwgBAAAAIAwgRAAAAAAwgRCAAAAAAgTCAEAAAAgTCAEAAAAgDCBEAAAAADCBEIAAAAA CBMIAQAAACBMIAQAAACAMIEQAAAAAMIEQgAAAAAIEwgBAAAAIEwgBAAAAIAwgRAAAAAAwgRCAAAA AAgTCAEAAAAgTCAEAAAAgDCBEAAAAADCBEIAAAAACBMIAQAAACBMIAQAAACAMIEQAAAAAMIEQgAA AAAIEwgBAAAAIEwgBAAAAIAwgRAAAAAAwgRCAAAAAAgTCAEAAAAgTCAEAAAAgDCBEAAAAADCBEIA AAAACBMIAQAAACBMIAQAAACAMIEQAAAAAMIEQgAAAAAIEwgBAAAAIEwgBAAAAIAwgRAAAAAAwgRC AAAAAAgTCAEAAAAgTCAEAAAAgDCBEAAAAAAAAAAAAAAAAAAAUl4BBgBwbAugzGB8+wAAAABJRU5E rkJggg=="
   transform="scale(0.24)">
	</image>
</g>
<g
   transform="matrix(1.4818267,0,0,1.4818267,-2.073029,-42.309089)"
   id="Layer_2_xA0_Image_1_">
	
		<image
   style="overflow:visible"
   width="519"
   height="294"
   id="Layer_2_xA0_Image"
   xlink:href="data:image/png;base64,iVBORw0KGgoAAAANSUhEUgAAAg0AAAEsCAYAAABAAICaAAAACXBIWXMAAC4jAAAuIwF4pT92AAAA GXRFWHRTb2Z0d2FyZQBBZG9iZSBJbWFnZVJlYWR5ccllPAAAbk1JREFUeNrsnQecVNX1x88sHRFR UXRBxYa9xNgr9pIQjSXWxK4xdqPGLhp7S9RojCUmJsaoMX8Vjb3EXmLvqIggiwUFkSawO//z3Xee O6y7U3bulDdzfp/PcXF35r1377v3nt899xQRh8PhcDgcDofD4XA4HA6Hw+FwOByOsiLlXeCoFUxo aOivPzZQWUtlgEo6oXNypspolWcGt7SMTVoDGhsbl9Yfx6qspNJSwUfh/c9WmaUyTWWyymcMFZVP VD5W+bSpqWmWz56qHEf8WEblSJXBXRxL8Xx6TN/zX71Xi0d37wJHDZCFXvpjfZWRKpuodKuBZjWr fKht+73+vF7Jw5wEPTvkbSMjb9UKFNBUlfGqnN7Uny+rvKDyuiqXKT6rqoZAD1TZUWXpIq7zjREH Jw1OGhxFKtv59cd6pmgXt8nF4vm4KqkJCWlDdyMM16isWEOvB+IzTOUMlfm1nZfoO2lJyLO32A6/ mtEgkTUKWU1lT3vmj5REPKE/71N5RgnEZ75SVHwsFWsJag5wDYeThromC91toUQh/UilR8af56q8 o5+5VH/epIqq2k38S6ocWmOEIROLqexru+DHffSWFD1VVjDZX2WsEohR+vN2lReVQMz1LnLUOxq8 C+qOMGDKH67yF5Wd2hGGmEhCKC5QOUU/37vKyc+yKpvX+GuDOGyn7XUfpPJuqJaTyDfjAZU7lED8 VKWfd43DSYOjXghDX/2xvcofVVbPQ1Edp3Kefm/BKm0SBAhvqUVq/NX1kcii0sdHcUXAMd5PVP6u cqcSh11V/F04nDQ4apow4Jy2h8rVtoPKBwupHKTye/1+YxU2i513jzoYxynb+XbzkVxRQLq3VLlR 5WYlDpt6lzicNDhqkTDggfxLld9J5PBY6C5rN5U/6nWWr8LmpevgFaYzxFF5cETxU5V/KXG4UGWI d4nDSYOjVggDJOEElXMlCoXrCjDFbqfyJ73eWt6rDkcrOBY7RuWfShy29e5wOGlwJJ0wLKE/Tlc5 UYqPlMGzHHPstXrdLbx3HY7v5gU5KW5Q4nCsSm/vEoeTBkfSyELKjhIuUjks4KU5U8fSwFHFLt7T Dsd3GGwE/WIlDgO9OxxOGhxJIQwo9h+oXCWR42No4JRH0qHL9F4HeY87HN+BKCPyO1zRaDmQHQ4n DY5qJgyYSjdW+ZPK1iW+HSGAZ+k9j1fp4b3vcLRiPonSHkMclvTucDhpcFQrYeAsdSuJ0imvXabb spv6jZGH+f0tOBytIDRzB5XL3OLgcNLgqEbCQAjYLlKZ+guc3/5K5RJ9jkX8bTgcrSDiiIiK85U3 LODd4agVeO2J5BMGzlF/rnKmRMmYKgEWxb1VFtTnOTGJ5ZwdVQuKDVGFkiO3GRL51BSyKcICxxwh wylllklstpRE2URLDcg8tV0mKnE4zWtXOJw0OCpNGAbZLv9EWxwrCc5ySbXbHz8HJQ5v+htyBCIN kNA/q9L9tpgLqeKGRJCrhHolm0mUUn19U+6lwsISVdD8UOU6f52OpMOPJ5JLGAjxOlmiMK9qiQ1n 90aaXXI5bORvyREAcQrtvsVeSElHi8oUlZdULjOSC3G4QeXLErYBh8jDlbSs46/T4aTBUQnCMFSi DI9HS2Hm2nKgu+3eIA4/9rflqFYocZip8pT+8wiJKr7eoTKnRLcjTPk4JQ7uMOxw0uAoG1loUFlV /3mlyr5VvjtcWeUKfd59/M05qpw8zDLycLDKkSofl+A2OEYSDv0L73GHkwZHOQhDD9vBEyGRlB38 0ioX6LMfZUmnHI5qJg+T9cefJXLq/W8JbkH45T6NjY3DvLcdThocpSQM+ApsZoQhab4C+F6conKq tqOPv01HlRMHjieekcjB+L4SrLekdz/AnDIdDicNjuCEoa9ZFgg5Wy2hzSDK4xizOizob9VR5cSB EuTvqJyk8mTgyxNNgfOlV4t1JBIeclndhIH8Bz9TOUdl0YQ3J87LTy6HUwa3tHzib9hRzcShsbER 4nC2yvUS5XYIBarP7qHXf5mIjkq3VZ8DPYCDJhuUXqYXyClBiCu5MaaZBcbhcNJQxYSBTIs4ZmHa 71cjzWJh2k1lIcvl8K6/aUcVE4c5qlBf1H9eokKIZqgaKxBoystjOXytzAQBUjBU5Ycqa0rksLyE PVNMGPA/gsxAFGapTNbvjdefH0iUaOt1lfcJX621d67tpO2svStJWyIwLKUDrH/IGzJV5VOJcm/Q H+9pX3zlpMFRScKwuP44TuVYm8C1BHJKbKNyjbbzBCUOL/obd1QxcfhaFQm+DZsa4Q0FfH12LBdp 0DZACjgW2UtlAykseyx5JtbI+H8sEGP0mkSc3KvyhDmRJpkosOaS9puj4HWMKOSjH2dbXzwqUcju M0TjOGlwlJMwMEFPVTmkhpvJjm0TiXI5kHb6IX/zjirGOJUbVYarhKqvgm/D5qpsblAlM6FEylCM HEBODjayEAK9bCeOEEL6lt6L/rld2/JZgsgC+o/soPup7C5RtFehoLLwiiaEwT+u1yUk/kHzjak5 uCNk9ZCFlMoKEplCD6mDJjP2MI9epe3ezUeAo4qtDZjpMUP/O+Blu9kOftMSKURIyS9VHpYojHSD EnUPBAKnzktVRul98dXomQDCgI8Y1tz/SOTwunSAy5JKn1ojN6v8Tu+xhJMGR6kIQzebeFdLWBNo EkAIGhUyD4E4+WhwVCk4w75Lwqab5ux845Dhl3qtvirbSWQq/6PKD8rUPxCFdeyeV+kzLFelZKGX CuHrt6hcKFERs9CAsB2m8ne91wa1NhGcNFSeMGCqJ1McIZVb1Gk3sOMaqXKi9kdPHxWOKrU2jFZ5 NOBlcXDGGXJwIIXYaPPoNonyulQCOAzuh1LWx9mqyggDz7a/EYZSr7WsY61HsHrfbZ00OEIRBpwC tzXC8MM67w4ckU5Q+a32S38fHY4qxBcqj0gUjhhq/V1Uisy/giOfChaF62wOVbq+Bb4Ca6tcrc+1 SxW8txYjMziW/97WmnIAyylp/y/VftjcSYOjWMLAxCYHA+a8FbxHWhGfw15mZb8djmrCNyovq4wJ eM0FTLF0lTD0NKsClTp3qLL+4ujxgiogDmxCdpXIwbxXBe6Pk+Q52g+r1sIkcNJQGcKAR/OBKper DPEe+d4E35NdivbTst4djmqBecN/ZcQhFHCeW9bC/golDCjAzaW8vguFAt+Gsyq808bywVFQpcLX uS9O36dqPyTeiuqkofyEgR00ZjKccAZ4j3SI71Jna3+t4d3hqCJ8rfJWwOv1to1DQenVVfngC7Wh bTyqvQAWltTT9JmH1vmaRqTMAU4aHIUQBhaHU03c4S876J/hEuVy2NS7w1ElIK0ymQBnBroeyp+N xMACCEN8Vn6uJONok50+0WHHWm6EegW+FHtrH6zipMGRiywghPacr3KkRA4yjtzArEcYF9kjf9LB 3zEXN3s3OcoIsv1RNyVk6GUfKcw5j9TGR0v43As4eE6SKJkVwlFMqNoYWFUJBd2+jscO6z564OdG /Jw0ODokDPQx3tFkCdvHe6RLE43Mc5drX+7b7m+9bZfmJMxRFliBqbj2QCjgm5BXpklVNjhO7hBo LUkbSSAEEbP5ehJFPaxrwr83M4LyfyqfF3k/Qqv31TbMX8dDCH+2bSS5FYs9jXSJCUN32ymT5XFD 75GiMFTlPO1TQtT+ZLuiTaQGzggdibQ2fBHwej0lj1oQlgSK44hfSfFOffhmjGJtUiKUrf7FRypP 6b2vkcjZ8mSJ0lJ3BZD8NUxp3lEl7xISiNXobYnKoY+VKEoGH4Tlrc1EP4QkOnHdkdedNDgyCUMv Y+lUx1vFeyQISF5zlkQ53qebBWJ+7xZHmUGip5AFmrrnOY4hzLsEWE+wklzB2qSE4dt8vqCfozDT 80oeDjfFyjFrQxfn8I56nXvyvXeJgG8KxfKwstyvMr6jMuX6nBwdcQz0awkX0kpo+XCrO9LkpMEB YYhzkF8gYXKaO9rQx0mYo8KYa7vRkOtwvxxWBiwLREnsXuS9OI4gp8OFHSnJPMjDBH0WEiQR7fGL Lty/r+3eSWb3TAXeXbNZFHAiHaXtmZ6jvTi8PqptxuJytoQ5FuJd4peykcrtSRv87tMQnjDg8PNz lT84YXA4ahIonpkBr4cS6Z3jM0RXbG3KpqtgZ0856991hTBkACfJa6XrSa5oyyYVeG+8M8qc763t /2cuwtCOPHxkm8AnAz1LXHckcf5YThrCEgacmY6QqOLbIt4jDkfNkobZAa+Xkiw+CqZYMOv/qMj7 fIyVQRVgUZEfRjjGSuQT0RVgpVhP29WvjO8MgkDBsUP0+bvqSwBJwqE9hJWJtuPfMThpg99JQzjC wKT+jcqZEpngHA5HbROHcqGvKZhijuXYZb8i4Qpucczx3y4qUPy9CD0sV1Iq2v6gyolKGCYWQZa4 zqsqDwV4JkgikV8rO2moT8KAyRAHPZxl3E/E4ah9pMp4PRzn1pfiEsKh5B9TxTcjxMOaE+MHKm92 8RL9y6gwv7K2jw9wrc9UHpYw+SsIn01c6KWThuLIQkqFcBwiJA7yHnE46gINEjajK/kSslXOxJy/ dgDLwIuB+6GYlNrzmbWhXAQvVN2JaSpvqIQgIBxRrGChtE4a6oAwMAhJjUqxmJ29RxyOukE+jouF gKOOWR39wapYLiHFOVXjfzFBwlbnBFgtxnXxu0RBDelKoa5Kwvw5IGDvBbhcb3u3CyepD9yU3jXC wEQmXAaHxx94jzgcdYWcIZIFIlsIZx8jDAsWcX1IA8mo0pZRMgTSpvTmdPH7+DUMMovD1IS9f6wN 70uUpKoYUHcEh/lFJWyyMCcN1YRPpKGPtLSGPpHlcXnvEYej7sBiH7JCLYr3607+hlLFZ6oYHwqI BxkIN5Swvhhcq6skpLsRoQUSSBpmSlR/JAT6GHl6KymNd9JQACatluo/93PZuflrOS+VKqjAjMMR brlyVBp514rIEzgVTsqiVIYUeX2OABaSPFJVlxEp68ckRprNtvfVLMX7SsT1cxIDJw15In2JLNzy bXq/9LfpM9Jzpb+XSHJUBOd6F1QSljOBo4mQmwZIw+dlIijVRBp6WPuShvg4CZ+OYtPY51V3xElD 8gjDYvrjyIbe8mvlxb2cMDgcdYvYeW3RUMuLKaDO8geEPgqpJjRY+5IGLAzTjewVSxpo/wJJaryT htyEAdPgSUJlubTShWbvE4ejjoE5fVmJjg1CAFM3BaS+l6WxsbExVirz1WhfpiSZEXxpIwxzAlyr e9Ler5OGzsmC2OLwW5U9vUccDoft+teUcA6FeKkQtjg1i1LtVqN9GToddzlJw1wJkxU0dM4PJw0V Igy8yFVVLlLZ1nvE4XBYEh6OKtcLeFmOJt5rampK59iR19wya4RhekKfPRRpiH07nDQkmDDwAteV KKRyfe8Rh8NhWMAIw5IBr0mo5Rs5FFRLDfYl5n2yKjb5sEoWPCPkvIQBJ6ctVf7khMHhcLQDzo9b Bdz5zzWl2WF2QbM+zDUFW2uYovK/ULUwyozYOhDi2Ih3PCdJjXdLQxthIIzqxyoXBt5JOByOhKOx sZENBcWFNgl4WY4mKNM8KQexmFZj3Ykfx3MqtyX0+VOmO0OQhhYnDckkDDg37aVytiQsD7jD4SgP b1DZRcKmjyZi4tkc/gzZskXmi8kq/5GopHMl13yULX4A1MF4Uds9OaFjAQs9JDKEA2PiSGHdkwYl DCROOVTlZElmdjKHw1FaKwPhlVSZ/FHAy6I8iZp4Nsfnvs1hichXMX2gSvqv/jaDoJuRxxD6YraR ukQxpnomDIONLJzphMHhcHQCCkYdIsUn8mm/+39GFfnEHJ+j+uXEIu9FHoBlrWKmo3jgz7CQhKl0 OjsAKXTSUCbCMFSiHAzHiltcHA5Hx1YGnB9/prJF4EtDBP6Tx+dwFBxf5L1I1UzRq0Z/o0GA5YkN ZwiHWPw7EhVBUnfKUskCL3pFlfMlqvzmcDgcHREGrI/DVY6QsLkSOMN+XuV/eXx2lpEGkj/17+L9 MKdzDLuCylh/s0UDi9OwANdpsff6qVsaqpcwQJLWUbnGCYPD4chCGDBBk5PhLAnvHA0JuK2pqSkf r/nZ9vkJRd6TNmzgb7bocQF5pKT3qgEux7ulxPbEJPVB3ZAGJQyc522mcq3Kpj78HQ5HFsKwocrF ElklQwIrw9Mqj+fzYYusIKfB20XeF0W3gR23OLoOrE8rqQwNNBZGJy1XRV2QBiUMvGg8n0natIaP e4fD0QlhwCv+p7a5+GEJbjFW5cY8rQwxcJr8X5H3xcq6vHha/GIRW2xCOJVCBl9JWgfUPGlQwsA5 IAWn/ihRASqHw+FoTxYQHAVPsc3FsBLc5guVOyR3mGV7TDXl8kWR98d5b3dt5kB/410aIw3Wh1sF uBz+DJ8lkTTUtCOkEgZY4f4qZ0jYcCmHw1E7yoCaEmSDPUqiujOlAOfXL6lcmyOZ0/eAVUKfEQvF C1Jcrgh2x/h0HSZR5Fgp+jJla+1QicISSUz1obZhaiVVgUmxgGxtF2jzSTbQl1U+dtJQPYRhcVsE CKns5Uujw+Fot2scJJG5fl+VjUu8Ho5R+b0qz66G1+Fh/4DKDlJcJAc+DQdo+z/WR7kpcH+Sfv8X KrtJdBTCukv0xzP69wv0fg9VmDgU0z78XNa0TWgIfK7yiPZJ4oqR1SRpUMLA4MXMeIjUZllZh6Ne EBf0KSrVrik1/BWGqKylsrlEjtHlOLKEKFynCuKBIq7BTv0ZiSpirl7k82AFOEf7hKRP1xfoX9GR ZYFjnf2MfC3f7iO9ra8X1s8eofd6qgJjCIvzVnr/UXr/j7rQRkJW8W/BOrNEgOehvz+QyCE2cagp 0pC+pPXHcirnGdt1OBzJBgv2Kirn6uI9q8BNALvDPqY0FpPoPJpFf74yPj/m+TtVri6KdTQ1pbEO 6D9vD0AaxPqBXDUb6nUv1eu/2gWyQL9Sj+NXOZ4pZe/wbP3eoXqv98s8hiAu20Dc9P4n6/1fLKCd fJdouwtUfhDQyvCAPsekJE7ImiENShhYXKhCd6ENEIfDURukgd3rCQl8dkLpHkRZqoKYFeB6FLi6 3zZEIYgDvhx7s16qcrxLIidNFOrkjvwuzFozv72P7Y0w5BuNhq5Zz4jD4Xr9r8r8LjgqIavn7Xp/ ImNu1Wf4MAcpgmQeqPJLI50hwHEE1o67kzoha4I0KGFgR0EYDLaGdXyddTgcFQYk4RGVE1U5fRbi gmZtYJeO0rtCwkS/oRzxczhYoiMGkki9p/cZbyQFUzrWmgGmRIdKlJK6Txfu1dc2dCfr9U8p5lik iLby7BwzHKPPwFEJRwTvZbQVZ1H84daXyOl0pcDPgJXhnq4ckzhpCEcYMB9taYRhRXE4HI7KEwac /o5R5TA25IX1el+rssM3giOPnQM/dw8jBUNL2DdEVOxl5OT3FXo/kC3Sav/UpFygsum7KrckeXAn Ok+DEgZMZbtKlBbaCYPD4ag0OJKgENVRquDHlOge7FIvl8iZLonAcfIIJT+725FHvYCU0X/TcTHO SUNlCANpUfezyTPE1yqHw1FhTLVd5OGhLQztrA3sWInxP0eirIJJBOXGf2k7/nrAdJUnVP6Z9IYk kjQoYeAMjhwMeLQu5GuVw+GoMMijcJFERxIlr1qo9yAEdZRE5/MzE9hfH9qG74s6GBs4P76lcmnS 6kx0hMT5NChhwKpwokRhPt18rXI4HBXEXJU3Ud6qEP5dzhsTgdDY2PhXW8fPlMjRMAngWOUkff47 62SMcJx0ibb3tVpoTKIsDUoYMGmRg+FIJwwOh6PCoJDU9Sq7lpswZBAHvP6vQwlL9R9VcKxCrYUj K9VfFQAOn5dre2+vlQYlwtKgZAFyQ+gLyUhG+FrlcDgqCKIjqANxmcqoSqcC1vtPbmxsvFH/SbKg syVKcFdt4EyfHBMj9XnfLON9OcahrDh5J9Yr96tRuVTlqloa/FVPGpQw8IzkXuC8cGNfrxwOR4VA 0SnOpsmTcFsFEhRlIw7TlDj8S6IaFxxVbF9F/TbRFOfVEJwy35vCUFg1nrJnWKNM9x2rcpa29y+1 NgmqmjQoYSCL13CJcjCs6muWw+GoAHA0pEIl/gN3qyL4vBof0pIlPa/kgaJR+6gcIeWprdEZSKGN s+YVhaRuDgwsHPhQPC9Rdc9Sbz6/lShhFBaVJ2txMlQtaVDCQH74HewlD/V1y+FwlBGcv2Nevk+i eg/PqhKYnoQHp6aBEoc/SJQv4gCVPSTKhFgOcFTzhfUbu+ynLES0UsDS8K4+w1ztk+ckCtPH/wNi 1TPwvbCo/AkpRwSNk4Z5CQM50X8mURzyor5+VfZ1ZCwG/LtBEp4UzOHoBOzUx9lOkZoRTyY1EQ9K Un+MVkV5qv78o0S+YGSQXFui+hGhCRYOmf+TqHz3g3r/dwNev6uVinEMJTfCaOsT1q8PtU9+LVGK 7+Mlql5Z7PqI5YkjkGsLLfzlpCEMYRioPw6SqLT1/OIoFzFIZSyc7BRIVDNIohzzLApz7e99SsDQ HbWFbtK12gTlAgQYZ0bM51SOfEeFcDgSJr1VTb4KAchDs7XxD6osibKg2NSGKhtJdL4/VKKS4d0K 6DuOa/BNoA4GxzbP2s9xHRW6CkAYunfh/bLrJ5HSxe1rXOj/T9W+uFX/+ahERbd2l8hvLt+QVdpI vgUcOik8dade8+16mdypanoYJQykFz1W5WiJ8qA7wi+WmFgpRvO2EQN2Hqu3+8wMIwkLVNsYqVOw SHM2fGDq+FZv8KqGLsjM4z0lMom3VPhxWOA5Z55mig5CQJTBpyZfVdh8Xql3xA98xhqNOCxumwTK XXM03JDRd1+bJSGWz63vJpcycsSekcy/69pa1JLn++ZI4v18i0LpfSC4ROdRpGotifxAFjUSkbKN 1NfWZvwjXjeC+W6g6qVOGrpIGFhgTjMrg6O4RbK1kppEMdFbSltGMgb7e7bL2lwiZ6n1bPHIRLMt rO8bY6e63QZOIJw0OBx1QKhStmmN10U2ULPrkVxWJWlQssAzYDI7V6LiU46uYbYRApy2/qXK5Z1O +hvGjvfwyrZrmGIsnt3GErbTIM57aSMgE6St+l1siUiZQCwets9tKe5/4qTB4XDUNCrq06AKjHO0 NVUuNKXjKByY4v6rcjMKXJXKpByf50jifv3cve3eRYORhSPtJ9flmAL/hrfNavGx/b6PkQo+95IR FQjHFirbSXRmurhbJhwOh8MtDaEIA850OOOQg2EtfxUFgd0+52v/Z2ThRSUBc4t8H4wFzvBwRI0d H/F/mK7XbsnynVTm340Icja6gRHB4RJZkrr7a+syOFeG5O2vfT3Vu8PhcNQVaVDFwk51G5WLTaE4 8kN8BEH5XY4g3q/mhzVS0V8iv4kfS5Slbjl/jQUDEkeimD31nX/q3eFwOOqGNKgiIYxyJ4nqSAz2 V5AXcFzEW5f88qNUcXyWtAbY8cciKj9S2VsivwoP3cwfb6gcrO/+ee8Kh8NRF6RBFcdCEmXiIjf6 AO/+nMCngCxmVNK7t1ZM00YcN5MoUgaLUx9/1TlBmOz5Ogb+6F3hcDhqnjSoolhMolzoZOPq7V2f 07JArvarVe6pVY95SxWOxYGc8FtLFBuOcnxGhcxq+EqsaJ9ZReo7EyURFHepHKDjYaZPEYfDUbOk QZUDnvUnmXJwj/rOQRIRIhWoxobPwuR6aLSRBxKq4Cw5Vtv9VcbfGC8QTqI6Tq7z8UE63BO0f+72 qeJwOGqSNOiiT2jebyU6x3Z0DvwUSPN6rSqF8d4d84whximZK6kySOa2dJ2ST6IoHjRrwyQfGQ6H o2ZIgzm+Uc4ah8cdvKs7BWGND6lc4E5uWccT4aDkgCDiBodKCglBSPvWWVeQkOtalTOKDbN1OByO qiAN6fOlh155PZWLVDbwbm7fQRKdzqfkE/3vpSp/9vj7vIgD0RZUpfuNkMUy3VooZwftxzW+q8FZ H/YHUnv/Xprl0tTJ4qltHQ5HcklD+r9L9ZaPJ28uU2dhVF7ZPRg66qTUt9Lc/JzMnnumkoX/eocU 2H0Xy2LSkNpDujcMlLnpu5WAHSI9u+0jqVSvOuqGz3X6XiNrDbkwtf6HM3xUOByOxJGG9Jsrzyfp NHH4F+nPpdzncR6wsI9VxdasSu5d+WL6ianhH4/1buniWBu1aE/p1jBAFu43XeY2d5c+PXaWnt1P kZZ0PSWPmqLj6WadZiNTq77tPg4OhyM5pEEJA3kX9lA5WzhzTjlhyAAObI+onKo93kuV3cepFd7w zH4hScS7q/VQwrCmktWzJMo8WScNT+MTQzGr3yhxGOcjweFwVD1pUMJAdcNDJTprns+7dR6QcwFH x+N0Uf+ganTNmyvH5V8b9LlmZfw/aZ9JwkUCpn4SZW3kb3gMEBKKxYS8EV+bzNTvN1dRu8gyerxE 4b296miMPUa79V287VPO4XBULWmwRZqETUepdPMunQfsAu+1xbxiYZRGCCADlMNeXaJESUQeNJri p1LlUInqQgyyz0IgyJuQmVAJd8O4mBUJhsgjgcWEtn0kUV0MBHL0lba5pULthfTso3KGRKW+6wEQ uudtrHkUjsPhqD7SoIvzUrYwH+Bd+T2gjG9TOU0X8c8rpDyxFKyvsovK5kYUSl3vAeVFzok3VV5Q eVrlFe2DLyrQdopkXaCyVJ2MOUgaNSpO0v6+36egw+GoCtJgO9cVVM5V2dm78Xsglv4G+kcX77KH Uur76WNk4ViJaju0N9OXMzgRqwShpY9LZHV5UvvkszL1A+0eLlFY6yp1NP7GGFm9xaeiw+GoKGnQ hRiT9VoqF9qC7JgXUQy9ii7as8tMFnifS6ocLpH1p9pM8xCIsSp3qtyi/fNyGfqEY5YNVX6n8oM6 GoetBa5UrtF+Ttf7pGxsbOSYjURgHKeS1n5xiY7iSBSG/w5EGytcNxunzF38dziCg+Q2qXxs4/er pqamuu9TR+LGP+O80ebAQImOoftKm/UZK/E3Kl/YOP9Yx/mUokiD7dwoHnSJypr+KjpcqM/TRfqa CpAFFj+OIX4pkd9CtYP6EnebUnu+xP0D0cXycrkR3noB/iZXqlyqffxtnS2SvHNqlpAMbG1br1a0 37FQFlr8DJLwrS2o8dEb4/Y1XVibfOlzVOEcYJyvJlFF4Y0kytDM+O+dY/wz1mfZ+oG/2+06xG8r mDSYyXtbidL4Luev5HvAEfBMXZz/Vkai0N8WxB3s3STRBE9+gb+rXFXK6BKzOGxkxGH1OhqXHJX9 ReUc7d8pNb5IsmOi8NlWNh/WMTJdqqO4ZrNCQCAeUHlYF9cPxOGorEUBK9pPVXY3/VBMVWnIw106 rvcoiDTogtvfdrHn2gM55gVnyKfqovzPMhGGBfXHTvZO2P1gdiJdd7+E9h+L77tCUrDo2GJOifoN pYJD6FWmXOoFmBzvsDFac7tiXSiZD9vZIrmpyoIVeAycUHF4xm+HwmrP6kLrtUEc5ZwHHLftp3Kg yvIB146bdSwfljdp0IWWc3HOx08V8v072uNDW4xvLRNhgEkOsN0yZ7NLGYFYQ6IQySSD82PMYBdo f44tUf9hMfuxEYdF6miczrTd8Inat+/XyI5qsBGFfWw+VEtGOZyfH1a5XuVRXXDr6mjIUfa5wDHE FiqnqawX+PJYJ/+iY/jYvEiDLrCcfxytcpyUPlQviUCxkcL3ryUkCfG51HCJzmUhCQubdWH+BFsX OgNWBsy9p2i/PlGiPoX8Uqqdo7Z6qpKJcx8hsMeXwwm1RAskaxbr0i9sMzOsih/3GyMPf1B5zJ0n HSWYDwPNsnCiREn5QqO1qq6O3VNykgZdWNnF8sFf+qvpEERJ4GB2aQnJwoZG2raQ+isBjY/IGdq/ fy9R/8aE+KQ661eOgl4xi8NjCVsgIXs/kSiUOEmRMFjQ/k/lCl18X/Ol0xFoPixuG3rmQ6kSK+L4 e5WO27PiXzR0sqAStne6E4ZOQeKmO2wHUQqFxmDA1HS7RKb0vnXYxySiukj74gRzYgwKVZh4BpNL 41911q8sLkQUXK79ukVCFseeKjg1/lkip86khc4uaFaRu7UdR6j08SXUEYAwkIn5eCltJmY2GfMc rzV0oLCoI3GQysH+ajoEzk2EoVwcOowNfwWVlY2MnCyR70I9g4lxAhYH80UIDRxYCR9+vc76FQsj 4+ws7deVqnxxROHuL5Gvy85SeKhkNYHN2DnMb23XUuJwdG1OcAyxl0SW0lID0jCzU9JgeRiIZz/c X02nILvhX0NXFMzIJXCDeJbNTOCsiOfumXZkE9LagMc7Mff4NkyrQ4sDzrPH2ryvxsURJXuekeih NdLvHLHguHmDtm8tn96OAucEc3VD20yVw/E9O2lQDJHIQWwhfz2ddiC70/8EJgw4mZJDAB8SnKW+ 9q6eBzh+4uxzmvZV75AXVuJAUbFHVa6rw37FkZYQxa2qbGHspgKhuVqiI9LuNdbvzPfhKtdoOzc2 506HIx9AnqkoPaiMOm9Gh6TBFBemym38vXQIvPpfZSFTRTMp8LV5DxPNykCq2n7e3d9D7CV8glll QoK+v0nlxXrcvKjsVAq/kS4SBp4Di9ufVH5Uw/0eW3p+Ix7K7shvbkDyye64XZluyQaW3CP/y/xl 5uLL2SExngP89XQIvPnPUsIwKqCFgcUCZzQyOpLNEX+SZb2rOwX9c4hEKaivCmhtSOu7eN+u+UeJ 6hDUCyCo5DhYRqKy5pVcFOMjuiukPtLUc9R5s0R5HRyOXOAkYBcpj+UN3z2irEY2NTW92xlpIOvj qv5eOgQm7OdUHgxIFthFHWGLpJsnC5s4x2gfTlRl/++AxGG6XpO8EFxz7zrqz5RtGFauJGngSEKi qIiL64QwYK38hy7I//Qp7chjfvS2jeXGgS+NBZ1Isgk2JtF1HI/j7H+/js/v+e5lkgZ2V43+ejrd EdxWbLSEmYBZEMkNsKOUNlSmlsGu+BTtz/H6Tl4M/J5J1LWlRAmE6gU4mC5RwQUR4kKSprMlfEa7 agT5/CGov/Op7MgTHM8Ol3Dh9+Rf+KcJm4WpShDySt/f0I5A9Pd30+EEf0Pl8SIJA8c+v7CXtLMT hqLAuMUqdrr2azCHIKt58bbKrXXWn5DZSp6rEyWBN/h2ddDXaRtjF+gi/ZVPZUeepBrSsH6gS3LU fqyOv6NUnlH5Ml/C0N7SkBI3k3cEqtjdZ172XSUMmNRJwkHooKfjDgNCj4g4OV7795SARa4w1ZG9 j7PDIXXSlympUISCLohExlBBb78KbAbG2gI63uY5YbdzbI7OZwv14iYQm8UCrJGYe8mw96JPYUee YDwOlTAp03G0P0fH381dvUD3DlhwvYC2koufcJK+poTao9kWloe6SBbYEa+g8ltTQo6wIDQYqw11 FG4JZG1o1vdGEbI7JfI5qaf5UG7CEMecH1eGDQvtI53zkxIV7noGwqCL59Qcz8gPLDHkC8HvY2uV 7SWydBX6zHE66b/51HUUgPlMj8xf5HXwVbhboqyqXUb3On4RLBYcFWCK5mxxjQ4+g/nwMVUk47tA GOhbUt9ebDtiR2lAZr1faX//L2D1Rnad99oOeKB3ccmAbwpZ7RYt4T3mmjXhHzbX31Oi0JLvl/Wz YtYH/tGkJOIR/XmByrYSxcsPz/NSbFCeZz0oxBTscEgU4bRMgOvgs3VHIeO/IzTU8YvAwjAmQ/F0 uGZIFxI5Wc4L4mn/5ISh5Ohmu77DQ+VvsKOODyCM3r0lszJAxnaVyOm0VGD+klFya10oCR17p9gF k0qVKpMt6oHnP8bukwsQ2gubjIU4HAWAIIXBRV6DNY2jiaILptUzacCKQFKfPaXj3BSUtaVE8ysF EgZCY8iwR7z/aj7eywLeHybjkI50jI37JDqicoQlDN2N6B1Yolvgr8CR4s9UR5+p8nFJGElTE2WD r+E+ElmmOjviwY/hcv384/72HV0Am9CFA2ySP9AxOKXYh6nX44nZRpj2U9k8y0T/u+465xZIGNg5 XS6epKncwFp0sL6Dp/WdTS70y1YQa1EjkzjEcV5NWNJbEiU/cgTkDUbWS1G0iXePkxfOXp+VuiF6 D8Kwn1YitK+Rh0NtvDB+sGpgzbxMP3edv3ZHFwh2rKeLTTgHkQ4yH+qVNODYhGPJStl2Bqp8nihA 6fQyAuKEoTKg/8mBsZvKtXm+M84K15bIwY0xQQp1kjtRgpnS3L+wyZYWjywKtQiya8ICt2sJLk/K Wyx856mSnl3OdmF10LZhdcB34gc2fnA8e1n/NtbfvKOLiCObik3zPlcCFeXrXscvoiMlMN4WnQeV MLxUAGHghZKp63dOGCq+g/2Zvo979P3lc3ZMCN2R0lZVlImFUrvPdomYBNewf3tejTBY3Po7dFE8 stmxmz+3Uo6G+DsYUXhciszrUgKyhmV1fpsjWNTIAtrfxjtHcISUT7Z+5GjuC22PH81Vh65qkDCu BEEipLr7O/kOnPlgWbikkJh/VVAoE6IkLjHrhaNy6G7vYCeJKiTmArvRL9t9H6vDHmZx+EQ6DsV1 dE1xxRa+Hwe+NP5HhMie75EJ3/U1ygZfHyxpOGOTaZM4/4FGHlKdKJVvbU6M02sQyvy0yvPar2Pq pM96GpnqbRuFWbZDn26kMOkExElDQJB7+44CCQMvgXzg50p95MtPArAe7Kjv5nZ9l1/koWzeafe7 QabUqDMyzrszKFBYW0vYEEusQzgs48Mwvd47WBXffLaJ4fiH47alC1jnU6YsB5tsIFFp8kl63WeM SD9UDl+RMvUVBIH06WtZn+GLsqS0WWDojzm2oZyon6dwExUfqUP0rvmzlBRE++h9eYaWIi8F4Qli OXLSEIGX/6bKIwV+j6OI0yX/WG1HeawNy0kUwZIr4dM39t7ZWcXeyewuiImmNkgf786guzhM49sG vjQ74CtKFSGRoP5F0eGEfbBE4d6hahR0MyL9UyPTo/VeJKei2Nb4ErSjh1lHqM8zXx7KMk7aBam5 O5f/iBVGa7S27Gj3yicygbWeI+iDJDrKeVmv9a987pnjeXhP+MIdbSQl3QGR490W6zRMcrIj9H4/ KcDiwJEIx1V/0Tbe76RhXpA6+F7dmeZdotZSQx8tpXHochRvbdhe39G/sxUZIzJGP4Ol4QLbWbHo rmY7YXZpb4s7QYZCP9vRrRzwmvgPsJjdU8dkAWJLTYJfGyHLZ01nToyWKNnUJ6aUsJT+ULLXIEGh Y1k9R2U/vTdHgH8LEcbXTkkOsrYUcjTIOryvPtNv9Hke7qSvmNf7GbFarohnhMxsIlE20yP1ujhO /7mLFpjuZu3YusRDhb5c0aQQjGu/mXbSEJlsPrLFJ1/CgBMX596H1XjfwPI5zxtvxGqS7c6/tR3I AjbBUbhDbDJVA2Dva5i8kHWFWvVtFs1L9J2y2/jMFkQWYsyUb1jbl/RpUjQG2kIb0qEUK8Nfi03Y lGDCwLw7xna/A/L4ylwjwjhs30WSqoxr9TbSgGPwLjl0Q3dTPheq7KDfxfn0qcBr8qwCSQPjiuOF 4/V5XtXnmdRuN4/15RQJW1q6m5GPM1W20/uQQKzQhHBpKf7oodQ6YI6ThnmBafpRVR4T8iQMKJTh KidKbXrUx7uQx1X+K1EGsU+1f6Z10h+xVzZseR1jzBtLBUstGzDHbZqLNGSA3RImzolGgCBES9ki 66ShOOWWsvexTsDLkk+D8/WX67A/OW9fV6KaNsM7ULj0DSb0oRm/nylRwit24u+2v6b+DiVNvgnK JJPQ7lRpq3WAYsMKi4/Q0hnrHmshCdVW1e/hCP4nu06l0N3azDi7z/qKaJ2jVA6X4ms3ZNvFs9Zc r/c7XfvgH7U8/pw0FJAq2hwfV7YJtUiN9QOmXgr5kBjnyXwTJOnnWuy7yJvaR38zywNnhj+3xa0S 5n2sQRuQi6EzwtMBo55h7RhiC8yytoA2i4dcFgOUyzBTOKGAhejfdUgYOObhXPo8+f45N3kqmH8v 2aYmkzBgST06lx8CO3S9x5+MdGBJ6Gvzl2vcYSQa68YPMr42xHbby+l3z8rc5Vdo3q+nz0F742KB 5TpCxhfqt3pvUo3fUqtjsJ7SSGOaYzBnnjtNswn2ep7XGGqsda0aIwsM8B1U9lQFe3cuwgB5IjeF yvwqA1DMlqui1U9A5WOVq2wXsr9EHsflBuwf0+FKeZKftJGGzzIINbHsvc364Og6ODNfTcKFr3JE 9lyFxlUlCQPjcT+Vq9oRhhm28eFY4fcSWfrWzLA80E8n5eu4aD4Kt0lUbC82nbf6CUkUbcSG4Hyz aMRY0Ob6VfqcS1V4rP3QLDCXS/l9ziAOp2kfbO6WhuSD44dREp1tDbLfoSAezCfM0lJEs/BtbgQk 6X03x8gSk//uzvrAikAtYm1f0ywtLAoDbQfZYP0xXT9Lf+If8qbt0N/R6/5Vf48Fg9AtSk0vXMY2 LmDP/WKen4dEUqhqC/t/fDQWt7EzxHV/Ue8hpAMkZvLH6in5kCohdtD72s4503cIQnulEYnZ0mbh i4Hfx++0r0YXcj/9/Od6T6yO+An81H69nG2aDrTnoMz4SImsifF8GQE51O8eU6FMmD1tjf6hzd1K AKvamdoHn2gf5FN5N1GO1vVCGjin5+VhWtsnw/JAmFa+DjxMyMds0vxBiq86VmnrAqbGc1Wpj+mA KEAE8DTGPwFT6IY2AQsZ3PTXGL3WE3YvzjwfMZJSrsqf7DpWKeDzU22MxOhrOyz6yKMouqbs6DOO ekIdTaSNNLxcR33Y36wIZ2UQBvoB/wPO0P9ln1tef+wtbWf3WAwopHVXF2+N0idDLomhGm0+8O/t 9Z532RHAGCMQu9l3+ti6cZH+/cgK5HRIWR9V0ikbvcrxzbHaB0fnkXAsUY689XI8MdN2iwykARkT 6tk80w3HZ/ew2BVsAiUVTOJLVQ5vTxjsyGGljF3ETRKZ9xq7oDDpKzysD7FF6yHru2Mlqu1QDrDI Latt6p/DitSgAklaxhbiOEtkN2lL9DJNHF1BDyOgiwWcy2wAPqoTwoASJhT47AwyACGHjB+QQRiw hBIttFUGqcBqdkNXo0tM2RFB9LeMX7NZ2o37WZlw5ssxtimYkTHvCJkcac9fj+hv7+JHOT6H4yhh jZ87aaguoPAwp2dmbeQlPZr39ubNVuvqEFOiSd1xQpAuNAvDrHZKc2lbmFDuhCYtF/C+LGjEkl9p i8vzZq0ptac1CmtQHgorbe/2SPv5Zrtn57x2sji6gp7W/wMCXQ/y9l49pIu2ehGUED+z3RiGNHwi 82Ys5e8cTfSz/4f43qf99GaRj8E6ebcRkJgQsIveIOMz043IzWynNHeyOVWvIIJsL8vSmY2YvVbG jZSThjzRx1j48IxJ96FETpD5YoB9/4cJ7YO4AuDlZjWJCQPnzXuZNeAkKe2xCwqY0CRyIeDbcE+7 haYU45tFdJEcVqQ4qxyLH+WNM72/exnhnCuOrqCXKbRQ0SfTbO7WA/AdOtrWrkwwpskT87AqpMNU Blgfb5FBgiEUdxS9y4isFGONOGQSFPIS9FFhTcQieZV831+Jz+2vn9mmTsd+7Ae3SY4+JgcOTptn tVt7nDRUeLczJEMhoiA4mvi6QNa4e0KtDJzVU9Dn0naEgT7hKOJ6G9zlAkr8p2b5+VQCVV/LorTy CY+Nz8khNVtnPFM3W6SxWtRlEqEA/T8w4PUwgY+v9U5TRQuZ38HIQUdgXHL8x1EjGRBHSpuzLtEl z0p0tBACzI0H7Cfg2ahUerNtNvB76sw/jiO/Y7Q9g+p0/NPurc23JxdxIIyWo6jTJAqRhaxV2qLW IO3KctdrngYG/xP5fpiwQnuZ6yewrXiYEyVxsRKGmdYeBgIOghxVbF9BFr5siQlDvLjmc646zUjD WzJvSG1cxGcBIw0N4iiUsIc6mmCsTE/CbqxIwsCYw//nVxkWGsIbH7Fxupe0ha8ytttbP1FAD4TK lIkJXZ9pjK2Zu0hbJsT2R5hzbP48bkRiGXv/zKcDTSlWC7A24+fWZJuqBrOUkMgtZEG1OASUDesn Ofp5tq3Vr1uNjAVtjWSNPizAc2GhIyR3TJ66P87P8U69k4ZvrfPyYuGW0GmoRFEXSbQyMCn+roTh gwzCgLmTVLKbVfjZUmXoUxaCTbXd92fLP6F/o2+Y1P8n38/DwTyZXxxdQXdpO2cPQYBRmrXuX7KY Kec4TJWjMUKYj7X2Qx6oNfGDzniH7e4J/SM67H1VSF91gbz0NsWP0iPnyoZZPs7x540SHVNMN4V8 oSljlN3Oer1R+hxvVLBfGT9Yqe4wCwnK8Mu45LVl2lzKlPQhUljkVbZNyyC71icFELVmI8eTrMrl rgFIA/Pm4Y4yghY6oesNRE28WEBxKpTODpJMXwaOX/6javnWVsLwlhKgdKtj1aVVQBjKhf62uC6c S9nomJikxAFvdJLjbNsBwXEUjgYJVy00roUys1Y7y3aYhE5mHkvgn0AUxAT7DGmKCf8mb8P+9vlM QNK2MGGT9Il+5wNTkvwkt8OXptzn2juKHX4H2SYJS8eKtvMekMXyAxkh/83V+nwvZrQDf6WtbB7F Gy8sJCdXqGuxvtxg/fhRlp3++/rsH5pV5WJpi0YpBlgpyXfxQBfGQ3w80C3QXCw6wVr3OqQPX+pQ fyYvK8No3ZW3tJqHfp64VqZ1MjfLn3W6npFaJTqW0KG3rP7+DJXNpX7QYgtnzkRA6fdaSRUTa444 QoHFrmfAnSJjeXYN99citquP653gw4F/wp0Zyg1l3aQKhZ08eRgukM6PGVESy5ps28HcaDZl0hWl NFblDJWb4916Bj42Jb2RkRiSU22lz/x3/exbZexPxgs1dM7R+z6d5y6/RZ+TY4Iz7T0MK/IZaD8p thtqobjad1ThiU/TUgeYo7NjXJ9u+R1NXPZmyyJD+sqIJfqmVpyTrFc9o3c3uX/dRVK/Ta0YEYYb 7llxsbvGthywcK/ULi118aoLxxMT073NKrGD90aVUuGIMNRkJIv5MnD2PSLj15i0/6nKZmYnym1u hiWH/iGMGUfIfEzZDZK/j05cm2WmtDkW87zdOiAMPNtMfTaOVHDoi8PUB9vcKhdpwApCZMdvCz2e sb7FjI+T+IVSnKUR4tZolpwva4Y0bPZoXWRk5UjiFTl7dG5HqlOGNfz65ZaldajsljTDtD7uB/17 pq78+rT3oiOY04f1PfD5luFCpTc3sncKnQMpW0Td4dFRCbAjXVva6qVAANjxPtYJyehmCjx2SIRQ 4e9wglkWcN5e1/69SIHWhBYjHxyNvCqRcyMh6jiD/8F0R66Mq01mIRkhbVE0w/W5r88sy12qjZNE lS5P03tN7+I1eEaS3I2xPixGz2JpGVBTpKFOlkiOJp7N65M9W18yZ4LDEpZA+Ct93PuUMDzX+n8j Wy1rDPgjWyd5/SVDTtk4z30A1/Cdo90sCee8V+9oCWgZSEl01NG9Rq0NKNWNM5Q7zoUPZlF6KOIh GTt/rAAfmKMbcq8q6DjBGWZ2Erjh6Le4KbA+dq9MC8VnZt3g3H+sykS93rQMksJu+Qu7BomehpKv oRNLyAz9G4mLKE9ProIe9gwQo4dK3JccMX5ZBGFoPQbS50fJv1YkaUC7zmckK/GoJ0dIFpnxuuzk m7Oeibbdd0tVcoCz1P+1W4h2lNjzuf4sDSlbGLvlOUbYXUx10hCUNITK/BmHz/aQ0mcTLSvsaALl v479CkWOw+J/s3ytt5GG2LlturRLr20ZBz8xeabIx2y2+THBSEOc7XOQEYyO8IW1IU5wtJBZPx4q Q7d2C+BHME3CpCyvmQisejLBxrvI3Mxz5LCexohXTVgbaRsmxJetHSljyPvUueLKz9IQjRF2FmMy Fm5H8fMuVLRDvGPrW4P9BBkaJm0lr5nLb+ZQWPRDZgZXTPLjSvWAqnzje3yS8T4WkOzJ0yAZLxoR F/v8GgmqSTFbwhwpNEg4h2AnDWVCLyMC+dRU6GvKdsGEtRFW/7iMHB17/xNmSArXFepYacV+Crkt DSNbqwezSJOR7Vxpy7fv6DrmSLhiXzVl5m2HfkYaetv/Ey79Wo4aG3GK7hizzDpRSnCPpnbPsEgW ojHbrBDvZnx+aAY5qna0SJhone9lVnTSkAwwIfOpsQ4jXChhbWNXTCxyZqlvPHZ/7HqrgCRSI0ej 4PB7eV7CVWasd9LwVaBrxbVEFq5R0pCZb+FrmbdwWmekYeGM+T8jYF93hm+lLZ10TtJgmJpBGlJG +pZO2PoR4hrdamGg1htpyDc7XfcE7maYmC9JbM4cOYwdGZkf13S9VTA4o6WkrWeBDKNkQioyzNqD a7CfmK9LZhAASMPHeWxuYmvoXPtOqUu4z273Ptk950oTzlFLZpGxvhltrRekpUaOO+uNNOTL9pJo aYD9P6Y75djph+ffSGrkHK1sGDmswZTSFt4ZwUjDZxIu2mG+hO1Sc8KcIPsaWY0VM302Ocd3elh/ gNhna0aJHxfL0TfSliwtn41YfKTRnGGdWNSnhpOGJDG+fEhDkvwZmMicv2d6WkMakpj6ml0JCWF+ X4H3LmZdwIN9OV8ego3NzwNaG1rN+JZet1bARqZ/BgGANHyeLZdBRkKl2MG3NcW2/v7rEj/rbHuf 32Y8e+8c38ERdlwGoWldX3NVfnRUJ7p7F3SIzLPCJABv/2tkpCWtiqI/cDQalsC+x5Hrb0YeDpfi nYfiLIL5OjMRooqFxhe0MMDCgBXs00C7S3bkOPbimzShhkhDX2mzCqKEN1elekuW76SsPxfLUMSb 6HduldKWcOe+jRnPCtnZVe+bi2QvlvGdOPywm9Rodk8nDbVlZci+44zCFHslyNKAMnxP5o17Zsey vCTzTJ7FcwmznIRY/OI8AbnD/qJ3j4VmVV8awsAS5GA253x+9UAKFmW5cg2RhrhgVEyQe9j8Xb7A tXxpKf/RDURgRZNCiEcPJ+bJHaz1RhpyFSOKTYVJUbitmc/atStWvEmclFh4trNFKMTzt5jVYloO wtDDCAPnyoN9aQgKzsDfCTxG1quxPkqJK1GHWxqqDi15koYFEkQasDRw9plp5sPDvDGh7wgrD9kr V5MwTpz0C+fpuc56MZ/uYDu+vr40BAWRPW/Z3AsRq44VcOPGxsaBTU1Nk2qgf+LNTHO732VL+p7u gGhkWlJTJXzWjghOOsd32hOjFp8WThqSQhpm59EnhBAlJY3w3Nad3MjRmZM23jUnFT0lnE9JnMEu V0U2jnTWNsI4RzzqJCQ4GnpfoiQ/ywe4HuObM3QKMt1aI+vSrIwNDZaxB1QuybG54bjndCO8fP9R lfPzGOvF6gxI/Zm2OYEQ3qXyxxzPilP22RJZceMsoc0+NZw01IKlIVZYSUnE0VGa3u7S5old72jJ IAQvdPiJkcP6mWXjB7YA+y4oIKzMMB73rwYiDQBL2s563XuKKUpURXP4G2mrp8FunOO057PVTdC2 z5K2Yzc2DVNUntPvlMy5UO8Zh0vGR9tEUXyo93w2x3cWySDirMFTi6wJ4agQ6tGnIRe7TVqOho5I A++1lw/v1vfNbogkV9kygRJpcoTthlBGXqwqPPC7eUrCJbjpY0TwJzVAqmLSMDljDVpcsmRaVEUc E+LM0EeOVAeU+HF5toEZBACCMiOPd7VUxpoUqp6Dw0lDWZRILktDr4SRhnQHO+P8ai3UPlJmZeAM fFKefegOaaUBZuz/SZiKgTFw9t1XFWgtpPuG+Mc1HbqbYl4sC9H4bseeQRow/ZfaHyfOAJnKIA3f 5PhOe8ds2jrBp4SThqQq2KRbGuZFFDYIi+dMdLwP8dZ3zqL2eY55wKI7K4NYThGPIQ+5m2bekavh 2cAKbC2Vw2qgizhiGZPx/xCAXHlWMlM6x5aGUqe/b7+pap9WuiP0a9cWLBMf+6xw0lAr6CHJygY5 b2psHCJHjib72s0SpaKtd3xrC9T4TkhWgy20OEBOs/5kURsr7qgVGhC3xwKTMUz4ezY2Nu6Y8L6B 2L6f8f+Mx9XzGNuZxaOI/Cl1eub2lTXbP8M8sMyd+IitbL9qts+P8engpKGWSMOABD1vZ2lc50rp i9ckAVgMXlIiNauTv9N3QyXyZYAwxBE29KtHUITfTVNU7bXA111G5TeqoCqalEvv36MxwkqEg3ah b6gE+WWGpWENvU62DQxm/sxS2BwDDClxMzMLhqXtGb7I8nmOB3kvS2W0823JbvlzVDE8jfS8u86U KYp+CXuHHUVK5GM2rAbEjlR9bReSlty57AsBvgxPZfk7i/J6tkjPNdIw1xZH920ICMsOyVn2KAlb FwWCxzHFhXr9I/Q+H5WzXZAFswocpbKN7azf0d9frT9vyCeaQT8zRz8/zhTqJrYOLStRldrHspCG T6Qtd0JfI8CdPWd3s2DMZ9LX1o845HOaKXVqWMzo4PvcY/4M0tBsJOfTLE2jLzaSNmsozp4ve+SE k4ZasrygLJIUeRAdp2Bmb6twGS8o1e5shGlzrC08a9ruI6R5lYXvDYlC/ToiiWL329QW6R7SVqei j0+HkiD2t9lbwoVfis1ZKpNeocrtOFVK75eJMEA2d1L5rcxb7hkSQV6CQfqZcy1CIp++ecpIAxhk JOSxLPOHOU7isgFGBIZmEJnBtsuHUK1su/1BGZ/NTOU814gD15pk5O5dmzvIR/b3hTJIA/8/rrPN iR1NYPkYnmGZwCrxnE8DJw1JIgU9c/y9b+CdbqnRyxaCXjJv6OV0m9DVDHwuyJ2wpS2YX2TbKXUB kJAHsxxN9Dcrw2r2/ynbPc2RZCfHqmZrAzkbOM/+h0QJgkKitynZG/Qep+i9nioxYeBs/wizMHSU QRZC+ivGlH72/Dx21yjfp203vqDJZvrdZfW7H3bw+dlGGiYaEWANWJt7GQlfqwASHpe47mekgDDl HTI2IG9KFP2SmWIfy8SHWdqFlWEraTua4PMvS1Qrx5FgJVpPyFXGNc5vkKSz7Dimu/0ZKqRhtOQO h6rkjvMViXwJetiiNCjg9VtsQX08y2dYHH8q84antkibxclRGkAO77b3X4r5wE79FlWeJ3bBtyAf stBTZQPIicqpkj3lPGOaaq2/zlUKWpUvJAALyRMZ6xEFqHbt5PNxQqe3MhQ/BPgkieq3hLLaMRco F3+YWYhiYJV4vZM+SpnlZZeMX3OMcX+eVheHk4aqQSrH33okjDQ02I5k3h36yNEsQB/LvB7Z1YIW W+xYPDjbflEiU+uSAe/xVSthGDm649CuKAvk+tJmOo2fK04h7Ud3pbM2pG1cXiO586Z0FZjFOR64 RxXYwSqLByAL3VSWMaV8e8ZOPBe49zEmObvHCNXsDGvFjnrfYe2VcmOU4WlXyc8/hLFNTgesjzij UhX3TonScN+hcp/KM7bR+DLP9wIh2kMfo6PiYUS1kHhr1QyrCEXLHvUZkGzU28KIkpqVgzR0l+Ql RmKnQ1XIJ9v9HjMnJsW1qvCZ+9n7wLyLEvlDoOvONqvFn2xhz6ZU9mhHEOOjCS9YVXri8I0qm4dM ae1TottgNVzPlOpJer+HheOqaE58ps8wKwdJiI8rG20ObauyubSZ2wviHGZtmKv3vTJLv0zTzzxr 1oatbFPA3D5Y5QR7Lsz+u0t09LFKJ5eaawQEgvC8WQQ+st1+hymczTqAVWGgtXFFszDQh8t1MC84 Evk55Em/+0/9eZVe9x1zuIQs7J/xWax+t+vfv/bR76QhSchMu1pLiGK6v+8M+aXtHvarMutJg+2g NjaitqSEyY2B4+M9KkdqP3Qe0jVy2HwdWBni8ZGW5FQ4TTqwAl0lUc2PVUq8zmEhOETlIImsXGNU uY01ZTYlY2cdH02hmJcwYXyGSJrEcdgJRhyyFXjCGvA3iaIO+tjcGKHfYy4zrs+QyHcj2/cvNiWd d64WswDNsO+Ps03IdXpfyMImRlq27OCr9BVHF9voZ6+w7/3S+k5so/aSWVAcThocVWJpWNN2z23O jyNHT1cF+YrtMtausmeGLGC23TXgNVEAt2QlDG2L987tiFScLZQ50cOHVFmsDThFMjbPVblaypMf BVKwkEkl5gSKlJwSs7X9N3TSL9P17zhx/p/KXvZrwi+vMwvCoA7I7hxpi/pqdegthDDkeE8z9Hma ZF4/H+7ZnDFX6FeiYS6SKMw5MwEU5Ox6vc5UH/XJhyd3+j4ya9In6T022s6kPTBH3lsH763Z2vpq 1k+NHMbCitl10w4WXhbk3j4Fykoc2Nk+aMqmXhzkMP2fror4gBxWmGulrVZHd9vRZxKGOTbej1Q5 Xtqip/jMDjkSQ+UNvQ6bEixz69qvZtqaghPxv6TN/0KMWCyRQSawdv5bIh8Kh5OGxJKCzhBnA5yT wHZh7t9alWL7XfIkm7C1nrY1TqfdsxOy0FeFxWxBWwAX6GRceNRE+YkDiuWvKlfUUbMhqNOz9Emz EYJL5ftHqs02n89RGaGfxUrz3wzCzBxYSSKfiCC8QWVHabNMs6b8R+8LcYD47CmRD0b7dZO1lJwM V3gyJycNSVYsPXKQhhny/VLTSQCOhbHTUoaybPVx+EDlnyUgX3EuCMygmB6/sZ/8P6mCX5Ty+ZAw luNMd+0JA9YDnNhulMiPYakO2pK2xdatb5UhDpi/fy+RA2utgzool2iTb83RJzgN3iXRsUQmmHck yDpHP/OJ/W6izGtRbI2saGxsnK9IKwP+DDiBbpGxRo6z+7c6tNp98aGY3G5OES1xbqhjEoeThkq1 NxtpaDall7SaDbGDJz4Ce1gRpkxwxs/56OuBSQMm1N/Yzh2TPx7Tq5scYjuScjlg0n5MuR0lwSHW nVj5DVVOkyhxTUdjw2tNVJY4oIzwb/hjDTcT5X65REcP+fQJpIBoi1EZv8Yp82cqF6lSjy1mhBgT zhiHWGMxw2fjJ0U+L06g+0qbBY45/UCcqttIyY9VLpN580J8aKTmWR/ZThqSjG6Szfwc7cohDF8k 0IIywxYOQsI2a9cuFDzx1yHj4hk7K9vi92eJvNKXMwKzjt1reylP/YbYlHuJtnVqOysDi+qW1i+8 +1Xk+5768dGG15qoPHFgF05+BbIazqpBwoBy/X2B5noshafLvOmk8W84lHlGDge7Hor61nYK/wDL 59AVKwNHeTtIW8RE2oj5rfZ3nEkPNJKXmRIc8nehPtO/fEQ7aUg64lSp2dC+rn1SSANK72t7p0dY WGEmcUCZ3t9uUQmB+U0hs9DjO4FJ8jaJwujKZWFgMf2ltvHpDv6O9WWE+LFDkogDDq04RpKeeUKN NAuLAT4IlxWaEdEIAblHjm9HHFjLyLj4D1XgO9lmh0RNr2esdxwtHGM5JwohDD3su0dJmy8D7wUi 8IH+fQX9+TuJfC4WaUcYsDBc7yPZSUOtkIZcMfgo3jcS2DYWEHbV1HIglezBHXyGCX2VhD2maD+e 4up55QDWlVFGGDqLmujVblFzJIM4kDuBXAWYxp9KcFPYnVP4iSJaV3fVITDDMRIlfk/Gn1DuJK/6 s+34u5sij9PHYw0gEdQBBRAGNiEcN3KUF/v/zLT3wDEnORnwtfiFzBu2z2brZH3W63wEO2moFfSQ 73vNtwc7chKRTExAe3A8ItvbLHuXi9jOmt3ZgTJy2IbtrA0sPK+ZVWBSwt8l5O7myKoy+sMOPzFy WJykZ5JP9UQSh1kqj0iUufMSmdfRLgmIk43tre24PUB/tKhgccA/B4fRTIsFRwn4EXGfjdttDDim OEXJwN55EgYiLy6UeatTfmlrI/cle+sKGV+bY+vQofp8//CR66ShltBTclUvHDmaUCjOEO9LQHvG 2K4iNsuTHGddIw/Lte4URg4b3K597BgeMeIwI6HvcZLtqo7T9nzWCWFYXKLz1h+JH00knTxAgs+w HfNDkow8KkSDUC57P33+lwP3BxbDkyVKwT42408o/KES+Re1rweBMzCOkySWGtAJYYBkE2WEpWD7 dtdlHSEtdPuMkFiECJfdS5/rYR+tThpqkTQs3EF0QXtw/vgXqc5iT5noZwvon6XNwRFLCo5+mOU3 al1so+JMmcSBiU4IJs5mcxP2DlEg50TtGj0tC2H4tcpZEnmQr+FTPfHEYaYKhIGoAcziz1UpeZhs 8/HH+rwXqHxVov7gPmSU3E0iH6I57ZR8R9l+cYikHPldShAOxC8BZ0eVwSo4PJLvAUvBhh18N9VO X3C/V8zqcbg+zxgfpU4aahE9zNLQL4e1AbMfk/3TKm8PqWU5X2TngQPU17aYjrNJTmgW6ZJ/o4q0 e7s24jR1re2GklCPIz4bPlqf/XKVOZ0QhsEShYEeZ++azI8DfarXDHmYovJ3ibz6IQ+PVsH4ZWwy n8gDgtPtQfqMr5ShL+aoUHwL/yXSTZPgKZeTZR+bE1gT+C7HGPhK4Bu0n+SuAcP1P7J1Y0eOI6yk t8NJQ82ShoGSy69h5DAUbm/JdZRReUAEiFLAbIvT2FTbAXDu2GSfob2YK0/4noUlqtHA+eTJRpKq CSxOWEQmmlLgSGV/feY7srw3CMOJEjmLefhkbZOHyUYeyEOAKZ1cBu9J+SxnEAWcDXEOpFT2Zvo8 B6g8bYWfytkXUy28cUdbC+62DUQ2pGzzNMTWiFy6YJaRDNq6pd7vtxYe66gz1FvBKsISB9gkGZ/j c/NLMqodsjPYTuUt2z0cYzvyCyRKlEMbFjNFmlbFerFZUmLi8JX+7lrrD8z+K1RBm+ba84w1awrP d6E+64QshAFnr9Ok46gRR+2SB0KkH2tsbHzc5jY5QqjIuIFEx3QLS5gCZEQ9cC+OLrEiPG3yTrXs tC2D5B3aFzhfDpOoEuY2trEYWCCRjjO+ckRLmCc+Xi+UqehUQ4B31hBIv6UCbUBSRWzS45D6EP1a dFvqscplH2PXr+QgDQtK7kiLagFlfwlNIw0v5kacmTAhEus+0tqzmBGKnqpgL1IFPCuDOFAN8077 Dp//cYUJAzuaa2zhwxJyZ7uS3+0Jw7JGePZwNVq35AElxzk/xa8eVMUZF3ha3oQxsqTNAyyIHN31 tjUwtgw0244aXxmsXBw5NBl5JUIHB+nxRlSquS+wzBE2/oaVqqbNhGGvbH0xxPqmn7W/xdpN/020 dYBNCJEaH+JPUuYmcL8JtuHpSohqyghPCOtpnPDvM/t3V6xIDfYsXe1HSOmnNmabu9gfYm0omuDW I2kgj8DQPFj2t5IcJ8EGWxQoHINp8gwjEURWkLL2UFsQhpjFob8q2nPMITImDrT1Jf098dz7SeTg tFSZ28GAxtx7gj5Pbo/zyE+DBDTnyfe9uh31TSLm2iL5mWTkebCQwjhleM8M0pCyBXm2SXO5jxlK 1A8cV443+Y/1QeZOvMHaT3+1VEGbeV6sRuvbO+nK88RKclaAQllYb/4ikbNpV/smbsc3XSQtEMCf ZBC8rj7DXAlQIiGVsQCTIIQzwhVrfD2Z0joIRo4+NodCWtaU0c8S1DbY7BNmWfiRDTaytq1nkxCm u6ENXpKznKb98HEHbe9huxIIxq7GcMvx7ER0cHwyNg/C0N8m0hkybwpbR+FgR3219vtI7wqHw5EN beckwxeGfuJpX+ue5qnWRXL4wvfJ41927nU9fOFZtvPAX6BXQtrWx6wonO2SlRGzJPHZ9xiDhywQ GrWmRL4La2g739R+mDdK5PEvW1Q+0789ZKw/jtOeL/Dz0r9NRhZOUqV1jd53Sh6EgWfBeXOktdFR HMjX8aL2/ePeFQ6Hw0nD99uMieZhXSQ7zxT4+JdzjTighFdJUPu6m2UgLsBE5bllTPnzO84r3zfr A23bWNs5Udv7bod98PiX41oJVnTsMcGISVedyzD7cp+bJIr2uFWifAs3631ye2KTb2L4wnjKc+SC BcirUjppcDgcZVYw9QYUKQ6Oy5sC60xB9bLPJD0xEGeWlKwme9w/jDg8K5JWJZ3iiAZfiKtaj2NS c6+SM8d8v7LgyNEo+7dbZeQwnC1JM8sxx7r27yWsT3vY9dPS5lRG+lkqbL5kxOXF1oiNQhD5LnBs xnEJfhv9fOo6HA5HJUlDt6n11G7diaexHozq3B4xFXP+FElGytp8gFPjQZHFIDVRm/Ww0qdXpaXn mcor1pHUrNMl1byKnLni2XLWu2M7V+CtaahfbpWzlklJukGJQmqAyiJGHPpIW7gWhOEL/d9vZOT7 hTvwnDt/N2npvaTI1P0kcuxcyqesw+FwVANpmHh4PbV7fkl3X0kOWaCnXPurjkNQTv+0RQ4fOUGV 4WOqGFeokXaj2PeQdI/BMnvR8XLDAffKaeu9It8ueaTMWPkA/f1e0jzfQvKTgw+Su/vlLvJ05hjI Af33uUkY/DjdU3qNGyajX9pL+r22u76rZXyqlgOnexc4HI6saIue2CFdL9ETgF0vVdl+Lv9Jfdjp p7ZP99EeIi0s6WH71lgfTNBe+IN0IyFU+htJp9aUtBwqDTJMBefEdyKrhLwlo1KlT9M7Is0xCvHz wyWK2NhSn2egtPgkLQOi6In/pEZ6VzgcjvwsDd3qqt0oKBw+Oc/vnDTcl5qpyowEJ9Rz2KLG+mCw vnOK12yjhOFiuTd1n7b1RYkSqkCUKEV8gpAsakSanPZkvyNH/adKIuYEIgr4QJA7Yj3rXwjDct+R 2VTdjUuHw+FICGmoP7CrJeXsnTk+R9rYO0yh1VqtDjLiba7KeS1V4Ph3XKWE4Dn9921Gps41ZU6O BxwbSRD1nv6d/A84RhK+SdQDRxOEc7YmxdFrtBgpiNU+4wznRY5HcJrEwRSfEpxMV5Tqr/HhcDgc jjonDfO3Kq0R6QVVyU3u9FOjUlP1M1TSe0DmrTFfS8CBcR8hIdSINEmfrtd2P63/JlKBDJGHS1th G2Qj+17s0zDNCAXetDP0e99mjK++RhjitNy9xYtJORwOh5OGhIEY/6ESHVE8keOz8a4bxbdeDSs9 2refyi6q+ClSQy4FKmbe3vq76NhiDWkr5EU/9DJZ2KeTw+FwOGmoZaDoNsxJGjjDH5F+Rv+1gwoO oyub1WHbGiUQkIK45DCECesDxxc3mbVgdZW1Jcr/QLrtQRJli+zeSX/EeRsapP7KsTscDoeThhra Wa+vhGABJQZf5yAOcRW9h1tlRJpshkeq/KaG+xFHxRVNjjUC8aQKjpFE2lARb7YRhgWsP8lGyZEE +Rp62r/JNrqBSR+fdg6Hw+GkIYmIsz5Sb/7xgr45KvWZEofrTSHuXwd9BQFYyeQQIwtUEBxrQv0K kmHNMWsD1orFJYqGIM8CTpC9fco5HA6Hk4Ykg9oMWxRMGiKMU7nOdtAr1lm/QSKWMNnEh5HD4XDU Pvx8OTKpbyQj0osX/M0otJC6Cn+R2kk37XA4HA6Hk4ZOQB4Bahps2qVvj0pRX4FwzFe9Kx0Oh8Ph pKH2sZjKdpahMD+MSCMLqRBFQAKo27wbHQ6Hw1HLcJ+GCHj/E0q5lkQ1KXJjVArSgLPfjhJVc3xI ZW+JwhAdDkeJ0NjYyGYndrSF8C9oc7h3xppGgjEqsuKcS20N6qlMampqmlMjfZCyNjeakHStn/UB R6WUpSfpGoXnJqhM1LZP99HjcNIQcB5KlJvg+QK+Q/pk0in/TiJnyinejQ5HSRTkAInSmXOMiHVv eVOUhPBms5jGWUvJVvqxXotjRGrJkHflPVWkLQnqB0gCkV4bS5RkbhUjTYQ1d1alhfaR4v1T/T51 dF5QeUrlDW37Nz66HE4aug52K8NlRHo5GZX6IE9rAwWtXtZ/ISO8Cx2OoEqSnB+b2dzi57JSeAmz OGvpIiYQjgMlyrnytN7j3/rzEVWg46u0D3obOdhZouRyK1l78gWEagGTFSTK7IoV5h299r368/9U XkkSeXI4aagWMLmGmrXhsgK+hz/DLULhJ89D4HCEsCqwe95dKF0fpS0PXeuUeyxkZARFPE7vS6r0 m1R5vlVFZIGCeocJNWGipGmhAOlY04QEdQ/p/Qgdf7RWjm8cpVWUjjYsKlHRpsa8vzEqxTnhsxKl WXY4HF1XlFj7SJR2n0RHfmtJ6Yujc/2lJSoDf78+w+kqgypJmlTYvJwnUQXePQMThvbob9YHMtze qPf+oY9Eh5OG/IHlZZjKTwv83scqN0iUFdHhcBSmKHuYsmIOXW/WhXID6wOVXE9RuUWfZ/MK9AM+ CzhW3yFR2vZylozn+AJH7v/T5zjGnsXhcNKQBxZrJQ2FJHuioFXk13C1d5/DUZCixOOf8/pbjKxX ugAcxwKb2677IIvUKEc/LGpE4a8SWVgqBTK8nqVyhT7TEj5CHU4a8rM2kBJ614K+NSr1hS18d3gX Ohx5KUoiIn5hZHv5Kns8Er6do3Ky+ReUsh+W1B9nq/xWSnsUkS/6m9XhOn02DyF3OGnI09qwi4xI L1ng9wi5fEU8pbTDkQ9h2EflfCmvGb4Q4NtwtMop+rw9S9QPQ40sHFplbcdZkjDyK/UZV/MR63DS kB3dzNqwT97fGJHGQoE38uFSeROrw1HNhIHETD+top11NhCmSYjmESWyMJwskbWlGkGGXIrxXaDP upSPXIeThuxYVCLfhnxZdrNEDpH/9a5zODpVlOxgNzXCMCApj61ymD77zgH7ASvGwRKVma9mxO/r TPM/cThpcHQCrAXLte4yRqRzh32NSnEk8aHKJRJlm3M4HPMqSuYUyYlOUxmcsMcnLPNobcMyAfoB 5butyjEJaTvPSz6Lo3wUO5w0ZMcAm9xb5/XpqFT2qza5HhH3bXA4MjHYdtfrJ/DZ2TjgFHhIMREV 9t2VVX5tyjgpwDLyC33+HXwYO2lw5N5h/FJGpBfM8/McU5DwaYZEOe8dDrcyNDZSHwEz974JbsZC tuNep5iukMiHYfUEth8rC9aWxX1EO2lwdI5etkjsV+D3ukthOeIdjlolDDH5xsqQ9KRBWEt2saOW QvuB0M11pRAH6+oCjpE4ex/ko7p+4bUn8gPM+ucyIv1fGZV6Oesno5LZOETepLKJJMsE6XCUAhzz ccS3WeDrUqUR/yGOAt+RqAw0lj6yGw41ss89Vwh4zwVtXrPr/rDA7xItsa89XyhQ/vs1lYdUXpK2 rLQwNZJEbalCts1QIaOtDuIUu2pqanrZh7aTBkfHYFdBeumjlRD8srW6ZXbiQPVLFrN/SPV7Rzsc pbYyoCz3kHChyJS5pj7FVSrPdVZkSe/9Z4lyrnDvI41IhFgLBhsJ+rCAfsDCgi/HtoH6gKNPlPbF Kg9oH0zv4DOkhL7IiMMxAUkbVqOfU2bcq2PWH/x4In8w6Ul2ckCen6f6Jbn0X/euc9QxyMmwru12 iwUK6m0j4vuownoyW1VGFJpKk/7zStvh/y9Qm/Bt2MDCR/MFRIMssyGOLGcaadpbm/fvTghD3Aff qFD4ioqhf5QwztkDbC304lZOGhw5QEGbg2VEet2cn4wiKSize6lETpEORz0Cc/Y2UrxVM22E4WhV greqzM33i0YsnpMo1POTQBsIIiDySnhkvgyrm6ItFrT7BZXjtV1jCuiD8frjAtvIhAAkaCcf3k4a HLnB+eiJeUVTRGWzH1a5xrvNUW9QZdnNlMu6AS6H0rtCld/DXfmyfi82518XqHn4JayU52cJV9xW wjiBQhQu0/Z80IU+GKc/LpcweWRY/4aHyFvhcNJQ62DXQOgY/g25+29UqsnY/SPedY46A0pytXx3 5FmApe4plZuLvA6OkvervB+obTkVpuVloFrk1gHuOdU2IfcUSTqukuKtn7QLy+uWPsydNDhyg3z0 hE3tkufnWaQuVBnnXeeoI3D2vWaA6zBvbtKdclGKTr/PEQfVaJ8NtHlYLE+LxPoBiBMgKusfxTgf Wh++qPJAoHVwi1JXAXU4aagV4EF8vIxI514UR6U4U33BiMO33nWOOgHFqFYu8hqzVN5QeSLQM7Fb fy/AdchZsKAqzB45PjdQZeMA95smkSPnCwGuNZFVSWVOkdfpo7KKyho+1J00OPLrO5ybzlDisGge xOFr/e/dKtdLFEs+y7vQUaswf4aFpfgaE5+rPKQ75JmBHg3S/mkAhUn75jPykK0PaH+IKAMsJI9m ixYpwNoAAXnZyFix4B1v6CPeSYMjP2CW21zlFCUO+YRSTZAomuJsCWMedDiqFcwH8jMUY5ZHQb5t ZDsU5pq1oVjl22BtzBYV0s924o1F3qvFiM6zAfsB/46nAlwHh8h1/IjCSYMjf3Bu+zPJpwIclTBH pT7Sf12h8ph3naOGgXKOQ47vlShj49QCvo//wbt8X3fGnwV8rrQp4WLzFaTyWD85nlktwDo7w8hT SJ+oyRL5NhR7XApZoBrw0j7k6wOeETIMSDN9mIxIT1RS8Pc8Pj/Vdg1v2U7E4agpZIQ4vmwRBOy6 cRxcViI/B8b9CmaNWETakh5xdMeZ+4Mq1+h1Xgz8aLGyLzY7ZYsp3OYsn8EJctUAz8zR5mshjiYy wPEoDtpjpbg02ynbOK1gxNDhpMGRJ2DaHFN8ocThgRwWhxb9HKFPpJk+17vOUeMEosWIMjJaomyG Yk6ECxlpWNiIA+ftYy2TYykQHyt0C0AaZnVGGsyfASfIEHkMpkhUXyLoO9FnnGzvo9jaHPNL2Poe DicNdYMVWknAiPTXSgyey0EcJunnSO+6lUR+EQ5HvZEJds6fmZQLPWxn3KPI68wxEjS7k78TWTDU yFAxgJTgfzCmBH3xjVkHRhR5ndacFViUvBZF7cN9GsL3J+FHlygh+EEen6fgzWUSeYg7HI7SgzP4 xQOsfZCFSVmUJKSBpE7FVpfEmjG2RGsEVh0ySxbr30FbcXhdyIeXkwZH4cB6s24rGRiRXi2HtYEz 0WdaSUbkOOZwOEoLfCuWC3AdnBPH5VCkSwa4D6Gmn5iPSGhASEjPPanI68ThtYv58HLS4OgaMH1u aMRhpRzE4Sv9720qf7YFYoYTCIcjPBobG1O2Gw6RjIhd+vs5SMPgAPdpJQ0l6hLWmS8lygFRDOjX vhIVJ3M4aXB0EZglqVFxpRKHVXMQB9LDHquylsoGKieJZ450OEKDs/fVA1ga5pgiz5ZZkmOQQYFI Q0mcQi2t9gwjDsUi37TaDicNjjyIw1VKHNbKQRxmqLyr8rr+360Srhqfw+GIwE4Yp+NiHcAJgfyf Kt0Ola2FmEJQBgZ45lbfiRL2CZuTEI6oRKQs4kPMSYOjeHBUsZHK1UocNsjrG6NS7GIoYXu7d5/D UTxUkUMUCIsOUZURc/7jWf7OvYjQ6BdIqX9Vwq6BlEwJtEFyR8g6QBvjTnlnlBA4Cq2jco3smD5R 7krlk0KayIpT7d3s5l3ocBQFdsHbS/EmdJwHScr2XI51dQFpS1jVVRBuOd2kVJgTiDT0sDY76oU0 7PnN094bpUVrgavu6Zarl9j432ee99TOf89hbeC88f1h2zUds1jzlI+XnDPpV82phr7ejY5S4Zba tTIw90iytHOAy2HKv7+pqWl6jk3C/AFIQ4sRhtkl7B6cIb8JRBr6e66GOiINm898y3ujDEhLapk5 qW4XX77BjUP0f39/9LP7Z612Ofr+xqZT1/vDWXNT3Z5sloZDzWLhZ4cOJw35g7wM1Icptj4CCpaI iXtzfA7S0FeK953A0oAjZCmdornHjADXoc39jCjN9NlUB6RhZqqn90b5gIn0RJUllTyco8Qhq3f0 vs8fQXjX3fpZmB1pp3f3LnQ48rIy4NW/vsovAlyOmhj/1p30pzk+1xDAyhBbGiAMc0rYRZCGWQGu Q5v7OGmofbgjZOVASdkDVP6qZGCdXB/Wz+CJvacTBocjb8LAj+VVjpHIMbEYcERAZFM+zsndApGG tBGGUuZtabG2FZsVMp9S4Q4nDY4iwSTbQuXvSgp+rpKtiA67gRdUbpQSxW07HDUGkisdrLJxgGuN Vbm2qakpn/BH1tUQptu0WQJK6SPQYsSk2HukjCz18GHnpMFR+ncwTOV3Kvg6NHb0oaOf3X+aCuWC D5GoyNUVEmWlczgc37cy4Mn/E5svxYJqkHer3FOgAg1BGuZK9vLboYhDOsB1GgK12+GkwZEHyN1+ uMq/lDhs29mHlDjMVaEy3Wm2IL6bscCwY/BMko56Jwz4MWwmUchysccEKO2XIOkFRgWk67DrnTQ4 aXCUGZg0SQB1kxKHc1UWy0IeCJPifHUXlWslSgBDqd4nJTKlOhz1SBgwj6+ncr6Eqf3QWolWCcN4 792cSIln/HHS4KgISHd7vMpdShx2Vumexerwtv7zKImOLK6SqNTtHyTy9HY46okwsJ6tqXKxysoB LkmUxI1KGO7z3s0LWGKavRucNDgqZ3WgxPYNiBKHtbJYHb5VeVX/ebbKr7FUqJxhlgeHox4IAztc StFTZn6dAJdk7owyAl4oQh1NpGyNLvXuPdT1m5001D48PKb6QajYz1W2VOJA5MQNShDGdkIe4kQt M/Szd0iUbIW8Dp5J0lHrhIES9BdIVCCuWBCp9JjKyByZH7PtuENkcUzZGt2thMoYUtJDivdFSFu7 5/qIdEuDo/Jg8eB8lpLZ9ykhOK6zKIsMAjHZLA6ni0dZOGqXMPBjmBGG7QJcEmX/FHNNCUNXQ5vj pEwh5n23Eq/T3KNnAGtD2vpujo9KJw2O6gG7jhVtgXxQicOJKktlIQ44R3K8cbSKO3I5apUwXKgy IsAlUfavGWF4t8jrhMqy2EvC5HzoDKESUdHmmVLaOhkOJw2OLgJz4ioq56k8qsThQpU1VBo6IA5f 6w+KY+0B0fCuc9QYYbhIZccAl2Sn/JYRhpeKvFacmrnYI4U4NXOpSUOI40uOJbBoesi3kwZHFYMJ T/U+6lj8V+U2JQ67WcrpTOIwW+UZ/edeKofZbirt3edwwvAd3jXC8GiAazWbAi12110O0oD1cr5Q bdb+c58GJw2OhIAMeLuYVeFJJQ6Xq2yjslAGefhSf/xJZbjKTvbv93x34EgYqCdxfkDCwBz4jSq8 /wS6HopzaoB51c0Uep8S9mUPWzuKBb4MX/vQrH149ETtgV3JiiaU0h6jxAHHrodUnlXi8In+nCJR WlwqZ2KaXFWiMDWE+HacLiEbvb07HVVmZVhOomO5nQNdcrQRhlEBH3OuKVDO+IsplJUywrBAideL BQNcB6vKZB+hThocyQYOTiuZUFHzcyUJ5HP4n0RHFGS7I4HNq0omKIZFNU0WKogENuClJfKdWNOu gdPlwuKpYh2VIwxYGHYNdEkSoZ2ihOGukM+p12vWZ4U04Ii8eIA5PLDEpGGRANfBqjLJR6mTBkft oJstYMj2GTsijiy+UrIwxXZHU2zHgHmVnA84dL1uOzIW7XXNiuFHW45KWBhCEYaxKr9VBX9HiR4Z Jfq5ke5igLVvsRL1aXz9EKRklm1AHE4aHDX+/geZ5AscKD2/vCPJFgbCjy9QwnBTCR8bJRqihD3H E0NKOP8XDGRpmGkkyVHj8N2io1A4YXCUkzAQHXR2QMKAIr9MoiJvpcQMCZMbhaPCpbQfSnEkyNHE 4ACkgcgJrJNe78ZJg8PhcFScMOwZ6JKfSVTU7cqmpqZShxzHpKGlyOtwfBD7EoUGhGSoRBEUxYCj GBys3afBSYPD4XBUlDDsHeiSKDSyo16Co2IZmsDxxFiJfISKAQodP6QlS/CM1KZZOsB1qM/xkfar p5B20uBwOByJJwyYzv+mco4qtrKkObb7NEmYIwpCLlcrwWPOL1FUVLH4RqJcFw4nDQ6Hw5FowkBE 0D9VzlBFPrPMzSEC6a1ApGGNwP2MBQN/huUDtdNJg5MGh8PhKCthGKo/TgtIGNgBE1JJLoZKVHqF sLwe4DocI6yq/bN4wGfrr/IDKd5XAovKOIlyXjicNDgcDkfZCMMZKvsHuiTn7GR5JNvjlAo1C9Ly hkRJnooBoZFLqPww4LMRMbFpIGL0qvbxVB/FThocDoejXIThzICEgWOIB1ROVGVWMY9+82v4WMIc USyqskWg/ibUkmOJ9QNcDkL0vI9iJw0Oh8NRTsKwX6BLEv73mMoJqrQnVEETybj6dIDr4NewofZX CMdFMkz+WIqriwHIKMvRxIs+kp00OBwOR6kJA/kHzghIGOaYgj5eCcOYKmkmkRvPSeQsWAxIqkZ4 5G5F9jkOkBCPnQK17Wnt6y98NDtpcDgcjlISBvIOnCzhjiTm2o4XC8M71dJOfRYsH9RteSHA5fBD 2En7bu0irgHxOEKi445iQbKsh300O2lwOByOUhOGUyUq3R4CZF181SwML1dhkynkdH+A62BtWEHl OO3DBbvQ74sZSftRgGfB0fR/gciQI0HwglUOh6MShOGQgBYGzP/HKWF4sYP7pWxzVGzNFNJOt3Qx /TTRG0+qvCtRhdhiQOrnbVVO07aRe2J6nv0+0AjDMRKmfgyJq+70LJBOGhwOh6OUhOGUgIQhJg1E A+yp1z/A/k29hj72s5f9rlirKmRhmt6DEMq7JTrLz6uuBERDv0cUxb8kykNRLBZSOVBloF73gmzH MVboioRZR6kcbP1RLIhOeUX8aMJJg8PhcJSIMJBnAB+GQwNfGmKwrkk5wC4fcnKztuk8Vdif5vk9 nAX/o/IzlWEBnoNoin1UttTngMTcK1FOiKlmSeDvq6psI9FxxDIB+4DU2H/L18rhcNLgcDgchRCG IfrjhBIQhkqBnT6m/vm1bUfnk9gIq4R+FofIv6icF+g5sJ6QCvowiaw3JJP6ykgDPg8DStB22kpI 6wM+susT7gjpcDhKTRhOkshjP1VDTSO1M8mWds/3C0ocyNlwl8rjJXiebkYSsCgsXSLCwBENxOeP 7svgpMHhcDhCE4bBZmE4vMYIQwycC4drO/sU8B3yR1wpxZfMrgQ+UblBCcNrPrqdNDgcDkdIwkBB JLIOHlrDzcSpkCJSCxRgbZglUSTF5QlrK8cS+GT81Ue3kwaHw+EISRj4MVSic/9eNd7cVKHrqGVQ vEmikt1JADU0nlE5rwLlxR1OGhwOR42D836yFv7Qu6JTfKRyvkROhdWMOHEWOSHG+WtzOGlwOByh gRPeWuLRWZ3CkkRR/RIn0Wer9DHjZzylo8RZDicNDofDEQJYGpbxbshJHJr1x0sSZWl8usoeDwsD Do9k2nzE35ajM9LgJMLhcBQLKikO8G7ImzhQw+FXEiVoqgbE5cUP1efzrI+OTkkCg9edXByO+gOp mENn9/MNSP7EgZoWr0sUaXKZyowKPg6hoDeq7K/P5MWoHFknNiE173iXOBx1B+b+m4GvmfZuLZg8 TNAfI1V+IeWvHkmyJhweyalxlD7LeH8jjo6Q6ahEDnVymI9Qmc+7xuGoC8TFh57wrqgK4kAq6Dsa GxvJ5UBtCQpTrVzCW2JlIpKD/As3OVlw5G1pOPrZ/TGJParyOxtIDoejtsHu8nmV83T+hz6eSNVB /6VK1U5V3p/bWry5RNUp8S2YFvAW39h6T3rvLfV+5zphcHRpYl++wY0UOtnZBhMMt6d3k8NRU8Az fiI7WpUrlTB8EPLiukteXX9cr7JOHfQjUQ972tFCyaB92tvWY+pdDFdZQ2WQRE6n+YAETViTOYJ4 0gjDm/rcs306OIreDShx4Mf8KiupLOLd5HDUFLAqfqBkoSQ7S1VwrB0Qh4VMsdYyqCr5iqWHLgu0 fylOxeZuOZMljEDQ75AL/ElmmjUBovCxRDUvxljRLIfD4XA4HA6Hw+FwOBwOh8PhcDgcDocjKfh/ AQYANYEtioLk+mcAAAAASUVORK5CYII="
   transform="matrix(0.24,0,0,0.24,14.64,51.12)">
	</image>
</g>
<flowRoot
   xml:space="preserve"
   id="flowRoot866"
   style="font-style:normal;font-variant:normal;font-weight:normal;font-stretch:normal;font-size:8.78951073px;font-family:'Liberation Sans';-inkscape-font-specification:'Liberation Sans, Normal';font-variant-ligatures:normal;font-variant-caps:normal;font-variant-numeric:normal;font-feature-settings:normal;text-align:center;writing-mode:lr-tb;text-anchor:middle;fill:#000000;fill-opacity:1"
   transform="matrix(4.8542708,0,0,4.8542708,-440.10769,32.373921)"><flowRegion
     id="flowRegion868"
     style="font-style:normal;font-variant:normal;font-weight:normal;font-stretch:normal;font-size:8.78951073px;font-family:'Liberation Sans';-inkscape-font-specification:'Liberation Sans, Normal';font-variant-ligatures:normal;font-variant-caps:normal;font-variant-numeric:normal;font-feature-settings:normal;text-align:center;writing-mode:lr-tb;text-anchor:middle"><rect
       id="rect870"
       width="132.7886"
       height="55.379761"
       x="156.14709"
       y="62.152279"
       style="font-style:normal;font-variant:normal;font-weight:normal;font-stretch:normal;font-size:8.78951073px;font-family:'Liberation Sans';-inkscape-font-specification:'Liberation Sans, Normal';font-variant-ligatures:normal;font-variant-caps:normal;font-variant-numeric:normal;font-feature-settings:normal;text-align:center;writing-mode:lr-tb;text-anchor:middle;stroke-width:1.11564112" /></flowRegion><flowPara
     id="flowPara872">@APOLOGY@</flowPara></flowRoot></svg>