Amount,Created (UTC),Currency,Destination Name
"163,00",2020-08-28 01:22,eur,CREDIT MUTUEL
"5033,17",2020-08-27 01:41,eur,CREDIT MUTUEL
"121,15",2020-08-26 01:23,eur,CREDIT MUTUEL
"40,71",2020-08-25 02:01,eur,CREDIT MUTUEL
"243,21",2020-08-23 02:26,eur,CREDIT MUTUEL
"39,92",2020-08-22 01:03,eur,CREDIT MUTUEL
"161,73",2020-08-21 01:23,eur,CREDIT MUTUEL
"283,86",2020-08-19 01:29,eur,CREDIT MUTUEL
"23,86",2020-08-18 01:59,eur,CREDIT MUTUEL
"40,65",2020-08-16 02:23,eur,CREDIT MUTUEL
"81,14",2020-08-15 01:00,eur,CREDIT MUTUEL
"40,30",2020-08-13 01:28,eur,CREDIT MUTUEL
"40,83",2020-08-12 01:33,eur,CREDIT MUTUEL
"161,03",2020-08-11 01:55,eur,CREDIT MUTUEL
"203,34",2020-08-09 02:19,eur,CREDIT MUTUEL
"160,33",2020-08-07 01:16,eur,CREDIT MUTUEL
"40,85",2020-08-06 01:34,eur,CREDIT MUTUEL
"40,45",2020-08-02 02:25,eur,CREDIT MUTUEL
"122,25",2020-07-31 01:18,eur,CREDIT MUTUEL
"203,22",2020-07-30 01:37,eur,CREDIT MUTUEL
"328,34",2020-07-28 02:01,eur,CREDIT MUTUEL
"41,20",2020-07-27 02:27,eur,CREDIT MUTUEL
"40,73",2020-07-26 02:23,eur,CREDIT MUTUEL
"40,87",2020-07-25 01:03,eur,CREDIT MUTUEL
"83,12",2020-07-24 01:15,eur,CREDIT MUTUEL
"82,66",2020-07-23 01:36,eur,CREDIT MUTUEL
"82,80",2020-07-19 02:29,eur,CREDIT MUTUEL
"126,51",2020-07-18 01:04,eur,CREDIT MUTUEL
"41,98",2020-07-17 01:23,eur,CREDIT MUTUEL
"253,51",2020-07-16 01:27,eur,CREDIT MUTUEL
"632,42",2020-07-15 01:33,eur,CREDIT MUTUEL
"168,05",2020-07-14 02:16,eur,CREDIT MUTUEL
