00 - Logo
01 - bis
02 - Logo + the annual conference of the Debian project
03 - bis
04 - tris
05 - tetra
06 - blank
07 - Many thanks to our Platinum sponsors
08 - bis
09 - tris
10 - blank
11 - Lenovo
12 - bis
13 - blank
14 - infomaniak
15 - bis
16 - blank
17 - Roche
18 - bis
19 - blank
20 - AWS
21 - bis
22 - blank
23 - Google
24 - bis
25 - blank
26 - Many thanks to our Gold sponsors
27 - bis
28 - tris
29 - blank
30 - Matanel
31 - bis
32 - blank
33 - Many thanks to our Silver sponsors
34 - bis
35 - tris
36 - blank
37 - arm, hrt, ubuntu, globo, two sigma, gitlab
38 - bis
39 - tris
40 - blank
41 - Many thanks to our Bronze sponsors
42 - bis
43 - tris
44 - blank
45 - univention, gandi, daskeyboard, credativ, interface
46 - bis
47 - blank
48 - Logo
