<?xml version="1.0" encoding="UTF-8" standalone="no"?>
<svg
   version="1.1"
   x="0px"
   y="0px"
   viewBox="0 0 1279.9999 719.99999"
   xml:space="preserve"
   id="svg885"
   sodipodi:docname="Apology.svg"
   inkscape:version="1.2 (dc2aedaf03, 2022-05-15)"
   width="1280"
   height="720"
   inkscape:export-filename="/home/wouter/debian/dc20-online/artwork/video/Opening.svg.png"
   inkscape:export-xdpi="96"
   inkscape:export-ydpi="96"
   xmlns:inkscape="http://www.inkscape.org/namespaces/inkscape"
   xmlns:sodipodi="http://sodipodi.sourceforge.net/DTD/sodipodi-0.dtd"
   xmlns="http://www.w3.org/2000/svg"
   xmlns:svg="http://www.w3.org/2000/svg"
   xmlns:rdf="http://www.w3.org/1999/02/22-rdf-syntax-ns#"
   xmlns:cc="http://creativecommons.org/ns#"
   xmlns:dc="http://purl.org/dc/elements/1.1/"><metadata
   id="metadata891"><rdf:RDF><cc:Work
       rdf:about=""><dc:format>image/svg+xml</dc:format><dc:type
         rdf:resource="http://purl.org/dc/dcmitype/StillImage" /><dc:title /></cc:Work></rdf:RDF></metadata><defs
   id="defs889"><style
     id="style1746">.cls-1{fill:#252f3e;}.cls-2{fill:#f90;fill-rule:evenodd;}</style><filter
     inkscape:collect="always"
     style="color-interpolation-filters:sRGB"
     id="filter1891"
     x="-0.011187034"
     y="-0.076917082"
     width="1.0223741"
     height="1.1538342"><feGaussianBlur
       inkscape:collect="always"
       stdDeviation="0.2490167"
       id="feGaussianBlur1893" /></filter></defs><sodipodi:namedview
   inkscape:document-rotation="0"
   pagecolor="#ffffff"
   bordercolor="#666666"
   borderopacity="1"
   objecttolerance="10"
   gridtolerance="10"
   guidetolerance="10"
   inkscape:pageopacity="0"
   inkscape:pageshadow="2"
   inkscape:window-width="1366"
   inkscape:window-height="720"
   id="namedview887"
   showgrid="false"
   inkscape:zoom="1.5877924"
   inkscape:cx="182.32863"
   inkscape:cy="147.68934"
   inkscape:window-x="0"
   inkscape:window-y="29"
   inkscape:window-maximized="1"
   inkscape:current-layer="g1812"
   fit-margin-top="0"
   fit-margin-left="0"
   fit-margin-right="-0.5"
   fit-margin-bottom="0"
   showguides="false"
   inkscape:guide-bbox="true"
   inkscape:showpageshadow="2"
   inkscape:pagecheckerboard="0"
   inkscape:deskcolor="#d1d1d1"><sodipodi:guide
     position="1251.2663,789.23865"
     orientation="1,0"
     id="guide52"
     inkscape:locked="false" /><sodipodi:guide
     position="1033.5937,651.61341"
     orientation="0,1"
     id="guide54"
     inkscape:locked="false" /><sodipodi:guide
     position="606.67453,403.04537"
     orientation="1,0"
     id="guide56"
     inkscape:locked="false" /></sodipodi:namedview>

<rect
   style="opacity:1;fill:#51489e;fill-opacity:1;stroke-width:3.5991"
   id="rect906"
   width="1280"
   height="720"
   x="0"
   y="0" />
<flowRoot
   xml:space="preserve"
   id="flowRoot866"
   style="font-style:normal;font-variant:normal;font-weight:normal;font-stretch:normal;font-size:8.78951px;font-family:'Liberation Sans';-inkscape-font-specification:'Liberation Sans, Normal';font-variant-ligatures:normal;font-variant-caps:normal;font-variant-numeric:normal;font-feature-settings:normal;text-align:center;writing-mode:lr-tb;text-anchor:middle;fill:#000000;fill-opacity:1;filter:url(#filter1891)"
   transform="matrix(4.8542708,0,0,4.8542708,-439.4424,32.578173)"><flowRegion
     id="flowRegion868"
     style="font-style:normal;font-variant:normal;font-weight:normal;font-stretch:normal;font-size:8.78951px;font-family:'Liberation Sans';-inkscape-font-specification:'Liberation Sans, Normal';font-variant-ligatures:normal;font-variant-caps:normal;font-variant-numeric:normal;font-feature-settings:normal;text-align:center;writing-mode:lr-tb;text-anchor:middle"><rect
       id="rect870"
       width="132.7886"
       height="55.379761"
       x="156.14709"
       y="62.152279"
       style="font-style:normal;font-variant:normal;font-weight:normal;font-stretch:normal;font-size:8.78951073px;font-family:'Liberation Sans';-inkscape-font-specification:'Liberation Sans, Normal';font-variant-ligatures:normal;font-variant-caps:normal;font-variant-numeric:normal;font-feature-settings:normal;text-align:center;writing-mode:lr-tb;text-anchor:middle;stroke-width:1.11564112" /></flowRegion><flowPara
     id="flowPara872"
     style="font-style:normal;font-variant:normal;font-weight:normal;font-stretch:normal;font-family:'Rilindja Technical';-inkscape-font-specification:'Rilindja Technical';fill:#ffffff;fill-opacity:1">@APOLOGY@</flowPara></flowRoot><g
   id="g1812"
   transform="matrix(0.48055982,0,0,0.48055982,34.999175,34.990389)"><path
     class="cls-1"
     d="m 402.19,256.19 h 21.24 c 13.57,0 21.24,6.75 21.24,19.86 v 17.17 c 0,12.81 -7.67,19.48 -21.24,19.48 h -21.24 z m 9.81,8.74 v 39 h 11.43 c 6,0 11.42,-1.84 11.42,-9.59 v -19.29 c 0,-8.13 -5.44,-10.12 -11.42,-10.12 z"
     transform="translate(-308.64,-255.5)"
     id="path1751"
     style="fill:#ffffff;fill-opacity:1" /><path
     class="cls-1"
     d="m 465.52,264.93 v 14.8 h 22.92 v 8.74 H 465.52 V 304 h 26.83 v 8.74 H 455.7 v -56.55 h 36.65 v 8.74 z"
     transform="translate(-308.64,-255.5)"
     id="path1753"
     style="fill:#ffffff;fill-opacity:1" /><path
     class="cls-1"
     d="M 502.55,256.19 H 525 c 10,0 16.4,4.91 16.4,14.41 v 4.07 c 0,4.06 -1.22,7 -3.52,9.2 2.83,2.37 4.29,6.9 4.29,11 v 3.45 c 0,9.51 -6.44,14.42 -16.49,14.42 h -23.13 z m 9.81,8.66 v 15.57 h 13.27 c 3.07,-0.08 6.21,-1.15 6.21,-5 v -5.52 c 0,-4.06 -3.53,-5.06 -6.82,-5.06 z M 532.61,299 v -4.83 c 0,-3.83 -3.22,-4.91 -6.37,-5.06 H 512.36 V 304 h 13.34 c 3.38,0 6.91,-1 6.91,-5 z"
     transform="translate(-308.64,-255.5)"
     id="path1755"
     style="fill:#ffffff;fill-opacity:1" /><path
     class="cls-1"
     d="m 593.94,293.91 v 3 c 0,9.74 -8.51,16.49 -19.55,16.49 h -1.3 c -13.5,0 -21.17,-6.9 -21.17,-19.71 v -18 c 0,-13.11 7.67,-20.16 21.17,-20.16 11.73,0 20.85,6.52 20.85,16.71 v 3.68 h -9.58 V 274 c 0,-8 -5.37,-9.36 -11.27,-9.36 -5.9,0 -11.43,2 -11.43,10.05 v 20.24 c 0,7.74 5.45,9.58 11.43,9.58 5.98,0 11.27,-1.22 11.27,-8.81 v -1.77 z"
     transform="translate(-308.64,-255.5)"
     id="path1757"
     style="fill:#ffffff;fill-opacity:1" /><path
     class="cls-1"
     d="m 644.24,293.68 c 0,12.81 -7.67,19.71 -21.24,19.71 -13.57,0 -21.16,-6.9 -21.16,-19.71 v -18 c 0,-13.11 7.66,-20.16 21.16,-20.16 13.5,0 21.24,7.05 21.24,20.16 z M 623,304.34 c 6,0 11.42,-1.84 11.42,-9.58 v -20.09 c 0,-8.05 -5.44,-10.05 -11.42,-10.05 -5.98,0 -11.43,2 -11.43,10.05 v 20.09 c 0,7.74 5.53,9.58 11.43,9.58 z"
     transform="translate(-308.64,-255.5)"
     id="path1759"
     style="fill:#ffffff;fill-opacity:1" /><path
     class="cls-1"
     d="m 700.29,256.19 v 56.51 h -9.13 l -26.07,-38.42 v 3.61 c 0,2.45 0.08,5 0.08,7.51 v 27.3 h -9.74 v -56.51 h 9.05 l 26.07,38.41 V 292 c -0.08,-2 -0.08,-4.67 -0.08,-6.59 v -29.22 z"
     transform="translate(-308.64,-255.5)"
     id="path1761"
     style="fill:#ffffff;fill-opacity:1" /><path
     class="cls-1"
     d="m 723,264.93 v 14.8 h 23.69 v 8.74 H 723 v 24.23 h -9.82 v -56.51 h 36.65 v 8.74 z"
     transform="translate(-308.64,-255.5)"
     id="path1763"
     style="fill:#ffffff;fill-opacity:1" /><path
     class="cls-1"
     d="m 412,335.5 v 25.84 c 3.61,-3.83 6.9,-7.67 10.51,-11.58 4.14,-4.52 8.89,-9.66 13,-14.26 h 11.81 l -20.52,23.85 c 3.22,5.06 6.52,10 9.81,15.1 3.45,5.29 8.06,12.35 11.43,17.56 h -12 l -15.95,-25.76 c -1.23,1.38 -2.38,2.53 -3.68,3.91 v -0.08 c -1.61,1.69 -2.84,2.84 -4.45,4.45 V 392 h -9.74 v -56.5 z"
     transform="translate(-308.64,-255.5)"
     id="path1765"
     style="fill:#ffffff;fill-opacity:1" /><path
     class="cls-1"
     d="m 491.21,373 c 0,12.8 -7.67,19.7 -21.24,19.7 -13.57,0 -21.17,-6.9 -21.17,-19.7 v -18 c 0,-13.11 7.67,-20.17 21.17,-20.17 13.5,0 21.24,7.06 21.24,20.17 z M 470,383.65 c 6,0 11.42,-1.84 11.42,-9.58 V 354 c 0,-8.05 -5.44,-10 -11.42,-10 -5.98,0 -11.43,2 -11.43,10 v 20.09 c -0.03,7.72 5.49,9.56 11.43,9.56 z"
     transform="translate(-308.64,-255.5)"
     id="path1767"
     style="fill:#ffffff;fill-opacity:1" /><path
     class="cls-1"
     d="m 508.38,379.67 c 2.15,4 8.13,4.06 11.42,4.06 5.37,0 10.81,-1 10.81,-6.36 v -2.84 c 0,-4.75 -5.06,-5.67 -11,-6.59 h 0.08 c -8.82,-1.31 -19.48,-3.46 -19.48,-17 0,-11.42 8.36,-16.1 19.86,-16.1 6.9,0 13.95,2.46 18.33,8.13 0,0 -4.45,3.37 -5.14,3.37 v 0.85 h -2.23 c -3,-2.84 -8,-3.3 -11,-3.3 -4.06,0 -9.89,0.92 -9.89,6 v 1.84 c 0,4.6 5,5.6 10.81,6.52 8.89,1.38 19.63,3.37 19.63,17.71 0,12 -9.28,16.79 -20.86,16.79 -8,0 -16.48,-2.45 -20.55,-9.28 l 7.44,-3.75 z"
     transform="translate(-308.64,-255.5)"
     id="path1769"
     style="fill:#ffffff;fill-opacity:1" /><path
     class="cls-1"
     d="m 590.88,373 c 0,12.8 -7.67,19.7 -21.24,19.7 -13.57,0 -21.16,-6.9 -21.16,-19.7 v -18 c 0,-13.11 7.66,-20.17 21.16,-20.17 13.5,0 21.24,7.06 21.24,20.17 z m -21.24,10.65 c 6,0 11.42,-1.84 11.42,-9.58 V 354 c 0,-8.05 -5.44,-10 -11.42,-10 -5.98,0 -11.43,2 -11.43,10 v 20.09 c 0,7.72 5.52,9.56 11.43,9.56 z"
     transform="translate(-308.64,-255.5)"
     id="path1771"
     style="fill:#ffffff;fill-opacity:1" /><path
     class="cls-1"
     d="m 616.33,392 c -5.37,-13.72 -20.39,-56.51 -20.39,-56.51 h 10 l 15.56,42.4 c -0.15,0.08 15.5,-42.4 15.5,-42.4 h 10 c -6.21,17.41 -12.65,35.35 -20.47,56.51 z"
     transform="translate(-308.64,-255.5)"
     id="path1773"
     style="fill:#ffffff;fill-opacity:1" /><path
     class="cls-1"
     d="m 694.62,373 c 0,12.8 -7.67,19.7 -21.24,19.7 -13.57,0 -21.17,-6.9 -21.17,-19.7 v -18 c 0,-13.11 7.67,-20.17 21.17,-20.17 13.5,0 21.24,7.06 21.24,20.17 z m -21.24,10.65 c 6,0 11.42,-1.84 11.42,-9.58 V 354 c 0,-8.05 -5.44,-10 -11.42,-10 -5.98,0 -11.43,2 -11.43,10 v 20.09 c 0.05,7.72 5.52,9.56 11.43,9.56 z"
     transform="translate(-308.64,-255.5)"
     id="path1775"
     style="fill:#ffffff;fill-opacity:1" /><path
     class="cls-2"
     d="m 357.33,508.25 h 1.09 L 358.06,492 a 32.44,32.44 0 0 1 -33.15,-31.75 24.37,24.37 0 0 1 23.81,-24.86 h 0.39 a 17.87,17.87 0 0 1 17.89,17.44 12.65,12.65 0 0 1 -12.38,12.92 8.48,8.48 0 0 1 -8.67,-8.31 l -16.26,0.35 a 24.8,24.8 0 0 0 25.24,24.21 28.93,28.93 0 0 0 28.28,-29.53 34.23,34.23 0 0 0 -34.84,-33.37 40.66,40.66 0 0 0 -39.72,41.47 48.71,48.71 0 0 0 48.68,47.67 z"
     transform="translate(-308.64,-255.5)"
     id="path1777"
     style="fill:#b9de20;fill-rule:evenodd;fill-opacity:1" /><path
     class="cls-2"
     d="m 378.28,355.8 v 50.53 H 313.57 V 355.8 a 32.36,32.36 0 1 1 64.71,0 z"
     transform="translate(-308.64,-255.5)"
     id="path1779"
     style="fill:#b9de20;fill-rule:evenodd;fill-opacity:1" /><path
     class="cls-2"
     d="M 647.3,402.39 396,419.11 v 89.14 h 23.85 v -14.59 a 43.1,43.1 0 0 1 86.19,0 v 14.59 h 42.36 c 0,0 -5.8,-78.59 96.27,-78.59 102.07,0 100.22,78.59 100.22,78.59 h 40.44 c 0,0 -2.08,-33.05 25.35,-33.05 27.43,0 25.32,33.05 25.32,33.05 h 37.88 V 434.4 Z m -111.78,69 h -20 v -17 c 0,-6.75 4.48,-12.63 10,-12.63 5.52,0 10,5.88 10,12.63 z m 27.64,-31.77 a 3.43,3.43 0 1 1 3.43,-3.43 3.43,3.43 0 0 1 -3.43,3.4 z m 176.89,6.9 a 3.43,3.43 0 1 1 3.43,-3.43 3.42,3.42 0 0 1 -3.43,3.4 z m 39.74,34.86 h -22.95 l 0.62,-28.13 c 30.77,3.4 22.33,28.1 22.33,28.1 z"
     transform="translate(-308.64,-255.5)"
     id="path1781"
     style="fill:#b9de20;fill-rule:evenodd;fill-opacity:1" /><path
     class="cls-1"
     d="M 810.44,535.4 H 801 v -2.07 c 0.23,-7.9 7.13,-12.12 16,-12.12 9.81,0 16.1,4.83 16.1,14.19 v 1.6 a 16.73,16.73 0 0 1 -2.92,10 c -1.84,2.3 -3.68,4.76 -5.59,7.21 h 0.07 c -1.91,2.45 -3.75,4.83 -5.59,7.13 h 0.07 c -2.22,3 -3.29,4.22 -5.59,7.21 h 2.68 c 1.69,0 3.37,-0.08 5.06,-0.08 h 12.34 v 9 h -32.7 l 0.16,-7.82 L 822.4,542 c 1.23,-1.38 1.38,-3.22 1.38,-5 v -1.6 c 0,-4 -3.52,-4.91 -6.74,-4.91 -2.92,0 -6.6,0.51 -6.6,4.91 z"
     transform="translate(-308.64,-255.5)"
     id="path1783"
     style="fill:#ffffff;fill-opacity:1" /><path
     class="cls-1"
     d="m 850.92,535.4 h -9.43 v -2.07 c 0.23,-7.9 7.13,-12.12 16,-12.12 9.81,0 16.1,4.83 16.1,14.19 v 1.6 a 16.72,16.72 0 0 1 -2.91,10 c -1.84,2.3 -3.68,4.76 -5.6,7.21 h 0.08 c -1.92,2.45 -3.76,4.83 -5.6,7.13 h 0.08 c -2.23,3 -3.3,4.22 -5.6,7.21 h 2.68 c 1.69,0 3.37,-0.08 5.06,-0.08 h 12.35 v 9 h -32.71 l 0.15,-7.82 21.32,-27.65 c 1.22,-1.38 1.38,-3.22 1.38,-5 v -1.6 c 0,-4 -3.53,-4.91 -6.75,-4.91 -2.91,0 -6.6,0.51 -6.6,4.91 z"
     transform="translate(-308.64,-255.5)"
     id="path1785"
     style="fill:#ffffff;fill-opacity:1" /><path
     class="cls-2"
     d="m 873.88,399.36 v 7 l -50.47,-19.79 -5.75,19.79 h -2.61 l -4.39,-22.73 A 45.57,45.57 0 0 1 797.06,372.1 32.53,32.53 0 0 1 790.37,355 c -1.17,-11.9 -11.65,-12.85 -11.65,-12.85 v -2 c 0,0 18.79,-16.52 31.16,-1 a 114.79,114.79 0 0 0 8.57,9.74 c 0,0 31,28.34 36.33,33.46 z"
     transform="translate(-308.64,-255.5)"
     id="path1787"
     style="fill:#b9de20;fill-rule:evenodd;fill-opacity:1" /></g></svg>
