Description,Created (UTC),Amount,Amount Refunded,Currency,Converted Amount,Converted Amount Refunded,Fee,Converted Currency,Status,Captured,reference_number (metadata),breakdown_accommodation (metadata),breakdown_meals (metadata),breakdown_registration (metadata)
DebConf Invoice 2022-00237,2022-09-15 10:42,"295,92","0,00",eur,"295,92","0,00","4,39",eur,Paid,true,2022-00237,0,0,295.92
DebConf Invoice 2022-00236,2022-09-14 07:52,"159,99","0,00",eur,"159,99","0,00","2,49",eur,Paid,true,2022-00236,0,0,155.24
DebConf Invoice 2022-00239,2022-09-12 10:56,"339,88","0,00",eur,"339,88","0,00","8,75",eur,Paid,true,2022-00239,0,0,339.88
DebConf Invoice 2022-00235,2022-07-24 09:31,"280,00","0,00",eur,"280,00","0,00","4,17",eur,Paid,true,2022-00235,120.0,160.0,0
DebConf Invoice 2022-00234,2022-07-22 18:12,"4150,00","0,00",eur,"4150,00","0,00","120,60",eur,Paid,true,2022-00234,0,0,4150.0
DebConf Invoice 2022-00232,2022-07-22 12:55,"1000,00","0,00",eur,"1000,00","0,00","29,25",eur,Paid,true,2022-00232,0,0,1000.0
DebConf Invoice 2022-00230,2022-07-21 16:44,"10,00","0,00",eur,"10,00","0,00","0,50",eur,Paid,true,2022-00230,0,10.0,0
DebConf Invoice 2022-00222,2022-07-19 14:01,"10,00","0,00",eur,"10,00","0,00","0,50",eur,Paid,true,2022-00222,0,10.0,0
DebConf Invoice 2022-00228,2022-07-19 08:55,"55,00","0,00",eur,"55,00","0,00","1,02",eur,Paid,true,2022-00228,0,55.0,0
DebConf Invoice 2022-00227,2022-07-19 08:51,"40,00","0,00",eur,"40,00","0,00","1,41",eur,Paid,true,2022-00227,0,40.0,0
DebConf Invoice 2022-00226,2022-07-18 14:09,"20,00","0,00",eur,"20,00","0,00","0,75",eur,Paid,true,2022-00226,0,20.0,0
DebConf Invoice 2022-00224,2022-07-18 14:01,"10,00","0,00",eur,"10,00","0,00","0,50",eur,Paid,true,2022-00224,0,10.0,0
DebConf Invoice 2022-00221,2022-07-18 13:51,"10,00","0,00",eur,"10,00","0,00","0,50",eur,Paid,true,2022-00221,0,10.0,0
DebConf Invoice 2022-00220,2022-07-18 06:48,"65,00","0,00",eur,"65,00","0,00","2,14",eur,Paid,true,2022-00220,0,65.0,0
DebConf Invoice 2022-00219,2022-07-17 15:59,"100,00","0,00",eur,"100,00","0,00","3,15",eur,Paid,true,2022-00219,45.0,55.0,0
DebConf Invoice 2022-00217,2022-07-17 11:52,"30,00","0,00",eur,"30,00","0,00","0,67",eur,Paid,true,2022-00217,0,30.0,0
DebConf Invoice 2022-00216,2022-07-17 10:32,"515,00","0,00",eur,"515,00","0,00","13,13",eur,Paid,true,2022-00216,0,15.0,500.0
DebConf Invoice 2022-00215,2022-07-17 10:24,"70,00","0,00",eur,"70,00","0,00","2,00",eur,Paid,true,2022-00215,0,70.0,0
DebConf Invoice 2022-00212,2022-07-17 10:04,"40,00","0,00",eur,"40,00","0,00","1,25",eur,Paid,true,2022-00212,0,40.0,0
DebConf Invoice 2022-00195,2022-07-16 18:49,"200,00","0,00",eur,"200,00","0,00","5,25",eur,Paid,true,2022-00195,0,0,200.0
DebConf Invoice 2022-00208,2022-07-16 09:25,"45,00","0,00",eur,"45,00","0,00","1,38",eur,Paid,true,2022-00208,0,45.0,0
DebConf Invoice 2022-00205,2022-07-12 20:10,"62,00","0,00",eur,"62,00","0,00","2,05",eur,Paid,true,2022-00205,0,62.0,0
DebConf Invoice 2022-00204,2022-07-12 17:51,"672,00","0,00",eur,"672,00","0,00","9,66",eur,Paid,true,2022-00204,0,172.0,500.0
DebConf Invoice 2022-00177,2022-07-09 11:19,"187,00","0,00",eur,"187,00","0,00","2,87",eur,Paid,true,2022-00177,0,187.0,0
DebConf Invoice 2022-00197,2022-07-08 16:00,"3212,00","0,00",eur,"3212,00","0,00","80,55",eur,Paid,true,2022-00197,720.0,1092.0,1400.0
DebConf Invoice 2022-00198,2022-07-08 08:49,"522,00","0,00",eur,"522,00","0,00","15,39",eur,Paid,true,2022-00198,0,22.0,500.0
DebConf Invoice 2022-00170,2022-07-07 12:50,"417,00","0,00",eur,"417,00","0,00","6,09",eur,Paid,true,2022-00170,240.0,177.0,0
DebConf Invoice 2022-00114,2022-07-07 09:14,"117,00","0,00",eur,"117,00","0,00","1,89",eur,Paid,true,2022-00114,0,117.0,0
DebConf Invoice 2022-00194,2022-07-06 21:49,"352,00","0,00",eur,"352,00","0,00","10,46",eur,Paid,true,2022-00194,270.0,82.0,0
DebConf Invoice 2022-00016,2022-07-06 14:11,"287,00","0,00",eur,"287,00","0,00","4,27",eur,Paid,true,2022-00016,120.0,167.0,0
DebConf Invoice 2022-00006,2022-07-06 09:00,"142,00","0,00",eur,"142,00","0,00","2,24",eur,Paid,true,2022-00006,0,142.0,0
DebConf Invoice 2022-00017,2022-07-06 08:01,"477,00","0,00",eur,"477,00","0,00","12,18",eur,Paid,true,2022-00017,105.0,172.0,200.0
DebConf Invoice 2022-00184,2022-07-04 18:09,"407,00","0,00",eur,"407,00","0,00","5,95",eur,Paid,true,2022-00184,240.0,167.0,0
DebConf Invoice 2022-00174,2022-07-04 08:49,"567,00","0,00",eur,"567,00","0,00","16,69",eur,Paid,true,2022-00174,330.0,237.0,0
DebConf Invoice 2022-00176,2022-07-03 14:13,"44,00","0,00",eur,"44,00","0,00","1,35",eur,Paid,true,2022-00176,0,44.0,0
DebConf Invoice 2022-00168,2022-06-30 19:59,"292,00","0,00",eur,"292,00","0,00","4,34",eur,Paid,true,2022-00168,120.0,172.0,0
DebConf Invoice 2022-00007,2022-06-29 09:34,"342,00","0,00",eur,"342,00","0,00","5,04",eur,Paid,true,2022-00007,0,142.0,200.0
DebConf Invoice 2022-00163,2022-06-28 07:45,"287,00","0,00",eur,"287,00","0,00","4,27",eur,Paid,true,2022-00163,120.0,167.0,0
DebConf Invoice 2022-00161,2022-06-27 08:29,"20,00","0,00",eur,"20,00","0,00","0,53",eur,Paid,true,2022-00161,0,20.0,0
DebConf Invoice 2022-00159,2022-06-26 20:11,"217,00","0,00",eur,"217,00","0,00","3,29",eur,Paid,true,2022-00159,90.0,127.0,0
DebConf Invoice 2022-00156,2022-06-26 13:19,"752,00","0,00",eur,"752,00","0,00","10,78",eur,Paid,true,2022-00156,240.0,312.0,200.0
DebConf Invoice 2022-00154,2022-06-26 06:04,"75,00","0,00",eur,"75,00","0,00","1,30",eur,Paid,true,2022-00154,75.0,0,0
DebConf Invoice 2022-00153,2022-06-26 01:21,"232,00","0,00",eur,"232,00","0,00","6,98",eur,Paid,true,2022-00153,90.0,142.0,0
DebConf Invoice 2022-00152,2022-06-25 21:50,"60,00","0,00",eur,"60,00","0,00","1,99",eur,Paid,true,2022-00152,60.0,0,0
DebConf Invoice 2022-00138,2022-06-21 19:57,"22,00","0,00",eur,"22,00","0,00","0,56",eur,Paid,true,2022-00138,0,22.0,0
DebConf Invoice 2022-00137,2022-06-20 21:45,"62,00","0,00",eur,"62,00","0,00","1,12",eur,Paid,true,2022-00137,0,62.0,0
DebConf Invoice 2022-00135,2022-06-20 18:38,"257,00","0,00",eur,"257,00","0,00","3,85",eur,Paid,true,2022-00135,0,57.0,200.0
DebConf Invoice 2022-00134,2022-06-20 18:13,"257,00","0,00",eur,"257,00","0,00","3,85",eur,Paid,true,2022-00134,0,57.0,200.0
DebConf Invoice 2022-00129,2022-06-15 15:05,"522,00","0,00",eur,"522,00","0,00","15,39",eur,Paid,true,2022-00129,0,22.0,500.0
DebConf Invoice 2022-00105,2022-06-15 09:13,"252,00","0,00",eur,"252,00","0,00","3,78",eur,Paid,true,2022-00105,0,52.0,200.0
DebConf Invoice 2022-00046,2022-06-14 14:43,"327,00","0,00",eur,"327,00","0,00","4,83",eur,Paid,true,2022-00046,135.0,192.0,0
DebConf Invoice 2022-00015,2022-06-13 21:59,"172,00","0,00",eur,"172,00","0,00","2,66",eur,Paid,true,2022-00015,0,172.0,0
DebConf Invoice 2022-00123,2022-06-08 18:31,"487,00","0,00",eur,"487,00","0,00","7,07",eur,Paid,true,2022-00123,210.0,277.0,0
DebConf Invoice 2022-00120,2022-06-02 21:59,"427,00","0,00",eur,"427,00","0,00","6,23",eur,Paid,true,2022-00120,210.0,217.0,0
DebConf Invoice 2022-00107,2022-05-26 07:08,"65,00","0,00",eur,"65,00","0,00","1,16",eur,Paid,true,2022-00107,0,65.0,0
DebConf Invoice 2022-00106,2022-05-23 19:30,"642,00","623,13",eur,"642,00","623,13","18,87",eur,Paid,true,2022-00106,270.0,172.0,200.0
DebConf Invoice 2022-00093,2022-05-23 13:35,"287,00","0,00",eur,"287,00","0,00","4,27",eur,Paid,true,2022-00093,120.0,167.0,0
DebConf Invoice 2022-00092,2022-05-14 09:40,"292,00","0,00",eur,"292,00","0,00","4,34",eur,Paid,true,2022-00092,120.0,172.0,0
DebConf Invoice 2022-00094,2022-05-10 05:59,"132,00","0,00",eur,"132,00","0,00","2,10",eur,Paid,true,2022-00094,0,132.0,0
DebConf Invoice 2022-00051,2022-05-05 01:38,"322,00","0,00",eur,"322,00","0,00","4,76",eur,Paid,true,2022-00051,300.0,22.0,0
DebConf Invoice 2022-00045,2022-05-01 22:39,"450,00","0,00",eur,"450,00","0,00","13,30",eur,Paid,true,2022-00045,450.0,0,0
DebConf Invoice 2022-00039,2022-04-26 19:42,"522,00","0,00",eur,"522,00","0,00","7,56",eur,Paid,true,2022-00039,0,22.0,500.0
DebConf Invoice 2022-00023,2022-04-25 19:00,"522,00","0,00",eur,"522,00","0,00","7,56",eur,Paid,true,2022-00023,0,22.0,500.0
DebConf Invoice 2022-00037,2022-04-25 09:20,"620,00","0,00",eur,"620,00","0,00","8,93",eur,Paid,true,2022-00037,120.0,0,500.0
DebConf Invoice 2022-00003,2022-04-21 10:48,"22,00","0,00",eur,"22,00","0,00","0,56",eur,Paid,true,2022-00003,0,22.0,0
DebConf Invoice 2022-00024,2022-04-11 19:56,"200,00","0,00",eur,"200,00","0,00","3,05",eur,Paid,true,2022-00024,0,0,200.0
DebConf Invoice 2022-00022,2022-04-11 17:35,"617,00","0,00",eur,"617,00","0,00","18,14",eur,Paid,true,2022-00022,0,117.0,500.0
DebConf Invoice 2022-00021,2022-04-09 20:25,"222,00","0,00",eur,"222,00","0,00","3,36",eur,Paid,true,2022-00021,0,22.0,200.0
DebConf Invoice 2022-00018,2022-04-06 23:21,"500,00","0,00",eur,"500,00","0,00","14,75",eur,Paid,true,2022-00018,0,0,500.0
