<?xml version="1.0" encoding="UTF-8" standalone="no"?>
<!DOCTYPE svg PUBLIC "-//W3C//DTD SVG 1.1//EN" "http://www.w3.org/Graphics/SVG/1.1/DTD/svg11.dtd">
<svg width="100%" height="100%" viewBox="0 0 591 591" version="1.1" xmlns="http://www.w3.org/2000/svg" xmlns:xlink="http://www.w3.org/1999/xlink" xml:space="preserve" xmlns:serif="http://www.serif.com/" style="fill-rule:evenodd;clip-rule:evenodd;stroke-linejoin:round;stroke-miterlimit:2;">
    <g transform="matrix(1.14315,0,0,1.14315,-62.591,-41.7094)">
        <path d="M297.091,72.278C306.61,65.363 319.498,65.363 329.017,72.278C373.045,104.266 495.847,193.488 539.875,225.476C549.393,232.391 553.376,244.649 549.74,255.839C532.923,307.597 486.017,451.96 469.2,503.717C465.564,514.907 455.137,522.483 443.372,522.483L182.736,522.483C170.971,522.483 160.544,514.907 156.908,503.717C140.091,451.96 93.185,307.597 76.368,255.839C72.732,244.649 76.715,232.391 86.233,225.476C130.261,193.488 253.063,104.266 297.091,72.278Z" style="fill:none;"/>
    </g>
    <g transform="matrix(1,0,0,1,0,-32.6775)">
        <g transform="matrix(0.952998,0.302977,-0.302977,0.952998,149.019,-26.3751)">
            <text x="159.517px" y="467.102px" style="font-family:'YydimibangBold', 'Yydimibang', serif;font-size:37.917px;fill:rgb(35,31,32);">I</text>
        </g>
        <g transform="matrix(0.955284,0.295691,-0.295691,0.955284,146.457,-28.7274)">
            <text x="168.209px" y="469.866px" style="font-family:'YydimibangBold', 'Yydimibang', serif;font-size:37.917px;fill:rgb(35,31,32);">&apos;</text>
        </g>
        <g transform="matrix(0.9594,0.282047,-0.282047,0.9594,140.451,-30.648)">
            <text x="176.682px" y="472.536px" style="font-family:'YydimibangBold', 'Yydimibang', serif;font-size:37.917px;fill:rgb(35,31,32);">m</text>
        </g>
        <g transform="matrix(0.968149,0.250376,-0.250376,0.968149,127.076,-36.4799)">
            <text x="206.918px" y="481.217px" style="font-family:'YydimibangBold', 'Yydimibang', serif;font-size:37.917px;fill:rgb(35,31,32);">g</text>
        </g>
        <g transform="matrix(0.973169,0.230093,-0.230093,0.973169,117.563,-38.0274)">
            <text x="221.834px" y="485.068px" style="font-family:'YydimibangBold', 'Yydimibang', serif;font-size:37.917px;fill:rgb(35,31,32);">o</text>
        </g>
        <g transform="matrix(0.977067,0.212933,-0.212933,0.977067,109.376,-38.9667)">
            <text x="235.59px" y="488.292px" style="font-family:'YydimibangBold', 'Yydimibang', serif;font-size:37.917px;fill:rgb(35,31,32);">i</text>
        </g>
        <g transform="matrix(0.981048,0.193767,-0.193767,0.981048,99.5377,-37.7889)">
            <text x="242.943px" y="489.935px" style="font-family:'YydimibangBold', 'Yydimibang', serif;font-size:37.917px;fill:rgb(35,31,32);">n</text>
        </g>
        <g transform="matrix(0.986738,0.16232,-0.16232,0.986738,83.4436,-35.3907)">
            <text x="258.307px" y="492.964px" style="font-family:'YydimibangBold', 'Yydimibang', serif;font-size:37.917px;fill:rgb(35,31,32);">g</text>
        </g>
        <g transform="matrix(0.994726,0.102571,-0.102571,0.994726,52.4395,-26.3965)">
            <text x="282.89px" y="496.706px" style="font-family:'YydimibangBold', 'Yydimibang', serif;font-size:37.917px;fill:rgb(35,31,32);">t</text>
        </g>
        <g transform="matrix(0.998354,0.0573476,-0.0573476,0.998354,29.0529,-16.1787)">
            <text x="296.411px" y="498.104px" style="font-family:'YydimibangBold', 'Yydimibang', serif;font-size:37.917px;fill:rgb(35,31,32);">o</text>
        </g>
        <g transform="matrix(0.999987,0.00510662,-0.00510662,0.999987,2.5524,-1.62749)">
            <text x="319.976px" y="499.004px" style="font-family:'YydimibangBold', 'Yydimibang', serif;font-size:37.917px;fill:rgb(35,31,32);">D</text>
        </g>
        <g transform="matrix(0.999973,-0.00735504,0.00735504,0.999973,-3.66171,2.48576)">
            <text x="336.131px" y="499.086px" style="font-family:'YydimibangBold', 'Yydimibang', serif;font-size:37.917px;fill:rgb(35,31,32);">e</text>
        </g>
        <g transform="matrix(0.999762,-0.0218147,0.0218147,0.999762,-10.8015,7.78294)">
            <text x="351.331px" y="498.977px" style="font-family:'YydimibangBold', 'Yydimibang', serif;font-size:37.917px;fill:rgb(35,31,32);">b</text>
        </g>
        <g transform="matrix(0.999152,-0.0411787,0.0411787,0.999152,-20.2224,15.5394)">
            <text x="367.094px" y="498.649px" style="font-family:'YydimibangBold', 'Yydimibang', serif;font-size:37.917px;fill:rgb(35,31,32);">C</text>
        </g>
        <g transform="matrix(0.998152,-0.0607725,0.0607725,0.998152,-29.5497,24.2828)">
            <text x="384.425px" y="497.927px" style="font-family:'YydimibangBold', 'Yydimibang', serif;font-size:37.917px;fill:rgb(35,31,32);">o</text>
        </g>
        <g transform="matrix(0.996619,-0.0821666,0.0821666,0.996619,-39.495,34.4291)">
            <text x="398.56px" y="497.071px" style="font-family:'YydimibangBold', 'Yydimibang', serif;font-size:37.917px;fill:rgb(35,31,32);">n</text>
        </g>
        <g transform="matrix(0.994525,-0.104498,0.104498,0.994525,-49.5502,45.9192)">
            <text x="413.449px" y="495.835px" style="font-family:'YydimibangBold', 'Yydimibang', serif;font-size:37.917px;fill:rgb(35,31,32);">f</text>
        </g>
        <g transform="matrix(0.991212,-0.132282,0.132282,0.991212,-61.6636,60.7857)">
            <text x="426.667px" y="494.499px" style="font-family:'YydimibangBold', 'Yydimibang', serif;font-size:37.917px;fill:rgb(35,31,32);">2</text>
        </g>
        <g transform="matrix(0.986791,-0.161998,0.161998,0.986791,-73.8082,78.718)">
            <text x="445.807px" y="491.962px" style="font-family:'YydimibangBold', 'Yydimibang', serif;font-size:37.917px;fill:rgb(35,31,32);">4</text>
        </g>
    </g>
    <g id="path4" transform="matrix(0.0709833,0,0,0.0709833,94.0628,30.5458)">
        <path d="M4592.11,4279.38C4716.78,4430.21 5385.43,4365.98 5447.29,4245.17C5468.51,4203.73 5601.31,4220.06 5644.7,4227.56L5644.74,4227.56C5723.18,4241.13 5772.89,4266.61 5802.89,4300.38C5831.27,4332.35 5841.02,4369.08 5848.25,4397.36C5853.65,4418.49 5846.14,4448.72 5840.47,4477.75C5829.93,4531.71 5813.62,4582.29 5807.81,4599.55C5782.53,4647.54 5735.57,4713.71 5689.87,4745.34C5688.1,4746.57 5685.11,4748.43 5681.03,4750.89C5647.97,4770.9 5624.43,4803.46 5615.77,4841.12C5607.12,4878.79 5614.1,4918.35 5635.11,4950.78C5652.17,4977.12 5660.66,5002.8 5665.84,5022.26C5686.54,5099.99 5647.21,5201.01 5609.68,5271.6C5607.3,5276.08 5605.16,5280.69 5603.27,5285.4C5599.02,5295.97 5502.84,5875.78 5124.71,6065.24C4848.78,6203.49 3987.77,6354.49 3122.08,6318.75C2182.91,6279.98 1236.18,6042.34 970.002,5889.1C655.871,5708.27 743.886,5289.67 744.138,5287.77C744.138,5287.77 765.631,5168.35 895.166,5049.04C935.299,5012.07 950.871,4955.48 935.296,4903.18C919.722,4850.89 875.722,4812.04 821.904,4803.05C705.145,4783.56 573.138,4772.8 413.789,4781.85L413.743,4781.85C279.03,4789.54 166.205,4906.52 142.765,4932.46C80.629,4977.6 25.184,4972.82 -1.697,4968.59C-100.459,4953.03 -189.137,4845.02 -185.546,4737.88C-185.534,4737.54 -185.522,4737.19 -185.508,4736.85C-185.033,4724.68 -179.808,4673.71 -139.45,4609.55C-76.151,4508.93 116.024,4281.35 500.4,4281.35C750.104,4281.35 901.273,4344.73 1129.22,4379.78C1185.73,4388.47 1241.98,4362.63 1272.2,4314.1C1302.43,4265.57 1300.8,4203.69 1268.08,4156.81C1125.6,3952.7 1017.2,3687.24 998.431,3346.71C937.021,2231.56 1685.19,1453.14 2791.15,1376.99C3871.84,1302.57 4426.11,2373.65 4261.59,3070.84C4224.11,3229.61 4164.38,3378.11 4085.84,3511.96C4052.04,3569.57 4062.66,3642.91 4111.42,3688.55C4118.19,3694.89 4124.56,3701.69 4130.49,3708.94L4130.71,3709.2L4147.82,3730.02C4192.76,3784.69 4207.6,3857.32 4188.35,3924.75L4188.32,3924.85C4181.25,3949.7 4169.68,3972.8 4154.59,3993.19C4122.98,4035.88 4117.67,4092.58 4140.8,4140.4C4163.92,4188.22 4211.67,4219.25 4264.76,4220.98C4403.7,4225.5 4530.95,4205.38 4592.11,4279.38Z" style="fill:none;stroke:rgb(236,0,140);stroke-width:14.09px;"/>
    </g>
    <g transform="matrix(0.80653,0,0,0.80653,154.428,124.24)">
        <g id="path41" serif:id="path4" transform="matrix(0.0880108,0,0,0.0880108,-74.8458,-116.17)">
            <path d="M2140.3,4592.2C2140.3,4592.2 1237.9,4318 1183.8,3336.5C1128.4,2330.5 1806.2,1630.9 2803.9,1562.2C3740.6,1497.7 4223.5,2423.9 4080.9,3028.2C3938.3,3632.4 3426.1,4072.3 2799.9,4006.5C2548.2,3980 2358,3884.8 2224.5,3748.6C2024.3,3544.3 1951.3,3247.1 1991.3,2947.8C2040.8,2576.8 2437.5,2316.5 2808.9,2387.3C3196.1,2461.1 3385.4,2836.1 3205.1,3106.1C3153.6,3183.2 3060,3243 2979.8,3265.9C2862.3,3299.5 2749.4,3290.5 2749.4,3290.5C2739.1,3289.7 2731.2,3280.9 2731.5,3270.6L2734.1,3170.9C2734.4,3160.8 2742.3,3152.6 2752.3,3152C2752.3,3152 2830.1,3147 2911.5,3115.7C2964.3,3095.4 3018.9,3064.1 3053.5,3015C3086.4,2968.1 3083,2904 3051.6,2844C3001.7,2748.4 2881.2,2663.8 2711.6,2665.3C2569.6,2666.5 2460.5,2717.7 2391,2804C2321,2890.8 2291.2,3012.4 2306.3,3152.4C2336.6,3433.3 2646.5,3683 2928.2,3659.7C3381.7,3622.1 3776.3,3373.5 3743.6,2755.6C3727.2,2446.5 3604.4,2220.9 3410.9,2085.4C3216.8,1949.4 2952.3,1904.2 2655.2,1954.4C2356.6,2004.8 2067.6,2200.6 1856.7,2450.4C1646.2,2699.7 1548,2969.8 1562.4,3271.3C1583.6,3714.8 1738.7,4118.8 2195,4491.4C2195,4491.4 2205,4499.1 2201.1,4512.9C2199.3,4519.2 2190.2,4550.5 2190.2,4550.5C2189.4,4553.3 2188,4555.8 2186.1,4558L2160.5,4586.7C2155.5,4592.2 2147.6,4594.5 2140.3,4592.2Z" style="fill:rgb(214,34,41);"/>
        </g>
        <g id="g258" transform="matrix(0.0880108,0,0,0.0880108,-74.8458,-116.17)">
            <path id="path6" d="M921.8,5346.3C921.8,5346.3 989.8,5065.5 1511.5,4992.3C2033.3,4919 2308.5,5283.3 3272.8,5267.8C4237,5252.3 4922.1,4993.2 5253.4,4997C5584.8,5000.9 5480.6,5123 5441.9,5191.5C5403.2,5260 5451.2,5331.8 5191,5347.3C4930.8,5362.7 4237.5,5620.3 3238.4,5626.7C2239.3,5633.1 1800.1,5139.3 1388.9,5165.4C977.7,5191.5 921.8,5346.3 921.8,5346.3Z" style="fill:rgb(0,91,171);"/>
            <path id="path8" d="M0,4744.1C-0.6,4762 10.7,4782.6 27.2,4785.2C43.7,4787.8 170,4609.8 403.2,4596.5C975.2,4564 1216.8,4762.1 1619.3,4772.3C2021.8,4782.6 2198.7,4677.9 2236.6,4642.7C2274.5,4607.5 2302.9,4500.2 2276.7,4477C2250.5,4453.9 1936.4,4591.5 1479.9,4591.5C1023.4,4591.5 861,4467 500.4,4467C139.8,4467 0.7,4726.2 0,4744.1Z" style="fill:rgb(0,91,171);"/>
            <path id="path10" d="M3703.3,4562.2C3707.7,4541.1 3869.3,4405.9 4219,4405.9C4568.7,4405.9 4617.5,4555.9 5036.7,4524.9C5455.9,4494 5520.5,4394.5 5613.1,4410.5C5705.6,4426.5 5658.6,4479.7 5647.8,4504.4C5636.9,4529.1 5611.5,4573.8 5584.2,4592.7C5556.9,4611.6 5325,4741.2 5012.4,4741.2C4699.8,4741.2 4276.8,4542.8 4020.7,4542.8C3764.6,4542.8 3761.5,4605.8 3730.8,4596.5C3700,4587.3 3698.9,4583.4 3703.3,4562.2Z" style="fill:rgb(0,91,171);"/>
        </g>
        <g id="g253" transform="matrix(0.0880108,0,0,0.0880108,-74.8458,-116.17)">
            <path id="path12" d="M2544.1,4497.1C2544.1,4497.1 2586.3,4473.5 2623.7,4444.7C2644.9,4428.4 2665.5,4411.4 2671.3,4395.9C2692.7,4338.7 2761.8,4288.8 2819.2,4284.7C2862.5,4281.6 2899.9,4298.3 2948.2,4334.3C2957.3,4306.2 2973.9,4276 2999.3,4243.6C3056.2,4171.1 3159.4,4085.2 3322.2,3984.3C3593.4,3816.4 3965.2,3816.7 3965.2,3816.7C3973.8,3816.7 3981.9,3820.5 3987.3,3827.1L4004.4,3847.9C4010.4,3855.2 4012.4,3864.9 4009.8,3873.9C4007.3,3882.9 4000.4,3890.2 3991.5,3893.2C3991.5,3893.2 3637.2,4013.6 3495.8,4134C3363.7,4246.5 3398.8,4402.7 3431.8,4489C3466.3,4579.1 3594.1,4705.7 3826,4797C3833.9,4800.1 3839.9,4806.5 3842.7,4814.5C3845.4,4822.5 3844.5,4831.2 3840.1,4838.5C3800.8,4903.7 3752.3,4965.1 3708.8,5020.3C3702.9,5027.8 3693.5,5031.9 3684,5031.1C3674.4,5030.3 3665.9,5024.8 3661.2,5016.5C3642.2,4982.3 3596.1,4943.5 3541.2,4904.1C3453.4,4841.1 3342.8,4778.8 3269.9,4737C3154.2,4670.7 3071.3,4638.3 2934.7,4654.2C2803.5,4699.2 2689,4608.8 2663,4579C2660.6,4576.2 2656.2,4574.4 2651.2,4572.3C2642.9,4568.7 2633,4565.6 2622.9,4563C2590.1,4554.5 2555,4550.6 2555,4550.6C2542.6,4549.2 2532.5,4540 2530,4527.8C2527.5,4515.6 2533.3,4503.2 2544.1,4497.1ZM3528.8,3950.2C3468.5,3971.4 3408.3,3998.4 3352.4,4033C3197.5,4129 3098.5,4209.9 3044.4,4278.9C3012.5,4319.6 2996.8,4355 2996.8,4386.6C2996.8,4397.7 2990.3,4407.8 2980.3,4412.5C2970.2,4417.2 2958.4,4415.7 2949.8,4408.6C2897,4364.8 2865,4338.8 2823.3,4341.8C2785.1,4344.5 2739.2,4377.9 2725,4416C2718.4,4433.6 2701.1,4454.4 2678.9,4473.7C2665.4,4485.4 2650.2,4496.8 2635.5,4507.1C2642.5,4508.9 2649.4,4510.8 2656,4513C2678.3,4520.3 2696.9,4530.5 2706.3,4541.4C2726.5,4564.6 2816.1,4635.9 2918.5,4599.2C2920.5,4598.5 2922.6,4598 2924.7,4597.7C3077.5,4579.2 3169.7,4613.6 3298.4,4687.3C3334.7,4708.1 3380.3,4734 3427.9,4762.5L3500.1,4670C3436.1,4612.8 3396.2,4556.2 3378.3,4509.6C3339.2,4407.5 3302.4,4223.5 3458.6,4090.5C3485.8,4067.3 3520.6,4044.1 3559.2,4021.7L3528.8,3950.2Z"/>
            <path id="path16" d="M2826,4456.4C2821.2,4471.5 2805.1,4479.9 2790.1,4475.1C2775,4470.4 2766.6,4454.3 2771.4,4439.2L2778,4418.3C2782.8,4403.2 2798.9,4394.8 2814,4399.6C2829.1,4404.4 2837.5,4420.4 2832.7,4435.5L2826,4456.4Z" style="fill:rgb(35,24,21);"/>
        </g>
    </g>
</svg>
