<?xml version="1.0" encoding="UTF-8"?>
<svg id="Layer_2" data-name="Layer 2" xmlns="http://www.w3.org/2000/svg" xmlns:xlink="http://www.w3.org/1999/xlink" viewBox="0 0 1700.79 5102.36">
  <defs>
    <style>
      .cls-1 {
        font-size: 60px;
      }

      .cls-2 {
        fill: #020202;
      }

      .cls-2, .cls-3, .cls-4, .cls-5, .cls-6, .cls-7, .cls-8, .cls-9, .cls-10, .cls-11, .cls-12, .cls-13, .cls-14, .cls-15 {
        stroke-width: 0px;
      }

      .cls-2, .cls-7, .cls-11, .cls-14 {
        fill-rule: evenodd;
      }

      .cls-3 {
        fill: #1c1b1a;
      }

      .cls-4, .cls-16, .cls-17 {
        fill: #010101;
      }

      .cls-5 {
        fill: none;
      }

      .cls-18 {
        font-size: 100px;
      }

      .cls-18, .cls-8, .cls-19, .cls-11, .cls-20 {
        fill: #fff;
      }

      .cls-18, .cls-19 {
        font-family: Pretendard-Medium-KSCpc-EUC-H, Pretendard;
        font-weight: 500;
      }

      .cls-6 {
        fill: #498ecc;
      }

      .cls-21 {
        clip-path: url(#clippath-1);
      }

      .cls-7 {
        fill: #231815;
      }

      .cls-9 {
        fill: #2b54a3;
      }

      .cls-22 {
        font-size: 163.63px;
      }

      .cls-19 {
        font-size: 169.41px;
      }

      .cls-10 {
        fill: #e47225;
      }

      .cls-23 {
        clip-path: url(#clippath);
      }

      .cls-16 {
        font-size: 88px;
      }

      .cls-16, .cls-17 {
        font-family: URWBookman-DemiItalic, 'URW Bookman';
        font-style: italic;
        font-weight: 300;
      }

      .cls-24 {
        letter-spacing: -.02em;
      }

      .cls-20 {
        font-family: Pretendard-Black-KSCpc-EUC-H, Pretendard;
        font-size: 290.41px;
        font-weight: 800;
      }

      .cls-12 {
        fill: #cc2028;
      }

      .cls-13 {
        fill: #00558e;
      }

      .cls-14 {
        fill: #35689b;
      }

      .cls-15 {
        fill: #6fc8b8;
      }
    </style>
    <clipPath id="clippath">
      <polygon class="cls-5" points="348.17 3194.26 223.14 3309.79 323.09 3388.67 448.12 3273.15 348.17 3194.26"/>
    </clipPath>
    <clipPath id="clippath-1">
      <polygon class="cls-5" points="297.97 3595.6 423.01 3480.08 323.06 3401.19 198.03 3516.72 297.97 3595.6"/>
    </clipPath>
  </defs>
  <g id="Background">
    <g>
      <rect class="cls-8" width="1700.79" height="5102.36"/>
      <g>
        <path class="cls-13" d="m1638.06,2509.17c-270.28,0-270.28-198.32-540.55-198.32s-270.28,198.32-540.55,198.32-270.27-198.32-540.55-198.32c-5.58,0-11.04.09-16.4.26v623.55c4.7-.11,9.46-.17,14.33-.17,282.34,0,282.34,190.65,564.68,190.65s282.34-190.65,564.68-190.65,282.32,187.22,557.1,190.6v-619.89c-19.22,2.57-40.02,3.97-62.73,3.97Z"/>
        <path class="cls-13" d="m556.95,2518.51c270.28,0,270.28-198.32,540.55-198.32s270.28,198.32,540.55,198.32c22.71,0,43.51-1.41,62.73-3.97v-758.58c-.7,0-1.38,0-2.08,0-284.61,0-284.61-163.1-569.22-163.1s-284.61,163.1-569.22,163.1S275.69,1596.31,0,1592.92v727.52c5.36-.17,10.82-.26,16.4-.26,270.28,0,270.28,198.32,540.55,198.32Z"/>
      </g>
    </g>
  </g>
  <g id="Layer_15" data-name="Layer 15">
    <g id="layer1">
      <g id="g3378">
        <g id="g3016-9">
          <g class="cls-23">
            <g id="text3093-5">
              <path id="path3098-5" class="cls-4" d="m323.08,3388.67l-74.35-81.76c2.88-2.88,6.24-5.15,10.08-6.8,3.83-1.65,7.95-2.49,12.36-2.52,4.68.04,8.96.96,12.86,2.78,3.89,1.82,7.28,4.31,10.15,7.49l28.9,31.56,28.71-31.56c2.97-3.17,6.44-5.67,10.39-7.49,3.95-1.82,8.22-2.75,12.81-2.78,4.4.03,8.52.87,12.36,2.52,3.83,1.65,7.19,3.91,10.08,6.8l-74.35,81.76"/>
            </g>
          </g>
          <g class="cls-21">
            <g id="g3196-9">
              <path id="path3198-1" class="cls-4" d="m323.07,3401.2l74.35,81.76c-2.88,2.88-6.24,5.15-10.08,6.8-3.83,1.65-7.95,2.49-12.36,2.52-4.68-.04-8.96-.96-12.86-2.78-3.89-1.82-7.28-4.31-10.15-7.49l-28.9-31.56-28.71,31.56c-2.97,3.17-6.44,5.67-10.39,7.49-3.95,1.82-8.22,2.75-12.81,2.78-4.4-.03-8.52-.87-12.36-2.52-3.83-1.65-7.19-3.91-10.08-6.8l74.35-81.76"/>
            </g>
          </g>
          <path id="path3278-4" class="cls-10" d="m316.8,3394.93l-56-61.41c-3.26-3.47-7.05-6.21-11.37-8.2-4.32-1.99-9-3.01-14.03-3.04-4.82.03-9.33.95-13.53,2.76-4.2,1.8-7.88,4.29-11.03,7.44l56.84,62.46-56.84,62.46c3.16,3.26,6.84,5.8,11.03,7.62,4.2,1.83,8.71,2.75,13.53,2.78,5.04-.04,9.74-1.05,14.1-3.04,4.36-1.99,8.13-4.72,11.29-8.2l56-61.62"/>
          <path id="path3280-5" class="cls-10" d="m329.31,3394.93l56-61.41c3.26-3.47,7.05-6.21,11.37-8.2,4.32-1.99,9-3.01,14.03-3.04,4.82.03,9.33.95,13.53,2.76,4.2,1.8,7.88,4.29,11.03,7.44l-56.84,62.46,56.84,62.46c-3.16,3.26-6.84,5.8-11.03,7.62-4.2,1.83-8.71,2.75-13.53,2.78-5.04-.04-9.74-1.05-14.1-3.04-4.36-1.99-8.13-4.72-11.29-8.2l-56-61.62"/>
        </g>
        <g id="g3368">
          <g id="text3223">
            <path id="path3354" class="cls-4" d="m559.16,3332.98h-81.52c-3.2.09-5.9,1.24-8.1,3.46-2.2,2.22-3.35,4.97-3.44,8.26v112.61c8.75-.22,16.03-3.25,21.85-9.08,5.82-5.84,8.84-13.17,9.06-22h62.16c8.84-.22,16.2-3.25,22.09-9.08,5.89-5.84,8.94-13.17,9.17-22v-30.9c-.23-8.84-3.28-16.2-9.17-22.09-5.89-5.89-13.25-8.94-22.09-9.17h0Zm-62.16,66.07v-34.81h54.53c.32-.16,1.59.16,3.82.95,2.23.8,3.5,3.02,3.82,6.68v19.36c.16.33-.16,1.63-.95,3.91-.8,2.28-3.02,3.58-6.68,3.91h-54.53Z"/>
            <path id="path3356" class="cls-4" d="m732.47,3387.51v-23.27c-.22-8.84-3.25-16.2-9.08-22.09-5.84-5.89-13.17-8.94-22-9.17h-81.52c-3.28.09-6,1.24-8.17,3.46-2.17,2.22-3.29,4.97-3.37,8.26v112.61c8.75-.22,16.07-3.25,21.93-9.08,5.87-5.84,8.92-13.17,9.15-22v-7.82h35.34l17.94,25.58c2.88,4.13,6.49,7.37,10.83,9.72,4.34,2.35,9.2,3.55,14.56,3.6,2.59,0,5.1-.31,7.53-.91,2.43-.6,4.72-1.48,6.86-2.64l-25.04-35.7c7.26-1.57,13.21-5.13,17.85-10.68,4.64-5.55,7.04-12.17,7.19-19.87h0Zm-93.07,3.73v-27h54.17c.33-.16,1.63.16,3.91.95,2.28.8,3.58,3.02,3.91,6.68v11.72c.16.32-.16,1.59-.98,3.82-.81,2.23-3.09,3.5-6.84,3.82h-54.17Z"/>
            <path id="path3358" class="cls-4" d="m843.27,3332.98h-61.98c-8.83.23-16.17,3.28-22,9.17-5.84,5.89-8.86,13.25-9.08,22.09v61.98c.22,8.83,3.25,16.17,9.08,22,5.84,5.84,13.17,8.86,22,9.08h61.98c8.83-.22,16.17-3.25,22-9.08,5.84-5.84,8.86-13.17,9.08-22v-61.98c-.22-8.84-3.25-16.2-9.08-22.09-5.84-5.89-13.17-8.94-22-9.17Zm0,85.43c.16.33-.16,1.63-.98,3.91-.81,2.28-3.09,3.58-6.84,3.91h-46.36c-.33.16-1.63-.16-3.91-.98-2.28-.81-3.58-3.09-3.91-6.84v-46.53c-.16-.32.16-1.59.98-3.82.81-2.23,3.09-3.5,6.84-3.82h46.36c.33-.16,1.63.16,3.91.95,2.28.8,3.58,3.02,3.91,6.68v46.53Z"/>
            <path id="path3360" class="cls-10" d="m1030.98,3341.87c-2.69-2.69-5.83-4.81-9.41-6.35-3.58-1.54-7.43-2.32-11.54-2.35-4.38.03-8.41.9-12.1,2.6-3.69,1.7-6.88,4.03-9.57,6.99l-26.82,29.48-27-29.48c-2.76-3.04-5.94-5.4-9.55-7.06-3.6-1.66-7.59-2.51-11.94-2.53-4.11.03-7.96.81-11.54,2.35-3.58,1.54-6.72,3.66-9.41,6.35l48.49,53.29-48.49,53.29c2.69,2.78,5.83,4.95,9.41,6.51,3.58,1.56,7.43,2.35,11.54,2.38,4.3-.03,8.31-.9,12.03-2.6,3.72-1.7,6.93-4.03,9.64-6.99l26.82-29.48,26.82,29.48c2.69,2.96,5.88,5.3,9.57,6.99,3.69,1.7,7.72,2.56,12.1,2.6,4.11-.03,7.96-.82,11.54-2.38,3.58-1.56,6.72-3.73,9.41-6.51l-48.49-53.29,48.49-53.29Z"/>
            <path id="path3362" class="cls-4" d="m1192.57,3332.98h-19.54c-6.39.09-12.08,1.82-17.07,5.2-4.99,3.37-8.77,7.86-11.35,13.45l.18-.36-18.29,40.14-18.12-40.14v.36c-2.49-5.59-6.25-10.08-11.28-13.45-5.03-3.37-10.74-5.11-17.14-5.2h-19.36c-3.36.09-6.14,1.24-8.33,3.46-2.19,2.22-3.32,4.97-3.4,8.26v112.61c8.75-.22,16.07-3.25,21.93-9.08,5.87-5.84,8.92-13.17,9.15-22v-59.5c.01-.81.26-1.45.73-1.93.48-.48,1.12-.72,1.93-.73.46.01.91.16,1.35.44.44.28.76.61.95.98l34.46,76.02c.65,1.36,1.61,2.46,2.89,3.31,1.27.85,2.68,1.28,4.22,1.31,1.53-.02,2.91-.43,4.15-1.22,1.24-.8,2.22-1.87,2.95-3.22l34.46-76.19c.27-.37.62-.7,1.04-.98.43-.28.91-.43,1.44-.44.73.01,1.32.26,1.78.73.46.48.7,1.12.71,1.93v59.5c.23,8.83,3.28,16.17,9.15,22,5.87,5.84,13.18,8.86,21.93,9.08v-112.61c-.08-3.29-1.21-6.04-3.37-8.26-2.17-2.22-4.89-3.37-8.17-3.46h0Z"/>
            <path id="path3364" class="cls-4" d="m1315.06,3332.98h-61.98c-8.83.23-16.17,3.28-22,9.17-5.84,5.89-8.86,13.25-9.08,22.09v61.98c.22,8.83,3.25,16.17,9.08,22,5.84,5.84,13.17,8.86,22,9.08h61.98c8.83-.22,16.17-3.25,22-9.08,5.84-5.84,8.86-13.17,9.08-22v-61.98c-.22-8.84-3.25-16.2-9.08-22.09-5.84-5.89-13.17-8.94-22-9.17h0Zm0,85.43c.16.33-.16,1.63-.98,3.91-.81,2.28-3.09,3.58-6.84,3.91h-46.36c-.33.16-1.63-.16-3.91-.98-2.28-.81-3.58-3.09-3.91-6.84v-46.53c-.16-.32.16-1.59.98-3.82.81-2.23,3.09-3.5,6.84-3.82h46.36c.33-.16,1.63.16,3.91.95,2.28.8,3.58,3.02,3.91,6.68v46.53Z"/>
            <path id="path3366" class="cls-10" d="m1502.76,3341.87c-2.69-2.69-5.83-4.81-9.41-6.35-3.58-1.54-7.43-2.32-11.54-2.35-4.38.03-8.41.9-12.1,2.6-3.69,1.7-6.88,4.03-9.57,6.99l-26.82,29.48-27-29.48c-2.76-3.04-5.94-5.4-9.55-7.06-3.6-1.66-7.59-2.51-11.94-2.53-4.11.03-7.96.81-11.54,2.35-3.58,1.54-6.72,3.66-9.41,6.35l48.49,53.29-48.49,53.29c2.69,2.78,5.83,4.95,9.41,6.51,3.58,1.56,7.43,2.35,11.54,2.38,4.3-.03,8.31-.9,12.03-2.6,3.72-1.7,6.93-4.03,9.64-6.99l26.82-29.48,26.82,29.48c2.69,2.96,5.88,5.3,9.57,6.99,3.69,1.7,7.72,2.56,12.1,2.6,4.11-.03,7.96-.82,11.54-2.38,3.58-1.56,6.72-3.73,9.41-6.51l-48.49-53.29,48.49-53.29Z"/>
          </g>
        </g>
      </g>
    </g>
    <g id="g4596">
      <path id="path4541" class="cls-6" d="m178.13,3643.64h45.63v31.06h-45.63v-31.06Zm0,45.3h45.63v119.08h-45.63v-119.08Z"/>
      <path id="path4543" class="cls-6" d="m250.15,3688.93h42.49v19.4c6.35-7.92,12.78-13.57,19.28-16.93,6.5-3.44,14.43-5.16,23.77-5.16,12.63,0,22.5,3.77,29.6,11.32,7.18,7.47,10.76,19.06,10.76,34.76v75.68h-45.86v-65.48c0-7.47-1.38-12.74-4.15-15.81-2.77-3.14-6.65-4.71-11.66-4.71-5.53,0-10.02,2.09-13.46,6.28-3.44,4.19-5.16,11.7-5.16,22.54v57.18h-45.63v-119.07Z"/>
      <path id="path4545" class="cls-6" d="m451.33,3688.93h21.75v33.41h-21.75v85.66h-45.75v-85.66h-17.04v-33.41h17.04v-5.38c0-4.86.52-10.2,1.57-16.03,1.05-5.83,2.99-10.58,5.83-14.24,2.92-3.74,6.95-6.73,12.11-8.97,5.23-2.32,12.86-3.48,22.87-3.48,8,0,19.62.93,34.87,2.8l-5.05,27.58c-5.46-.9-9.87-1.35-13.23-1.35-4.11,0-7.06.71-8.86,2.13-1.79,1.35-3.06,3.51-3.81,6.5-.37,1.64-.56,5.12-.56,10.43h0Z"/>
      <path id="path4547" class="cls-6" d="m477.37,3748.81c0-18.16,6.13-33.11,18.39-44.85,12.26-11.81,28.82-17.72,49.67-17.72,23.84,0,41.86,6.91,54.04,20.74,9.79,11.14,14.69,24.85,14.69,41.15,0,18.31-6.09,33.34-18.28,45.07-12.11,11.66-28.89,17.49-50.34,17.49-19.14,0-34.61-4.86-46.42-14.58-14.5-12.03-21.75-27.81-21.75-47.32h0Zm45.75-.11c0,10.61,2.13,18.46,6.39,23.55,4.34,5.08,9.75,7.62,16.26,7.62s11.96-2.5,16.15-7.51c4.26-5.01,6.39-13.04,6.39-24.11,0-10.32-2.13-17.98-6.39-22.98-4.26-5.08-9.53-7.62-15.81-7.62-6.65,0-12.15,2.58-16.48,7.74-4.34,5.08-6.5,12.86-6.5,23.32h0Z"/>
      <path id="path4549" class="cls-6" d="m633.93,3688.93h42.61v17.38c6.13-7.25,12.3-12.41,18.5-15.47,6.28-3.06,13.83-4.6,22.65-4.6,9.49,0,17.01,1.68,22.54,5.05,5.53,3.36,10.05,8.37,13.57,15.02,7.18-7.77,13.72-13.04,19.62-15.81,5.91-2.84,13.19-4.26,21.86-4.26,12.78,0,22.76,3.81,29.94,11.44,7.18,7.55,10.76,19.4,10.76,35.54v74.79h-45.75v-67.83c0-5.38-1.05-9.38-3.14-12-3.06-4.11-6.88-6.17-11.44-6.17-5.38,0-9.72,1.94-13.01,5.83-3.29,3.89-4.93,10.13-4.93,18.72v61.44h-45.75v-65.59c0-5.23-.3-8.78-.9-10.65-.97-2.99-2.65-5.38-5.05-7.18-2.39-1.87-5.2-2.8-8.41-2.8-5.23,0-9.53,1.98-12.89,5.94-3.36,3.96-5.05,10.46-5.05,19.51v60.77h-45.75v-119.07Z"/>
      <path id="path4551" class="cls-6" d="m901.82,3727.51l-43.62-4.6c1.64-7.62,4-13.6,7.06-17.94,3.14-4.41,7.62-8.22,13.46-11.44,4.19-2.32,9.94-4.11,17.27-5.38,7.33-1.27,15.25-1.91,23.77-1.91,13.68,0,24.67.78,32.96,2.35,8.3,1.49,15.21,4.67,20.74,9.53,3.89,3.36,6.95,8.15,9.19,14.35,2.24,6.13,3.36,12,3.36,17.6v52.59c0,5.61.34,10.02,1.01,13.23.75,3.14,2.32,7.18,4.71,12.11h-42.83c-1.72-3.06-2.84-5.38-3.36-6.95-.52-1.64-1.05-4.19-1.57-7.62-5.98,5.76-11.92,9.87-17.83,12.33-8.07,3.29-17.45,4.93-28.14,4.93-14.2,0-25-3.29-32.4-9.87-7.33-6.58-10.99-14.69-10.99-24.33,0-9.04,2.65-16.48,7.96-22.31,5.31-5.83,15.1-10.17,29.38-13.01,17.12-3.44,28.22-5.83,33.3-7.18,5.08-1.42,10.46-3.25,16.15-5.49,0-5.61-1.16-9.53-3.48-11.77-2.32-2.24-6.39-3.36-12.22-3.36-7.47,0-13.08,1.2-16.82,3.59-2.92,1.87-5.27,5.38-7.06,10.54h0Zm39.58,23.99c-6.28,2.24-12.82,4.22-19.62,5.94-9.27,2.47-15.14,4.9-17.6,7.29-2.54,2.47-3.81,5.27-3.81,8.41,0,3.59,1.23,6.54,3.7,8.86,2.54,2.24,6.24,3.36,11.1,3.36s9.79-1.23,14.13-3.7c4.41-2.47,7.51-5.46,9.31-8.97,1.87-3.59,2.8-8.22,2.8-13.9v-7.29Z"/>
      <path id="path4553" class="cls-6" d="m1010.62,3688.93h42.49v19.4c6.35-7.92,12.78-13.57,19.28-16.93,6.5-3.44,14.43-5.16,23.77-5.16,12.63,0,22.5,3.77,29.6,11.32,7.18,7.47,10.76,19.06,10.76,34.76v75.68h-45.86v-65.48c0-7.47-1.38-12.74-4.15-15.81-2.77-3.14-6.65-4.71-11.66-4.71-5.53,0-10.02,2.09-13.46,6.28-3.44,4.19-5.16,11.7-5.16,22.54v57.18h-45.63v-119.07Z"/>
      <path id="path4555" class="cls-6" d="m1162.64,3643.64h45.63v31.06h-45.63v-31.06Zm0,45.3h45.63v119.08h-45.63v-119.08Z"/>
      <path id="path4557" class="cls-6" d="m1276.26,3727.51l-43.62-4.6c1.64-7.62,4-13.6,7.06-17.94,3.14-4.41,7.62-8.22,13.46-11.44,4.19-2.32,9.94-4.11,17.27-5.38,7.33-1.27,15.25-1.91,23.77-1.91,13.68,0,24.67.78,32.96,2.35,8.3,1.49,15.21,4.67,20.74,9.53,3.89,3.36,6.95,8.15,9.19,14.35,2.24,6.13,3.36,12,3.36,17.6v52.59c0,5.61.34,10.02,1.01,13.23.75,3.14,2.32,7.18,4.71,12.11h-42.83c-1.72-3.06-2.84-5.38-3.36-6.95-.52-1.64-1.05-4.19-1.57-7.62-5.98,5.76-11.92,9.87-17.83,12.33-8.07,3.29-17.45,4.93-28.14,4.93-14.2,0-25-3.29-32.4-9.87-7.33-6.58-10.99-14.69-10.99-24.33,0-9.04,2.65-16.48,7.96-22.31,5.31-5.83,15.1-10.17,29.38-13.01,17.12-3.44,28.22-5.83,33.3-7.18,5.08-1.42,10.46-3.25,16.15-5.49,0-5.61-1.16-9.53-3.48-11.77-2.32-2.24-6.39-3.36-12.22-3.36-7.47,0-13.08,1.2-16.82,3.59-2.92,1.87-5.27,5.38-7.06,10.54h0Zm39.58,23.99c-6.28,2.24-12.82,4.22-19.62,5.94-9.27,2.47-15.14,4.9-17.6,7.29-2.54,2.47-3.81,5.27-3.81,8.41,0,3.59,1.23,6.54,3.7,8.86,2.54,2.24,6.24,3.36,11.1,3.36s9.79-1.23,14.13-3.7c4.41-2.47,7.51-5.46,9.31-8.97,1.87-3.59,2.8-8.22,2.8-13.9v-7.29Z"/>
      <path id="path4559" class="cls-6" d="m1383.28,3643.64h46.64v84.76l34.09-39.47h56.17l-42.72,41.71,45.19,77.36h-51.46l-24.11-47.76-17.16,16.82v30.95h-46.64v-164.37Z"/>
    </g>
    <g id="g10">
      <path id="path14" class="cls-8" d="m390.18,4147.06l39.04-136.66,3.63,25.93-39.27,137.3-3.39-26.56"/>
      <path id="path16" class="cls-8" d="m707.61,4176.12h-14.43l-101.25-157.79v157.79h-11.35v-170.56h16.08l99.36,155.19,11.59,15.38Zm-11.59-29.05v-141.51h11.59v168.08l-11.59-26.56"/>
      <path id="path18" class="cls-8" d="m761.85,4015.73v149.75h41.16c24.13,0,39.03-5.21,51.1-17.51,12.3-12.78,18.93-32.17,18.93-55.12,0-24.84-7.33-46.6-20.11-59.38-11.59-11.82-27.68-17.74-48.97-17.74h-42.11Zm-11.59-10.17h58.66c46.13,0,75.94,34.54,75.94,88.48,0,26.26-7.81,47.08-22.95,61.98-14.43,13.96-32.4,20.11-60.32,20.11h-51.33v-170.56"/>
      <path id="path20" class="cls-8" d="m1144.68,4176.12h-11.83l-59.14-170.56h10.88l53.93,155.19,6.15,15.38"/>
      <path id="path22" class="cls-8" d="m1143.23,4147.06l48.75-141.51h11.12l-57.58,168.07-2.29-26.56"/>
      <path id="path24" class="cls-8" d="m1310.52,4084.27c25.27-.99,41.69-14.46,41.69-34.72s-17.03-34.3-39.5-34.3h-57.72v160.86h-11.59v-170.56h69.31c30.28,0,51.1,17.98,51.1,44.24,0,12.53-5.2,23.65-15.14,31.94-6.15,5.2-10.41,7.33-21.76,10.64l42.34,83.74h-11.59l-41.87-81.85-5.26-9.99"/>
      <path id="path26" class="cls-8" d="m988.57,4084.27c25.27-.99,41.69-14.46,41.69-34.72s-17.03-34.3-39.51-34.3h-57.72v160.86h-11.59v-170.56h69.31c30.28,0,51.1,17.98,51.1,44.24,0,12.53-5.2,23.65-15.14,31.94-6.15,5.2-10.41,7.33-21.76,10.64l42.35,83.74h-11.59l-41.87-81.85-5.26-9.99"/>
      <path id="path28" class="cls-8" d="m392.8,4176.12h-12.3l-48.96-170.56h10.88l50.39,170.56Zm96.83-29.05l40.25-140.78h11.12l-47.98,167.35-3.39-26.57Zm-59.14-141.51h11.59l50.23,170.56h-11.67l-50.15-170.56"/>
      <path id="path30" class="cls-3" d="m390.18,4147.06l39.04-136.66,3.63,25.93-39.27,137.3-3.39-26.56"/>
      <path id="path32" class="cls-3" d="m707.61,4176.12h-14.43l-101.25-157.79v157.79h-11.35v-170.56h16.08l99.36,155.19,11.59,15.38Zm-11.59-29.05v-141.51h11.59v168.08l-11.59-26.56"/>
      <path id="path34" class="cls-3" d="m761.85,4015.73v149.75h41.16c24.13,0,39.03-5.21,51.1-17.51,12.3-12.78,18.93-32.17,18.93-55.12,0-24.84-7.33-46.6-20.11-59.38-11.59-11.82-27.68-17.74-48.97-17.74h-42.11Zm-11.59-10.17h58.66c46.13,0,75.94,34.54,75.94,88.48,0,26.26-7.81,47.08-22.95,61.98-14.43,13.96-32.4,20.11-60.32,20.11h-51.33v-170.56"/>
      <path id="path36" class="cls-3" d="m1144.68,4176.12h-11.83l-59.14-170.56h10.88l53.93,155.19,6.15,15.38"/>
      <path id="path38" class="cls-15" d="m1143.23,4147.06l48.75-141.51h11.12l-57.58,168.07-2.29-26.56"/>
      <path id="path40" class="cls-3" d="m1310.52,4084.27c25.27-.99,41.69-14.46,41.69-34.72s-17.03-34.3-39.5-34.3h-57.72v160.86h-11.59v-170.56h69.31c30.28,0,51.1,17.98,51.1,44.24,0,12.53-5.2,23.65-15.14,31.94-6.15,5.2-10.41,7.33-21.76,10.64l42.34,83.74h-11.59l-41.87-81.85-5.26-9.99"/>
      <path id="path42" class="cls-3" d="m988.57,4084.27c25.27-.99,41.69-14.46,41.69-34.72s-17.03-34.3-39.51-34.3h-57.72v160.86h-11.59v-170.56h69.31c30.28,0,51.1,17.98,51.1,44.24,0,12.53-5.2,23.65-15.14,31.94-6.15,5.2-10.41,7.33-21.76,10.64l42.35,83.74h-11.59l-41.87-81.85-5.26-9.99"/>
      <path id="path44" class="cls-3" d="m392.8,4176.12h-12.3l-48.96-170.56h10.88l50.39,170.56Zm96.83-29.05l40.25-140.78h11.12l-47.98,167.35-3.39-26.57Zm-59.14-141.51h11.59l50.23,170.56h-11.67l-50.15-170.56"/>
    </g>
  </g>
  <g id="Layer_4" data-name="Layer 4">
    <text class="cls-20" transform="translate(340.47 2265.11)"><tspan x="0" y="0">H</tspan><tspan class="cls-24" x="211.29" y="0">y</tspan><tspan x="376.35" y="0">orim</tspan></text>
    <text class="cls-18" transform="translate(177.79 2690.58)"><tspan x="0" y="0">국립부경대학교 대연캠퍼스 미래관</tspan></text>
    <text class="cls-19" transform="translate(703.98 2462.43)"><tspan x="0" y="0">효림</tspan></text>
  </g>
  <g id="Layer_1-2" data-name="Layer 1">
    <text class="cls-16" transform="translate(383.04 1365.55)"><tspan x="0" y="0">Busan, South Korea</tspan></text>
    <text class="cls-16" transform="translate(323.67 1492.39)"><tspan x="0" y="0">July 28th - August 4th</tspan></text>
    <g>
      <g id="seagull">
        <g>
          <path id="path12" class="cls-14" d="m768.49,724.62s6.18-3.45,11.82-7.64c3.09-2.55,6.18-4.91,7.09-7.27,3.09-8.55,13.27-15.82,22-16.36,6.36-.36,12,2,19.09,7.27,1.27-4.18,3.82-8.73,7.45-13.45,8.55-10.73,23.64-23.45,47.82-38.54,40.18-24.91,95.45-24.91,95.45-24.91,1.27,0,2.55.55,3.27,1.45l2.55,3.09c.91,1.09,1.27,2.55.91,3.82s-1.45,2.55-2.73,2.91c0,0-52.54,17.82-73.63,35.82-19.64,16.73-14.36,40-9.64,52.54,5.27,13.27,24.18,32.18,58.36,45.82,1.27.36,2,1.45,2.55,2.55.36,1.27.18,2.55-.36,3.45-5.82,9.82-13.09,18.73-19.64,27.09-.91,1.09-2.36,1.64-3.82,1.64s-2.73-1.09-3.27-2c-2.91-4.91-9.64-10.73-17.82-16.73-13.09-9.27-29.27-18.54-40.36-24.73-17.09-9.82-29.45-14.54-49.63-12.18-19.64,6.73-36.36-6.73-40.36-11.27-.36-.36-1.09-.55-1.64-1.09-1.27-.55-2.73-1.09-4.18-1.45-4.73-1.27-10-1.82-10-1.82-1.82,0-3.27-1.64-3.82-3.27s.36-3.82,2-4.55h.18l.36-.18Z"/>
          <path id="path14-2" data-name="path14" class="cls-14" d="m914.66,643.53c-8.91,3.09-17.82,7.09-26.18,12.18-23.09,14.18-37.64,26.18-45.82,36.36-4.73,6-7.09,11.27-7.09,16s-1.09,3.09-2.55,3.82-3.27.36-4.55-.55c-7.82-6.36-12.73-10.36-18.73-10-5.64.36-12.54,5.45-14.54,11.09-1.09,2.73-3.45,5.64-6.91,8.55-2,1.64-4.36,3.45-6.36,4.91,1.09.18,2,.55,3.09.91,3.27,1.09,6,2.55,7.45,4.18,2.91,3.45,16.18,14,31.45,8.55.18,0,.55,0,.91-.18,22.73-2.73,36.36,2.36,55.27,13.27,5.45,3.09,12,6.91,19.09,11.27l10.55-13.64c-9.64-8.55-15.45-16.91-18.18-23.64-5.82-15.27-11.27-42.36,11.82-62.18,4-3.45,9.09-6.91,14.91-10.18l-4.55-10.55h.55l.36-.18Z"/>
          <path id="path16-2" data-name="path16" class="cls-14" d="m810.3,718.62c-.55,2.36-3.09,3.45-5.45,2.73-2.36-.55-3.45-3.09-2.73-5.45l1.09-3.09c.55-2.36,3.09-3.45,5.45-2.73s3.45,3.09,2.73,5.45l-1.09,3.09h0Z"/>
        </g>
        <g>
          <path id="path12-2" class="cls-2" d="m768.49,724.62s6.18-3.45,11.82-7.64c3.09-2.55,6.18-4.91,7.09-7.27,3.09-8.55,13.27-15.82,22-16.36,6.36-.36,12,2,19.09,7.27,1.27-4.18,3.82-8.73,7.45-13.45,8.55-10.73,23.64-23.45,47.82-38.54,40.18-24.91,95.45-24.91,95.45-24.91,1.27,0,2.55.55,3.27,1.45l2.55,3.09c.91,1.09,1.27,2.55.91,3.82s-1.45,2.55-2.73,2.91c0,0-52.54,17.82-73.63,35.82-19.64,16.73-14.36,40-9.64,52.54,5.27,13.27,24.18,32.18,58.36,45.82,1.27.36,2,1.45,2.55,2.55.36,1.27.18,2.55-.36,3.45-5.82,9.82-13.09,18.73-19.64,27.09-.91,1.09-2.36,1.64-3.82,1.64s-2.73-1.09-3.27-2c-2.91-4.91-9.64-10.73-17.82-16.73-13.09-9.27-29.27-18.54-40.36-24.73-17.09-9.82-29.45-14.54-49.63-12.18-19.64,6.73-36.36-6.73-40.36-11.27-.36-.36-1.09-.55-1.64-1.09-1.27-.55-2.73-1.09-4.18-1.45-4.73-1.27-10-1.82-10-1.82-1.82,0-3.27-1.64-3.82-3.27s.36-3.82,2-4.55h.18l.36-.18Z"/>
          <path id="path14-2" class="cls-11" d="m914.66,643.53c-8.91,3.09-17.82,7.09-26.18,12.18-23.09,14.18-37.64,26.18-45.82,36.36-4.73,6-7.09,11.27-7.09,16s-1.09,3.09-2.55,3.82-3.27.36-4.55-.55c-7.82-6.36-12.73-10.36-18.73-10-5.64.36-12.54,5.45-14.54,11.09-1.09,2.73-3.45,5.64-6.91,8.55-2,1.64-4.36,3.45-6.36,4.91,1.09.18,2,.55,3.09.91,3.27,1.09,6,2.55,7.45,4.18,2.91,3.45,16.18,14,31.45,8.55.18,0,.55,0,.91-.18,22.73-2.73,36.36,2.36,55.27,13.27,5.45,3.09,12,6.91,19.09,11.27l10.55-13.64c-9.64-8.55-15.45-16.91-18.18-23.64-5.82-15.27-11.27-42.36,11.82-62.18,4-3.45,9.09-6.91,14.91-10.18l-4.55-10.55h.55l.36-.18Z"/>
          <path id="path16-2" class="cls-7" d="m810.3,718.62c-.55,2.36-3.09,3.45-5.45,2.73-2.36-.55-3.45-3.09-2.73-5.45l1.09-3.09c.55-2.36,3.09-3.45,5.45-2.73s3.45,3.09,2.73,5.45l-1.09,3.09h0Z"/>
        </g>
      </g>
      <g id="debian">
        <path class="cls-12" d="m712.13,721.53c-64.18-18.36-117.09-70.91-144.72-131.45-22.54-48.18-29.27-103.45-21.09-155.99,10.36-68.18,46.54-132.72,100.91-175.81,64.54-50,154.9-59.82,229.81-28.91,79.45,32,139.63,108.18,138.36,195.63-1.82,74-50.36,143.45-117.27,173.63-30.18,13.27-65.27,17.64-97.09,8.36-54.73-16.36-93.81-73.27-88.54-130.36.18-1.45.91-7.64,1.09-8.91.18-1.09.91-4.36,1.27-5.45,6-23.45,20-44.54,39.45-58.73,19.82-12.91,47.27-17.27,68.91-7.27,15.82,7.09,28.36,18.36,38,31.82-17.45-4.73-35.27-8.73-52.91-5.27-5.64,1.09-11.09,2.36-16,4.91-2,1.09-4.91,2.91-6.91,4.18-3.27,2.55-6.18,5.45-9.27,7.82-10.18,8.91-17.64,22-18.91,35.64,0,2.36-.36,6-.18,8.36,1.27,36.18,32.73,72,69.63,72.36,47.45.36,87.09-37.82,104.18-79.82,8.73-21.64,11.64-44.36,5.82-66.54-10-45.09-48.91-80-92-94.36-46.18-16-101.09-8.18-138.9,23.45-6.36,5.45-12.73,12.18-18.36,18.54-2.55,3.27-6,7.27-8.36,10.55-18.18,24-29.82,52.18-35.27,81.82-8.36,50-1.64,102.18,13.27,150.9,12.73,42.36,32.73,81.09,54.91,120.18h0v.36l.18.36Z"/>
      </g>
      <path class="cls-9" d="m379.05,944.61c52.54-40,108.72-76.18,172.9-94.72,16-4.91,33.27-8.36,49.82-11.09,93.27-15.27,188.36-1.45,280.17,16.18,42.54,8,85.82,17.27,127.63,28.54,26.18,6.73,50.18,14,75.45,18.91,48.36,9.82,98.72,10.91,148.18,5.64,47.45-5.27,94.54-14,139.81-30-36.54,29.45-79.09,50.18-122.9,67.09-15.64,5.82-32,11.27-48,15.45-30.73,8.18-62.73,14.18-94.72,13.27-28.91-.73-57.45-8.55-85.09-16.54-45.27-13.09-92-25.45-138-35.09-130.72-28.73-250.72-56-383.44-17.45-40.36,10.73-81.82,27.64-122,39.45h0v.36h.18Z"/>
      <path class="cls-9" d="m1603.73,808.98h0c-24.91-9.27-50.73-22.36-75.82-30.73-82.36-30-156.9-8.73-238.17,13.64-28.54,7.64-57.63,17.27-85.63,27.45-17.09,6.18-34.91,12.36-52.91,12.91-19.82.73-39.82-4-58.73-10.36-10-3.27-20.18-7.45-29.82-12-27.27-13.09-53.63-29.45-76.36-52.36,28.18,12.55,57.45,19.45,86.91,23.45,30.73,4,62,3.27,92-4.36,15.64-4,30.54-9.45,46.91-14.73,26-8.73,52.73-16,79.27-22.36,56.91-13.82,116.18-24.54,173.99-12.73,10.18,2,20.91,4.73,30.91,8.55,39.82,14.36,74.91,42.73,107.45,74h0v-.36Z"/>
      <path class="cls-9" d="m714.49,795.89h0c-24.91-9.27-50.73-22.36-75.82-30.73-82.36-30-156.9-8.73-238.17,13.64-28.54,7.64-57.63,17.27-85.63,27.45-17.09,6.18-34.91,12.36-52.91,12.91-19.82.73-39.82-4-58.73-10.36-10-3.27-20.18-7.45-29.82-12-27.27-13.09-53.63-29.45-76.36-52.36,28.18,12.55,57.45,19.45,86.91,23.45,30.73,4,62,3.27,92-4.36,15.64-4,30.54-9.45,46.91-14.73,26-8.73,52.73-16,79.27-22.36,56.91-13.82,116.18-24.54,173.99-12.73,10.18,2,20.91,4.73,30.91,8.55,39.82,14.36,74.91,42.73,107.45,74h0v-.36Z"/>
      <text class="cls-17" transform="translate(373.2 1169.74)"><tspan class="cls-22" x="0" y="0">DebConf</tspan><tspan class="cls-1" x="706.85" y="0"> </tspan><tspan class="cls-22" x="727.25" y="0">24</tspan></text>
    </g>
  </g>
</svg>