<?xml version="1.0" encoding="UTF-8" standalone="no"?>
<!-- Created with Inkscape (http://www.inkscape.org/) -->

<svg
   width="54.022617mm"
   height="7.6193457mm"
   viewBox="0 0 54.022617 7.6193457"
   version="1.1"
   id="svg188315"
   inkscape:version="1.2.2 (b0a8486541, 2022-12-01)"
   sodipodi:docname="badge-background-logo.svg"
   xmlns:inkscape="http://www.inkscape.org/namespaces/inkscape"
   xmlns:sodipodi="http://sodipodi.sourceforge.net/DTD/sodipodi-0.dtd"
   xmlns="http://www.w3.org/2000/svg"
   xmlns:svg="http://www.w3.org/2000/svg">
  <sodipodi:namedview
     id="namedview188317"
     pagecolor="#ffffff"
     bordercolor="#666666"
     borderopacity="1.0"
     inkscape:showpageshadow="2"
     inkscape:pageopacity="0.0"
     inkscape:pagecheckerboard="0"
     inkscape:deskcolor="#d1d1d1"
     inkscape:document-units="mm"
     showgrid="false"
     inkscape:zoom="0.71090067"
     inkscape:cx="89.323308"
     inkscape:cy="239.8366"
     inkscape:window-width="3840"
     inkscape:window-height="2091"
     inkscape:window-x="0"
     inkscape:window-y="0"
     inkscape:window-maximized="1"
     inkscape:current-layer="layer1" />
  <defs
     id="defs188312" />
  <g
     inkscape:label="레이어 1"
     inkscape:groupmode="layer"
     id="layer1"
     transform="translate(-81.470571,-85.18943)">
    <path
       class="cls-17"
       d="m 81.470571,91.204165 c 2.84956,-2.145771 5.90815,-4.087813 9.398,-5.074709 0.87312,-0.259291 1.80181,-0.455083 2.70404,-0.587375 5.06942,-0.820208 10.231439,-0.07673 15.221479,0.873125 2.3204,0.423334 4.66196,0.931334 6.93738,1.529292 1.42875,0.367771 2.73314,0.751417 4.10368,1.018646 2.62467,0.529166 5.36311,0.582083 8.05657,0.306916 2.57968,-0.277812 5.13556,-0.74877 7.60147,-1.613958 -1.97908,1.584854 -4.29947,2.69875 -6.67279,3.603625 -0.84666,0.309563 -1.73566,0.597958 -2.60879,0.830792 -1.66952,0.431271 -3.41048,0.769937 -5.14085,0.711729 -1.56898,-0.04233 -3.12209,-0.463021 -4.62492,-0.883708 -2.45798,-0.706438 -5.00327,-1.362605 -7.49829,-1.88648 -7.10936,-1.537229 -13.628689,-2.995083 -20.835939,-0.936625 -2.19075,0.574146 -4.44764,1.481667 -6.63575,2.114021 v 0 z"
       id="path180512"
       style="fill:#2b54a3;stroke-width:0px" />
  </g>
</svg>
