<?xml version="1.0" encoding="UTF-8"?>
<svg id="Layer_1" data-name="Layer 1" xmlns="http://www.w3.org/2000/svg" viewBox="0 0 245.48 79.67">
  <defs>
    <style>
      .cls-1 {
        stroke-width: 0px;
      }

      .cls-1, .cls-2 {
        fill: #231f20;
      }

      .cls-2 {
        stroke: #231f20;
        stroke-miterlimit: 10;
        stroke-width: .5px;
      }
    </style>
  </defs>
  <g>
    <path class="cls-1" d="M19.46,26.81l.53-2.92.81-.07c.91-.08,1.58-.34,1.99-.77s.71-1.2.91-2.29l2.25-12.43c.09-.54.14-1.01.14-1.41,0-.98-.64-1.54-1.92-1.65l-.79-.07.53-2.92h11.5c3.35,0,5.69.27,7.01.81,2.1.84,3.61,2.26,4.54,4.24.66,1.39.98,3,.98,4.82,0,3.13-.81,5.96-2.43,8.51-2.04,3.22-5.06,5.14-9.05,5.77-1.66.26-3.77.39-6.33.39h-10.67ZM32.19,8.49l-2.3,12.66c-.11.59-.16,1.04-.16,1.35,0,.41.22.71.65.9s1.14.28,2.11.28c2.16,0,4.12-.93,5.89-2.78,1.17-1.23,2.05-2.76,2.64-4.59.47-1.49.7-3.02.7-4.59,0-2.17-.5-3.79-1.51-4.85-1.03-1.09-2.48-1.63-4.36-1.63-1.45,0-2.41.23-2.88.7-.19.19-.32.41-.4.67s-.2.88-.38,1.88Z"/>
    <path class="cls-1" d="M64.92,20.55l1.95,2.11c-.61.68-1.46,1.37-2.57,2.07-1.31.84-2.55,1.46-3.71,1.84s-2.37.57-3.62.57c-2.43,0-4.4-.64-5.92-1.93-.81-.67-1.44-1.5-1.89-2.5s-.68-2.07-.68-3.21c0-2.24.74-4.33,2.21-6.28,1.45-1.91,3.35-3.31,5.68-4.2,1.62-.62,3.32-.93,5.1-.93s3.25.36,4.39,1.07c1.3.82,1.95,1.94,1.95,3.36,0,2.2-1.33,3.83-3.99,4.89-2.4.94-5.13,1.41-8.19,1.41-.21,0-.52,0-.93-.02-.07.57-.11,1.09-.11,1.55,0,1.01.33,1.82.98,2.43s1.51.91,2.59.91c2.1,0,4.35-1.04,6.75-3.13ZM55.23,16.31c2.05,0,3.79-.36,5.2-1.09,1.37-.69,2.06-1.56,2.06-2.6,0-.5-.19-.92-.56-1.24s-.86-.48-1.46-.48c-1.32,0-2.54.7-3.64,2.11-.86,1.11-1.39,2.21-1.6,3.3Z"/>
    <path class="cls-1" d="M76.24,10.71c.55-.76,1.21-1.34,1.97-1.74,1.1-.59,2.26-.88,3.46-.88.97,0,1.93.19,2.88.57s1.75.9,2.41,1.56c1.42,1.43,2.13,3.3,2.13,5.62s-.66,4.31-1.99,6.26c-1.35,2-3.06,3.43-5.15,4.29-1.23.5-2.4.76-3.5.76-1.52,0-3.16-.53-4.9-1.6l-.23,1.27h-4.97l3.52-19.39c.13-.67.19-1.13.19-1.39,0-.3-.08-.53-.23-.67-.29-.29-.91-.47-1.85-.54l-.42-.04.54-2.94c2.44-.05,4.71-.51,6.8-1.39h1.2l-1.86,10.25ZM74.76,22.83c.7.76,1.52,1.14,2.46,1.14.52,0,1.05-.12,1.6-.37s1.01-.57,1.39-.97c.95-1.01,1.68-2.34,2.2-4.01.42-1.34.63-2.61.63-3.81,0-1-.23-1.79-.69-2.38s-1.07-.89-1.85-.89c-1.09,0-2.05.6-2.88,1.81-.75,1.09-1.33,2.33-1.75,3.72s-.79,3.31-1.12,5.76Z"/>
    <path class="cls-1" d="M113.24,2.29l1.78,9.44-2.65.56c-.23-1.32-.96-2.82-2.18-4.48-1.31-1.79-2.95-2.69-4.9-2.69s-3.81,1.12-5.29,3.36c-.75,1.15-1.34,2.48-1.76,4s-.63,3.06-.63,4.61c0,2.17.5,3.83,1.51,4.99,1.09,1.27,2.58,1.9,4.46,1.9,1.5,0,3.01-.48,4.54-1.43s2.82-2.22,3.86-3.79l2.46,1.62c-1.05,1.64-2.29,3-3.69,4.08-2.44,1.89-5.3,2.83-8.58,2.83-2.38,0-4.49-.53-6.35-1.58-1.9-1.08-3.29-2.63-4.18-4.66-.63-1.44-.95-2.9-.95-4.38,0-2.38.6-4.74,1.79-7.08,1.31-2.55,3.05-4.51,5.2-5.85,2.09-1.28,4.44-1.92,7.05-1.92,1.8,0,3.82.52,6.05,1.56l.44-1.09h2.02Z"/>
    <path class="cls-1" d="M127.09,8.09c2.87,0,5.08.7,6.63,2.09,1.42,1.28,2.13,3.12,2.13,5.52,0,1.93-.54,3.87-1.63,5.82-1.08,1.92-2.59,3.37-4.54,4.34-1.68.84-3.53,1.27-5.57,1.27-2.47,0-4.47-.55-5.99-1.65-.86-.62-1.52-1.43-2-2.43s-.71-2.09-.71-3.28c0-2.19.59-4.3,1.78-6.33,1.18-2,2.78-3.45,4.8-4.32,1.55-.68,3.25-1.02,5.12-1.02ZM126.95,11.25c-.81,0-1.5.21-2.07.62s-1.11,1.09-1.6,2.03c-.45.84-.83,1.96-1.16,3.36s-.49,2.6-.49,3.62.24,1.73.73,2.27,1.16.81,2.03.81c1.59,0,2.85-.88,3.76-2.65.41-.8.79-1.89,1.13-3.27s.52-2.51.52-3.38c0-1.16-.22-2.01-.65-2.55-.45-.57-1.18-.86-2.2-.86Z"/>
    <path class="cls-1" d="M143.86,26.81h-5.7l2.09-11.53c.12-.63.18-1.09.18-1.37,0-.32-.08-.54-.23-.69-.3-.3-.94-.5-1.9-.58l-.44-.04.53-2.94c2.33-.11,4.64-.52,6.93-1.25h1.88l-.33,1.83c.77-.66,1.7-1.18,2.79-1.56s2.15-.58,3.21-.58c1.43,0,2.63.32,3.6.97.46.32.83.74,1.12,1.27s.44,1.08.44,1.63c0,.42-.08,1.07-.25,1.93l-1.14,6.31c-.18.97-.26,1.57-.26,1.79,0,.82.45,1.23,1.34,1.23.39,0,.88-.19,1.49-.58l1.41,2.04c-1.97,1.62-3.87,2.43-5.7,2.43-1.32,0-2.4-.33-3.23-.98s-1.25-1.5-1.25-2.54c0-.45.06-.99.18-1.63l1.39-7.44c.05-.25.07-.47.07-.67,0-.54-.19-.96-.58-1.27s-.93-.47-1.62-.47c-1.34,0-2.53.42-3.59,1.27l-2.43,13.41Z"/>
    <path class="cls-1" d="M172.36,11.65l-1.18,6.45c-.57,3.16-1,5.27-1.27,6.31s-.64,2.02-1.12,2.94c-1.05,1.97-2.54,3.59-4.46,4.87-2.09,1.38-4.49,2.07-7.21,2.07-1.38,0-2.49-.22-3.32-.67-.89-.48-1.34-1.2-1.34-2.16,0-.66.22-1.23.67-1.72.63-.71,1.45-1.07,2.44-1.07.86,0,1.63.38,2.32,1.12.42.46.74.75.96.87s.51.18.87.18c1.36,0,2.48-.84,3.36-2.53.57-1.1,1.15-3.23,1.72-6.38l1.88-10.28h-3.02l.58-3.23h3.02c.38-2.24,1.25-4.05,2.62-5.45,1.95-1.98,4.55-2.97,7.82-2.97,1.23,0,2.24.18,3.02.53,1.15.52,1.72,1.31,1.72,2.37,0,.67-.25,1.22-.76,1.66s-1.16.66-1.94.66c-.61,0-1.1-.1-1.47-.3s-.75-.57-1.15-1.12c-.3-.42-.7-.63-1.2-.63-.73,0-1.3.31-1.72.92s-.76,1.63-1.02,3.05l-.23,1.28h3.45l-.6,3.23h-3.45Z"/>
    <path class="cls-1" d="M201.37,19.37l-3.36,7.44h-17.82l-.3-3.66c.46-.28.8-.49,1.04-.62,2.12-1.24,3.49-2.06,4.1-2.44s1.32-.87,2.1-1.44c5.2-3.86,7.8-7.46,7.8-10.83,0-.89-.32-1.62-.96-2.2s-1.46-.86-2.45-.86c-1.35,0-2.48.34-3.39,1.02-.53.39-.79.82-.79,1.3,0,.22.13.53.4.93.3.45.46.84.46,1.2,0,.81-.35,1.52-1.04,2.14-.67.61-1.4.91-2.2.91s-1.48-.27-1.99-.81-.76-1.24-.76-2.11c0-1.59.73-3.11,2.18-4.54,2.05-2,4.79-3.01,8.23-3.01,1.73,0,3.35.27,4.85.81,1.37.5,2.45,1.29,3.23,2.37.68.95,1.02,2.07,1.02,3.36,0,1.84-.76,3.62-2.29,5.34-.86.97-1.87,1.9-3.04,2.78s-2.95,2.04-5.34,3.48l-3.45,2.07h4.45c1.55,0,2.64-.07,3.27-.22s1.21-.46,1.72-.94c.53-.48,1.14-1.28,1.83-2.39l2.48.9Z"/>
    <path class="cls-1" d="M224.84,2.29l-2.6,14.33h5.22l-1.78,3.6h-4.13l-.25,1.28c-.04.2-.05.38-.05.53,0,1.09.69,1.69,2.06,1.79l.9.07-.53,2.92h-12.48l.54-2.92.98-.07c.94-.07,1.6-.32,2-.75s.69-1.23.91-2.4l.09-.46h-10.71l-.77-2.9c1.61-1.54,2.85-2.75,3.73-3.65s4.41-4.54,10.58-10.94l.42-.44h5.87ZM216.37,16.61l1.72-9.49c-.45.47-1.87,2.04-4.27,4.73-.08.09-1.61,1.68-4.57,4.76h7.12Z"/>
  </g>
  <g>
    <path class="cls-2" d="M5.57,65.21c-.06.33-.06.56-.02.69.05.13.11.19.18.19,1.47-.12,3.06-.35,4.74-.69,1.69-.34,3.33-.77,4.92-1.28l-.23,1.72c-1.81.7-3.61,1.31-5.38,1.81-1.78.5-3.46.89-5.05,1.14-1.41.26-2.35.13-2.83-.39-.48-.51-.62-1.36-.42-2.53l1.67-9.49c.07-.4.09-.74.06-1.04-.03-.29-.14-.56-.32-.79-.18-.23-.47-.44-.88-.61-.4-.18-.94-.36-1.61-.55l1.08-1.51c1.3.21,2.64.33,4.01.37,1.38.04,2.74.02,4.09-.05,1.35-.07,2.65-.18,3.89-.33,1.25-.15,2.4-.33,3.47-.54l-1.22,3.13c-1.6-.09-3.07-.13-4.41-.11-1.34.02-2.63.09-3.87.21l-1.88,10.65ZM16.94,60.14c-1.02.07-2.1.17-3.25.3-1.15.13-2.1.29-2.86.47l-1.09-3.2c.88.19,1.7.32,2.46.39.76.07,1.41.09,1.96.07.43-.02.9-.05,1.44-.07.53-.02,1.11-.06,1.72-.11l1.3-7.35c.06-.33.07-.62.03-.88-.04-.26-.16-.5-.37-.72-.21-.22-.53-.43-.96-.61s-1.01-.38-1.73-.56l.97-1.51c.57.07,1.18.16,1.82.26.64.1,1.27.22,1.89.35.62.13,1.21.26,1.76.39.55.13,1.03.25,1.43.37-.08.21-.17.49-.27.83-.1.34-.19.68-.29,1.02-.1.34-.18.64-.25.9-.07.26-.11.4-.11.42l-2.93,16.59c-.13.73-.29,1.56-.49,2.5-.2.94-.41,1.88-.64,2.83-.23.95-.46,1.86-.69,2.72-.24.87-.45,1.59-.65,2.18l-3.02.39c.03-.45.09-.99.17-1.63.08-.65.16-1.33.26-2.06.09-.73.19-1.46.3-2.21.11-.75.22-1.46.34-2.15l1.75-9.91ZM23.01,44.85c.55.07,1.16.17,1.83.3.67.13,1.34.26,2.01.39.67.13,1.31.26,1.92.39.61.13,1.13.24,1.56.33-.08.21-.17.49-.27.84-.1.35-.19.69-.29,1.02s-.17.63-.25.9c-.07.27-.11.42-.11.44l-3.4,19.3c-.13.73-.29,1.55-.49,2.48-.2.93-.41,1.86-.64,2.81-.23.95-.46,1.86-.69,2.72-.24.87-.44,1.59-.61,2.18l-3.13.42c.06-.45.12-.99.2-1.63.08-.65.17-1.34.28-2.08.11-.74.22-1.48.34-2.23.12-.75.24-1.46.36-2.14l3.87-21.97c.12-.68-.06-1.24-.53-1.69-.47-.44-1.44-.85-2.89-1.23l.94-1.55Z"/>
    <path class="cls-2" d="M47.15,66.86c-1.19-.05-2.49-.05-3.92,0-1.43.05-2.8.12-4.13.21-.08.19-.17.37-.25.55-.09.18-.17.36-.25.54l-3,.49c.04-.47.09-1.08.17-1.85.08-.76.17-1.47.29-2.13l1.77-10.02c.06-.35.08-.65.05-.9-.03-.25-.13-.46-.31-.65s-.45-.35-.83-.49c-.37-.14-.87-.28-1.47-.42l1-1.48c.39.05.86.1,1.4.16.54.06,1.1.14,1.68.23.58.09,1.16.19,1.72.3.57.1,1.08.21,1.53.3-.08.21-.18.47-.28.77s-.19.6-.28.9c-.09.29-.16.56-.23.79-.06.23-.1.39-.12.46l-.34,1.93c1.16-.05,2.38-.1,3.68-.16,1.3-.06,2.57-.13,3.8-.23l.53-3.02c.06-.33.07-.62.03-.86-.04-.25-.15-.46-.34-.65-.19-.19-.48-.36-.86-.51-.38-.15-.89-.31-1.52-.47l.97-1.51c.44.05.95.11,1.55.18.6.07,1.2.15,1.82.25.62.09,1.21.19,1.8.28.58.09,1.07.19,1.48.28-.08.21-.18.47-.28.79-.1.32-.21.63-.31.93s-.18.58-.25.83c-.07.25-.1.39-.11.44l-1.7,9.63c-.21,1.2-.46,2.2-.76,3.02-.3.82-.53,1.49-.69,2l-3.03.46c-.01-.19-.03-.4-.05-.63-.02-.23,0-.48.04-.74ZM48.41,58.49c-1.12,0-2.35.01-3.66.04s-2.58.07-3.79.14l-.8,4.54c-.1.59-.23,1.1-.38,1.55,1.2-.02,2.47-.07,3.8-.14,1.34-.07,2.6-.14,3.78-.21l1.04-5.91ZM56.16,44.85c.53.07,1.14.16,1.85.28.71.12,1.42.25,2.15.39.73.14,1.42.27,2.09.39s1.22.21,1.66.28c-.08.21-.18.49-.29.84-.11.35-.21.7-.31,1.06-.1.35-.18.66-.25.93-.07.27-.11.42-.11.44l-3.4,19.3c-.13.73-.29,1.56-.5,2.51-.2.95-.42,1.9-.66,2.87-.24.96-.48,1.87-.71,2.74-.24.87-.45,1.56-.63,2.07l-2.99.42c0-.38.03-.89.09-1.53.07-.64.15-1.34.25-2.09.1-.75.21-1.51.33-2.29.12-.77.25-1.5.37-2.18l3.87-21.97c.12-.68-.13-1.24-.74-1.67s-1.66-.85-3.14-1.25l1.08-1.55Z"/>
    <path class="cls-2" d="M79.83,50.58c.96.16,1.79.45,2.52.86.72.41,1.32.9,1.78,1.48.46.57.78,1.23.96,1.95.18.73.2,1.49.05,2.29-.17.96-.54,1.85-1.1,2.67s-1.28,1.54-2.14,2.14c-.86.61-1.83,1.09-2.93,1.44-1.09.35-2.25.53-3.47.53s-2.31-.18-3.28-.53c-.97-.35-1.77-.83-2.4-1.44-.63-.61-1.08-1.32-1.34-2.14s-.31-1.71-.14-2.67c.15-.84.45-1.64.91-2.39.46-.75,1.05-1.42,1.76-2.02.71-.6,1.53-1.09,2.46-1.48s1.92-.64,3-.76c.03-.33-.03-.58-.2-.76-.17-.18-.5-.35-.98-.51l.96-1.27c.23.05.53.12.91.21.38.09.78.19,1.2.28.42.09.83.19,1.23.28s.74.18,1.01.25c-.07.14-.18.35-.34.63-.16.28-.3.6-.43.95ZM91.97,77.65c-1.43-.02-2.89-.03-4.39-.03s-2.97.01-4.4.03-2.8.06-4.11.11c-1.31.05-2.49.11-3.53.18-.93.07-1.56-.11-1.91-.54-.35-.43-.47-.91-.38-1.45l.77-4.35c.09-.49.13-.88.13-1.17,0-.29-.08-.54-.24-.74-.16-.21-.44-.38-.82-.53-.38-.14-.92-.31-1.62-.5l.98-1.58c.32.05.77.11,1.34.18.57.07,1.17.15,1.8.25.63.09,1.24.18,1.83.26.59.08,1.06.16,1.4.23-.05.14-.11.33-.17.56-.06.23-.13.49-.2.76-.07.27-.14.53-.21.79-.07.26-.12.49-.16.7l-.71,4.04c-.07.4-.06.63.02.7s.32.12.71.14c.86.02,1.94,0,3.23-.07,1.29-.07,2.63-.16,4.02-.26,1.39-.11,2.76-.23,4.13-.37,1.36-.14,2.54-.28,3.55-.42l-1.07,3.09ZM81.09,56.98c.12-.66.1-1.26-.03-1.81-.14-.55-.37-1.03-.71-1.44-.34-.41-.74-.73-1.22-.97-.47-.23-.99-.35-1.55-.35s-1.13.12-1.7.35c-.57.23-1.08.56-1.54.97-.46.41-.85.89-1.19,1.44-.33.55-.55,1.15-.67,1.81-.12.7-.12,1.34.02,1.9.13.56.36,1.04.68,1.44.32.4.72.71,1.21.93.49.22,1.01.33,1.58.33s1.13-.11,1.69-.33c.57-.22,1.08-.53,1.55-.93.47-.4.87-.88,1.2-1.44.33-.56.56-1.2.69-1.9ZM92.28,63.73c-.1.54-.21,1.12-.34,1.74-.13.62-.28,1.25-.44,1.88s-.32,1.23-.47,1.79c-.16.56-.31,1.04-.45,1.44l-3.25.49c0-.28.03-.68.09-1.2.06-.52.12-1.07.21-1.67.08-.6.16-1.2.25-1.79.08-.6.16-1.11.23-1.53l2.75-15.57c.12-.68-.1-1.24-.67-1.67s-1.59-.85-3.07-1.25l.87-1.55c.57.07,1.23.16,1.97.28.74.12,1.47.25,2.18.39.71.14,1.39.27,2.04.39s1.18.21,1.58.28c-.08.21-.18.49-.29.84-.11.35-.21.7-.31,1.06-.1.35-.18.66-.25.93-.07.27-.11.42-.11.44l-1.24,7.03c.5-.05,1.06-.1,1.68-.16.62-.06,1.25-.12,1.88-.19.63-.07,1.25-.15,1.85-.23s1.14-.17,1.63-.26l-1.02,3.2c-.35-.02-.78-.04-1.31-.05-.53-.01-1.08-.02-1.67-.02h-3.45l-.87,4.96Z"/>
    <path class="cls-2" d="M134.16,46.5l1.06-1.62c.64.07,1.32.16,2.02.28.71.12,1.41.24,2.1.37.69.13,1.35.26,1.99.39.63.13,1.2.24,1.7.33-.09.26-.2.54-.31.86s-.22.63-.3.93-.17.59-.24.84c-.07.26-.11.45-.13.56l-2.48,14.06c-.1.54-.21,1.12-.36,1.74-.15.62-.3,1.24-.47,1.85-.17.61-.34,1.2-.52,1.78-.18.57-.36,1.07-.53,1.49l-3.11.49c.02-.35.05-.79.11-1.32.06-.53.12-1.08.19-1.65.07-.57.14-1.14.23-1.71.09-.56.17-1.04.24-1.44l.89-5.03c-.64.02-1.33.06-2.08.11-.75.05-1.5.1-2.25.18-.75.07-1.48.15-2.19.23-.71.08-1.35.17-1.93.26l-.52-1.83c-2.12,2.06-4.43,3.93-6.93,5.61-2.5,1.68-5.04,3.04-7.61,4.1l-.9-1.3c2.11-1.05,4.12-2.34,6.02-3.85s3.62-3.04,5.13-4.59c-.34.05-.72.1-1.15.16-.43.06-.89.11-1.36.16-.75.12-1.57.23-2.47.35-.9.12-1.77.23-2.61.35l-1.05-3.02c1.02.19,2.03.28,3.01.26.99-.01,1.8-.03,2.44-.05.68-.02,1.5-.08,2.45-.16.95-.08,1.87-.16,2.75-.23.62-.72,1.2-1.45,1.74-2.18.54-.73,1.01-1.44,1.41-2.11-.4,0-.83,0-1.29.02-.46.01-.9.03-1.33.05-.43.02-.82.05-1.19.07-.37.02-.67.05-.91.07-.21.02-.53.06-.95.11-.42.05-.88.1-1.38.18-.5.07-1.03.16-1.58.26-.55.11-1.05.21-1.51.3l-1.58-3.41c.41.05.89.1,1.43.16.54.06,1.09.11,1.66.14.57.04,1.11.06,1.64.09.52.02.98.04,1.38.04.96,0,1.92-.03,2.86-.09.95-.06,1.85-.13,2.71-.21.86-.08,1.65-.18,2.37-.3.72-.12,1.33-.23,1.82-.35l1.44.98c-.61,1.21-1.37,2.42-2.28,3.64s-1.92,2.43-3.05,3.64c.62.09,1.24.17,1.86.21.62.05,1.16.06,1.61.04.35,0,.74,0,1.16-.02s.85-.03,1.29-.05c.44-.02.86-.05,1.26-.07s.73-.05,1-.07l1.44-8.15c.12-.71-.1-1.27-.69-1.69-.58-.42-1.65-.83-3.19-1.23ZM139.32,74.66l-1.12,3.16c-1.51-.09-3.01-.15-4.5-.18s-2.95-.03-4.36-.02-2.74.04-4,.07c-1.26.04-2.41.09-3.46.16-.99.05-1.66-.14-1.99-.56-.34-.42-.46-.87-.38-1.34l.68-3.83c.09-.52.14-.92.15-1.23,0-.31-.08-.56-.25-.76-.18-.2-.46-.38-.86-.53-.39-.15-.94-.32-1.63-.51l1.02-1.62c.41.05.91.11,1.5.19.58.08,1.18.16,1.78.25.61.08,1.2.16,1.77.23.57.07,1.05.14,1.44.21-.1.33-.24.77-.39,1.34-.16.56-.28,1.07-.35,1.51l-.63,3.55c-.08.42-.08.67-.03.74.06.07.31.12.75.14.86.02,1.91.02,3.13-.02,1.22-.03,2.51-.1,3.87-.19,1.35-.09,2.71-.21,4.08-.33,1.37-.13,2.63-.27,3.79-.44Z"/>
    <path class="cls-2" d="M162.63,65.7c.93-.12,1.84-.24,2.72-.37s1.68-.26,2.41-.4l-.34,1.91c-1.17.23-2.39.45-3.68.66-1.29.21-2.59.41-3.88.59-1.3.19-2.55.36-3.76.51-1.21.15-2.3.28-3.28.37-.21.02-.55.06-1,.11-.45.05-.96.11-1.51.18s-1.1.13-1.63.19c-.54.06-1,.12-1.39.19l-1.33-3.45c.43.07.92.15,1.47.23.55.08,1.11.15,1.69.19.58.05,1.15.08,1.7.11s1.05.02,1.48,0l.79-7.88c.06-.61-.01-1.13-.22-1.56-.21-.43-.78-.67-1.74-.72l.54-1.48c.33,0,.75,0,1.26.02.51.01,1.05.04,1.6.07.56.04,1.1.08,1.63.12.53.05.99.09,1.38.14-.11.21-.2.46-.29.75-.09.29-.16.59-.21.89-.05.3-.1.61-.14.91-.04.3-.06.56-.05.77l-.9,7.67c.53-.07,1.03-.14,1.5-.21.47-.07.97-.13,1.49-.17l1.52-7.82c.08-.35.12-.65.12-.89s-.07-.46-.2-.66c-.13-.19-.35-.36-.65-.51s-.7-.28-1.2-.39l.68-1.44c.69.07,1.57.18,2.63.32,1.06.14,2.26.33,3.57.56-.33.66-.6,1.26-.81,1.81-.21.55-.37.94-.45,1.18.84.16,1.63.26,2.38.28.75.02,1.42.02,2.04,0,.18.02.43.02.74-.02.31-.03.66-.06,1.04-.09l1.6-9.07c.12-.68-.13-1.24-.74-1.67s-1.66-.85-3.14-1.25l1.08-1.55c.53.07,1.14.16,1.85.28.71.12,1.42.25,2.15.39.73.14,1.42.27,2.09.39s1.23.21,1.69.28c-.11.21-.22.49-.32.84-.11.35-.22.7-.33,1.06-.11.35-.2.66-.27.93-.07.27-.11.42-.11.44l-3.4,19.3c-.13.73-.29,1.56-.5,2.51-.2.95-.42,1.9-.65,2.87-.23.96-.46,1.87-.69,2.74-.24.87-.45,1.56-.63,2.07l-3.06.42c.02-.38.07-.89.15-1.53.08-.64.17-1.34.26-2.09.1-.75.21-1.51.33-2.29.12-.77.25-1.5.37-2.18l1.9-10.76c-.83.07-1.68.18-2.55.33-.87.15-1.64.29-2.32.4l-.98-2.81-1.49,7.24ZM167.57,53.46c-.91-.05-1.91-.06-3.02-.04-1.11.02-2.2.06-3.29.1-1.09.05-2.12.11-3.09.18-.97.07-1.79.12-2.45.14-.26.02-.64.05-1.12.09-.49.04-1,.08-1.54.14-.54.06-1.06.11-1.56.16-.5.05-.91.09-1.22.14l-.95-3.38c.34.05.79.11,1.34.19.55.08,1.11.16,1.7.23.58.07,1.16.14,1.72.19.56.06,1.02.09,1.37.09.73,0,1.59-.04,2.58-.1,1-.07,2.08-.16,3.25-.28,1.17-.12,2.4-.25,3.69-.4,1.29-.15,2.6-.32,3.92-.51l-1.35,3.06Z"/>
    <path class="cls-2" d="M196.28,51.49c-.72-.05-1.56-.03-2.52.05-.96.08-1.88.16-2.76.23-.26.02-.61.05-1.05.09s-.91.08-1.41.14c-.5.06-1.02.12-1.55.19-.53.07-1.01.14-1.44.21l-1.4-3.23c.27.05.66.11,1.15.18.49.07,1.02.13,1.59.18.57.05,1.12.09,1.67.12s1,.05,1.38.05c.63,0,1.4-.01,2.31-.04s1.87-.05,2.9-.09c1.03-.03,2.07-.08,3.12-.14,1.05-.06,2.03-.13,2.94-.23-.07.14-.15.34-.25.6-.09.26-.19.54-.29.84s-.19.59-.27.84c-.08.26-.15.46-.19.6l-1.22,3.94c.05-.02.1-.04.15-.04s.1-.02.15-.07l-.75,2.64c-1.37-.07-2.53-.11-3.48-.12s-1.77-.01-2.46,0-1.32.04-1.88.09c-.56.05-1.13.08-1.72.1-.03.19-.07.35-.12.49-.05.14-.09.3-.12.49l-.61,3.48c-.09.54.03.81.38.81,1.88-.14,3.89-.43,6.04-.86,2.15-.43,4.34-.98,6.56-1.63l-.31,1.76c-2.17.73-4.36,1.39-6.57,1.99-2.21.6-4.49,1.08-6.83,1.46-1.43.26-2.39.1-2.89-.47s-.64-1.45-.43-2.62l.61-3.48c.07-.4.1-.72.1-.97,0-.25-.07-.46-.21-.63-.13-.18-.36-.34-.67-.49-.31-.15-.75-.32-1.3-.51l.99-1.23c2.21.23,4.25.35,6.11.33s3.64-.09,5.33-.23l1.24-4.82ZM206.89,77.9c-1.39-.07-2.83-.12-4.3-.16-1.47-.04-2.91-.04-4.32-.02-1.41.02-2.76.05-4.06.09-1.29.03-2.46.09-3.51.16-1,.07-1.65-.11-1.96-.54-.31-.43-.42-.92-.32-1.46l.68-3.83c.09-.49.13-.88.14-1.18,0-.29-.08-.54-.26-.74-.18-.2-.46-.37-.86-.51-.4-.14-.95-.31-1.67-.49l1.06-1.62c.34.05.81.11,1.39.19.58.08,1.19.17,1.83.26s1.26.19,1.85.28c.59.09,1.06.16,1.4.21-.1.28-.24.72-.43,1.32-.19.6-.32,1.11-.39,1.53l-.61,3.44c-.07.4-.06.63.02.7s.28.12.61.14c.86.02,1.93.01,3.19-.03,1.26-.05,2.58-.11,3.95-.19,1.37-.08,2.73-.19,4.06-.32,1.33-.13,2.52-.28,3.56-.44l-1.06,3.2ZM204.66,58.21c-.82.12-1.65.24-2.49.37-.84.13-1.58.25-2.21.37l-.59-3.02c.87.12,1.61.2,2.21.25.6.05,1.2.06,1.79.04.18.02.42.02.71-.02.29-.04.61-.06.96-.09l1.2-6.78c.12-.68-.13-1.24-.74-1.67s-1.66-.85-3.14-1.25l1.08-1.55c.53.07,1.14.16,1.85.28.71.12,1.42.25,2.15.39.73.14,1.42.27,2.09.39s1.23.21,1.69.28c-.11.21-.22.49-.32.84-.11.35-.22.7-.33,1.06-.11.35-.2.66-.27.93-.07.27-.11.42-.11.44l-2.58,14.62c-.09.54-.21,1.12-.36,1.74-.14.62-.3,1.25-.47,1.88-.17.63-.35,1.23-.53,1.79-.18.56-.34,1.04-.48,1.44l-3.15.53c0-.28.04-.69.11-1.21.07-.53.14-1.09.21-1.69.07-.6.15-1.19.24-1.78.09-.59.17-1.09.25-1.51l1.25-7.07Z"/>
    <path class="cls-2" d="M244.05,73.29c-.46-.02-1.02-.05-1.66-.07s-1.34-.04-2.1-.05-1.54-.02-2.35-.04c-.81-.01-1.6-.02-2.37-.02-.63,0-1.41,0-2.34.02-.93.01-1.93.04-3,.07-1.07.04-2.17.07-3.31.11-1.13.03-2.2.07-3.22.11-1.01.03-1.94.08-2.76.12-.83.05-1.47.08-1.92.11-.9.05-1.9.12-2.99.21-1.09.09-2.09.2-2.97.32l-.68-3.51c.5.07,1.05.14,1.63.21.59.07,1.19.13,1.81.18.62.05,1.25.09,1.86.12.62.04,1.19.06,1.73.09.58.02,1.3.04,2.16.04s1.79,0,2.8-.02c1.01-.01,2.05-.04,3.12-.07,1.07-.04,2.11-.06,3.11-.09,1-.02,1.92-.05,2.78-.09.85-.04,1.56-.06,2.12-.09.78-.05,1.6-.1,2.46-.17.86-.07,1.71-.14,2.55-.21.84-.07,1.66-.15,2.45-.23.79-.08,1.51-.17,2.16-.26l-1.06,3.24ZM232.77,54.13c.89.66,1.87,1.32,2.94,1.99,1.07.67,2.14,1.31,3.21,1.92,1.08.61,2.11,1.17,3.1,1.67.99.5,1.86.91,2.6,1.21l-3.37,2.95c-.72-.59-1.5-1.23-2.35-1.93-.85-.7-1.73-1.41-2.63-2.11-.91-.7-1.81-1.39-2.71-2.07-.9-.68-1.75-1.3-2.54-1.86-2.1,2.06-4.36,3.85-6.78,5.36-2.42,1.51-4.98,2.85-7.67,4.03l-.86-1.3c1.57-.77,3.1-1.66,4.6-2.67,1.5-1.01,2.91-2.07,4.22-3.2,1.31-1.12,2.51-2.27,3.6-3.45,1.08-1.17,1.99-2.31,2.73-3.41.15-.19.23-.4.23-.63,0-.23-.02-.39-.08-.46-.08-.09-.22-.2-.42-.33-.2-.13-.41-.26-.63-.39s-.44-.24-.64-.33c-.21-.09-.35-.15-.44-.18l1.35-1.27c.42.12.92.26,1.47.42.56.16,1.12.33,1.7.51.58.18,1.14.36,1.68.54.54.19,1.01.35,1.41.49-.57.82-1.15,1.61-1.75,2.35-.6.75-1.25,1.47-1.96,2.15Z"/>
  </g>
</svg>