<?xml version="1.0" encoding="UTF-8"?>
<svg id="Layer_1" data-name="Layer 1" xmlns="http://www.w3.org/2000/svg" version="1.1" viewBox="0 0 963.8 1133.9">
  <defs>
    <style>
      .cls-1, .cls-2, .cls-3, .cls-4, .cls-5, .cls-6 {
        stroke-width: 0px;
      }

      .cls-1, .cls-3 {
        fill: #204593;
      }

      .cls-2 {
        fill: #fefefe;
      }

      .cls-2, .cls-3, .cls-4, .cls-5 {
        fill-rule: evenodd;
      }

      .cls-4, .cls-6 {
        fill: #fff;
      }

      .cls-7 {
        isolation: isolate;
      }

      .cls-5 {
        fill: #34679a;
      }

      .cls-8 {
        display: none;
      }
    </style>
  </defs>
  <g id="Layer_2" data-name="Layer 2">
    <rect class="cls-1" y="0" width="963.8" height="1133.9"/>
  </g>
  <g class="cls-7">
    <path class="cls-6" d="M193.5,647.7l1.5-8.1,2.2-.2c2.5-.2,4.4-.9,5.5-2.1,1.1-1.2,2-3.3,2.5-6.3l6.2-34.5c.3-1.5.4-2.8.4-3.9,0-2.7-1.8-4.3-5.3-4.6l-2.2-.2,1.5-8.1h31.9c9.3,0,15.8.7,19.5,2.2,5.8,2.3,10,6.3,12.6,11.8,1.8,3.9,2.7,8.3,2.7,13.4,0,8.7-2.2,16.6-6.7,23.6-5.7,8.9-14,14.3-25.1,16-4.6.7-10.5,1.1-17.6,1.1h-29.6,0ZM228.8,596.9l-6.4,35.1c-.3,1.6-.4,2.9-.4,3.8s.6,2,1.8,2.5,3.2.8,5.9.8c6,0,11.4-2.6,16.3-7.7,3.3-3.4,5.7-7.7,7.3-12.7,1.3-4.1,2-8.4,2-12.7s-1.4-10.5-4.2-13.5c-2.9-3-6.9-4.5-12.1-4.5s-6.7.7-8,2c-.5.5-.9,1.1-1.1,1.9-.2.7-.6,2.5-1,5.2v-.2h-.1Z"/>
    <path class="cls-6" d="M319.6,630.3l5.4,5.9c-1.7,1.9-4.1,3.8-7.1,5.8-3.6,2.3-7.1,4-10.3,5.1-3.2,1.1-6.6,1.6-10,1.6-6.7,0-12.2-1.8-16.4-5.4-2.2-1.9-4-4.2-5.2-7-1.3-2.8-1.9-5.7-1.9-8.9,0-6.2,2-12,6.1-17.4,4-5.3,9.3-9.2,15.8-11.7,4.5-1.7,9.2-2.6,14.1-2.6s9,1,12.2,3c3.6,2.3,5.4,5.4,5.4,9.3,0,6.1-3.7,10.6-11.1,13.6-6.7,2.6-14.2,3.9-22.7,3.9s-1.4,0-2.6,0c-.2,1.6-.3,3-.3,4.3,0,2.8.9,5,2.7,6.7,1.8,1.7,4.2,2.5,7.2,2.5,5.8,0,12.1-2.9,18.7-8.7h0ZM292.7,618.6c5.7,0,10.5-1,14.4-3,3.8-1.9,5.7-4.3,5.7-7.2s-.5-2.5-1.6-3.4c-1-.9-2.4-1.3-4-1.3-3.7,0-7,2-10.1,5.9-2.4,3.1-3.9,6.1-4.4,9.2v-.2Z"/>
    <path class="cls-6" d="M351,603c1.5-2.1,3.3-3.7,5.5-4.8,3.1-1.6,6.3-2.4,9.6-2.4s5.4.5,8,1.6,4.9,2.5,6.7,4.3c3.9,4,5.9,9.2,5.9,15.6s-1.8,12-5.5,17.4c-3.7,5.6-8.5,9.5-14.3,11.9-3.4,1.4-6.7,2.1-9.7,2.1s-8.8-1.5-13.6-4.4l-.6,3.5h-13.8l9.8-53.8c.4-1.9.5-3.1.5-3.9s-.2-1.5-.6-1.9c-.8-.8-2.5-1.3-5.1-1.5h-1.2l1.5-8.2c6.8,0,13.1-1.4,18.9-3.9h3.3l-5.2,28.4h0ZM346.9,636.7c2,2.1,4.2,3.2,6.8,3.2s2.9-.3,4.4-1,2.8-1.6,3.9-2.7c2.6-2.8,4.7-6.5,6.1-11.1,1.2-3.7,1.8-7.2,1.8-10.6s-.6-5-1.9-6.6-3-2.5-5.1-2.5-5.7,1.7-8,5c-2.1,3-3.7,6.5-4.9,10.3s-2.2,9.2-3.1,16h0Z"/>
    <path class="cls-6" d="M453.7,579.7l4.9,26.2-7.4,1.6c-.7-3.7-2.7-7.8-6-12.4-3.6-5-8.2-7.5-13.6-7.5s-10.6,3.1-14.7,9.3c-2.1,3.2-3.7,6.9-4.9,11.1-1.2,4.2-1.8,8.5-1.8,12.8s1.4,10.6,4.2,13.9c3,3.5,7.2,5.3,12.4,5.3s8.4-1.3,12.6-4,7.8-6.2,10.7-10.5l6.8,4.5c-2.9,4.6-6.3,8.3-10.2,11.3-6.8,5.2-14.7,7.9-23.8,7.9s-12.5-1.5-17.6-4.4c-5.3-3-9.1-7.3-11.6-12.9-1.8-4-2.6-8-2.6-12.1,0-6.6,1.7-13.2,5-19.7,3.6-7.1,8.5-12.5,14.4-16.2,5.8-3.5,12.3-5.3,19.6-5.3s10.6,1.4,16.8,4.3l1.2-3h5.6v-.2h0Z"/>
    <path class="cls-6" d="M492.1,595.7c8,0,14.1,1.9,18.4,5.8,3.9,3.5,5.9,8.7,5.9,15.3s-1.5,10.7-4.5,16.1c-3,5.3-7.2,9.3-12.6,12-4.7,2.3-9.8,3.5-15.5,3.5s-12.4-1.5-16.6-4.6c-2.4-1.7-4.2-4-5.5-6.8s-2-5.8-2-9.1c0-6.1,1.6-11.9,4.9-17.6,3.3-5.6,7.7-9.6,13.3-12,4.3-1.9,9-2.8,14.2-2.8v.2h0ZM491.8,604.5c-2.2,0-4.2.6-5.8,1.7-1.6,1.2-3.1,3-4.4,5.6-1.2,2.3-2.3,5.4-3.2,9.3-.9,3.9-1.4,7.2-1.4,10s.7,4.8,2,6.3,3.2,2.2,5.6,2.2c4.4,0,7.9-2.5,10.4-7.4,1.1-2.2,2.2-5.2,3.1-9.1,1-3.8,1.4-7,1.4-9.4s-.6-5.6-1.8-7.1c-1.2-1.6-3.3-2.4-6.1-2.4l.2.3h0Z"/>
    <path class="cls-6" d="M538.7,647.7h-15.8l5.8-32c.3-1.8.5-3,.5-3.8s-.2-1.5-.6-1.9c-.8-.8-2.6-1.4-5.3-1.6h-1.2l1.5-8.2c6.5-.3,12.9-1.4,19.2-3.5h5.2l-.9,5.1c2.1-1.8,4.7-3.3,7.7-4.3,3-1.1,6-1.6,8.9-1.6s7.3.9,10,2.7c1.3.9,2.3,2.1,3.1,3.5.8,1.5,1.2,3,1.2,4.5s-.2,3-.7,5.4l-3.2,17.5c-.5,2.7-.7,4.4-.7,5,0,2.3,1.2,3.4,3.7,3.4s2.5-.5,4.1-1.6l3.9,5.7c-5.5,4.5-10.7,6.7-15.8,6.7s-6.7-.9-9-2.7-3.5-4.2-3.5-7,.2-2.7.5-4.5l3.9-20.6c0-.7.2-1.3.2-1.9,0-1.5-.5-2.7-1.6-3.5-1.1-.9-2.6-1.3-4.5-1.3-3.7,0-7,1.2-10,3.5l-6.7,37.2v-.2h0Z"/>
    <path class="cls-6" d="M617.7,605.7l-3.3,17.9c-1.6,8.8-2.8,14.6-3.5,17.5s-1.8,5.6-3.1,8.1c-2.9,5.5-7.1,10-12.4,13.5-5.8,3.8-12.5,5.8-20,5.8s-6.9-.6-9.2-1.9c-2.5-1.3-3.7-3.3-3.7-6s.6-3.4,1.9-4.8c1.8-2,4-3,6.8-3s4.5,1,6.4,3.1c1.2,1.3,2.1,2.1,2.7,2.4.6.3,1.4.5,2.4.5,3.8,0,6.9-2.3,9.3-7,1.6-3.1,3.2-9,4.8-17.7l5.2-28.5h-8.4l1.6-9h8.4c1-6.2,3.5-11.3,7.3-15.1,5.4-5.5,12.6-8.3,21.7-8.2s6.2.5,8.4,1.5c3.2,1.4,4.8,3.6,4.8,6.6s-.7,3.4-2.1,4.6c-1.4,1.2-3.2,1.8-5.4,1.8s-3-.3-4.1-.8c-1-.6-2.1-1.6-3.2-3.1-.8-1.2-2-1.8-3.3-1.8-2,0-3.6.9-4.8,2.6-1.2,1.7-2.1,4.5-2.8,8.5l-.6,3.6h9.6l-1.7,9h-9.7Z"/>
    <path class="cls-6" d="M700.9,627.1l-9.3,20.6h-49.5l-.8-10.1c1.3-.8,2.2-1.3,2.9-1.7,5.9-3.4,9.7-5.7,11.4-6.8s3.7-2.4,5.8-4c14.4-10.7,22.6-20.7,21.7-30s-.9-4.5-2.7-6.1-4-2.4-6.8-2.4-6.9.9-9.4,2.8c-1.5,1.1-2.2,2.3-2.2,3.6s.4,1.5,1.1,2.6c.8,1.2,1.3,2.3,1.3,3.3,0,2.2-1,4.2-2.9,6-1.9,1.7-3.9,2.5-6.1,2.5s-4.1-.7-5.5-2.2-2.1-3.4-2.1-5.9c0-4.4,2-8.6,6-12.6,5.7-5.6,13.3-8.3,22.8-8.3s9.3.7,13.5,2.2c3.8,1.4,6.8,3.6,9,6.6,1.9,2.6,2.8,5.7,2.8,9.3,0,5.1-2.1,10-6.3,14.8-2.4,2.7-5.2,5.3-8.4,7.7-3.3,2.4-8.2,5.7-14.8,9.7l-9.6,5.8h12.3c4.3,0,7.3-.2,9.1-.6,1.8-.4,3.3-1.3,4.8-2.6s3.2-3.5,5.1-6.6l6.9,2.5h0Z"/>
    <path class="cls-6" d="M763.1,579.7l-7.2,39.8h14.5l-4.9,10h-11.5l-.7,3.6v1.5c0,3,1.9,4.7,5.7,5l2.5.2-1.5,8.1h-34.6l1.5-8.1,2.7-.2c2.6-.2,4.4-.9,5.5-2.1,1.1-1.2,1.9-3.4,2.5-6.7l.2-1.3h-29.7l-2.1-8c4.5-4.3,7.9-7.6,10.3-10.1,2.4-2.5,12.2-12.6,29.4-30.4l1.2-1.2h16.3-.1ZM739.6,619.4l4.8-26.3c-1.2,1.3-5.2,5.7-11.9,13.1-.2.3-4.5,4.7-12.7,13.2h19.8Z"/>
  </g>
  <g class="cls-8">
    <path id="path12" class="cls-5" d="M436.9,400.9s3.4-1.9,6.5-4.2c1.7-1.4,3.4-2.7,3.9-4,1.7-4.7,7.3-8.7,12.1-9,3.5-.2,6.6,1.1,10.5,4,.7-2.3,2.1-4.8,4.1-7.4,4.7-5.9,13-12.9,26.3-21.2,22.1-13.7,52.5-13.7,52.5-13.7.7,0,1.4.3,1.8.8l1.4,1.7c.5.6.7,1.4.5,2.1s-.8,1.4-1.5,1.6c0,0-28.9,9.8-40.5,19.7-10.8,9.2-7.9,22-5.3,28.9,2.9,7.3,13.3,17.7,32.1,25.2.7.2,1.1.8,1.4,1.4.2.7,0,1.4-.2,1.9-3.2,5.4-7.2,10.3-10.8,14.9-.5.6-1.3.9-2.1.9s-1.5-.6-1.8-1.1c-1.6-2.7-5.3-5.9-9.8-9.2-7.2-5.1-16.1-10.2-22.2-13.6-9.4-5.4-16.2-8-27.3-6.7-10.8,3.7-20-3.7-22.2-6.2-.2-.2-.6-.3-.9-.6-.7-.3-1.5-.6-2.3-.8-2.6-.7-5.5-1-5.5-1-1,0-1.8-.9-2.1-1.8s.2-2.1,1.1-2.5h.3,0Z"/>
    <path id="path14" class="cls-5" d="M517.3,356.3c-4.9,1.7-9.8,3.9-14.4,6.7-12.7,7.8-20.7,14.4-25.2,20-2.6,3.3-3.9,6.2-3.9,8.8s-.6,1.7-1.4,2.1-1.8.2-2.5-.3c-4.3-3.5-7-5.7-10.3-5.5-3.1.2-6.9,3-8,6.1-.6,1.5-1.9,3.1-3.8,4.7-1.1.9-2.4,1.9-3.5,2.7.6.1,1.1.3,1.7.5,1.8.6,3.3,1.4,4.1,2.3,1.6,1.9,8.9,7.7,17.3,4.7.1,0,.3,0,.5-.1,12.5-1.5,20,1.3,30.4,7.3,3,1.7,6.6,3.8,10.5,6.2l5.8-7.5c-5.3-4.7-8.5-9.3-10-13-3.2-8.4-6.2-23.3,6.5-34.2,2.2-1.9,5-3.8,8.2-5.6l-2.5-5.8h.5,0Z"/>
    <path id="path16" class="cls-5" d="M459.9,397.6c-.3,1.3-1.7,1.9-3,1.5-1.3-.3-1.9-1.7-1.5-3l.6-1.7c.3-1.3,1.7-1.9,3-1.5s1.9,1.7,1.5,3l-.6,1.7h0Z"/>
  </g>
  <path id="path12-2" class="cls-2" d="M436.9,400.9s3.4-1.9,6.5-4.2c1.7-1.4,3.4-2.7,3.9-4,1.7-4.7,7.3-8.7,12.1-9,3.5-.2,6.6,1.1,10.5,4,.7-2.3,2.1-4.8,4.1-7.4,4.7-5.9,13-12.9,26.3-21.2,22.1-13.7,52.5-13.7,52.5-13.7.7,0,1.4.3,1.8.8l1.4,1.7c.5.6.7,1.4.5,2.1s-.8,1.4-1.5,1.6c0,0-28.9,9.8-40.5,19.7-10.8,9.2-7.9,22-5.3,28.9,2.9,7.3,13.3,17.7,32.1,25.2.7.2,1.1.8,1.4,1.4.2.7,0,1.4-.2,1.9-3.2,5.4-7.2,10.3-10.8,14.9-.5.6-1.3.9-2.1.9s-1.5-.6-1.8-1.1c-1.6-2.7-5.3-5.9-9.8-9.2-7.2-5.1-16.1-10.2-22.2-13.6-9.4-5.4-16.2-8-27.3-6.7-10.8,3.7-20-3.7-22.2-6.2-.2-.2-.6-.3-.9-.6-.7-.3-1.5-.6-2.3-.8-2.6-.7-5.5-1-5.5-1-1,0-1.8-.9-2.1-1.8s.2-2.1,1.1-2.5h.3,0Z"/>
  <path id="path14-2" class="cls-3" d="M517.3,356.3c-4.9,1.7-9.8,3.9-14.4,6.7-12.7,7.8-20.7,14.4-25.2,20-2.6,3.3-3.9,6.2-3.9,8.8s-.6,1.7-1.4,2.1-1.8.2-2.5-.3c-4.3-3.5-7-5.7-10.3-5.5-3.1.2-6.9,3-8,6.1-.6,1.5-1.9,3.1-3.8,4.7-1.1.9-2.4,1.9-3.5,2.7.6.1,1.1.3,1.7.5,1.8.6,3.3,1.4,4.1,2.3,1.6,1.9,8.9,7.7,17.3,4.7.1,0,.3,0,.5-.1,12.5-1.5,20,1.3,30.4,7.3,3,1.7,6.6,3.8,10.5,6.2l5.8-7.5c-5.3-4.7-8.5-9.3-10-13-3.2-8.4-6.2-23.3,6.5-34.2,2.2-1.9,5-3.8,8.2-5.6l-2.5-5.8h.5,0Z"/>
  <path id="path16-2" class="cls-4" d="M459.9,397.6c-.3,1.3-1.7,1.9-3,1.5-1.3-.3-1.9-1.7-1.5-3l.6-1.7c.3-1.3,1.7-1.9,3-1.5s1.9,1.7,1.5,3l-.6,1.7h0Z"/>
  <g id="debian">
    <path class="cls-6" d="M405.9,399.2c-35.3-10.1-64.4-39-79.6-72.3-12.4-26.5-16.1-56.9-11.6-85.8,5.7-37.5,25.6-73,55.5-96.7,35.5-27.5,85.2-32.9,126.4-15.9,43.7,17.6,76.8,59.5,76.1,107.6-1,40.7-27.7,78.9-64.5,95.5-16.6,7.3-35.9,9.7-53.4,4.6-30.1-9-51.6-40.3-48.7-71.7.1-.8.5-4.2.6-4.9.1-.6.5-2.4.7-3,3.3-12.9,11-24.5,21.7-32.3,10.9-7.1,26-9.5,37.9-4,8.7,3.9,15.6,10.1,20.9,17.5-9.6-2.6-19.4-4.8-29.1-2.9-3.1.6-6.1,1.3-8.8,2.7-1.1.6-2.7,1.6-3.8,2.3-1.8,1.4-3.4,3-5.1,4.3-5.6,4.9-9.7,12.1-10.4,19.6,0,1.3-.2,3.3-.1,4.6.7,19.9,18,39.6,38.3,39.8,26.1.2,47.9-20.8,57.3-43.9,4.8-11.9,6.4-24.4,3.2-36.6-5.5-24.8-26.9-44-50.6-51.9-25.4-8.8-55.6-4.5-76.4,12.9-3.5,3-7,6.7-10.1,10.2-1.4,1.8-3.3,4-4.6,5.8-10,13.2-16.4,28.7-19.4,45-4.6,27.5-.9,56.2,7.3,83,7,23.3,18,44.6,30.2,66.1h0v.4h.1Z"/>
  </g>
  <g>
    <path class="cls-6" d="M222.8,521.9c28.9-22,59.8-41.9,95.1-52.1,8.8-2.7,18.3-4.6,27.4-6.1,51.3-8.4,103.6-.8,154.1,8.9,23.4,4.4,47.2,9.5,70.2,15.7,14.4,3.7,27.6,7.7,41.5,10.4,26.6,5.4,54.3,6,81.5,3.1,26.1-2.9,52-7.7,76.9-16.5-20.1,16.2-43.5,27.6-67.6,36.9-8.6,3.2-17.6,6.2-26.4,8.5-16.9,4.5-34.5,7.8-52.1,7.3-15.9-.4-31.6-4.7-46.8-9.1-24.9-7.2-50.6-14-75.9-19.3-71.9-15.8-137.9-30.8-210.9-9.6-22.2,5.9-45,15.2-67.1,21.7h0v.2h0Z"/>
    <path class="cls-6" d="M896.3,447.3h0c-13.7-5.1-27.9-12.3-41.7-16.9-45.3-16.5-86.3-4.8-131,7.5-15.7,4.2-31.7,9.5-47.1,15.1-9.4,3.4-19.2,6.8-29.1,7.1-10.9.4-21.9-2.2-32.3-5.7-5.5-1.8-11.1-4.1-16.4-6.6-15-7.2-29.5-16.2-42-28.8,15.5,6.9,31.6,10.7,47.8,12.9,16.9,2.2,34.1,1.8,50.6-2.4,8.6-2.2,16.8-5.2,25.8-8.1,14.3-4.8,29-8.8,43.6-12.3,31.3-7.6,63.9-13.5,95.7-7,5.6,1.1,11.5,2.6,17,4.7,21.9,7.9,41.2,23.5,59.1,40.7h0v-.2h0Z"/>
    <path class="cls-6" d="M407.2,440.2h0c-13.7-5.1-27.9-12.3-41.7-16.9-45.3-16.5-86.3-4.8-131,7.5-15.7,4.2-31.7,9.5-47.1,15.1-9.4,3.4-19.2,6.8-29.1,7.1-10.9.4-21.9-2.2-32.3-5.7-5.5-1.8-11.1-4.1-16.4-6.6-15-7.2-29.5-16.2-42-28.8,15.5,6.9,31.6,10.7,47.8,12.9,16.9,2.2,34.1,1.8,50.6-2.4,8.6-2.2,16.8-5.2,25.8-8.1,14.3-4.8,29-8.8,43.6-12.3,31.3-7.6,63.9-13.5,95.7-7,5.6,1.1,11.5,2.6,17,4.7,21.9,7.9,41.2,23.5,59.1,40.7h0v-.2h0Z"/>
  </g>
  <g class="cls-7">
    <path class="cls-6" d="M353.7,698.6h8l-3.3,18.1c-.3,1.4-.4,2.3-.4,2.8s.2,1.2.6,1.6c.4.4.9.6,1.5.6,1,0,2.2-.5,3.7-1.6,3.8-2.7,5.6-6.6,5.6-11.7s-2.1-10.5-6.2-14.3c-4.3-4-9.6-6-16-6s-12.6,2-17.4,6.1c-5.6,4.6-8.3,10.8-8.3,18.4s3.5,15.7,10.5,20.5c4.4,3.1,9.5,4.6,15.2,4.6s9.3-.9,13-2.8c3.7-1.8,6.9-4.7,9.5-8.5h6c-2.1,3.6-4.4,6.5-6.8,8.7-6,5.4-13.2,8.1-21.7,8.1s-17-3.2-23.3-9.6c-5.7-5.9-8.5-12.8-8.5-20.9s1.7-11.7,5.1-16.7c3.2-4.6,7.6-8.1,13.2-10.5,4.5-1.9,9-2.9,13.5-2.9s10.5,1.3,15.4,4c4.2,2.3,7.4,5.3,9.7,9.1,2.1,3.6,3.2,7.5,3.2,11.7s-1.5,9.1-4.4,12.6c-1.9,2.2-4.2,4-7,5.5-2.8,1.4-5.4,2.1-7.9,2.1-3.7,0-6-1.5-6.8-4.5-2.5,3-5.6,4.5-9.3,4.5s-5.8-1.1-7.8-3.4c-2-2.2-3.1-5.1-3.1-8.6s1.1-7.4,3.3-10.5c1.6-2.2,3.6-3.9,6-5.3,2.4-1.3,4.9-2,7.4-2s5.5.9,7.6,2.7l.4-2.2-.2.3h0ZM352,704.8c-1.9-1.2-3.5-1.8-4.7-1.8-2.1,0-3.9,1.1-5.5,3.3-.9,1.3-1.7,2.9-2.3,5-.6,2.1-.9,4-.9,5.8s.3,2.8,1,3.7,1.6,1.4,2.8,1.4c2.1,0,4.1-1.5,5.8-4.4,1.2-2.1,2.5-6.4,3.9-12.9h0Z"/>
    <path class="cls-6" d="M424.2,711.1c3.3,0,6.2.9,8.7,2.5,1.5,1,2.7,2.2,3.5,3.8.8,1.5,1.2,3.2,1.2,5.1,0,3.7-1.2,7.2-3.6,10.5-4.4,6.1-11.8,9.2-22.2,9.2h-35.8l1.2-6.9,1.9-.2c2.2-.2,3.7-.8,4.7-1.8s1.7-2.8,2.2-5.4l5.3-29.3c.2-1.3.3-2.4.3-3.3,0-2.3-1.5-3.6-4.5-3.9l-1.9-.2,1.2-6.9h32c4.3,0,7.5.2,9.8.5s4.2.9,5.6,1.7c1.8,1,3.2,2.4,4.2,4.1,1,1.8,1.5,3.7,1.5,5.8,0,3.8-1.4,7-4.3,9.8-2.9,2.7-6.6,4.3-11.1,4.9h0ZM403.1,714.8l-1.9,10.3c-.6,4.3-.9,6.5-.9,6.8,0,2.1,2.2,3.2,6.5,3.2s4.1-.3,5.7-.8c1.5-.5,3-1.4,4.3-2.7,2.8-2.5,4.2-5.6,4.2-9.2s-.8-4.7-2.5-5.8-4.5-1.7-8.4-1.7h-7.1,0ZM404.4,707.8h5.2c5,0,8.8-.9,11.2-2.6,2.4-1.7,3.7-4,3.7-6.9,0-4.7-3.4-7.1-10.3-7.1s-4.3.3-5.6.9c-.6.3-1,.8-1.3,1.6s-.7,2.1-1,3.8l-1.9,10.3h0Z"/>
    <path class="cls-6" d="M492.6,698.8l-4.9,26.9c-.4,2.3-.6,3.9-.6,4.8s.3,1.7.9,2.4,1.3,1,2.1,1,2.2-.6,3.8-2l3.4,4.9c-1.8,1.9-3.9,3.5-6.3,4.6s-4.8,1.7-7.3,1.7c-5.2,0-8.5-1.9-10-5.6-3.2,2.1-6,3.5-8.2,4.4-2.3.8-4.7,1.2-7.3,1.2-3.7,0-6.8-.9-9.2-2.6-2.2-1.6-3.4-3.7-3.4-6.4s.1-2.5.4-3.9l2.7-15.1c.3-1.5.4-2.6.4-3.2s-.2-1.3-.5-1.6c-.7-.7-2.2-1.2-4.5-1.4h-1l1.2-7c5.5-.2,11-1.2,16.4-2.9h4.4l-4.7,25.9c-.3,1.7-.5,3.2-.5,4.6s.5,2.2,1.5,2.9c1,.8,2.3,1.2,3.8,1.2,2.8,0,5.6-1.1,8.3-3.3l5.7-31.3h13.4v-.2h0Z"/>
    <path class="cls-6" d="M524.2,714.3l6.7,2.1c2.8.9,4.8,1.8,6.1,2.8,1.2.9,2.1,2,2.8,3.3s1,2.7,1,4.1c0,3.1-1.3,6-3.8,8.8-2.3,2.5-5.5,4.5-9.6,5.8-3.4,1.1-7.1,1.7-11.1,1.7-6.8,0-12.3-1.4-16.6-4.1-2.2-1.4-3.3-3.2-3.3-5.4s.5-2.7,1.6-3.7,2.4-1.5,4-1.5,2.9.3,4,1c1.1.6,2.4,1.9,4,3.7,1.7,2,3.8,2.9,6.4,2.9s3.8-.5,5.3-1.4c1.6-1,2.4-2.3,2.4-4.1s-.4-2-1.1-2.6c-.7-.6-2-1.2-3.9-1.7l-6-1.7c-2.6-.7-4.7-1.6-6.4-2.6-1.5-.9-2.6-2.1-3.5-3.6s-1.3-3.1-1.3-4.8c0-3.2,1.2-6.1,3.5-8.8,1.8-2.1,4.4-3.7,7.7-4.9s6.9-1.8,10.9-1.8,9.5.9,13.1,2.6c3.6,1.7,5.3,3.8,5.3,6.2s-.5,2.5-1.5,3.4-2.2,1.3-3.7,1.3-2.5-.3-3.4-.8-2-1.6-3.3-3.1c-.8-1-1.6-1.6-2.5-2s-2.1-.6-3.6-.6-3.3.4-4.4,1.2c-1.1.8-1.6,1.9-1.6,3.3s.4,2.2,1.2,2.9c.6.5,2.2,1.2,4.6,2h0Z"/>
    <path class="cls-6" d="M595.1,698.8l-5,27.4c-.4,2.1-.6,3.6-.6,4.3s.3,1.8.9,2.4,1.4,1,2.3,1,2.7-.7,4.5-2l3.6,4.5c-4.8,4.5-9.5,6.7-14.3,6.7s-4.9-.6-6.7-1.7c-1.8-1.1-3-2.8-3.6-5-1.2,1.5-2.5,2.7-3.9,3.6-3.1,2.1-6.5,3.1-10.3,3.1s-8.6-1.7-11.8-5-4.8-7.7-4.8-13.1,1.7-11.2,5-15.9c3.2-4.4,7.4-7.6,12.7-9.6,2.5-.9,5-1.4,7.6-1.4,4.5,0,8.3,1.3,11.6,4l.6-3.2h12.2ZM580.4,708.2c-2.9-1.8-5.2-2.7-7.2-2.7-3.2,0-6,1.7-8.4,5-1.4,1.9-2.5,4.4-3.5,7.6-.9,3.1-1.4,6-1.4,8.7s.5,4.3,1.6,5.6c1.1,1.4,2.5,2.1,4.3,2.1,3.2,0,6.1-2.2,8.7-6.7,1.1-1.8,2-4.1,2.8-6.8s1.8-6.9,3.1-12.7h0Z"/>
    <path class="cls-6" d="M617.4,742.2h-13.4l4.9-27.2c.3-1.5.4-2.6.4-3.2s-.2-1.3-.5-1.6c-.7-.7-2.2-1.2-4.5-1.4h-1l1.2-7c5.5-.2,11-1.2,16.4-2.9h4.4l-.8,4.3c1.8-1.5,4-2.8,6.6-3.7s5.1-1.4,7.6-1.4,6.2.8,8.5,2.3c1.1.7,2,1.8,2.7,3s1,2.5,1,3.8-.2,2.5-.6,4.6l-2.7,14.9c-.4,2.3-.6,3.7-.6,4.2,0,1.9,1.1,2.9,3.2,2.9s2.1-.5,3.5-1.4l3.3,4.8c-4.6,3.8-9.1,5.7-13.4,5.7s-5.7-.8-7.6-2.3c-2-1.5-2.9-3.5-2.9-6s0-2.3.4-3.9l3.3-17.6c0-.6.2-1.1.2-1.6,0-1.3-.5-2.3-1.4-3s-2.2-1.1-3.8-1.1c-3.2,0-6,1-8.5,3l-5.7,31.7h-.2Z"/>
  </g>
</svg>