<?xml version="1.0" encoding="UTF-8" standalone="no"?>
<!DOCTYPE svg PUBLIC "-//W3C//DTD SVG 1.1//EN" "http://www.w3.org/Graphics/SVG/1.1/DTD/svg11.dtd">
<svg width="100%" height="100%" viewBox="0 0 5169 3508" version="1.1" xmlns="http://www.w3.org/2000/svg" xmlns:xlink="http://www.w3.org/1999/xlink" xml:space="preserve" xmlns:serif="http://www.serif.com/" style="fill-rule:evenodd;clip-rule:evenodd;stroke-linecap:round;stroke-linejoin:round;stroke-miterlimit:1.5;">
    <rect id="Artboard1" x="0" y="0" width="2480.32" height="3507.87" style="fill:none;"/>
    <g id="Artboard11" serif:id="Artboard1">
        <path d="M2480.32,0L2480.32,3507.87L0,3507.87L0,0L2480.32,0ZM2362.2,118.11L118.11,118.11L118.11,3389.76L2362.2,3389.76L2362.2,118.11Z" style="fill:rgb(237,30,36);"/>
        <g transform="matrix(1,0,0,1,62.4404,0)">
            <g id="path4" transform="matrix(0.0880108,0,0,0.0880108,213.936,83.0258)">
                <path d="M2140.3,4592.2C2140.3,4592.2 1237.9,4318 1183.8,3336.5C1128.4,2330.5 1806.2,1630.9 2803.9,1562.2C3740.6,1497.7 4223.5,2423.9 4080.9,3028.2C3938.3,3632.4 3426.1,4072.3 2799.9,4006.5C2548.2,3980 2358,3884.8 2224.5,3748.6C2024.3,3544.3 1951.3,3247.1 1991.3,2947.8C2040.8,2576.8 2437.5,2316.5 2808.9,2387.3C3196.1,2461.1 3385.4,2836.1 3205.1,3106.1C3153.6,3183.2 3060,3243 2979.8,3265.9C2862.3,3299.5 2749.4,3290.5 2749.4,3290.5C2739.1,3289.7 2731.2,3280.9 2731.5,3270.6L2734.1,3170.9C2734.4,3160.8 2742.3,3152.6 2752.3,3152C2752.3,3152 2830.1,3147 2911.5,3115.7C2964.3,3095.4 3018.9,3064.1 3053.5,3015C3086.4,2968.1 3083,2904 3051.6,2844C3001.7,2748.4 2881.2,2663.8 2711.6,2665.3C2569.6,2666.5 2460.5,2717.7 2391,2804C2321,2890.8 2291.2,3012.4 2306.3,3152.4C2336.6,3433.3 2646.5,3683 2928.2,3659.7C3381.7,3622.1 3776.3,3373.5 3743.6,2755.6C3727.2,2446.5 3604.4,2220.9 3410.9,2085.4C3216.8,1949.4 2952.3,1904.2 2655.2,1954.4C2356.6,2004.8 2067.6,2200.6 1856.7,2450.4C1646.2,2699.7 1548,2969.8 1562.4,3271.3C1583.6,3714.8 1738.7,4118.8 2195,4491.4C2195,4491.4 2205,4499.1 2201.1,4512.9C2199.3,4519.2 2190.2,4550.5 2190.2,4550.5C2189.4,4553.3 2188,4555.8 2186.1,4558L2160.5,4586.7C2155.5,4592.2 2147.6,4594.5 2140.3,4592.2Z" style="fill:rgb(255,0,0);"/>
            </g>
            <g id="g258" transform="matrix(0.0880108,0,0,0.0880108,213.936,83.0258)">
                <path id="path6" d="M921.8,5346.3C921.8,5346.3 989.8,5065.5 1511.5,4992.3C2033.3,4919 2308.5,5283.3 3272.8,5267.8C4237,5252.3 4922.1,4993.2 5253.4,4997C5584.8,5000.9 5480.6,5123 5441.9,5191.5C5403.2,5260 5451.2,5331.8 5191,5347.3C4930.8,5362.7 4237.5,5620.3 3238.4,5626.7C2239.3,5633.1 1800.1,5139.3 1388.9,5165.4C977.7,5191.5 921.8,5346.3 921.8,5346.3Z" style="fill:rgb(7,77,162);"/>
                <path id="path8" d="M0,4744.1C-0.6,4762 10.7,4782.6 27.2,4785.2C43.7,4787.8 170,4609.8 403.2,4596.5C975.2,4564 1216.8,4762.1 1619.3,4772.3C2021.8,4782.6 2198.7,4677.9 2236.6,4642.7C2274.5,4607.5 2302.9,4500.2 2276.7,4477C2250.5,4453.9 1936.4,4591.5 1479.9,4591.5C1023.4,4591.5 861,4467 500.4,4467C139.8,4467 0.7,4726.2 0,4744.1Z" style="fill:rgb(7,77,162);"/>
                <path id="path10" d="M3703.3,4562.2C3707.7,4541.1 3869.3,4405.9 4219,4405.9C4568.7,4405.9 4617.5,4555.9 5036.7,4524.9C5455.9,4494 5520.5,4394.5 5613.1,4410.5C5705.6,4426.5 5658.6,4479.7 5647.8,4504.4C5636.9,4529.1 5611.5,4573.8 5584.2,4592.7C5556.9,4611.6 5325,4741.2 5012.4,4741.2C4699.8,4741.2 4276.8,4542.8 4020.7,4542.8C3764.6,4542.8 3761.5,4605.8 3730.8,4596.5C3700,4587.3 3698.9,4583.4 3703.3,4562.2Z" style="fill:rgb(7,77,162);"/>
            </g>
            <g id="g253" transform="matrix(0.0880108,0,0,0.0880108,213.936,83.0258)">
                <path id="path12" d="M2544.1,4497.1C2544.1,4497.1 2586.3,4473.5 2623.7,4444.7C2644.9,4428.4 2665.5,4411.4 2671.3,4395.9C2692.7,4338.7 2761.8,4288.8 2819.2,4284.7C2862.5,4281.6 2899.9,4298.3 2948.2,4334.3C2957.3,4306.2 2973.9,4276 2999.3,4243.6C3056.2,4171.1 3159.4,4085.2 3322.2,3984.3C3593.4,3816.4 3965.2,3816.7 3965.2,3816.7C3973.8,3816.7 3981.9,3820.5 3987.3,3827.1L4004.4,3847.9C4010.4,3855.2 4012.4,3864.9 4009.8,3873.9C4007.3,3882.9 4000.4,3890.2 3991.5,3893.2C3991.5,3893.2 3637.2,4013.6 3495.8,4134C3363.7,4246.5 3398.8,4402.7 3431.8,4489C3466.3,4579.1 3594.1,4705.7 3826,4797C3833.9,4800.1 3839.9,4806.5 3842.7,4814.5C3845.4,4822.5 3844.5,4831.2 3840.1,4838.5C3800.8,4903.7 3752.3,4965.1 3708.8,5020.3C3702.9,5027.8 3693.5,5031.9 3684,5031.1C3674.4,5030.3 3665.9,5024.8 3661.2,5016.5C3642.2,4982.3 3596.1,4943.5 3541.2,4904.1C3453.4,4841.1 3342.8,4778.8 3269.9,4737C3154.2,4670.7 3071.3,4638.3 2934.7,4654.2C2803.5,4699.2 2689,4608.8 2663,4579C2660.6,4576.2 2656.2,4574.4 2651.2,4572.3C2642.9,4568.7 2633,4565.6 2622.9,4563C2590.1,4554.5 2555,4550.6 2555,4550.6C2542.6,4549.2 2532.5,4540 2530,4527.8C2527.5,4515.6 2533.3,4503.2 2544.1,4497.1Z"/>
                <path id="path14" d="M3528.8,3950.2C3468.5,3971.4 3408.3,3998.4 3352.4,4033C3197.5,4129 3098.5,4209.9 3044.4,4278.9C3012.5,4319.6 2996.8,4355 2996.8,4386.6C2996.8,4397.7 2990.3,4407.8 2980.3,4412.5C2970.2,4417.2 2958.4,4415.7 2949.8,4408.6C2897,4364.8 2865,4338.8 2823.3,4341.8C2785.1,4344.5 2739.2,4377.9 2725,4416C2718.4,4433.6 2701.1,4454.4 2678.9,4473.7C2665.4,4485.4 2650.2,4496.8 2635.5,4507.1C2642.5,4508.9 2649.4,4510.8 2656,4513C2678.3,4520.3 2696.9,4530.5 2706.3,4541.4C2726.5,4564.6 2816.1,4635.9 2918.5,4599.2C2920.5,4598.5 2922.6,4598 2924.7,4597.7C3077.5,4579.2 3169.7,4613.6 3298.4,4687.3C3334.7,4708.1 3380.3,4734 3427.9,4762.5L3500.1,4670C3436.1,4612.8 3396.2,4556.2 3378.3,4509.6C3339.2,4407.5 3302.4,4223.5 3458.6,4090.5C3485.8,4067.3 3520.6,4044.1 3559.2,4021.7L3528.8,3950.2Z" style="fill:white;"/>
                <path id="path16" d="M2826,4456.4C2821.2,4471.5 2805.1,4479.9 2790.1,4475.1C2775,4470.4 2766.6,4454.3 2771.4,4439.2L2778,4418.3C2782.8,4403.2 2798.9,4394.8 2814,4399.6C2829.1,4404.4 2837.5,4420.4 2832.7,4435.5L2826,4456.4Z" style="fill:rgb(35,24,21);"/>
            </g>
        </g>
        <g transform="matrix(1,0,0,1,63.27,-78.6487)">
            <text x="934.538px" y="462.356px" style="font-family:'PretendardVariable-SemiBold', 'Pretendard Variable';font-size:150px;fill:rgb(35,31,32);">DebConf 202<tspan x="1832.85px " y="462.356px ">4</tspan></text>
            <g transform="matrix(150,0,0,150,2134.98,612.356)">
            </g>
            <text x="934.538px" y="612.356px" style="font-family:'PretendardVariable-SemiBold', 'Pretendard Variable';font-size:150px;fill:rgb(35,31,32);">Design Guidelines</text>
        </g>
        <g transform="matrix(1,0,0,1,-663.346,400.794)">
            <g transform="matrix(108.333,0,0,108.333,1247.79,462.356)">
            </g>
            <text x="934.538px" y="462.356px" style="font-family:'PretendardVariable-SemiBold', 'Pretendard Variable';font-size:108.333px;fill:rgb(35,31,32);">Colors</text>
        </g>
        <g transform="matrix(1,0,0,1,-663.346,1295.13)">
            <g transform="matrix(108.333,0,0,108.333,1201.93,462.356)">
            </g>
            <text x="934.538px" y="462.356px" style="font-family:'PretendardVariable-SemiBold', 'Pretendard Variable';font-size:108.333px;fill:rgb(35,31,32);">F<tspan x="990.662px " y="462.356px ">o</tspan>nt<tspan x="1148.19px " y="462.356px ">s</tspan></text>
        </g>
        <g transform="matrix(1,0,0,1,-663.346,1903.15)">
            <g transform="matrix(108.333,0,0,108.333,1307.25,462.356)">
            </g>
            <text x="934.538px" y="462.356px" style="font-family:'PretendardVariable-SemiBold', 'Pretendard Variable';font-size:108.333px;fill:rgb(35,31,32);">Naming</text>
        </g>
        <g transform="matrix(1,0,0,1,0,-70)">
            <g>
                <g transform="matrix(1,0,0,1,-484.019,596.327)">
                    <g transform="matrix(54.1667,0,0,54.1667,1323.28,462.356)">
                    </g>
                    <text x="934.538px" y="462.356px" style="font-family:'PretendardVariable-SemiBold', 'Pretendard Variable';font-size:54.167px;fill:rgb(35,31,32);">DebConf2<tspan x="1181.28px " y="462.356px ">4</tspan> R<tspan x="1261.34px " y="462.356px ">e</tspan>d</text>
                </g>
                <g transform="matrix(1,0,0,1,-483.195,643.108)">
                    <g transform="matrix(41.6667,0,0,41.6667,1015.23,462.356)">
                        <path d="M0.137,-0.088C0.123,-0.088 0.11,-0.092 0.099,-0.099C0.087,-0.106 0.078,-0.115 0.071,-0.127C0.064,-0.138 0.061,-0.151 0.061,-0.165C0.061,-0.178 0.064,-0.19 0.071,-0.202C0.078,-0.213 0.087,-0.223 0.099,-0.229C0.11,-0.236 0.123,-0.239 0.137,-0.239C0.15,-0.239 0.162,-0.236 0.174,-0.229C0.186,-0.223 0.195,-0.213 0.202,-0.202C0.208,-0.19 0.212,-0.178 0.212,-0.165C0.212,-0.151 0.208,-0.138 0.202,-0.127C0.195,-0.115 0.186,-0.106 0.174,-0.099C0.162,-0.092 0.15,-0.088 0.137,-0.088ZM0.137,-0.467C0.123,-0.467 0.11,-0.471 0.099,-0.478C0.087,-0.485 0.078,-0.494 0.071,-0.506C0.064,-0.517 0.061,-0.53 0.061,-0.543C0.061,-0.557 0.064,-0.569 0.071,-0.581C0.078,-0.592 0.087,-0.601 0.099,-0.608C0.11,-0.615 0.123,-0.618 0.137,-0.618C0.15,-0.618 0.162,-0.615 0.174,-0.608C0.186,-0.601 0.195,-0.592 0.202,-0.581C0.208,-0.569 0.212,-0.557 0.212,-0.543C0.212,-0.53 0.208,-0.517 0.202,-0.506C0.195,-0.494 0.186,-0.485 0.174,-0.478C0.162,-0.471 0.15,-0.467 0.137,-0.467Z" style="fill:rgb(35,31,32);fill-rule:nonzero;"/>
                    </g>
                    <g transform="matrix(41.6667,0,0,41.6667,1015.23,462.356)">
                    </g>
                    <g transform="matrix(41.6667,0,0,41.6667,1376.45,462.356)">
                        <path d="M0.137,-0.088C0.123,-0.088 0.11,-0.092 0.099,-0.099C0.087,-0.106 0.078,-0.115 0.071,-0.127C0.064,-0.138 0.061,-0.151 0.061,-0.165C0.061,-0.178 0.064,-0.19 0.071,-0.202C0.078,-0.213 0.087,-0.223 0.099,-0.229C0.11,-0.236 0.123,-0.239 0.137,-0.239C0.15,-0.239 0.162,-0.236 0.174,-0.229C0.186,-0.223 0.195,-0.213 0.202,-0.202C0.208,-0.19 0.212,-0.178 0.212,-0.165C0.212,-0.151 0.208,-0.138 0.202,-0.127C0.195,-0.115 0.186,-0.106 0.174,-0.099C0.162,-0.092 0.15,-0.088 0.137,-0.088ZM0.137,-0.467C0.123,-0.467 0.11,-0.471 0.099,-0.478C0.087,-0.485 0.078,-0.494 0.071,-0.506C0.064,-0.517 0.061,-0.53 0.061,-0.543C0.061,-0.557 0.064,-0.569 0.071,-0.581C0.078,-0.592 0.087,-0.601 0.099,-0.608C0.11,-0.615 0.123,-0.618 0.137,-0.618C0.15,-0.618 0.162,-0.615 0.174,-0.608C0.186,-0.601 0.195,-0.592 0.202,-0.581C0.208,-0.569 0.212,-0.557 0.212,-0.543C0.212,-0.53 0.208,-0.517 0.202,-0.506C0.195,-0.494 0.186,-0.485 0.174,-0.478C0.162,-0.471 0.15,-0.467 0.137,-0.467Z" style="fill:rgb(35,31,32);fill-rule:nonzero;"/>
                    </g>
                    <g transform="matrix(41.6667,0,0,41.6667,1376.45,462.356)">
                    </g>
                    <g transform="matrix(41.6667,0,0,41.6667,1624.7,462.356)">
                    </g>
                    <text x="934.538px" y="462.356px" style="font-family:'PretendardVariable-SemiBold', 'Pretendard Variable';font-size:41.667px;fill:rgb(35,31,32);">RGB<tspan x="1025.81px " y="462.356px "> </tspan>#ED1E2<tspan x="1179.19px " y="462.356px ">4</tspan>   | CMYK<tspan x="1387.03px " y="462.356px "> </tspan>0/100/100/0</text>
                </g>
                <g transform="matrix(0.782578,0,0,0.782578,60.09,217.266)">
                    <rect x="276.374" y="999.282" width="166.017" height="166.017" style="fill:rgb(237,30,36);"/>
                </g>
            </g>
            <g>
                <g transform="matrix(1,0,0,1,-484.019,757.654)">
                    <g transform="matrix(54.1667,0,0,54.1667,1333.89,462.356)">
                    </g>
                    <text x="934.538px" y="462.356px" style="font-family:'PretendardVariable-SemiBold', 'Pretendard Variable';font-size:54.167px;fill:rgb(35,31,32);">DebConf2<tspan x="1181.28px " y="462.356px ">4</tspan> Blue</text>
                </g>
                <g transform="matrix(1,0,0,1,-483.195,804.435)">
                    <g transform="matrix(41.6667,0,0,41.6667,1015.23,462.356)">
                        <path d="M0.137,-0.088C0.123,-0.088 0.11,-0.092 0.099,-0.099C0.087,-0.106 0.078,-0.115 0.071,-0.127C0.064,-0.138 0.061,-0.151 0.061,-0.165C0.061,-0.178 0.064,-0.19 0.071,-0.202C0.078,-0.213 0.087,-0.223 0.099,-0.229C0.11,-0.236 0.123,-0.239 0.137,-0.239C0.15,-0.239 0.162,-0.236 0.174,-0.229C0.186,-0.223 0.195,-0.213 0.202,-0.202C0.208,-0.19 0.212,-0.178 0.212,-0.165C0.212,-0.151 0.208,-0.138 0.202,-0.127C0.195,-0.115 0.186,-0.106 0.174,-0.099C0.162,-0.092 0.15,-0.088 0.137,-0.088ZM0.137,-0.467C0.123,-0.467 0.11,-0.471 0.099,-0.478C0.087,-0.485 0.078,-0.494 0.071,-0.506C0.064,-0.517 0.061,-0.53 0.061,-0.543C0.061,-0.557 0.064,-0.569 0.071,-0.581C0.078,-0.592 0.087,-0.601 0.099,-0.608C0.11,-0.615 0.123,-0.618 0.137,-0.618C0.15,-0.618 0.162,-0.615 0.174,-0.608C0.186,-0.601 0.195,-0.592 0.202,-0.581C0.208,-0.569 0.212,-0.557 0.212,-0.543C0.212,-0.53 0.208,-0.517 0.202,-0.506C0.195,-0.494 0.186,-0.485 0.174,-0.478C0.162,-0.471 0.15,-0.467 0.137,-0.467Z" style="fill:rgb(35,31,32);fill-rule:nonzero;"/>
                    </g>
                    <g transform="matrix(41.6667,0,0,41.6667,1015.23,462.356)">
                    </g>
                    <g transform="matrix(41.6667,0,0,41.6667,1381.66,462.356)">
                        <path d="M0.137,-0.088C0.123,-0.088 0.11,-0.092 0.099,-0.099C0.087,-0.106 0.078,-0.115 0.071,-0.127C0.064,-0.138 0.061,-0.151 0.061,-0.165C0.061,-0.178 0.064,-0.19 0.071,-0.202C0.078,-0.213 0.087,-0.223 0.099,-0.229C0.11,-0.236 0.123,-0.239 0.137,-0.239C0.15,-0.239 0.162,-0.236 0.174,-0.229C0.186,-0.223 0.195,-0.213 0.202,-0.202C0.208,-0.19 0.212,-0.178 0.212,-0.165C0.212,-0.151 0.208,-0.138 0.202,-0.127C0.195,-0.115 0.186,-0.106 0.174,-0.099C0.162,-0.092 0.15,-0.088 0.137,-0.088ZM0.137,-0.467C0.123,-0.467 0.11,-0.471 0.099,-0.478C0.087,-0.485 0.078,-0.494 0.071,-0.506C0.064,-0.517 0.061,-0.53 0.061,-0.543C0.061,-0.557 0.064,-0.569 0.071,-0.581C0.078,-0.592 0.087,-0.601 0.099,-0.608C0.11,-0.615 0.123,-0.618 0.137,-0.618C0.15,-0.618 0.162,-0.615 0.174,-0.608C0.186,-0.601 0.195,-0.592 0.202,-0.581C0.208,-0.569 0.212,-0.557 0.212,-0.543C0.212,-0.53 0.208,-0.517 0.202,-0.506C0.195,-0.494 0.186,-0.485 0.174,-0.478C0.162,-0.471 0.15,-0.467 0.137,-0.467Z" style="fill:rgb(35,31,32);fill-rule:nonzero;"/>
                    </g>
                    <g transform="matrix(41.6667,0,0,41.6667,1381.66,462.356)">
                    </g>
                    <g transform="matrix(41.6667,0,0,41.6667,1612.09,462.356)">
                    </g>
                    <text x="934.538px" y="462.356px" style="font-family:'PretendardVariable-SemiBold', 'Pretendard Variable';font-size:41.667px;fill:rgb(35,31,32);">RGB<tspan x="1025.81px " y="462.356px "> </tspan>#0<tspan x="1085.25px 1105.88px 1131.88px 1159.05px " y="462.356px 462.356px 462.356px 462.356px ">74DA</tspan>2   | CMYK<tspan x="1392.24px " y="462.356px "> </tspan>100/80/0/0</text>
                </g>
                <g transform="matrix(0.782578,0,0,0.782578,60.09,378.594)">
                    <rect x="276.374" y="999.282" width="166.017" height="166.017" style="fill:rgb(7,77,162);"/>
                </g>
            </g>
            <g>
                <g transform="matrix(1,0,0,1,-484.019,918.981)">
                    <g transform="matrix(54.1667,0,0,54.1667,1359.65,462.356)">
                    </g>
                    <text x="934.538px" y="462.356px" style="font-family:'PretendardVariable-SemiBold', 'Pretendard Variable';font-size:54.167px;fill:rgb(35,31,32);">DebConf2<tspan x="1181.28px " y="462.356px ">4</tspan> Black</text>
                </g>
                <g transform="matrix(1,0,0,1,-483.195,965.762)">
                    <g transform="matrix(41.6667,0,0,41.6667,1015.23,462.356)">
                        <path d="M0.137,-0.088C0.123,-0.088 0.11,-0.092 0.099,-0.099C0.087,-0.106 0.078,-0.115 0.071,-0.127C0.064,-0.138 0.061,-0.151 0.061,-0.165C0.061,-0.178 0.064,-0.19 0.071,-0.202C0.078,-0.213 0.087,-0.223 0.099,-0.229C0.11,-0.236 0.123,-0.239 0.137,-0.239C0.15,-0.239 0.162,-0.236 0.174,-0.229C0.186,-0.223 0.195,-0.213 0.202,-0.202C0.208,-0.19 0.212,-0.178 0.212,-0.165C0.212,-0.151 0.208,-0.138 0.202,-0.127C0.195,-0.115 0.186,-0.106 0.174,-0.099C0.162,-0.092 0.15,-0.088 0.137,-0.088ZM0.137,-0.467C0.123,-0.467 0.11,-0.471 0.099,-0.478C0.087,-0.485 0.078,-0.494 0.071,-0.506C0.064,-0.517 0.061,-0.53 0.061,-0.543C0.061,-0.557 0.064,-0.569 0.071,-0.581C0.078,-0.592 0.087,-0.601 0.099,-0.608C0.11,-0.615 0.123,-0.618 0.137,-0.618C0.15,-0.618 0.162,-0.615 0.174,-0.608C0.186,-0.601 0.195,-0.592 0.202,-0.581C0.208,-0.569 0.212,-0.557 0.212,-0.543C0.212,-0.53 0.208,-0.517 0.202,-0.506C0.195,-0.494 0.186,-0.485 0.174,-0.478C0.162,-0.471 0.15,-0.467 0.137,-0.467Z" style="fill:rgb(35,31,32);fill-rule:nonzero;"/>
                    </g>
                    <g transform="matrix(41.6667,0,0,41.6667,1015.23,462.356)">
                    </g>
                    <g transform="matrix(41.6667,0,0,41.6667,1381.44,462.356)">
                        <path d="M0.137,-0.088C0.123,-0.088 0.11,-0.092 0.099,-0.099C0.087,-0.106 0.078,-0.115 0.071,-0.127C0.064,-0.138 0.061,-0.151 0.061,-0.165C0.061,-0.178 0.064,-0.19 0.071,-0.202C0.078,-0.213 0.087,-0.223 0.099,-0.229C0.11,-0.236 0.123,-0.239 0.137,-0.239C0.15,-0.239 0.162,-0.236 0.174,-0.229C0.186,-0.223 0.195,-0.213 0.202,-0.202C0.208,-0.19 0.212,-0.178 0.212,-0.165C0.212,-0.151 0.208,-0.138 0.202,-0.127C0.195,-0.115 0.186,-0.106 0.174,-0.099C0.162,-0.092 0.15,-0.088 0.137,-0.088ZM0.137,-0.467C0.123,-0.467 0.11,-0.471 0.099,-0.478C0.087,-0.485 0.078,-0.494 0.071,-0.506C0.064,-0.517 0.061,-0.53 0.061,-0.543C0.061,-0.557 0.064,-0.569 0.071,-0.581C0.078,-0.592 0.087,-0.601 0.099,-0.608C0.11,-0.615 0.123,-0.618 0.137,-0.618C0.15,-0.618 0.162,-0.615 0.174,-0.608C0.186,-0.601 0.195,-0.592 0.202,-0.581C0.208,-0.569 0.212,-0.557 0.212,-0.543C0.212,-0.53 0.208,-0.517 0.202,-0.506C0.195,-0.494 0.186,-0.485 0.174,-0.478C0.162,-0.471 0.15,-0.467 0.137,-0.467Z" style="fill:rgb(35,31,32);fill-rule:nonzero;"/>
                    </g>
                    <g transform="matrix(41.6667,0,0,41.6667,1381.44,462.356)">
                    </g>
                    <g transform="matrix(41.6667,0,0,41.6667,1586.6,462.356)">
                    </g>
                    <text x="934.538px" y="462.356px" style="font-family:'PretendardVariable-SemiBold', 'Pretendard Variable';font-size:41.667px;fill:rgb(35,31,32);">RGB<tspan x="1025.81px " y="462.356px "> </tspan>#000000   | CMYK<tspan x="1392.02px " y="462.356px "> </tspan>0/0/0/100</text>
                </g>
                <g transform="matrix(0.782578,0,0,0.782578,60.09,539.921)">
                    <rect x="276.374" y="999.282" width="166.017" height="166.017" style="fill:rgb(35,31,32);"/>
                </g>
            </g>
            <g transform="matrix(1,0,0,1,1.13687e-13,-11.2456)">
                <g transform="matrix(1,0,0,1,-484.019,1091.55)">
                    <g transform="matrix(54.1667,0,0,54.1667,1368.56,462.356)">
                    </g>
                    <text x="934.538px" y="462.356px" style="font-family:'PretendardVariable-SemiBold', 'Pretendard Variable';font-size:54.167px;fill:rgb(35,31,32);">DebConf2<tspan x="1181.28px " y="462.356px ">4</tspan> Whit<tspan x="1338.62px " y="462.356px ">e</tspan></text>
                </g>
                <g transform="matrix(1,0,0,1,-483.195,1138.34)">
                    <g transform="matrix(41.6667,0,0,41.6667,1015.23,462.356)">
                        <path d="M0.137,-0.088C0.123,-0.088 0.11,-0.092 0.099,-0.099C0.087,-0.106 0.078,-0.115 0.071,-0.127C0.064,-0.138 0.061,-0.151 0.061,-0.165C0.061,-0.178 0.064,-0.19 0.071,-0.202C0.078,-0.213 0.087,-0.223 0.099,-0.229C0.11,-0.236 0.123,-0.239 0.137,-0.239C0.15,-0.239 0.162,-0.236 0.174,-0.229C0.186,-0.223 0.195,-0.213 0.202,-0.202C0.208,-0.19 0.212,-0.178 0.212,-0.165C0.212,-0.151 0.208,-0.138 0.202,-0.127C0.195,-0.115 0.186,-0.106 0.174,-0.099C0.162,-0.092 0.15,-0.088 0.137,-0.088ZM0.137,-0.467C0.123,-0.467 0.11,-0.471 0.099,-0.478C0.087,-0.485 0.078,-0.494 0.071,-0.506C0.064,-0.517 0.061,-0.53 0.061,-0.543C0.061,-0.557 0.064,-0.569 0.071,-0.581C0.078,-0.592 0.087,-0.601 0.099,-0.608C0.11,-0.615 0.123,-0.618 0.137,-0.618C0.15,-0.618 0.162,-0.615 0.174,-0.608C0.186,-0.601 0.195,-0.592 0.202,-0.581C0.208,-0.569 0.212,-0.557 0.212,-0.543C0.212,-0.53 0.208,-0.517 0.202,-0.506C0.195,-0.494 0.186,-0.485 0.174,-0.478C0.162,-0.471 0.15,-0.467 0.137,-0.467Z" style="fill:rgb(35,31,32);fill-rule:nonzero;"/>
                    </g>
                    <g transform="matrix(41.6667,0,0,41.6667,1015.23,462.356)">
                    </g>
                    <g transform="matrix(41.6667,0,0,41.6667,1371.67,462.356)">
                        <path d="M0.137,-0.088C0.123,-0.088 0.11,-0.092 0.099,-0.099C0.087,-0.106 0.078,-0.115 0.071,-0.127C0.064,-0.138 0.061,-0.151 0.061,-0.165C0.061,-0.178 0.064,-0.19 0.071,-0.202C0.078,-0.213 0.087,-0.223 0.099,-0.229C0.11,-0.236 0.123,-0.239 0.137,-0.239C0.15,-0.239 0.162,-0.236 0.174,-0.229C0.186,-0.223 0.195,-0.213 0.202,-0.202C0.208,-0.19 0.212,-0.178 0.212,-0.165C0.212,-0.151 0.208,-0.138 0.202,-0.127C0.195,-0.115 0.186,-0.106 0.174,-0.099C0.162,-0.092 0.15,-0.088 0.137,-0.088ZM0.137,-0.467C0.123,-0.467 0.11,-0.471 0.099,-0.478C0.087,-0.485 0.078,-0.494 0.071,-0.506C0.064,-0.517 0.061,-0.53 0.061,-0.543C0.061,-0.557 0.064,-0.569 0.071,-0.581C0.078,-0.592 0.087,-0.601 0.099,-0.608C0.11,-0.615 0.123,-0.618 0.137,-0.618C0.15,-0.618 0.162,-0.615 0.174,-0.608C0.186,-0.601 0.195,-0.592 0.202,-0.581C0.208,-0.569 0.212,-0.557 0.212,-0.543C0.212,-0.53 0.208,-0.517 0.202,-0.506C0.195,-0.494 0.186,-0.485 0.174,-0.478C0.162,-0.471 0.15,-0.467 0.137,-0.467Z" style="fill:rgb(35,31,32);fill-rule:nonzero;"/>
                    </g>
                    <g transform="matrix(41.6667,0,0,41.6667,1371.67,462.356)">
                    </g>
                    <g transform="matrix(41.6667,0,0,41.6667,1533.74,462.356)">
                    </g>
                    <text x="934.538px" y="462.356px" style="font-family:'PretendardVariable-SemiBold', 'Pretendard Variable';font-size:41.667px;fill:rgb(35,31,32);">RGB<tspan x="1025.81px " y="462.356px "> </tspan>#FFFFFF   | CMYK<tspan x="1382.25px " y="462.356px "> </tspan>0/0/0/0</text>
                </g>
                <g transform="matrix(0.782578,0,0,0.782578,60.09,712.494)">
                    <rect x="276.374" y="999.282" width="166.017" height="166.017" style="fill:white;"/>
                </g>
            </g>
        </g>
        <g transform="matrix(1.16828,0,0,1.16828,-388.2,-247.651)">
            <path d="M1660.96,1017.4C1800.45,1017.4 1913.7,1130.65 1913.7,1270.14C1913.7,1409.63 1800.45,1522.88 1660.96,1522.88C1521.47,1522.88 1408.22,1409.63 1408.22,1270.14C1408.22,1130.65 1521.47,1017.4 1660.96,1017.4ZM1660.96,1118.61C1577.33,1118.61 1509.43,1186.51 1509.43,1270.14C1509.43,1353.77 1577.33,1421.67 1660.96,1421.67C1744.59,1421.67 1812.49,1353.77 1812.49,1270.14C1812.49,1186.51 1744.59,1118.61 1660.96,1118.61Z" style="fill:white;"/>
            <clipPath id="_clip1">
                <path d="M1660.96,1017.4C1800.45,1017.4 1913.7,1130.65 1913.7,1270.14C1913.7,1409.63 1800.45,1522.88 1660.96,1522.88C1521.47,1522.88 1408.22,1409.63 1408.22,1270.14C1408.22,1130.65 1521.47,1017.4 1660.96,1017.4ZM1660.96,1118.61C1577.33,1118.61 1509.43,1186.51 1509.43,1270.14C1509.43,1353.77 1577.33,1421.67 1660.96,1421.67C1744.59,1421.67 1812.49,1353.77 1812.49,1270.14C1812.49,1186.51 1744.59,1118.61 1660.96,1118.61Z"/>
            </clipPath>
            <g clip-path="url(#_clip1)">
                <g transform="matrix(0.855957,0,0,0.855957,79.0673,152.061)">
                    <rect x="1848.1" y="956.364" width="373.1" height="762.175" style="fill:rgb(237,30,36);"/>
                </g>
                <g transform="matrix(0.922991,0,0,0.922991,22.0394,124.188)">
                    <rect x="1377.04" y="1241.57" width="398.625" height="398.625" style="fill:rgb(7,77,162);"/>
                </g>
                <g transform="matrix(0.855957,0,0,0.855957,79.0673,152.061)">
                    <path d="M1523.49,1306.23L1848.1,1306.23L1580.27,1038.4L1539.16,1118.51L1531.9,1200.24L1523.49,1306.23Z" style="fill:rgb(35,31,32);"/>
                </g>
            </g>
        </g>
        <g transform="matrix(1,0,0,1,184.979,-174.565)">
            <text x="1725.53px" y="1269.31px" style="font-family:'PretendardVariable-SemiBold', 'Pretendard Variable';font-size:41.667px;fill:rgb(35,31,32);">DebConf2<tspan x="1915.33px " y="1269.31px ">4</tspan> R<tspan x="1976.91px " y="1269.31px ">e</tspan>d</text>
            <g transform="matrix(41.6667,0,0,41.6667,1811.14,1310.98)">
            </g>
            <text x="1725.53px" y="1310.98px" style="font-family:'PretendardVariable-SemiBold', 'Pretendard Variable';font-size:41.667px;fill:rgb(35,31,32);">50%</text>
        </g>
        <g transform="matrix(1,0,0,1,189.268,-84.1184)">
            <text x="1721.45px" y="1269.31px" style="font-family:'PretendardVariable-SemiBold', 'Pretendard Variable';font-size:41.667px;fill:rgb(35,31,32);">DebConf2<tspan x="1911.25px " y="1269.31px ">4</tspan> Blue</text>
            <g transform="matrix(41.6667,0,0,41.6667,1806.69,1310.98)">
            </g>
            <text x="1721.45px" y="1310.98px" style="font-family:'PretendardVariable-SemiBold', 'Pretendard Variable';font-size:41.667px;fill:rgb(35,31,32);">25%</text>
        </g>
        <g transform="matrix(1,0,0,1,199.479,6.32773)">
            <text x="1711.54px" y="1269.31px" style="font-family:'PretendardVariable-SemiBold', 'Pretendard Variable';font-size:41.667px;fill:rgb(35,31,32);">DebConf2<tspan x="1901.34px " y="1269.31px ">4</tspan> Black</text>
            <g transform="matrix(41.6667,0,0,41.6667,1791.01,1310.98)">
            </g>
            <text x="1711.54px" y="1310.98px" style="font-family:'PretendardVariable-SemiBold', 'Pretendard Variable';font-size:41.667px;fill:rgb(35,31,32);">18%</text>
        </g>
        <g transform="matrix(1,0,0,1,202.907,96.7942)">
            <text x="1708.11px" y="1269.31px" style="font-family:'PretendardVariable-SemiBold', 'Pretendard Variable';font-size:41.667px;fill:rgb(35,31,32);">DebConf2<tspan x="1897.91px " y="1269.31px ">4</tspan> Whit<tspan x="2018.94px " y="1269.31px ">e</tspan></text>
            <g transform="matrix(41.6667,0,0,41.6667,1785.3,1310.98)">
            </g>
            <text x="1708.11px" y="1310.98px" style="font-family:'PretendardVariable-SemiBold', 'Pretendard Variable';font-size:41.667px;fill:rgb(35,31,32);">17%</text>
        </g>
        <g transform="matrix(1,0,0,1,-56.3889,-107.863)">
            <g transform="matrix(70.8333,0,0,70.8333,882.341,2014.45)">
            </g>
            <text x="328.091px" y="2014.45px" style="font-family:'PretendardVariable-SemiBold', 'Pretendard Variable';font-size:70.833px;fill:rgb(35,31,32);">F<tspan x="364.787px " y="2014.45px ">o</tspan>r English &amp; CJK</text>
        </g>
        <g transform="matrix(1,0,0,1,-56.3889,500.159)">
            <g transform="matrix(70.8333,0,0,70.8333,1634.7,2014.45)">
            </g>
            <text x="328.091px" y="2014.45px" style="font-family:'PretendardVariable-SemiBold', 'Pretendard Variable';font-size:70.833px;fill:rgb(35,31,32);">The naming of t<tspan x="824.927px " y="2014.45px ">h</tspan>e DebConf2<tspan x="1244.36px " y="2014.45px ">4</tspan> should be:</text>
        </g>
        <g transform="matrix(1,0,0,1,-50.8854,771.414)">
            <g transform="matrix(70.8333,0,0,70.8333,874.732,2014.45)">
            </g>
            <text x="328.091px" y="2014.45px" style="font-family:'PretendardVariable-SemiBold', 'Pretendard Variable';font-size:70.833px;fill:rgb(35,31,32);">W<tspan x="390.554px 414.108px " y="2014.45px 2014.45px ">ro</tspan>ng Examples:</text>
        </g>
        <g transform="matrix(1,0,0,1,922.036,-107.863)">
            <g transform="matrix(70.8333,0,0,70.8333,1029.55,2014.45)">
            </g>
            <text x="328.091px" y="2014.45px" style="font-family:'NotoSansKR-Medium', 'Noto Sans KR', sans-serif;font-weight:500;font-size:70.833px;fill:rgb(35,31,32);">F<tspan x="366.978px " y="2014.45px ">o</tspan>r Other Languag<tspan x="955.533px " y="2014.45px ">e</tspan>s</text>
        </g>
        <g transform="matrix(1,0,0,1,-57.2135,0.711096)">
            <g transform="matrix(83.3333,0,0,83.3333,743.333,2014.45)">
            </g>
            <text x="328.091px" y="2014.45px" style="font-family:'PretendardVariable-SemiBold', 'Pretendard Variable';font-size:83.333px;fill:rgb(35,31,32);">Pr<tspan x="406.175px 452.236px 480.109px " y="2014.45px 2014.45px 2014.45px ">ete</tspan>ndar<tspan x="694.098px " y="2014.45px ">d</tspan></text>
        </g>
        <g transform="matrix(1,0,0,1,-57.2135,608.733)">
            <g transform="matrix(83.3333,0,0,83.3333,1922.04,2014.45)">
            </g>
            <text x="328.091px" y="2014.45px" style="font-family:'PretendardVariable-SemiBold', 'Pretendard Variable';font-size:83.333px;fill:rgb(35,31,32);">(ENG)DebConf2<tspan x="930.671px " y="2014.45px ">4</tspan>                (K<tspan x="1394.66px " y="2014.45px ">O</tspan>R)데브컨프2<tspan x="1870.04px " y="2014.45px ">4</tspan></text>
        </g>
        <g transform="matrix(1,0,0,1,-52.945,879.989)">
            <text x="328.091px" y="2014.45px" style="font-family:'PretendardVariable-SemiBold', 'Pretendard Variable';font-size:83.333px;fill:rgb(35,31,32);">debconf2<tspan x="686.123px " y="2014.45px ">4</tspan></text>
            <text x="328.091px" y="2097.78px" style="font-family:'PretendardVariable-SemiBold', 'Pretendard Variable';font-size:83.333px;fill:rgb(35,31,32);">Debian Conf 202<tspan x="957.201px " y="2097.78px ">4</tspan></text>
            <text x="328.091px" y="2181.12px" style="font-family:'PretendardVariable-SemiBold', 'Pretendard Variable';font-size:83.333px;fill:rgb(35,31,32);">DEBCONF2<tspan x="756.273px " y="2181.12px ">4</tspan></text>
            <g transform="matrix(83.3333,0,0,83.3333,858.242,2264.45)">
            </g>
            <text x="328.091px" y="2264.45px" style="font-family:'PretendardVariable-SemiBold', 'Pretendard Variable';font-size:83.333px;fill:rgb(35,31,32);">DebConf202<tspan x="806.24px " y="2264.45px ">4</tspan></text>
        </g>
        <g transform="matrix(1,0,0,1,926.469,879.989)">
            <text x="328.091px" y="2014.45px" style="font-family:'PretendardVariable-SemiBold', 'Pretendard Variable';font-size:83.333px;fill:rgb(35,31,32);">대브컨프2<tspan x="663.825px " y="2014.45px ">4</tspan></text>
            <text x="328.091px" y="2097.78px" style="font-family:'PretendardVariable-SemiBold', 'Pretendard Variable';font-size:83.333px;fill:rgb(35,31,32);">데비안 컨퍼런스 202<tspan x="1020.27px " y="2097.78px ">4</tspan></text>
            <text x="328.091px" y="2181.12px" style="font-family:'PretendardVariable-SemiBold', 'Pretendard Variable';font-size:83.333px;fill:rgb(35,31,32);">데브컨퍼2<tspan x="663.825px " y="2181.12px ">4</tspan></text>
            <g transform="matrix(83.3333,0,0,83.3333,715.827,2264.45)">
            </g>
            <text x="328.091px" y="2264.45px" style="font-family:'PretendardVariable-SemiBold', 'Pretendard Variable';font-size:83.333px;fill:rgb(35,31,32);">데브콘프2<tspan x="663.825px " y="2264.45px ">4</tspan></text>
        </g>
        <g transform="matrix(1,0,0,1,921.211,0.711096)">
            <g transform="matrix(83.3333,0,0,83.3333,1013.76,2014.45)">
            </g>
            <text x="328.091px" y="2014.45px" style="font-family:'NotoSansKR-Medium', 'Noto Sans KR', sans-serif;font-weight:500;font-size:83.333px;fill:rgb(35,31,32);">No<tspan x="438.508px 470.091px " y="2014.45px 2014.45px ">to</tspan> Sans F<tspan x="793.258px " y="2014.45px ">a</tspan>mily</text>
        </g>
    </g>
    <g id="Artboard2" transform="matrix(1,0,0,1,-0.648294,0)">
        <rect x="2688.65" y="0" width="2480.32" height="3507.87" style="fill:none;"/>
        <g transform="matrix(1,0,0,1,0,490.323)">
            <g transform="matrix(1,0,0,1,-1.1357,1.78399)">
                <rect x="2966.01" y="1946.84" width="597.469" height="482.048" style="fill:rgb(244,236,69);"/>
            </g>
            <g transform="matrix(0.708052,0,0,0.648265,948.572,775.046)">
                <rect x="2966.01" y="1946.84" width="597.469" height="482.048" style="fill:white;"/>
            </g>
            <g id="path41" serif:id="path4" transform="matrix(0.0591593,0,0,0.0591593,3092.49,1980.81)">
                <path d="M2140.3,4592.2C2140.3,4592.2 1237.9,4318 1183.8,3336.5C1128.4,2330.5 1806.2,1630.9 2803.9,1562.2C3740.6,1497.7 4223.5,2423.9 4080.9,3028.2C3938.3,3632.4 3426.1,4072.3 2799.9,4006.5C2548.2,3980 2358,3884.8 2224.5,3748.6C2024.3,3544.3 1951.3,3247.1 1991.3,2947.8C2040.8,2576.8 2437.5,2316.5 2808.9,2387.3C3196.1,2461.1 3385.4,2836.1 3205.1,3106.1C3153.6,3183.2 3060,3243 2979.8,3265.9C2862.3,3299.5 2749.4,3290.5 2749.4,3290.5C2739.1,3289.7 2731.2,3280.9 2731.5,3270.6L2734.1,3170.9C2734.4,3160.8 2742.3,3152.6 2752.3,3152C2752.3,3152 2830.1,3147 2911.5,3115.7C2964.3,3095.4 3018.9,3064.1 3053.5,3015C3086.4,2968.1 3083,2904 3051.6,2844C3001.7,2748.4 2881.2,2663.8 2711.6,2665.3C2569.6,2666.5 2460.5,2717.7 2391,2804C2321,2890.8 2291.2,3012.4 2306.3,3152.4C2336.6,3433.3 2646.5,3683 2928.2,3659.7C3381.7,3622.1 3776.3,3373.5 3743.6,2755.6C3727.2,2446.5 3604.4,2220.9 3410.9,2085.4C3216.8,1949.4 2952.3,1904.2 2655.2,1954.4C2356.6,2004.8 2067.6,2200.6 1856.7,2450.4C1646.2,2699.7 1548,2969.8 1562.4,3271.3C1583.6,3714.8 1738.7,4118.8 2195,4491.4C2195,4491.4 2205,4499.1 2201.1,4512.9C2199.3,4519.2 2190.2,4550.5 2190.2,4550.5C2189.4,4553.3 2188,4555.8 2186.1,4558L2160.5,4586.7C2155.5,4592.2 2147.6,4594.5 2140.3,4592.2Z" style="fill:rgb(255,0,0);"/>
            </g>
            <g id="g2581" serif:id="g258" transform="matrix(0.0591593,0,0,0.0591593,3092.49,1980.81)">
                <path id="path61" serif:id="path6" d="M921.8,5346.3C921.8,5346.3 989.8,5065.5 1511.5,4992.3C2033.3,4919 2308.5,5283.3 3272.8,5267.8C4237,5252.3 4922.1,4993.2 5253.4,4997C5584.8,5000.9 5480.6,5123 5441.9,5191.5C5403.2,5260 5451.2,5331.8 5191,5347.3C4930.8,5362.7 4237.5,5620.3 3238.4,5626.7C2239.3,5633.1 1800.1,5139.3 1388.9,5165.4C977.7,5191.5 921.8,5346.3 921.8,5346.3Z" style="fill:rgb(7,77,162);"/>
                <path id="path81" serif:id="path8" d="M0,4744.1C-0.6,4762 10.7,4782.6 27.2,4785.2C43.7,4787.8 170,4609.8 403.2,4596.5C975.2,4564 1216.8,4762.1 1619.3,4772.3C2021.8,4782.6 2198.7,4677.9 2236.6,4642.7C2274.5,4607.5 2302.9,4500.2 2276.7,4477C2250.5,4453.9 1936.4,4591.5 1479.9,4591.5C1023.4,4591.5 861,4467 500.4,4467C139.8,4467 0.7,4726.2 0,4744.1Z" style="fill:rgb(7,77,162);"/>
                <path id="path101" serif:id="path10" d="M3703.3,4562.2C3707.7,4541.1 3869.3,4405.9 4219,4405.9C4568.7,4405.9 4617.5,4555.9 5036.7,4524.9C5455.9,4494 5520.5,4394.5 5613.1,4410.5C5705.6,4426.5 5658.6,4479.7 5647.8,4504.4C5636.9,4529.1 5611.5,4573.8 5584.2,4592.7C5556.9,4611.6 5325,4741.2 5012.4,4741.2C4699.8,4741.2 4276.8,4542.8 4020.7,4542.8C3764.6,4542.8 3761.5,4605.8 3730.8,4596.5C3700,4587.3 3698.9,4583.4 3703.3,4562.2Z" style="fill:rgb(7,77,162);"/>
            </g>
            <g id="g2531" serif:id="g253" transform="matrix(0.0591593,0,0,0.0591593,3092.49,1980.81)">
                <path id="path121" serif:id="path12" d="M2544.1,4497.1C2544.1,4497.1 2586.3,4473.5 2623.7,4444.7C2644.9,4428.4 2665.5,4411.4 2671.3,4395.9C2692.7,4338.7 2761.8,4288.8 2819.2,4284.7C2862.5,4281.6 2899.9,4298.3 2948.2,4334.3C2957.3,4306.2 2973.9,4276 2999.3,4243.6C3056.2,4171.1 3159.4,4085.2 3322.2,3984.3C3593.4,3816.4 3965.2,3816.7 3965.2,3816.7C3973.8,3816.7 3981.9,3820.5 3987.3,3827.1L4004.4,3847.9C4010.4,3855.2 4012.4,3864.9 4009.8,3873.9C4007.3,3882.9 4000.4,3890.2 3991.5,3893.2C3991.5,3893.2 3637.2,4013.6 3495.8,4134C3363.7,4246.5 3398.8,4402.7 3431.8,4489C3466.3,4579.1 3594.1,4705.7 3826,4797C3833.9,4800.1 3839.9,4806.5 3842.7,4814.5C3845.4,4822.5 3844.5,4831.2 3840.1,4838.5C3800.8,4903.7 3752.3,4965.1 3708.8,5020.3C3702.9,5027.8 3693.5,5031.9 3684,5031.1C3674.4,5030.3 3665.9,5024.8 3661.2,5016.5C3642.2,4982.3 3596.1,4943.5 3541.2,4904.1C3453.4,4841.1 3342.8,4778.8 3269.9,4737C3154.2,4670.7 3071.3,4638.3 2934.7,4654.2C2803.5,4699.2 2689,4608.8 2663,4579C2660.6,4576.2 2656.2,4574.4 2651.2,4572.3C2642.9,4568.7 2633,4565.6 2622.9,4563C2590.1,4554.5 2555,4550.6 2555,4550.6C2542.6,4549.2 2532.5,4540 2530,4527.8C2527.5,4515.6 2533.3,4503.2 2544.1,4497.1Z"/>
                <path id="path141" serif:id="path14" d="M3528.8,3950.2C3468.5,3971.4 3408.3,3998.4 3352.4,4033C3197.5,4129 3098.5,4209.9 3044.4,4278.9C3012.5,4319.6 2996.8,4355 2996.8,4386.6C2996.8,4397.7 2990.3,4407.8 2980.3,4412.5C2970.2,4417.2 2958.4,4415.7 2949.8,4408.6C2897,4364.8 2865,4338.8 2823.3,4341.8C2785.1,4344.5 2739.2,4377.9 2725,4416C2718.4,4433.6 2701.1,4454.4 2678.9,4473.7C2665.4,4485.4 2650.2,4496.8 2635.5,4507.1C2642.5,4508.9 2649.4,4510.8 2656,4513C2678.3,4520.3 2696.9,4530.5 2706.3,4541.4C2726.5,4564.6 2816.1,4635.9 2918.5,4599.2C2920.5,4598.5 2922.6,4598 2924.7,4597.7C3077.5,4579.2 3169.7,4613.6 3298.4,4687.3C3334.7,4708.1 3380.3,4734 3427.9,4762.5L3500.1,4670C3436.1,4612.8 3396.2,4556.2 3378.3,4509.6C3339.2,4407.5 3302.4,4223.5 3458.6,4090.5C3485.8,4067.3 3520.6,4044.1 3559.2,4021.7L3528.8,3950.2Z" style="fill:white;"/>
                <path id="path161" serif:id="path16" d="M2826,4456.4C2821.2,4471.5 2805.1,4479.9 2790.1,4475.1C2775,4470.4 2766.6,4454.3 2771.4,4439.2L2778,4418.3C2782.8,4403.2 2798.9,4394.8 2814,4399.6C2829.1,4404.4 2837.5,4420.4 2832.7,4435.5L2826,4456.4Z" style="fill:rgb(35,24,21);"/>
            </g>
            <g id="g2532" serif:id="g253" transform="matrix(0.0591593,0,0,0.0591593,2855.2,2087.89)">
                <path id="path122" serif:id="path12" d="M2544.1,4497.1C2544.1,4497.1 2586.3,4473.5 2623.7,4444.7C2644.9,4428.4 2665.5,4411.4 2671.3,4395.9C2692.7,4338.7 2761.8,4288.8 2819.2,4284.7C2862.5,4281.6 2899.9,4298.3 2948.2,4334.3C2957.3,4306.2 2973.9,4276 2999.3,4243.6C3056.2,4171.1 3159.4,4085.2 3322.2,3984.3C3593.4,3816.4 3965.2,3816.7 3965.2,3816.7C3973.8,3816.7 3981.9,3820.5 3987.3,3827.1L4004.4,3847.9C4010.4,3855.2 4012.4,3864.9 4009.8,3873.9C4007.3,3882.9 4000.4,3890.2 3991.5,3893.2C3991.5,3893.2 3637.2,4013.6 3495.8,4134C3363.7,4246.5 3398.8,4402.7 3431.8,4489C3466.3,4579.1 3594.1,4705.7 3826,4797C3833.9,4800.1 3839.9,4806.5 3842.7,4814.5C3845.4,4822.5 3844.5,4831.2 3840.1,4838.5C3800.8,4903.7 3752.3,4965.1 3708.8,5020.3C3702.9,5027.8 3693.5,5031.9 3684,5031.1C3674.4,5030.3 3665.9,5024.8 3661.2,5016.5C3642.2,4982.3 3596.1,4943.5 3541.2,4904.1C3453.4,4841.1 3342.8,4778.8 3269.9,4737C3154.2,4670.7 3071.3,4638.3 2934.7,4654.2C2803.5,4699.2 2689,4608.8 2663,4579C2660.6,4576.2 2656.2,4574.4 2651.2,4572.3C2642.9,4568.7 2633,4565.6 2622.9,4563C2590.1,4554.5 2555,4550.6 2555,4550.6C2542.6,4549.2 2532.5,4540 2530,4527.8C2527.5,4515.6 2533.3,4503.2 2544.1,4497.1Z"/>
                <path id="path142" serif:id="path14" d="M3528.8,3950.2C3468.5,3971.4 3408.3,3998.4 3352.4,4033C3197.5,4129 3098.5,4209.9 3044.4,4278.9C3012.5,4319.6 2996.8,4355 2996.8,4386.6C2996.8,4397.7 2990.3,4407.8 2980.3,4412.5C2970.2,4417.2 2958.4,4415.7 2949.8,4408.6C2897,4364.8 2865,4338.8 2823.3,4341.8C2785.1,4344.5 2739.2,4377.9 2725,4416C2718.4,4433.6 2701.1,4454.4 2678.9,4473.7C2665.4,4485.4 2650.2,4496.8 2635.5,4507.1C2642.5,4508.9 2649.4,4510.8 2656,4513C2678.3,4520.3 2696.9,4530.5 2706.3,4541.4C2726.5,4564.6 2816.1,4635.9 2918.5,4599.2C2920.5,4598.5 2922.6,4598 2924.7,4597.7C3077.5,4579.2 3169.7,4613.6 3298.4,4687.3C3334.7,4708.1 3380.3,4734 3427.9,4762.5L3500.1,4670C3436.1,4612.8 3396.2,4556.2 3378.3,4509.6C3339.2,4407.5 3302.4,4223.5 3458.6,4090.5C3485.8,4067.3 3520.6,4044.1 3559.2,4021.7L3528.8,3950.2Z" style="fill:white;"/>
                <path id="path162" serif:id="path16" d="M2826,4456.4C2821.2,4471.5 2805.1,4479.9 2790.1,4475.1C2775,4470.4 2766.6,4454.3 2771.4,4439.2L2778,4418.3C2782.8,4403.2 2798.9,4394.8 2814,4399.6C2829.1,4404.4 2837.5,4420.4 2832.7,4435.5L2826,4456.4Z" style="fill:rgb(35,24,21);"/>
            </g>
            <g id="g2533" serif:id="g253" transform="matrix(0.0591593,0,0,0.0591593,3278.24,1775.39)">
                <path id="path123" serif:id="path12" d="M2544.1,4497.1C2544.1,4497.1 2586.3,4473.5 2623.7,4444.7C2644.9,4428.4 2665.5,4411.4 2671.3,4395.9C2692.7,4338.7 2761.8,4288.8 2819.2,4284.7C2862.5,4281.6 2899.9,4298.3 2948.2,4334.3C2957.3,4306.2 2973.9,4276 2999.3,4243.6C3056.2,4171.1 3159.4,4085.2 3322.2,3984.3C3593.4,3816.4 3965.2,3816.7 3965.2,3816.7C3973.8,3816.7 3981.9,3820.5 3987.3,3827.1L4004.4,3847.9C4010.4,3855.2 4012.4,3864.9 4009.8,3873.9C4007.3,3882.9 4000.4,3890.2 3991.5,3893.2C3991.5,3893.2 3637.2,4013.6 3495.8,4134C3363.7,4246.5 3398.8,4402.7 3431.8,4489C3466.3,4579.1 3594.1,4705.7 3826,4797C3833.9,4800.1 3839.9,4806.5 3842.7,4814.5C3845.4,4822.5 3844.5,4831.2 3840.1,4838.5C3800.8,4903.7 3752.3,4965.1 3708.8,5020.3C3702.9,5027.8 3693.5,5031.9 3684,5031.1C3674.4,5030.3 3665.9,5024.8 3661.2,5016.5C3642.2,4982.3 3596.1,4943.5 3541.2,4904.1C3453.4,4841.1 3342.8,4778.8 3269.9,4737C3154.2,4670.7 3071.3,4638.3 2934.7,4654.2C2803.5,4699.2 2689,4608.8 2663,4579C2660.6,4576.2 2656.2,4574.4 2651.2,4572.3C2642.9,4568.7 2633,4565.6 2622.9,4563C2590.1,4554.5 2555,4550.6 2555,4550.6C2542.6,4549.2 2532.5,4540 2530,4527.8C2527.5,4515.6 2533.3,4503.2 2544.1,4497.1Z"/>
                <path id="path143" serif:id="path14" d="M3528.8,3950.2C3468.5,3971.4 3408.3,3998.4 3352.4,4033C3197.5,4129 3098.5,4209.9 3044.4,4278.9C3012.5,4319.6 2996.8,4355 2996.8,4386.6C2996.8,4397.7 2990.3,4407.8 2980.3,4412.5C2970.2,4417.2 2958.4,4415.7 2949.8,4408.6C2897,4364.8 2865,4338.8 2823.3,4341.8C2785.1,4344.5 2739.2,4377.9 2725,4416C2718.4,4433.6 2701.1,4454.4 2678.9,4473.7C2665.4,4485.4 2650.2,4496.8 2635.5,4507.1C2642.5,4508.9 2649.4,4510.8 2656,4513C2678.3,4520.3 2696.9,4530.5 2706.3,4541.4C2726.5,4564.6 2816.1,4635.9 2918.5,4599.2C2920.5,4598.5 2922.6,4598 2924.7,4597.7C3077.5,4579.2 3169.7,4613.6 3298.4,4687.3C3334.7,4708.1 3380.3,4734 3427.9,4762.5L3500.1,4670C3436.1,4612.8 3396.2,4556.2 3378.3,4509.6C3339.2,4407.5 3302.4,4223.5 3458.6,4090.5C3485.8,4067.3 3520.6,4044.1 3559.2,4021.7L3528.8,3950.2Z" style="fill:white;"/>
                <path id="path163" serif:id="path16" d="M2826,4456.4C2821.2,4471.5 2805.1,4479.9 2790.1,4475.1C2775,4470.4 2766.6,4454.3 2771.4,4439.2L2778,4418.3C2782.8,4403.2 2798.9,4394.8 2814,4399.6C2829.1,4404.4 2837.5,4420.4 2832.7,4435.5L2826,4456.4Z" style="fill:rgb(35,24,21);"/>
            </g>
            <g transform="matrix(1,0,0,1,24.1555,38.1596)">
                <path d="M3068.33,2347.37L3068.33,1963.03" style="fill:none;stroke:rgb(35,31,32);stroke-width:1px;"/>
            </g>
            <g transform="matrix(1,0,0,1,359.55,38.1596)">
                <path d="M3068.33,2347.37L3068.33,1963.03" style="fill:none;stroke:rgb(35,31,32);stroke-width:1px;"/>
            </g>
            <g transform="matrix(1,0,0,1,403.372,38.1596)">
                <path d="M3068.33,2347.37L3068.33,1963.03" style="fill:none;stroke:rgb(35,31,32);stroke-width:1px;"/>
            </g>
            <g transform="matrix(1,0,0,1,-19.6665,38.1596)">
                <path d="M3068.33,2347.37L3068.33,1963.03" style="fill:none;stroke:rgb(35,31,32);stroke-width:1px;"/>
            </g>
            <g transform="matrix(1.07835e-15,1,-1.29505,8.32667e-16,6051.27,-995.292)">
                <path d="M3068.33,2347.37L3068.33,1963.03" style="fill:none;stroke:rgb(35,31,32);stroke-width:0.86px;"/>
            </g>
            <g transform="matrix(1.07835e-15,1,-1.29505,8.32667e-16,6051.27,-1031.22)">
                <path d="M3068.33,2347.37L3068.33,1963.03" style="fill:none;stroke:rgb(35,31,32);stroke-width:0.86px;"/>
            </g>
            <g transform="matrix(1.07835e-15,1,-1.29505,8.32667e-16,6051.27,-718.722)">
                <path d="M3068.33,2347.37L3068.33,1963.03" style="fill:none;stroke:rgb(35,31,32);stroke-width:0.86px;"/>
            </g>
            <g transform="matrix(1.07835e-15,1,-1.29505,8.32667e-16,6051.27,-754.647)">
                <path d="M3068.33,2347.37L3068.33,1963.03" style="fill:none;stroke:rgb(35,31,32);stroke-width:0.86px;"/>
            </g>
            <g transform="matrix(1,0,0,1,13.4285,435.084)">
                <g transform="matrix(41.6667,0,0,41.6667,3447.54,1950.45)">
                </g>
                <text x="3425.62px" y="1950.45px" style="font-family:'NotoSansKR-Medium', 'Noto Sans KR', sans-serif;font-weight:500;font-size:41.667px;fill:rgb(35,31,32);">x</text>
            </g>
            <g transform="matrix(1,0,0,1,56.36,393.313)">
                <g transform="matrix(41.6667,0,0,41.6667,3447.54,1950.45)">
                </g>
                <text x="3425.62px" y="1950.45px" style="font-family:'NotoSansKR-Medium', 'Noto Sans KR', sans-serif;font-weight:500;font-size:41.667px;fill:rgb(35,31,32);">x</text>
            </g>
        </g>
        <g transform="matrix(0.672183,0,0,0.672183,3898.64,553.659)">
            <g id="path42" serif:id="path4" transform="matrix(0.0880108,0,0,0.0880108,213.936,83.0258)">
                <path d="M2140.3,4592.2C2140.3,4592.2 1237.9,4318 1183.8,3336.5C1128.4,2330.5 1806.2,1630.9 2803.9,1562.2C3740.6,1497.7 4223.5,2423.9 4080.9,3028.2C3938.3,3632.4 3426.1,4072.3 2799.9,4006.5C2548.2,3980 2358,3884.8 2224.5,3748.6C2024.3,3544.3 1951.3,3247.1 1991.3,2947.8C2040.8,2576.8 2437.5,2316.5 2808.9,2387.3C3196.1,2461.1 3385.4,2836.1 3205.1,3106.1C3153.6,3183.2 3060,3243 2979.8,3265.9C2862.3,3299.5 2749.4,3290.5 2749.4,3290.5C2739.1,3289.7 2731.2,3280.9 2731.5,3270.6L2734.1,3170.9C2734.4,3160.8 2742.3,3152.6 2752.3,3152C2752.3,3152 2830.1,3147 2911.5,3115.7C2964.3,3095.4 3018.9,3064.1 3053.5,3015C3086.4,2968.1 3083,2904 3051.6,2844C3001.7,2748.4 2881.2,2663.8 2711.6,2665.3C2569.6,2666.5 2460.5,2717.7 2391,2804C2321,2890.8 2291.2,3012.4 2306.3,3152.4C2336.6,3433.3 2646.5,3683 2928.2,3659.7C3381.7,3622.1 3776.3,3373.5 3743.6,2755.6C3727.2,2446.5 3604.4,2220.9 3410.9,2085.4C3216.8,1949.4 2952.3,1904.2 2655.2,1954.4C2356.6,2004.8 2067.6,2200.6 1856.7,2450.4C1646.2,2699.7 1548,2969.8 1562.4,3271.3C1583.6,3714.8 1738.7,4118.8 2195,4491.4C2195,4491.4 2205,4499.1 2201.1,4512.9C2199.3,4519.2 2190.2,4550.5 2190.2,4550.5C2189.4,4553.3 2188,4555.8 2186.1,4558L2160.5,4586.7C2155.5,4592.2 2147.6,4594.5 2140.3,4592.2Z" style="fill:rgb(255,242,0);"/>
            </g>
            <g id="g2582" serif:id="g258" transform="matrix(0.0880108,0,0,0.0880108,213.936,83.0258)">
                <path id="path62" serif:id="path6" d="M921.8,5346.3C921.8,5346.3 989.8,5065.5 1511.5,4992.3C2033.3,4919 2308.5,5283.3 3272.8,5267.8C4237,5252.3 4922.1,4993.2 5253.4,4997C5584.8,5000.9 5480.6,5123 5441.9,5191.5C5403.2,5260 5451.2,5331.8 5191,5347.3C4930.8,5362.7 4237.5,5620.3 3238.4,5626.7C2239.3,5633.1 1800.1,5139.3 1388.9,5165.4C977.7,5191.5 921.8,5346.3 921.8,5346.3Z" style="fill:rgb(73,183,72);"/>
                <path id="path82" serif:id="path8" d="M0,4744.1C-0.6,4762 10.7,4782.6 27.2,4785.2C43.7,4787.8 170,4609.8 403.2,4596.5C975.2,4564 1216.8,4762.1 1619.3,4772.3C2021.8,4782.6 2198.7,4677.9 2236.6,4642.7C2274.5,4607.5 2302.9,4500.2 2276.7,4477C2250.5,4453.9 1936.4,4591.5 1479.9,4591.5C1023.4,4591.5 861,4467 500.4,4467C139.8,4467 0.7,4726.2 0,4744.1Z" style="fill:rgb(73,183,72);"/>
                <path id="path102" serif:id="path10" d="M3703.3,4562.2C3707.7,4541.1 3869.3,4405.9 4219,4405.9C4568.7,4405.9 4617.5,4555.9 5036.7,4524.9C5455.9,4494 5520.5,4394.5 5613.1,4410.5C5705.6,4426.5 5658.6,4479.7 5647.8,4504.4C5636.9,4529.1 5611.5,4573.8 5584.2,4592.7C5556.9,4611.6 5325,4741.2 5012.4,4741.2C4699.8,4741.2 4276.8,4542.8 4020.7,4542.8C3764.6,4542.8 3761.5,4605.8 3730.8,4596.5C3700,4587.3 3698.9,4583.4 3703.3,4562.2Z" style="fill:rgb(73,183,72);"/>
            </g>
            <g id="g2534" serif:id="g253" transform="matrix(0.0880108,0,0,0.0880108,213.936,83.0258)">
                <path id="path124" serif:id="path12" d="M2544.1,4497.1C2544.1,4497.1 2586.3,4473.5 2623.7,4444.7C2644.9,4428.4 2665.5,4411.4 2671.3,4395.9C2692.7,4338.7 2761.8,4288.8 2819.2,4284.7C2862.5,4281.6 2899.9,4298.3 2948.2,4334.3C2957.3,4306.2 2973.9,4276 2999.3,4243.6C3056.2,4171.1 3159.4,4085.2 3322.2,3984.3C3593.4,3816.4 3965.2,3816.7 3965.2,3816.7C3973.8,3816.7 3981.9,3820.5 3987.3,3827.1L4004.4,3847.9C4010.4,3855.2 4012.4,3864.9 4009.8,3873.9C4007.3,3882.9 4000.4,3890.2 3991.5,3893.2C3991.5,3893.2 3637.2,4013.6 3495.8,4134C3363.7,4246.5 3398.8,4402.7 3431.8,4489C3466.3,4579.1 3594.1,4705.7 3826,4797C3833.9,4800.1 3839.9,4806.5 3842.7,4814.5C3845.4,4822.5 3844.5,4831.2 3840.1,4838.5C3800.8,4903.7 3752.3,4965.1 3708.8,5020.3C3702.9,5027.8 3693.5,5031.9 3684,5031.1C3674.4,5030.3 3665.9,5024.8 3661.2,5016.5C3642.2,4982.3 3596.1,4943.5 3541.2,4904.1C3453.4,4841.1 3342.8,4778.8 3269.9,4737C3154.2,4670.7 3071.3,4638.3 2934.7,4654.2C2803.5,4699.2 2689,4608.8 2663,4579C2660.6,4576.2 2656.2,4574.4 2651.2,4572.3C2642.9,4568.7 2633,4565.6 2622.9,4563C2590.1,4554.5 2555,4550.6 2555,4550.6C2542.6,4549.2 2532.5,4540 2530,4527.8C2527.5,4515.6 2533.3,4503.2 2544.1,4497.1Z"/>
                <path id="path144" serif:id="path14" d="M3528.8,3950.2C3468.5,3971.4 3408.3,3998.4 3352.4,4033C3197.5,4129 3098.5,4209.9 3044.4,4278.9C3012.5,4319.6 2996.8,4355 2996.8,4386.6C2996.8,4397.7 2990.3,4407.8 2980.3,4412.5C2970.2,4417.2 2958.4,4415.7 2949.8,4408.6C2897,4364.8 2865,4338.8 2823.3,4341.8C2785.1,4344.5 2739.2,4377.9 2725,4416C2718.4,4433.6 2701.1,4454.4 2678.9,4473.7C2665.4,4485.4 2650.2,4496.8 2635.5,4507.1C2642.5,4508.9 2649.4,4510.8 2656,4513C2678.3,4520.3 2696.9,4530.5 2706.3,4541.4C2726.5,4564.6 2816.1,4635.9 2918.5,4599.2C2920.5,4598.5 2922.6,4598 2924.7,4597.7C3077.5,4579.2 3169.7,4613.6 3298.4,4687.3C3334.7,4708.1 3380.3,4734 3427.9,4762.5L3500.1,4670C3436.1,4612.8 3396.2,4556.2 3378.3,4509.6C3339.2,4407.5 3302.4,4223.5 3458.6,4090.5C3485.8,4067.3 3520.6,4044.1 3559.2,4021.7L3528.8,3950.2Z" style="fill:white;"/>
                <path id="path164" serif:id="path16" d="M2826,4456.4C2821.2,4471.5 2805.1,4479.9 2790.1,4475.1C2775,4470.4 2766.6,4454.3 2771.4,4439.2L2778,4418.3C2782.8,4403.2 2798.9,4394.8 2814,4399.6C2829.1,4404.4 2837.5,4420.4 2832.7,4435.5L2826,4456.4Z" style="fill:rgb(35,24,21);"/>
            </g>
        </g>
        <g transform="matrix(1,0,0,1,2025.3,-131.351)">
            <g transform="matrix(108.333,0,0,108.333,1231.71,462.356)">
            </g>
            <text x="934.538px" y="462.356px" style="font-family:'PretendardVariable-SemiBold', 'Pretendard Variable';font-size:108.333px;fill:rgb(35,31,32);">Logos</text>
        </g>
        <g transform="matrix(1,0,0,1,2632.26,-1375.1)">
            <g transform="matrix(70.8333,0,0,70.8333,1086.82,2014.45)">
            </g>
            <text x="328.091px" y="2014.45px" style="font-family:'PretendardVariable-SemiBold', 'Pretendard Variable';font-size:70.833px;fill:rgb(35,31,32);">Do Not Modify t<tspan x="829.354px " y="2014.45px ">h</tspan>e Ratio</text>
        </g>
        <g transform="matrix(1,0,0,1,2632.26,-687.219)">
            <text x="328.091px" y="2014.45px" style="font-family:'PretendardVariable-SemiBold', 'Pretendard Variable';font-size:70.833px;fill:rgb(35,31,32);">Use Whit<tspan x="614.018px " y="2014.45px ">e</tspan> or Black Logo if t<tspan x="1201.61px " y="2014.45px ">h</tspan>e</text>
            <text x="328.091px" y="2085.28px" style="font-family:'PretendardVariable-SemiBold', 'Pretendard Variable';font-size:70.833px;fill:rgb(35,31,32);">back<tspan x="480.376px 521.395px 544.949px " y="2085.28px 2085.28px 2085.28px ">gro</tspan>und is complicat<tspan x="1099.41px " y="2085.28px ">e</tspan>d</text>
            <g transform="matrix(70.8333,0,0,70.8333,789.822,2156.12)">
            </g>
            <text x="328.091px" y="2156.12px" style="font-family:'PretendardVariable-SemiBold', 'Pretendard Variable';font-size:70.833px;fill:rgb(35,31,32);">or similar color</text>
        </g>
        <g transform="matrix(1,0,0,1,2630.48,258.653)">
            <text x="328.091px" y="2014.45px" style="font-family:'PretendardVariable-SemiBold', 'Pretendard Variable';font-size:70.833px;fill:rgb(35,31,32);">Logo should contain t<tspan x="1011px " y="2014.45px ">h</tspan>e</text>
            <g transform="matrix(70.8333,0,0,70.8333,1258.37,2085.28)">
            </g>
            <text x="328.091px" y="2085.28px" style="font-family:'PretendardVariable-SemiBold', 'Pretendard Variable';font-size:70.833px;fill:rgb(35,31,32);">padding at least of 0<tspan x="975.863px 992.88px " y="2085.28px 2085.28px ">.5</tspan>seagull</text>
        </g>
        <g transform="matrix(1,0,0,1,3711.71,258.653)">
            <g transform="matrix(70.8333,0,0,70.8333,1073.81,2014.45)">
            </g>
            <text x="328.091px" y="2014.45px" style="font-family:'PretendardVariable-SemiBold', 'Pretendard Variable';font-size:70.833px;fill:rgb(35,31,32);">Do Not R<tspan x="610.214px " y="2014.45px ">o</tspan>tat<tspan x="736.074px " y="2014.45px ">e</tspan> t<tspan x="817.872px " y="2014.45px ">h</tspan>e Logo</text>
        </g>
        <g transform="matrix(1,0,0,1,3711.72,-692.871)">
            <text x="328.091px" y="2014.45px" style="font-family:'PretendardVariable-SemiBold', 'Pretendard Variable';font-size:70.833px;fill:rgb(35,31,32);">The Seagull&apos;s e<tspan x="804.417px 840.526px " y="2014.45px 2014.45px ">ye</tspan> should be</text>
            <text x="328.091px" y="2085.28px" style="font-family:'PretendardVariable-SemiBold', 'Pretendard Variable';font-size:70.833px;fill:rgb(35,31,32);">black or whit<tspan x="731.889px " y="2085.28px ">e</tspan> accor<tspan x="965.453px " y="2085.28px ">d</tspan>ing t<tspan x="1144.65px " y="2085.28px ">o</tspan> t<tspan x="1227.48px " y="2085.28px ">h</tspan>e</text>
            <g transform="matrix(70.8333,0,0,70.8333,918.519,2156.12)">
            </g>
            <text x="328.091px" y="2156.12px" style="font-family:'PretendardVariable-SemiBold', 'Pretendard Variable';font-size:70.833px;fill:rgb(35,31,32);">colours of t<tspan x="684.921px " y="2156.12px ">h</tspan>e logo</text>
        </g>
        <g transform="matrix(1,0,0,1,3709.68,-1375.1)">
            <g transform="matrix(70.8333,0,0,70.8333,1197.36,2014.45)">
            </g>
            <text x="328.091px" y="2014.45px" style="font-family:'PretendardVariable-SemiBold', 'Pretendard Variable';font-size:70.833px;fill:rgb(35,31,32);">Do Not Change t<tspan x="856.609px " y="2014.45px ">h</tspan>e Colours</text>
        </g>
        <g transform="matrix(1.32704,0,0,0.627973,2683.41,579.223)">
            <g id="path43" serif:id="path4" transform="matrix(0.0880108,0,0,0.0880108,213.936,83.0258)">
                <path d="M2140.3,4592.2C2140.3,4592.2 1237.9,4318 1183.8,3336.5C1128.4,2330.5 1806.2,1630.9 2803.9,1562.2C3740.6,1497.7 4223.5,2423.9 4080.9,3028.2C3938.3,3632.4 3426.1,4072.3 2799.9,4006.5C2548.2,3980 2358,3884.8 2224.5,3748.6C2024.3,3544.3 1951.3,3247.1 1991.3,2947.8C2040.8,2576.8 2437.5,2316.5 2808.9,2387.3C3196.1,2461.1 3385.4,2836.1 3205.1,3106.1C3153.6,3183.2 3060,3243 2979.8,3265.9C2862.3,3299.5 2749.4,3290.5 2749.4,3290.5C2739.1,3289.7 2731.2,3280.9 2731.5,3270.6L2734.1,3170.9C2734.4,3160.8 2742.3,3152.6 2752.3,3152C2752.3,3152 2830.1,3147 2911.5,3115.7C2964.3,3095.4 3018.9,3064.1 3053.5,3015C3086.4,2968.1 3083,2904 3051.6,2844C3001.7,2748.4 2881.2,2663.8 2711.6,2665.3C2569.6,2666.5 2460.5,2717.7 2391,2804C2321,2890.8 2291.2,3012.4 2306.3,3152.4C2336.6,3433.3 2646.5,3683 2928.2,3659.7C3381.7,3622.1 3776.3,3373.5 3743.6,2755.6C3727.2,2446.5 3604.4,2220.9 3410.9,2085.4C3216.8,1949.4 2952.3,1904.2 2655.2,1954.4C2356.6,2004.8 2067.6,2200.6 1856.7,2450.4C1646.2,2699.7 1548,2969.8 1562.4,3271.3C1583.6,3714.8 1738.7,4118.8 2195,4491.4C2195,4491.4 2205,4499.1 2201.1,4512.9C2199.3,4519.2 2190.2,4550.5 2190.2,4550.5C2189.4,4553.3 2188,4555.8 2186.1,4558L2160.5,4586.7C2155.5,4592.2 2147.6,4594.5 2140.3,4592.2Z" style="fill:rgb(255,0,0);"/>
            </g>
            <g id="g2583" serif:id="g258" transform="matrix(0.0880108,0,0,0.0880108,213.936,83.0258)">
                <path id="path63" serif:id="path6" d="M921.8,5346.3C921.8,5346.3 989.8,5065.5 1511.5,4992.3C2033.3,4919 2308.5,5283.3 3272.8,5267.8C4237,5252.3 4922.1,4993.2 5253.4,4997C5584.8,5000.9 5480.6,5123 5441.9,5191.5C5403.2,5260 5451.2,5331.8 5191,5347.3C4930.8,5362.7 4237.5,5620.3 3238.4,5626.7C2239.3,5633.1 1800.1,5139.3 1388.9,5165.4C977.7,5191.5 921.8,5346.3 921.8,5346.3Z" style="fill:rgb(7,77,162);"/>
                <path id="path83" serif:id="path8" d="M0,4744.1C-0.6,4762 10.7,4782.6 27.2,4785.2C43.7,4787.8 170,4609.8 403.2,4596.5C975.2,4564 1216.8,4762.1 1619.3,4772.3C2021.8,4782.6 2198.7,4677.9 2236.6,4642.7C2274.5,4607.5 2302.9,4500.2 2276.7,4477C2250.5,4453.9 1936.4,4591.5 1479.9,4591.5C1023.4,4591.5 861,4467 500.4,4467C139.8,4467 0.7,4726.2 0,4744.1Z" style="fill:rgb(7,77,162);"/>
                <path id="path103" serif:id="path10" d="M3703.3,4562.2C3707.7,4541.1 3869.3,4405.9 4219,4405.9C4568.7,4405.9 4617.5,4555.9 5036.7,4524.9C5455.9,4494 5520.5,4394.5 5613.1,4410.5C5705.6,4426.5 5658.6,4479.7 5647.8,4504.4C5636.9,4529.1 5611.5,4573.8 5584.2,4592.7C5556.9,4611.6 5325,4741.2 5012.4,4741.2C4699.8,4741.2 4276.8,4542.8 4020.7,4542.8C3764.6,4542.8 3761.5,4605.8 3730.8,4596.5C3700,4587.3 3698.9,4583.4 3703.3,4562.2Z" style="fill:rgb(7,77,162);"/>
            </g>
            <g id="g2535" serif:id="g253" transform="matrix(0.0880108,0,0,0.0880108,213.936,83.0258)">
                <path id="path125" serif:id="path12" d="M2544.1,4497.1C2544.1,4497.1 2586.3,4473.5 2623.7,4444.7C2644.9,4428.4 2665.5,4411.4 2671.3,4395.9C2692.7,4338.7 2761.8,4288.8 2819.2,4284.7C2862.5,4281.6 2899.9,4298.3 2948.2,4334.3C2957.3,4306.2 2973.9,4276 2999.3,4243.6C3056.2,4171.1 3159.4,4085.2 3322.2,3984.3C3593.4,3816.4 3965.2,3816.7 3965.2,3816.7C3973.8,3816.7 3981.9,3820.5 3987.3,3827.1L4004.4,3847.9C4010.4,3855.2 4012.4,3864.9 4009.8,3873.9C4007.3,3882.9 4000.4,3890.2 3991.5,3893.2C3991.5,3893.2 3637.2,4013.6 3495.8,4134C3363.7,4246.5 3398.8,4402.7 3431.8,4489C3466.3,4579.1 3594.1,4705.7 3826,4797C3833.9,4800.1 3839.9,4806.5 3842.7,4814.5C3845.4,4822.5 3844.5,4831.2 3840.1,4838.5C3800.8,4903.7 3752.3,4965.1 3708.8,5020.3C3702.9,5027.8 3693.5,5031.9 3684,5031.1C3674.4,5030.3 3665.9,5024.8 3661.2,5016.5C3642.2,4982.3 3596.1,4943.5 3541.2,4904.1C3453.4,4841.1 3342.8,4778.8 3269.9,4737C3154.2,4670.7 3071.3,4638.3 2934.7,4654.2C2803.5,4699.2 2689,4608.8 2663,4579C2660.6,4576.2 2656.2,4574.4 2651.2,4572.3C2642.9,4568.7 2633,4565.6 2622.9,4563C2590.1,4554.5 2555,4550.6 2555,4550.6C2542.6,4549.2 2532.5,4540 2530,4527.8C2527.5,4515.6 2533.3,4503.2 2544.1,4497.1Z"/>
                <path id="path145" serif:id="path14" d="M3528.8,3950.2C3468.5,3971.4 3408.3,3998.4 3352.4,4033C3197.5,4129 3098.5,4209.9 3044.4,4278.9C3012.5,4319.6 2996.8,4355 2996.8,4386.6C2996.8,4397.7 2990.3,4407.8 2980.3,4412.5C2970.2,4417.2 2958.4,4415.7 2949.8,4408.6C2897,4364.8 2865,4338.8 2823.3,4341.8C2785.1,4344.5 2739.2,4377.9 2725,4416C2718.4,4433.6 2701.1,4454.4 2678.9,4473.7C2665.4,4485.4 2650.2,4496.8 2635.5,4507.1C2642.5,4508.9 2649.4,4510.8 2656,4513C2678.3,4520.3 2696.9,4530.5 2706.3,4541.4C2726.5,4564.6 2816.1,4635.9 2918.5,4599.2C2920.5,4598.5 2922.6,4598 2924.7,4597.7C3077.5,4579.2 3169.7,4613.6 3298.4,4687.3C3334.7,4708.1 3380.3,4734 3427.9,4762.5L3500.1,4670C3436.1,4612.8 3396.2,4556.2 3378.3,4509.6C3339.2,4407.5 3302.4,4223.5 3458.6,4090.5C3485.8,4067.3 3520.6,4044.1 3559.2,4021.7L3528.8,3950.2Z" style="fill:white;"/>
                <path id="path165" serif:id="path16" d="M2826,4456.4C2821.2,4471.5 2805.1,4479.9 2790.1,4475.1C2775,4470.4 2766.6,4454.3 2771.4,4439.2L2778,4418.3C2782.8,4403.2 2798.9,4394.8 2814,4399.6C2829.1,4404.4 2837.5,4420.4 2832.7,4435.5L2826,4456.4Z" style="fill:rgb(35,24,21);"/>
            </g>
        </g>
        <g transform="matrix(1,0,0,1,2688.65,0)">
            <path d="M2480.32,0L2480.32,3507.87L0,3507.87L0,0L2480.32,0ZM2362.2,118.11L118.11,118.11L118.11,3389.76L2362.2,3389.76L2362.2,118.11Z" style="fill:rgb(237,30,36);"/>
        </g>
        <g transform="matrix(1,0,0,1,25.5734,214.795)">
            <rect x="2937.41" y="1318.93" width="487.727" height="325.129" style="fill:url(#_Linear2);"/>
        </g>
        <g transform="matrix(0.672183,0,0,0.672183,2895.35,1427.93)">
            <g id="path44" serif:id="path4" transform="matrix(0.0880108,0,0,0.0880108,213.936,83.0258)">
                <path d="M2140.3,4592.2C2140.3,4592.2 1237.9,4318 1183.8,3336.5C1128.4,2330.5 1806.2,1630.9 2803.9,1562.2C3740.6,1497.7 4223.5,2423.9 4080.9,3028.2C3938.3,3632.4 3426.1,4072.3 2799.9,4006.5C2548.2,3980 2358,3884.8 2224.5,3748.6C2024.3,3544.3 1951.3,3247.1 1991.3,2947.8C2040.8,2576.8 2437.5,2316.5 2808.9,2387.3C3196.1,2461.1 3385.4,2836.1 3205.1,3106.1C3153.6,3183.2 3060,3243 2979.8,3265.9C2862.3,3299.5 2749.4,3290.5 2749.4,3290.5C2739.1,3289.7 2731.2,3280.9 2731.5,3270.6L2734.1,3170.9C2734.4,3160.8 2742.3,3152.6 2752.3,3152C2752.3,3152 2830.1,3147 2911.5,3115.7C2964.3,3095.4 3018.9,3064.1 3053.5,3015C3086.4,2968.1 3083,2904 3051.6,2844C3001.7,2748.4 2881.2,2663.8 2711.6,2665.3C2569.6,2666.5 2460.5,2717.7 2391,2804C2321,2890.8 2291.2,3012.4 2306.3,3152.4C2336.6,3433.3 2646.5,3683 2928.2,3659.7C3381.7,3622.1 3776.3,3373.5 3743.6,2755.6C3727.2,2446.5 3604.4,2220.9 3410.9,2085.4C3216.8,1949.4 2952.3,1904.2 2655.2,1954.4C2356.6,2004.8 2067.6,2200.6 1856.7,2450.4C1646.2,2699.7 1548,2969.8 1562.4,3271.3C1583.6,3714.8 1738.7,4118.8 2195,4491.4C2195,4491.4 2205,4499.1 2201.1,4512.9C2199.3,4519.2 2190.2,4550.5 2190.2,4550.5C2189.4,4553.3 2188,4555.8 2186.1,4558L2160.5,4586.7C2155.5,4592.2 2147.6,4594.5 2140.3,4592.2Z" style="fill:white;"/>
            </g>
            <g id="g2584" serif:id="g258" transform="matrix(0.0880108,0,0,0.0880108,213.936,83.0258)">
                <path id="path64" serif:id="path6" d="M921.8,5346.3C921.8,5346.3 989.8,5065.5 1511.5,4992.3C2033.3,4919 2308.5,5283.3 3272.8,5267.8C4237,5252.3 4922.1,4993.2 5253.4,4997C5584.8,5000.9 5480.6,5123 5441.9,5191.5C5403.2,5260 5451.2,5331.8 5191,5347.3C4930.8,5362.7 4237.5,5620.3 3238.4,5626.7C2239.3,5633.1 1800.1,5139.3 1388.9,5165.4C977.7,5191.5 921.8,5346.3 921.8,5346.3Z" style="fill:white;"/>
                <path id="path84" serif:id="path8" d="M0,4744.1C-0.6,4762 10.7,4782.6 27.2,4785.2C43.7,4787.8 170,4609.8 403.2,4596.5C975.2,4564 1216.8,4762.1 1619.3,4772.3C2021.8,4782.6 2198.7,4677.9 2236.6,4642.7C2274.5,4607.5 2302.9,4500.2 2276.7,4477C2250.5,4453.9 1936.4,4591.5 1479.9,4591.5C1023.4,4591.5 861,4467 500.4,4467C139.8,4467 0.7,4726.2 0,4744.1Z" style="fill:white;"/>
                <path id="path104" serif:id="path10" d="M3703.3,4562.2C3707.7,4541.1 3869.3,4405.9 4219,4405.9C4568.7,4405.9 4617.5,4555.9 5036.7,4524.9C5455.9,4494 5520.5,4394.5 5613.1,4410.5C5705.6,4426.5 5658.6,4479.7 5647.8,4504.4C5636.9,4529.1 5611.5,4573.8 5584.2,4592.7C5556.9,4611.6 5325,4741.2 5012.4,4741.2C4699.8,4741.2 4276.8,4542.8 4020.7,4542.8C3764.6,4542.8 3761.5,4605.8 3730.8,4596.5C3700,4587.3 3698.9,4583.4 3703.3,4562.2Z" style="fill:white;"/>
            </g>
            <g transform="matrix(0.0880108,0,0,0.0880108,213.936,83.0258)">
                <path id="path126" serif:id="path12" d="M2544.1,4497.1C2544.1,4497.1 2586.3,4473.5 2623.7,4444.7C2644.9,4428.4 2665.5,4411.4 2671.3,4395.9C2692.7,4338.7 2761.8,4288.8 2819.2,4284.7C2862.5,4281.6 2899.9,4298.3 2948.2,4334.3C2957.3,4306.2 2973.9,4276 2999.3,4243.6C3056.2,4171.1 3159.4,4085.2 3322.2,3984.3C3593.4,3816.4 3965.2,3816.7 3965.2,3816.7C3973.8,3816.7 3981.9,3820.5 3987.3,3827.1L4004.4,3847.9C4010.4,3855.2 4012.4,3864.9 4009.8,3873.9C4007.3,3882.9 4000.4,3890.2 3991.5,3893.2C3991.5,3893.2 3637.2,4013.6 3495.8,4134C3363.7,4246.5 3398.8,4402.7 3431.8,4489C3466.3,4579.1 3594.1,4705.7 3826,4797C3833.9,4800.1 3839.9,4806.5 3842.7,4814.5C3845.4,4822.5 3844.5,4831.2 3840.1,4838.5C3800.8,4903.7 3752.3,4965.1 3708.8,5020.3C3702.9,5027.8 3693.5,5031.9 3684,5031.1C3674.4,5030.3 3665.9,5024.8 3661.2,5016.5C3642.2,4982.3 3596.1,4943.5 3541.2,4904.1C3453.4,4841.1 3342.8,4778.8 3269.9,4737C3154.2,4670.7 3071.3,4638.3 2934.7,4654.2C2803.5,4699.2 2689,4608.8 2663,4579C2660.6,4576.2 2656.2,4574.4 2651.2,4572.3C2642.9,4568.7 2633,4565.6 2622.9,4563C2590.1,4554.5 2555,4550.6 2555,4550.6C2542.6,4549.2 2532.5,4540 2530,4527.8C2527.5,4515.6 2533.3,4503.2 2544.1,4497.1Z" style="fill:white;"/>
                <path id="path146" serif:id="path14" d="M3528.8,3950.2C3468.5,3971.4 3408.3,3998.4 3352.4,4033C3197.5,4129 3098.5,4209.9 3044.4,4278.9C3012.5,4319.6 2996.8,4355 2996.8,4386.6C2996.8,4397.7 2990.3,4407.8 2980.3,4412.5C2970.2,4417.2 2958.4,4415.7 2949.8,4408.6C2897,4364.8 2865,4338.8 2823.3,4341.8C2785.1,4344.5 2739.2,4377.9 2725,4416C2718.4,4433.6 2701.1,4454.4 2678.9,4473.7C2665.4,4485.4 2650.2,4496.8 2635.5,4507.1C2642.5,4508.9 2649.4,4510.8 2656,4513C2678.3,4520.3 2696.9,4530.5 2706.3,4541.4C2726.5,4564.6 2816.1,4635.9 2918.5,4599.2C2920.5,4598.5 2922.6,4598 2924.7,4597.7C3077.5,4579.2 3169.7,4613.6 3298.4,4687.3C3334.7,4708.1 3380.3,4734 3427.9,4762.5L3500.1,4670C3436.1,4612.8 3396.2,4556.2 3378.3,4509.6C3339.2,4407.5 3302.4,4223.5 3458.6,4090.5C3485.8,4067.3 3520.6,4044.1 3559.2,4021.7L3528.8,3950.2Z" style="fill:white;"/>
                <path id="path166" serif:id="path16" d="M2826,4456.4C2821.2,4471.5 2805.1,4479.9 2790.1,4475.1C2775,4470.4 2766.6,4454.3 2771.4,4439.2L2778,4418.3C2782.8,4403.2 2798.9,4394.8 2814,4399.6C2829.1,4404.4 2837.5,4420.4 2832.7,4435.5L2826,4456.4Z" style="fill:rgb(35,24,21);"/>
            </g>
        </g>
        <g transform="matrix(0.672183,0,0,0.672183,3898.64,1427.93)">
            <g id="path45" serif:id="path4" transform="matrix(0.0880108,0,0,0.0880108,213.936,83.0258)">
                <path d="M2140.3,4592.2C2140.3,4592.2 1237.9,4318 1183.8,3336.5C1128.4,2330.5 1806.2,1630.9 2803.9,1562.2C3740.6,1497.7 4223.5,2423.9 4080.9,3028.2C3938.3,3632.4 3426.1,4072.3 2799.9,4006.5C2548.2,3980 2358,3884.8 2224.5,3748.6C2024.3,3544.3 1951.3,3247.1 1991.3,2947.8C2040.8,2576.8 2437.5,2316.5 2808.9,2387.3C3196.1,2461.1 3385.4,2836.1 3205.1,3106.1C3153.6,3183.2 3060,3243 2979.8,3265.9C2862.3,3299.5 2749.4,3290.5 2749.4,3290.5C2739.1,3289.7 2731.2,3280.9 2731.5,3270.6L2734.1,3170.9C2734.4,3160.8 2742.3,3152.6 2752.3,3152C2752.3,3152 2830.1,3147 2911.5,3115.7C2964.3,3095.4 3018.9,3064.1 3053.5,3015C3086.4,2968.1 3083,2904 3051.6,2844C3001.7,2748.4 2881.2,2663.8 2711.6,2665.3C2569.6,2666.5 2460.5,2717.7 2391,2804C2321,2890.8 2291.2,3012.4 2306.3,3152.4C2336.6,3433.3 2646.5,3683 2928.2,3659.7C3381.7,3622.1 3776.3,3373.5 3743.6,2755.6C3727.2,2446.5 3604.4,2220.9 3410.9,2085.4C3216.8,1949.4 2952.3,1904.2 2655.2,1954.4C2356.6,2004.8 2067.6,2200.6 1856.7,2450.4C1646.2,2699.7 1548,2969.8 1562.4,3271.3C1583.6,3714.8 1738.7,4118.8 2195,4491.4C2195,4491.4 2205,4499.1 2201.1,4512.9C2199.3,4519.2 2190.2,4550.5 2190.2,4550.5C2189.4,4553.3 2188,4555.8 2186.1,4558L2160.5,4586.7C2155.5,4592.2 2147.6,4594.5 2140.3,4592.2Z"/>
            </g>
            <g id="g2585" serif:id="g258" transform="matrix(0.0880108,0,0,0.0880108,213.936,83.0258)">
                <path id="path65" serif:id="path6" d="M921.8,5346.3C921.8,5346.3 989.8,5065.5 1511.5,4992.3C2033.3,4919 2308.5,5283.3 3272.8,5267.8C4237,5252.3 4922.1,4993.2 5253.4,4997C5584.8,5000.9 5480.6,5123 5441.9,5191.5C5403.2,5260 5451.2,5331.8 5191,5347.3C4930.8,5362.7 4237.5,5620.3 3238.4,5626.7C2239.3,5633.1 1800.1,5139.3 1388.9,5165.4C977.7,5191.5 921.8,5346.3 921.8,5346.3Z"/>
                <path id="path85" serif:id="path8" d="M0,4744.1C-0.6,4762 10.7,4782.6 27.2,4785.2C43.7,4787.8 170,4609.8 403.2,4596.5C975.2,4564 1216.8,4762.1 1619.3,4772.3C2021.8,4782.6 2198.7,4677.9 2236.6,4642.7C2274.5,4607.5 2302.9,4500.2 2276.7,4477C2250.5,4453.9 1936.4,4591.5 1479.9,4591.5C1023.4,4591.5 861,4467 500.4,4467C139.8,4467 0.7,4726.2 0,4744.1Z"/>
                <path id="path105" serif:id="path10" d="M3703.3,4562.2C3707.7,4541.1 3869.3,4405.9 4219,4405.9C4568.7,4405.9 4617.5,4555.9 5036.7,4524.9C5455.9,4494 5520.5,4394.5 5613.1,4410.5C5705.6,4426.5 5658.6,4479.7 5647.8,4504.4C5636.9,4529.1 5611.5,4573.8 5584.2,4592.7C5556.9,4611.6 5325,4741.2 5012.4,4741.2C4699.8,4741.2 4276.8,4542.8 4020.7,4542.8C3764.6,4542.8 3761.5,4605.8 3730.8,4596.5C3700,4587.3 3698.9,4583.4 3703.3,4562.2Z"/>
            </g>
            <g transform="matrix(0.0880108,0,0,0.0880108,213.936,83.0258)">
                <path id="path127" serif:id="path12" d="M2544.1,4497.1C2544.1,4497.1 2586.3,4473.5 2623.7,4444.7C2644.9,4428.4 2665.5,4411.4 2671.3,4395.9C2692.7,4338.7 2761.8,4288.8 2819.2,4284.7C2862.5,4281.6 2899.9,4298.3 2948.2,4334.3C2957.3,4306.2 2973.9,4276 2999.3,4243.6C3056.2,4171.1 3159.4,4085.2 3322.2,3984.3C3593.4,3816.4 3965.2,3816.7 3965.2,3816.7C3973.8,3816.7 3981.9,3820.5 3987.3,3827.1L4004.4,3847.9C4010.4,3855.2 4012.4,3864.9 4009.8,3873.9C4007.3,3882.9 4000.4,3890.2 3991.5,3893.2C3991.5,3893.2 3637.2,4013.6 3495.8,4134C3363.7,4246.5 3398.8,4402.7 3431.8,4489C3466.3,4579.1 3594.1,4705.7 3826,4797C3833.9,4800.1 3839.9,4806.5 3842.7,4814.5C3845.4,4822.5 3844.5,4831.2 3840.1,4838.5C3800.8,4903.7 3752.3,4965.1 3708.8,5020.3C3702.9,5027.8 3693.5,5031.9 3684,5031.1C3674.4,5030.3 3665.9,5024.8 3661.2,5016.5C3642.2,4982.3 3596.1,4943.5 3541.2,4904.1C3453.4,4841.1 3342.8,4778.8 3269.9,4737C3154.2,4670.7 3071.3,4638.3 2934.7,4654.2C2803.5,4699.2 2689,4608.8 2663,4579C2660.6,4576.2 2656.2,4574.4 2651.2,4572.3C2642.9,4568.7 2633,4565.6 2622.9,4563C2590.1,4554.5 2555,4550.6 2555,4550.6C2542.6,4549.2 2532.5,4540 2530,4527.8C2527.5,4515.6 2533.3,4503.2 2544.1,4497.1Z"/>
                <path id="path147" serif:id="path14" d="M3528.8,3950.2C3468.5,3971.4 3408.3,3998.4 3352.4,4033C3197.5,4129 3098.5,4209.9 3044.4,4278.9C3012.5,4319.6 2996.8,4355 2996.8,4386.6C2996.8,4397.7 2990.3,4407.8 2980.3,4412.5C2970.2,4417.2 2958.4,4415.7 2949.8,4408.6C2897,4364.8 2865,4338.8 2823.3,4341.8C2785.1,4344.5 2739.2,4377.9 2725,4416C2718.4,4433.6 2701.1,4454.4 2678.9,4473.7C2665.4,4485.4 2650.2,4496.8 2635.5,4507.1C2642.5,4508.9 2649.4,4510.8 2656,4513C2678.3,4520.3 2696.9,4530.5 2706.3,4541.4C2726.5,4564.6 2816.1,4635.9 2918.5,4599.2C2920.5,4598.5 2922.6,4598 2924.7,4597.7C3077.5,4579.2 3169.7,4613.6 3298.4,4687.3C3334.7,4708.1 3380.3,4734 3427.9,4762.5L3500.1,4670C3436.1,4612.8 3396.2,4556.2 3378.3,4509.6C3339.2,4407.5 3302.4,4223.5 3458.6,4090.5C3485.8,4067.3 3520.6,4044.1 3559.2,4021.7L3528.8,3950.2Z"/>
                <path id="path167" serif:id="path16" d="M2826,4456.4C2821.2,4471.5 2805.1,4479.9 2790.1,4475.1C2775,4470.4 2766.6,4454.3 2771.4,4439.2L2778,4418.3C2782.8,4403.2 2798.9,4394.8 2814,4399.6C2829.1,4404.4 2837.5,4420.4 2832.7,4435.5L2826,4456.4Z" style="fill:white;"/>
            </g>
        </g>
        <g transform="matrix(-0.843441,-0.537222,0.537222,-0.843441,4542.94,3234.94)">
            <g id="path46" serif:id="path4" transform="matrix(0.0880108,0,0,0.0880108,213.936,83.0258)">
                <path d="M2140.3,4592.2C2140.3,4592.2 1237.9,4318 1183.8,3336.5C1128.4,2330.5 1806.2,1630.9 2803.9,1562.2C3740.6,1497.7 4223.5,2423.9 4080.9,3028.2C3938.3,3632.4 3426.1,4072.3 2799.9,4006.5C2548.2,3980 2358,3884.8 2224.5,3748.6C2024.3,3544.3 1951.3,3247.1 1991.3,2947.8C2040.8,2576.8 2437.5,2316.5 2808.9,2387.3C3196.1,2461.1 3385.4,2836.1 3205.1,3106.1C3153.6,3183.2 3060,3243 2979.8,3265.9C2862.3,3299.5 2749.4,3290.5 2749.4,3290.5C2739.1,3289.7 2731.2,3280.9 2731.5,3270.6L2734.1,3170.9C2734.4,3160.8 2742.3,3152.6 2752.3,3152C2752.3,3152 2830.1,3147 2911.5,3115.7C2964.3,3095.4 3018.9,3064.1 3053.5,3015C3086.4,2968.1 3083,2904 3051.6,2844C3001.7,2748.4 2881.2,2663.8 2711.6,2665.3C2569.6,2666.5 2460.5,2717.7 2391,2804C2321,2890.8 2291.2,3012.4 2306.3,3152.4C2336.6,3433.3 2646.5,3683 2928.2,3659.7C3381.7,3622.1 3776.3,3373.5 3743.6,2755.6C3727.2,2446.5 3604.4,2220.9 3410.9,2085.4C3216.8,1949.4 2952.3,1904.2 2655.2,1954.4C2356.6,2004.8 2067.6,2200.6 1856.7,2450.4C1646.2,2699.7 1548,2969.8 1562.4,3271.3C1583.6,3714.8 1738.7,4118.8 2195,4491.4C2195,4491.4 2205,4499.1 2201.1,4512.9C2199.3,4519.2 2190.2,4550.5 2190.2,4550.5C2189.4,4553.3 2188,4555.8 2186.1,4558L2160.5,4586.7C2155.5,4592.2 2147.6,4594.5 2140.3,4592.2Z" style="fill:rgb(255,0,0);"/>
            </g>
            <g id="g2586" serif:id="g258" transform="matrix(0.0880108,0,0,0.0880108,213.936,83.0258)">
                <path id="path66" serif:id="path6" d="M921.8,5346.3C921.8,5346.3 989.8,5065.5 1511.5,4992.3C2033.3,4919 2308.5,5283.3 3272.8,5267.8C4237,5252.3 4922.1,4993.2 5253.4,4997C5584.8,5000.9 5480.6,5123 5441.9,5191.5C5403.2,5260 5451.2,5331.8 5191,5347.3C4930.8,5362.7 4237.5,5620.3 3238.4,5626.7C2239.3,5633.1 1800.1,5139.3 1388.9,5165.4C977.7,5191.5 921.8,5346.3 921.8,5346.3Z" style="fill:rgb(7,77,162);"/>
                <path id="path86" serif:id="path8" d="M0,4744.1C-0.6,4762 10.7,4782.6 27.2,4785.2C43.7,4787.8 170,4609.8 403.2,4596.5C975.2,4564 1216.8,4762.1 1619.3,4772.3C2021.8,4782.6 2198.7,4677.9 2236.6,4642.7C2274.5,4607.5 2302.9,4500.2 2276.7,4477C2250.5,4453.9 1936.4,4591.5 1479.9,4591.5C1023.4,4591.5 861,4467 500.4,4467C139.8,4467 0.7,4726.2 0,4744.1Z" style="fill:rgb(7,77,162);"/>
                <path id="path106" serif:id="path10" d="M3703.3,4562.2C3707.7,4541.1 3869.3,4405.9 4219,4405.9C4568.7,4405.9 4617.5,4555.9 5036.7,4524.9C5455.9,4494 5520.5,4394.5 5613.1,4410.5C5705.6,4426.5 5658.6,4479.7 5647.8,4504.4C5636.9,4529.1 5611.5,4573.8 5584.2,4592.7C5556.9,4611.6 5325,4741.2 5012.4,4741.2C4699.8,4741.2 4276.8,4542.8 4020.7,4542.8C3764.6,4542.8 3761.5,4605.8 3730.8,4596.5C3700,4587.3 3698.9,4583.4 3703.3,4562.2Z" style="fill:rgb(7,77,162);"/>
            </g>
            <g id="g2536" serif:id="g253" transform="matrix(0.0880108,0,0,0.0880108,213.936,83.0258)">
                <path id="path128" serif:id="path12" d="M2544.1,4497.1C2544.1,4497.1 2586.3,4473.5 2623.7,4444.7C2644.9,4428.4 2665.5,4411.4 2671.3,4395.9C2692.7,4338.7 2761.8,4288.8 2819.2,4284.7C2862.5,4281.6 2899.9,4298.3 2948.2,4334.3C2957.3,4306.2 2973.9,4276 2999.3,4243.6C3056.2,4171.1 3159.4,4085.2 3322.2,3984.3C3593.4,3816.4 3965.2,3816.7 3965.2,3816.7C3973.8,3816.7 3981.9,3820.5 3987.3,3827.1L4004.4,3847.9C4010.4,3855.2 4012.4,3864.9 4009.8,3873.9C4007.3,3882.9 4000.4,3890.2 3991.5,3893.2C3991.5,3893.2 3637.2,4013.6 3495.8,4134C3363.7,4246.5 3398.8,4402.7 3431.8,4489C3466.3,4579.1 3594.1,4705.7 3826,4797C3833.9,4800.1 3839.9,4806.5 3842.7,4814.5C3845.4,4822.5 3844.5,4831.2 3840.1,4838.5C3800.8,4903.7 3752.3,4965.1 3708.8,5020.3C3702.9,5027.8 3693.5,5031.9 3684,5031.1C3674.4,5030.3 3665.9,5024.8 3661.2,5016.5C3642.2,4982.3 3596.1,4943.5 3541.2,4904.1C3453.4,4841.1 3342.8,4778.8 3269.9,4737C3154.2,4670.7 3071.3,4638.3 2934.7,4654.2C2803.5,4699.2 2689,4608.8 2663,4579C2660.6,4576.2 2656.2,4574.4 2651.2,4572.3C2642.9,4568.7 2633,4565.6 2622.9,4563C2590.1,4554.5 2555,4550.6 2555,4550.6C2542.6,4549.2 2532.5,4540 2530,4527.8C2527.5,4515.6 2533.3,4503.2 2544.1,4497.1Z"/>
                <path id="path148" serif:id="path14" d="M3528.8,3950.2C3468.5,3971.4 3408.3,3998.4 3352.4,4033C3197.5,4129 3098.5,4209.9 3044.4,4278.9C3012.5,4319.6 2996.8,4355 2996.8,4386.6C2996.8,4397.7 2990.3,4407.8 2980.3,4412.5C2970.2,4417.2 2958.4,4415.7 2949.8,4408.6C2897,4364.8 2865,4338.8 2823.3,4341.8C2785.1,4344.5 2739.2,4377.9 2725,4416C2718.4,4433.6 2701.1,4454.4 2678.9,4473.7C2665.4,4485.4 2650.2,4496.8 2635.5,4507.1C2642.5,4508.9 2649.4,4510.8 2656,4513C2678.3,4520.3 2696.9,4530.5 2706.3,4541.4C2726.5,4564.6 2816.1,4635.9 2918.5,4599.2C2920.5,4598.5 2922.6,4598 2924.7,4597.7C3077.5,4579.2 3169.7,4613.6 3298.4,4687.3C3334.7,4708.1 3380.3,4734 3427.9,4762.5L3500.1,4670C3436.1,4612.8 3396.2,4556.2 3378.3,4509.6C3339.2,4407.5 3302.4,4223.5 3458.6,4090.5C3485.8,4067.3 3520.6,4044.1 3559.2,4021.7L3528.8,3950.2Z" style="fill:white;"/>
                <path id="path168" serif:id="path16" d="M2826,4456.4C2821.2,4471.5 2805.1,4479.9 2790.1,4475.1C2775,4470.4 2766.6,4454.3 2771.4,4439.2L2778,4418.3C2782.8,4403.2 2798.9,4394.8 2814,4399.6C2829.1,4404.4 2837.5,4420.4 2832.7,4435.5L2826,4456.4Z" style="fill:rgb(35,24,21);"/>
            </g>
        </g>
    </g>
    <defs>
        <linearGradient id="_Linear2" x1="0" y1="0" x2="1" y2="0" gradientUnits="userSpaceOnUse" gradientTransform="matrix(359.347,-17.2224,17.2224,359.347,3065.79,1440.3)"><stop offset="0" style="stop-color:rgb(237,30,36);stop-opacity:1"/><stop offset="0.51" style="stop-color:rgb(7,77,162);stop-opacity:1"/><stop offset="1" style="stop-color:rgb(169,213,155);stop-opacity:1"/></linearGradient>
    </defs>
</svg>
