<?xml version="1.0" encoding="UTF-8" standalone="no"?>
<!-- Created with Inkscape (http://www.inkscape.org/) -->

<svg
   width="330"
   height="80"
   id="svg3948"
   version="1.1"
   inkscape:version="1.2.2 (b0a8486541, 2022-12-01)"
   sodipodi:docname="logo-toradez.svg"
   inkscape:export-filename="/home/phls/Dropbox/debian-brasil/logo-debian-brasil.png"
   inkscape:export-xdpi="96"
   inkscape:export-ydpi="96"
   xmlns:inkscape="http://www.inkscape.org/namespaces/inkscape"
   xmlns:sodipodi="http://sodipodi.sourceforge.net/DTD/sodipodi-0.dtd"
   xmlns="http://www.w3.org/2000/svg"
   xmlns:svg="http://www.w3.org/2000/svg"
   xmlns:rdf="http://www.w3.org/1999/02/22-rdf-syntax-ns#"
   xmlns:cc="http://creativecommons.org/ns#"
   xmlns:dc="http://purl.org/dc/elements/1.1/">
  <defs
     id="defs3950">
    <clipPath
       clipPathUnits="userSpaceOnUse"
       id="clipPath16">
      <path
         inkscape:connector-curvature="0"
         d="M 0,800 H 1280 V 0 H 0 Z"
         id="path18" />
    </clipPath>
    <clipPath
       clipPathUnits="userSpaceOnUse"
       id="clipPath38">
      <path
         inkscape:connector-curvature="0"
         d="M 0,800 H 1280 V 0 H 0 Z"
         id="path40" />
    </clipPath>
    <clipPath
       clipPathUnits="userSpaceOnUse"
       id="clipPath56">
      <path
         inkscape:connector-curvature="0"
         d="M 0,800 H 1280 V 0 H 0 Z"
         id="path58" />
    </clipPath>
    <clipPath
       clipPathUnits="userSpaceOnUse"
       id="clipPath80">
      <path
         inkscape:connector-curvature="0"
         d="M 0,800 H 1280 V 0 H 0 Z"
         id="path82" />
    </clipPath>
    <clipPath
       clipPathUnits="userSpaceOnUse"
       id="clipPath100">
      <path
         inkscape:connector-curvature="0"
         d="M 0,800 H 1280 V 0 H 0 Z"
         id="path102" />
    </clipPath>
  </defs>
  <sodipodi:namedview
     id="base"
     pagecolor="#ffffff"
     bordercolor="#666666"
     borderopacity="1.0"
     inkscape:pageopacity="0.0"
     inkscape:pageshadow="2"
     inkscape:zoom="1.979899"
     inkscape:cx="212.13203"
     inkscape:cy="-34.345186"
     inkscape:document-units="px"
     inkscape:current-layer="g4457"
     showgrid="false"
     inkscape:window-width="1920"
     inkscape:window-height="1003"
     inkscape:window-x="1080"
     inkscape:window-y="0"
     inkscape:window-maximized="1"
     inkscape:showpageshadow="2"
     inkscape:pagecheckerboard="0"
     inkscape:deskcolor="#d1d1d1" />
  <metadata
     id="metadata3953">
    <rdf:RDF>
      <cc:Work
         rdf:about="">
        <dc:format>image/svg+xml</dc:format>
        <dc:type
           rdf:resource="http://purl.org/dc/dcmitype/StillImage" />
      </cc:Work>
    </rdf:RDF>
  </metadata>
  <g
     inkscape:label="Camada 1"
     inkscape:groupmode="layer"
     id="layer1"
     transform="translate(0,-622.5197)">
    <g
       id="g4457"
       transform="translate(-201.18066,-543.63188)">
      <g
         id="Logo_-_Blue"
         data-name="Logo - Blue"
         transform="matrix(2.6862035,0,0,2.6862035,191.94654,1156.5637)">
        <path
           class="cls-1"
           d="M 16.88,16.1 A 1.82,1.82 0 1 1 18.7,14.1 6.43,6.43 0 0 0 6.1,12.48 H 5.86 a 1.82,1.82 0 1 0 0,3.63 h 0.23 a 6.43,6.43 0 0 0 12.61,-1.7 1.82,1.82 0 0 1 -1.82,1.69 z m -5.51,0 a 1.82,1.82 0 1 1 1.82,-1.82 1.81,1.81 0 0 1 -1.82,1.82 z"
           id="path386"
           style="fill:#96c837;fill-rule:evenodd" />
        <path
           class="cls-2"
           d="m 22.39,12.47 a 1.82,1.82 0 1 0 1.82,1.81 1.82,1.82 0 0 0 -1.82,-1.81 z"
           id="path388"
           style="fill:#00508c" />
        <path
           class="cls-2"
           d="m 27.9,12.47 a 1.82,1.82 0 1 0 1.82,1.81 1.82,1.82 0 0 0 -1.82,-1.81 z"
           id="path390"
           style="fill:#00508c" />
        <polygon
           class="cls-2"
           points="28.7,4.5 27.09,6.52 33.94,6.52 33.94,20.33 36.13,20.33 36.13,6.52 42.22,6.52 42.22,4.5 "
           id="polygon392"
           style="fill:#00508c" />
        <path
           class="cls-2"
           d="m 45.88,7.86 a 6.43,6.43 0 1 0 6.43,6.45 6.4,6.4 0 0 0 -6.43,-6.45 z m 0,10.94 a 4.32,4.32 0 0 1 -4.35,-4.51 4.35,4.35 0 1 1 8.69,0 4.32,4.32 0 0 1 -4.34,4.51 z"
           id="path394"
           style="fill:#00508c" />
        <polygon
           class="cls-2"
           points="118.12,8.14 115.52,8.14 112.31,12.29 109.11,8.14 106.56,8.14 111.01,13.85 105.81,20.33 108.41,20.33 112.31,15.38 116.19,20.33 118.72,20.33 113.64,13.85 "
           id="polygon396"
           style="fill:#00508c" />
        <path
           class="cls-2"
           d="m 62.53,10.11 a 8,8 0 0 1 1.22,-1.56 6.52,6.52 0 0 0 -2.93,-0.69 6.41,6.41 0 0 0 -6.43,6.42 v 6 h 2.09 v -6 a 4.38,4.38 0 0 1 6.05,-4.17 z"
           id="path398"
           style="fill:#00508c" />
        <path
           class="cls-2"
           d="m 69.89,20.72 a 6.43,6.43 0 0 0 4.35,-1.67 v 1.28 h 2.08 v -6 a 6.43,6.43 0 1 0 -6.43,6.41 z m 0,-10.94 a 4.34,4.34 0 0 1 4.35,4.52 4.35,4.35 0 1 1 -8.69,0 4.33,4.33 0 0 1 4.34,-4.52 z"
           id="path400"
           style="fill:#00508c" />
        <path
           class="cls-2"
           d="M 90.94,14.22 V 4.5 h -2.08 v 5 a 6.44,6.44 0 1 0 2.08,4.77 z m -6.43,4.58 a 4.32,4.32 0 0 1 -4.34,-4.51 4.35,4.35 0 1 1 8.69,0 4.32,4.32 0 0 1 -4.35,4.51 z"
           id="path402"
           style="fill:#00508c" />
        <path
           class="cls-2"
           d="m 102.72,17.43 a 4.35,4.35 0 0 1 -7.43,-2.11 h 10.6 a 8.28,8.28 0 0 0 0.07,-1 6.36,6.36 0 1 0 -0.79,3.12 z M 99.53,9.78 a 4.26,4.26 0 0 1 4.24,3.46 H 95.3 a 4.25,4.25 0 0 1 4.23,-3.46 z"
           id="path404"
           style="fill:#00508c" />
        <path
           class="cls-2"
           d="m 36.51,25.81 a 1.88,1.88 0 0 0 -1,-0.26 0.82,0.82 0 0 0 -0.87,0.84 c 0,0.37 0.14,0.59 1,1.06 0.86,0.47 1.16,1 1.16,1.63 A 1.51,1.51 0 0 1 35.16,30.68 2.91,2.91 0 0 1 34,30.44 v -0.73 a 2.43,2.43 0 0 0 1.08,0.36 0.92,0.92 0 0 0 1,-0.89 c 0,-0.43 -0.12,-0.68 -0.88,-1.14 -1,-0.62 -1.24,-1 -1.24,-1.69 a 1.41,1.41 0 0 1 1.57,-1.41 2.71,2.71 0 0 1 1,0.19 z"
           id="path406"
           style="fill:#00508c" />
        <path
           class="cls-2"
           d="M 41.57,30.62 H 40.8 l -0.86,-3.47 v 0 l -0.79,3.47 H 38.38 L 37.29,26.51 H 38 L 38.76,30 v 0 l 0.78,-3.44 h 0.81 L 41.18,30 v 0 L 42,26.51 h 0.68 z"
           id="path408"
           style="fill:#00508c" />
        <path
           class="cls-2"
           d="m 44,24.82 v 0.81 h -0.74 v -0.81 z m -0.71,1.69 H 44 v 4.11 h -0.68 z"
           id="path410"
           style="fill:#00508c" />
        <path
           class="cls-2"
           d="m 44.92,29.83 a 1.93,1.93 0 0 0 1,0.3 c 0.51,0 0.78,-0.26 0.78,-0.58 0,-0.32 -0.15,-0.47 -0.53,-0.64 l -0.45,-0.2 c -0.59,-0.27 -0.8,-0.54 -0.8,-1.06 a 1.2,1.2 0 0 1 1.32,-1.19 2.44,2.44 0 0 1 0.87,0.14 v 0.58 A 2.11,2.11 0 0 0 46.3,27.01 c -0.44,0 -0.68,0.24 -0.68,0.56 0,0.32 0.25,0.52 0.7,0.69 l 0.24,0.1 a 1.11,1.11 0 0 1 0.81,1.05 1.18,1.18 0 0 1 -1.37,1.27 2.49,2.49 0 0 1 -1.11,-0.24 z"
           id="path412"
           style="fill:#00508c" />
        <path
           class="cls-2"
           d="m 48,29.83 a 1.93,1.93 0 0 0 1,0.3 c 0.51,0 0.78,-0.26 0.78,-0.58 0,-0.32 -0.15,-0.47 -0.53,-0.64 L 48.8,28.71 C 48.21,28.44 48,28.17 48,27.65 a 1.2,1.2 0 0 1 1.32,-1.19 2.44,2.44 0 0 1 0.87,0.14 v 0.58 a 2.11,2.11 0 0 0 -0.81,-0.17 c -0.44,0 -0.68,0.24 -0.68,0.56 0,0.32 0.25,0.52 0.7,0.69 l 0.24,0.1 a 1.11,1.11 0 0 1 0.81,1.05 1.18,1.18 0 0 1 -1.45,1.27 2.49,2.49 0 0 1 -1.11,-0.24 z"
           id="path414"
           style="fill:#00508c" />
        <path
           class="cls-2"
           d="m 51,29.72 h 0.77 v 0.9 H 51 Z"
           id="path416"
           style="fill:#00508c" />
        <path
           class="cls-2"
           d="m 54.66,25 h 2.62 v 0.61 h -1.92 v 1.79 h 1.83 V 28 h -1.83 v 2 h 2 v 0.61 h -2.7 z"
           id="path418"
           style="fill:#00508c" />
        <path
           class="cls-2"
           d="m 58.31,27.4 c 0,-0.3 0,-0.6 0,-0.89 h 0.66 v 0.62 0 a 1.08,1.08 0 0 1 2,0 1.08,1.08 0 0 1 1,-0.64 c 0.71,0 1.19,0.41 1.19,1.31 v 2.85 H 62.49 V 27.8 c 0,-0.52 -0.23,-0.76 -0.63,-0.76 -0.4,0 -0.78,0.3 -0.78,1.05 v 2.53 H 60.41 V 27.8 c 0,-0.52 -0.23,-0.76 -0.63,-0.76 -0.4,0 -0.78,0.3 -0.78,1.05 v 2.53 h -0.67 z"
           id="path420"
           style="fill:#00508c" />
        <path
           class="cls-2"
           d="m 64.11,24.58 h 0.68 v 2.5 0 a 1.13,1.13 0 0 1 1,-0.62 c 0.85,0 1.42,0.69 1.42,2.11 0,1.42 -0.57,2.11 -1.42,2.11 A 1.17,1.17 0 0 1 64.77,30 v 0 0.6 h -0.65 c 0,-0.25 0,-0.5 0,-0.75 z m 1.58,5.55 c 0.62,0 0.9,-0.53 0.9,-1.56 0,-1.03 -0.28,-1.57 -0.9,-1.57 -0.62,0 -0.9,0.53 -0.9,1.56 0,1.03 0.28,1.57 0.9,1.57 z"
           id="path422"
           style="fill:#00508c" />
        <path
           class="cls-2"
           d="m 68.61,28.77 c 0,0.95 0.37,1.39 1.12,1.39 a 1.72,1.72 0 0 0 0.94,-0.33 v 0.61 a 2.81,2.81 0 0 1 -1.15,0.24 c -1.09,0 -1.65,-0.82 -1.65,-2.11 0,-1.29 0.56,-2.11 1.59,-2.11 1.03,0 1.44,0.74 1.44,1.95 v 0.36 z m 1.64,-0.52 c 0,-0.85 -0.26,-1.28 -0.8,-1.28 -0.54,0 -0.83,0.33 -0.84,1.28 z"
           id="path424"
           style="fill:#00508c" />
        <path
           class="cls-2"
           d="m 74.68,29.87 c 0,0.25 0,0.5 0,0.75 h -0.66 v -0.6 0 a 1.15,1.15 0 0 1 -1.08,0.66 c -0.84,0 -1.42,-0.69 -1.42,-2.11 0,-1.42 0.58,-2.11 1.42,-2.11 a 1.12,1.12 0 0 1 1,0.62 v 0 -2.5 h 0.67 z M 73.1,27 c -0.62,0 -0.9,0.53 -0.9,1.56 0,1.03 0.28,1.56 0.9,1.56 0.62,0 0.91,-0.53 0.91,-1.56 C 74.01,27.53 73.73,27 73.1,27 Z"
           id="path426"
           style="fill:#00508c" />
        <path
           class="cls-2"
           d="m 78.61,29.87 c 0,0.25 0,0.5 0,0.75 H 78 v -0.6 0 a 1.18,1.18 0 0 1 -1.08,0.66 c -0.85,0 -1.42,-0.69 -1.42,-2.11 0,-1.42 0.57,-2.11 1.42,-2.11 a 1.13,1.13 0 0 1 1,0.62 v 0 -2.5 H 78.6 Z M 77,27 c -0.62,0 -0.9,0.53 -0.9,1.56 0,1.03 0.28,1.56 0.9,1.56 0.62,0 0.9,-0.53 0.9,-1.56 C 77.9,27.53 77.65,27 77,27 Z"
           id="path428"
           style="fill:#00508c" />
        <path
           class="cls-2"
           d="m 80.08,28.77 c 0,0.95 0.37,1.39 1.12,1.39 a 1.78,1.78 0 0 0 1,-0.33 v 0.61 a 2.81,2.81 0 0 1 -1.15,0.24 c -1.09,0 -1.66,-0.82 -1.66,-2.11 0,-1.29 0.57,-2.11 1.59,-2.11 1.02,0 1.45,0.74 1.45,1.95 v 0.36 z m 1.65,-0.52 c 0,-0.85 -0.27,-1.28 -0.81,-1.28 -0.54,0 -0.82,0.33 -0.84,1.28 z"
           id="path430"
           style="fill:#00508c" />
        <path
           class="cls-2"
           d="m 86.16,29.87 c 0,0.25 0,0.5 0,0.75 h -0.65 v -0.6 0 a 1.17,1.17 0 0 1 -1.08,0.66 c -0.85,0 -1.42,-0.69 -1.42,-2.11 0,-1.42 0.57,-2.11 1.42,-2.11 a 1.13,1.13 0 0 1 1,0.62 v 0 -2.5 h 0.68 z M 84.58,27 c -0.62,0 -0.9,0.53 -0.9,1.56 0,1.03 0.28,1.56 0.9,1.56 0.62,0 0.9,-0.53 0.9,-1.56 0,-1.03 -0.28,-1.56 -0.9,-1.56 z"
           id="path432"
           style="fill:#00508c" />
        <path
           class="cls-2"
           d="M 87.22,29.72 H 88 v 0.9 h -0.77 z"
           id="path434"
           style="fill:#00508c" />
        <path
           class="cls-2"
           d="m 94.25,30.51 a 3.42,3.42 0 0 1 -1,0.17 c -1.78,0 -2.53,-1.35 -2.53,-2.88 0,-1.75 1,-2.86 2.49,-2.86 a 2.59,2.59 0 0 1 1.07,0.2 v 0.7 a 1.92,1.92 0 0 0 -1.06,-0.29 1.87,1.87 0 0 0 -1.76,2.11 c 0,1.45 0.58,2.41 1.81,2.41 a 2,2 0 0 0 1,-0.27 z"
           id="path436"
           style="fill:#00508c" />
        <path
           class="cls-2"
           d="m 96.62,26.46 c 1.09,0 1.66,0.82 1.66,2.11 0,1.29 -0.57,2.11 -1.66,2.11 -1.09,0 -1.62,-0.82 -1.62,-2.11 0,-1.29 0.53,-2.11 1.62,-2.11 z m 0,3.67 c 0.65,0 0.95,-0.53 0.95,-1.56 0,-1.03 -0.3,-1.57 -0.95,-1.57 -0.65,0 -0.94,0.53 -0.94,1.56 0,1.03 0.32,1.57 0.94,1.57 z"
           id="path438"
           style="fill:#00508c" />
        <path
           class="cls-2"
           d="m 99.1,27.4 c 0,-0.3 0,-0.6 0,-0.89 h 0.66 v 0.62 0 a 1.08,1.08 0 0 1 2,0 1.08,1.08 0 0 1 1,-0.64 c 0.71,0 1.19,0.41 1.19,1.31 v 2.85 h -0.68 V 27.8 c 0,-0.52 -0.22,-0.76 -0.62,-0.76 -0.4,0 -0.78,0.3 -0.78,1.05 v 2.53 h -0.68 V 27.8 c 0,-0.52 -0.22,-0.76 -0.62,-0.76 -0.4,0 -0.78,0.3 -0.78,1.05 v 2.53 H 99.1 Z"
           id="path440"
           style="fill:#00508c" />
        <path
           class="cls-2"
           d="m 104.91,27.27 c 0,-0.25 0,-0.51 0,-0.76 h 0.65 v 0.61 0 a 1.17,1.17 0 0 1 1.08,-0.66 c 0.85,0 1.42,0.69 1.42,2.11 0,1.42 -0.57,2.11 -1.42,2.11 a 1.13,1.13 0 0 1 -1.05,-0.62 v 0 2.31 h -0.68 z m 1.58,2.86 c 0.62,0 0.9,-0.53 0.9,-1.56 0,-1.03 -0.28,-1.56 -0.9,-1.56 -0.62,0 -0.9,0.53 -0.9,1.56 0,1.03 0.28,1.56 0.9,1.56 z"
           id="path442"
           style="fill:#00508c" />
        <path
           class="cls-2"
           d="m 111.8,29.74 c 0,0.3 0,0.59 0,0.88 h -0.65 v -0.61 0 a 1.06,1.06 0 0 1 -1,0.67 c -0.72,0 -1.2,-0.41 -1.2,-1.31 v -2.86 h 0.67 v 2.66 c 0,0.65 0.25,0.93 0.68,0.93 0.43,0 0.87,-0.37 0.87,-1.11 v -2.48 h 0.68 z"
           id="path444"
           style="fill:#00508c" />
        <path
           class="cls-2"
           d="m 114.64,30.58 a 2.06,2.06 0 0 1 -0.57,0.1 c -0.62,0 -0.95,-0.25 -0.95,-1 v -2.62 h -0.65 v -0.55 h 0.65 v -0.83 l 0.68,-0.21 v 1 h 0.84 v 0.55 h -0.84 v 2.43 c 0,0.47 0.12,0.64 0.43,0.64 a 1,1 0 0 0 0.41,-0.1 z"
           id="path446"
           style="fill:#00508c" />
        <path
           class="cls-2"
           d="m 116,24.82 v 0.81 h -0.74 v -0.81 z m -0.71,1.69 H 116 v 4.11 h -0.68 z"
           id="path448"
           style="fill:#00508c" />
        <path
           class="cls-2"
           d="m 117.1,27.4 c 0,-0.3 0,-0.6 0,-0.89 h 0.65 v 0.62 0 a 1.06,1.06 0 0 1 1,-0.67 c 0.72,0 1.2,0.41 1.2,1.31 v 2.85 h -0.67 V 28 c 0,-0.65 -0.24,-0.93 -0.68,-0.93 -0.44,0 -0.87,0.37 -0.87,1.11 v 2.47 h -0.68 z"
           id="path450"
           style="fill:#00508c" />
        <path
           class="cls-2"
           d="m 124,30.8 a 1.57,1.57 0 0 1 -1.75,1.61 3.88,3.88 0 0 1 -1.2,-0.25 v -0.68 a 2.31,2.31 0 0 0 1.13,0.35 1,1 0 0 0 1.15,-1.2 V 30 30 a 1.19,1.19 0 0 1 -1.08,0.69 c -0.84,0 -1.42,-0.69 -1.42,-2.11 0,-1.42 0.58,-2.11 1.5,-2.11 a 1.16,1.16 0 0 1 1,0.65 v 0 -0.6 H 124 c 0,0.25 0,0.5 0,0.75 z m -1.58,-0.67 c 0.62,0 0.91,-0.53 0.91,-1.56 0,-1.03 -0.33,-1.57 -0.92,-1.57 -0.59,0 -0.9,0.53 -0.9,1.56 0,1.03 0.28,1.57 0.9,1.57 z"
           id="path452"
           style="fill:#00508c" />
        <path
           class="cls-2"
           d="m 125.05,29.72 h 0.77 v 0.9 h -0.77 z"
           id="path454"
           style="fill:#00508c" />
      </g>
    </g>
  </g>
</svg>
