<?xml version="1.0" encoding="UTF-8" standalone="no"?>
<!-- Created with Inkscape (http://www.inkscape.org/) -->

<svg
   width="150"
   height="80"
   id="svg3948"
   version="1.1"
   inkscape:version="1.2.2 (b0a8486541, 2022-12-01)"
   sodipodi:docname="logo-brdsoft-capa.svg"
   inkscape:export-filename="/home/phls/Dropbox/debian-brasil/logo-debian-brasil.png"
   inkscape:export-xdpi="96"
   inkscape:export-ydpi="96"
   xmlns:inkscape="http://www.inkscape.org/namespaces/inkscape"
   xmlns:sodipodi="http://sodipodi.sourceforge.net/DTD/sodipodi-0.dtd"
   xmlns="http://www.w3.org/2000/svg"
   xmlns:svg="http://www.w3.org/2000/svg"
   xmlns:rdf="http://www.w3.org/1999/02/22-rdf-syntax-ns#"
   xmlns:cc="http://creativecommons.org/ns#"
   xmlns:dc="http://purl.org/dc/elements/1.1/">
  <defs
     id="defs3950">
    <clipPath
       clipPathUnits="userSpaceOnUse"
       id="clipPath16">
      <path
         inkscape:connector-curvature="0"
         d="M 0,800 H 1280 V 0 H 0 Z"
         id="path18" />
    </clipPath>
    <clipPath
       clipPathUnits="userSpaceOnUse"
       id="clipPath38">
      <path
         inkscape:connector-curvature="0"
         d="M 0,800 H 1280 V 0 H 0 Z"
         id="path40" />
    </clipPath>
    <clipPath
       clipPathUnits="userSpaceOnUse"
       id="clipPath56">
      <path
         inkscape:connector-curvature="0"
         d="M 0,800 H 1280 V 0 H 0 Z"
         id="path58" />
    </clipPath>
    <clipPath
       clipPathUnits="userSpaceOnUse"
       id="clipPath80">
      <path
         inkscape:connector-curvature="0"
         d="M 0,800 H 1280 V 0 H 0 Z"
         id="path82" />
    </clipPath>
    <clipPath
       clipPathUnits="userSpaceOnUse"
       id="clipPath100">
      <path
         inkscape:connector-curvature="0"
         d="M 0,800 H 1280 V 0 H 0 Z"
         id="path102" />
    </clipPath>
  </defs>
  <sodipodi:namedview
     id="base"
     pagecolor="#ffffff"
     bordercolor="#666666"
     borderopacity="1.0"
     inkscape:pageopacity="0.0"
     inkscape:pageshadow="2"
     inkscape:zoom="2.8"
     inkscape:cx="212.85714"
     inkscape:cy="46.428571"
     inkscape:document-units="px"
     inkscape:current-layer="g4457"
     showgrid="false"
     inkscape:window-width="1920"
     inkscape:window-height="1003"
     inkscape:window-x="1080"
     inkscape:window-y="0"
     inkscape:window-maximized="1"
     inkscape:showpageshadow="2"
     inkscape:pagecheckerboard="0"
     inkscape:deskcolor="#d1d1d1" />
  <metadata
     id="metadata3953">
    <rdf:RDF>
      <cc:Work
         rdf:about="">
        <dc:format>image/svg+xml</dc:format>
        <dc:type
           rdf:resource="http://purl.org/dc/dcmitype/StillImage" />
      </cc:Work>
    </rdf:RDF>
  </metadata>
  <g
     inkscape:label="Camada 1"
     inkscape:groupmode="layer"
     id="layer1"
     transform="translate(0,-622.5197)">
    <g
       id="g4457"
       transform="translate(-201.18066,-543.63188)">
      <g
         id="g505"
         transform="matrix(0.71239755,0,0,0.71239755,161.82018,1128.3993)">
        <path
           class="st2"
           d="m 255.41,125.1 v 0 c -2.46,-0.08 -4.34,-0.69 -5.64,-1.82 -1.29,-1.13 -2.15,-2.6 -2.58,-4.39 -0.42,-1.8 -0.64,-3.97 -0.64,-6.51 V 96.19 h -3.39 v -6.48 h 3.39 V 79.04 h 10 v 10.67 h 4.97 v 6.48 h -4.97 v 18.06 c 0,1.9 1.13,2.85 3.39,2.85 0.53,0 1.02,-0.04 1.48,-0.12 0.46,-0.08 0.76,-0.12 0.88,-0.12 v 7.76 c -2.06,0.36 -3.86,0.55 -5.39,0.55 z m -28,-28.72 v 0 h -3.33 v -6.67 h 3.33 V 87.1 c 0,-2.34 0.22,-4.23 0.67,-5.67 0.44,-1.43 1.36,-2.56 2.76,-3.36 1.39,-0.81 3.44,-1.21 6.15,-1.21 1.62,0 3.19,0.1 4.73,0.3 v 7.33 c -0.89,-0.2 -1.6,-0.3 -2.12,-0.3 -1.54,0 -2.3,0.91 -2.3,2.73 v 2.79 h 4.42 v 6.67 h -4.42 v 28.36 h -9.88 V 96.38 Z m -19.03,22.42 v 0 c 0.97,0 1.64,-0.35 2,-1.06 0.36,-0.71 0.55,-1.77 0.55,-3.18 V 99.89 c 0,-1.41 -0.18,-2.47 -0.55,-3.18 -0.36,-0.71 -1.03,-1.06 -2,-1.06 -0.89,0 -1.53,0.36 -1.91,1.09 -0.38,0.73 -0.58,1.78 -0.58,3.15 v 14.66 c 0,1.41 0.19,2.47 0.58,3.18 0.39,0.71 1.02,1.07 1.91,1.07 z m 0,6.54 v 0 c -3.84,0 -6.84,-0.97 -9,-2.91 -2.16,-1.94 -3.24,-4.79 -3.24,-8.54 v -13.33 c 0,-3.76 1.08,-6.61 3.24,-8.54 2.16,-1.94 5.16,-2.91 9,-2.91 3.84,0 6.85,0.98 9.03,2.94 2.18,1.96 3.27,4.8 3.27,8.51 v 13.33 c 0,3.72 -1.09,6.55 -3.27,8.51 -2.18,1.96 -5.19,2.94 -9.03,2.94 z m -29.09,0.12 v 0 c -4.69,0 -8.17,-1.24 -10.45,-3.73 -2.28,-2.48 -3.5,-6.43 -3.67,-11.85 l 9.27,-1.39 c 0.04,3.11 0.41,5.34 1.12,6.7 0.71,1.35 1.77,2.03 3.18,2.03 1.82,0 2.73,-1.19 2.73,-3.58 0,-1.9 -0.43,-3.54 -1.3,-4.91 -0.87,-1.37 -2.23,-2.85 -4.09,-4.42 l -4.24,-3.7 c -2.18,-1.9 -3.83,-3.79 -4.94,-5.67 -1.11,-1.88 -1.67,-4.25 -1.67,-7.12 0,-4.12 1.22,-7.29 3.67,-9.51 2.44,-2.22 5.81,-3.33 10.09,-3.33 4.65,0 7.81,1.35 9.48,4.06 1.68,2.71 2.58,6 2.7,9.88 l -9.33,1.15 c -0.08,-2.55 -0.31,-4.38 -0.7,-5.51 -0.38,-1.13 -1.22,-1.68 -2.51,-1.64 -0.93,0 -1.65,0.39 -2.15,1.18 -0.51,0.79 -0.76,1.67 -0.76,2.64 0,1.74 0.39,3.16 1.18,4.27 0.79,1.11 1.97,2.37 3.54,3.79 l 4.06,3.58 c 2.42,2.18 4.3,4.4 5.64,6.67 1.33,2.26 2,4.95 2,8.06 0,2.3 -0.54,4.39 -1.61,6.27 -1.07,1.88 -2.58,3.36 -4.51,4.45 -1.94,1.09 -4.18,1.63 -6.73,1.63 z m -35.99,-8.24 v 0 c 1.58,0 2.74,-0.23 3.48,-0.7 0.75,-0.46 1.22,-1.13 1.42,-2 0.2,-0.87 0.3,-2.15 0.3,-3.85 V 89.29 c 0,-1.58 -0.11,-2.78 -0.33,-3.61 -0.22,-0.83 -0.71,-1.44 -1.45,-1.85 -0.75,-0.4 -1.91,-0.61 -3.48,-0.61 h -1.64 v 34 z M 130.75,75.65 v 0 h 12.42 c 4.24,0 7.55,0.53 9.94,1.58 2.38,1.05 4.07,2.7 5.06,4.94 0.99,2.24 1.48,5.24 1.48,9 v 17.82 c 0,3.8 -0.49,6.83 -1.48,9.09 -0.99,2.26 -2.67,3.94 -5.03,5.03 -2.36,1.09 -5.65,1.64 -9.85,1.64 H 130.75 Z M 108.27,96.5 v 0 c 2.18,0 3.71,-0.58 4.58,-1.73 0.87,-1.15 1.3,-2.88 1.3,-5.18 0,-2.22 -0.4,-3.89 -1.21,-5 -0.81,-1.11 -2.2,-1.67 -4.18,-1.67 h -3.52 V 96.5 Z M 94.39,75.65 v 0 h 13.51 c 5.37,0 9.43,0.95 12.18,2.85 2.75,1.9 4.12,5.27 4.12,10.12 0,3.27 -0.42,5.88 -1.27,7.82 -0.85,1.94 -2.42,3.45 -4.73,4.55 l 6.73,23.76 h -11.21 l -5.39,-22 h -3.09 v 22 H 94.39 Z m -22.48,41.51 v 0 c 2.3,0 3.93,-0.58 4.88,-1.73 0.95,-1.15 1.42,-2.96 1.42,-5.42 0,-2.79 -0.47,-4.75 -1.42,-5.88 -0.95,-1.13 -2.6,-1.7 -4.94,-1.7 h -2.24 v 14.73 z M 71.73,95.29 v 0 c 2.3,0 3.87,-0.52 4.7,-1.58 0.83,-1.05 1.24,-2.69 1.24,-4.91 0,-1.94 -0.53,-3.4 -1.58,-4.39 -1.05,-0.99 -2.59,-1.48 -4.61,-1.48 H 69.6 V 95.29 Z M 58.76,75.65 h 12.79 c 4.89,0 8.72,0.87 11.48,2.61 2.77,1.74 4.15,5.03 4.15,9.88 0,5.94 -2.4,9.35 -7.21,10.24 2.91,0.36 5.09,1.58 6.54,3.64 1.45,2.06 2.18,4.89 2.18,8.48 0,9.49 -4.95,14.24 -14.85,14.24 H 58.76 Z"
           id="path439"
           style="clip-rule:evenodd;fill:#002e5e;fill-rule:evenodd" />
        <g
           id="g503">
          <path
             class="st6"
             d="m 64.13,132.74 c 0.01,-1.45 -2.73,-1.51 -3.67,-0.62 -0.61,0.58 -0.74,1.86 -0.16,2.54 0.42,0.51 1.2,0.71 1.9,0.89 1.71,0.44 3.08,1.18 3.06,3.15 -0.01,0.83 -0.39,1.49 -0.94,1.96 -0.93,0.77 -2.52,0.78 -3.64,0.42 -0.84,-0.29 -1.48,-0.96 -1.47,-1.86 l 0.71,0.01 c 0.03,0.61 0.54,1.1 1.09,1.26 0.94,0.26 2.03,0.28 2.84,-0.39 0.41,-0.33 0.67,-0.81 0.68,-1.41 0.01,-1.55 -1.32,-2.19 -2.52,-2.5 -0.87,-0.22 -1.7,-0.48 -2.21,-1.02 -0.89,-0.96 -0.74,-2.74 0.16,-3.58 1.31,-1.23 4.9,-0.97 4.89,1.16 z"
             id="path441"
             style="fill:#949698" />
          <path
             class="st6"
             d="m 71.77,139.25 c 0,0.9 -0.62,1.48 -1.47,1.77 -0.62,0.2 -1.29,0.23 -1.94,0.13 -1.09,-0.19 -2.02,-0.81 -2.02,-1.9 v -3.37 c 0,-0.96 0.73,-1.57 1.65,-1.81 0.35,-0.1 0.7,-0.15 1.06,-0.15 0.36,0 0.73,0.04 1.06,0.15 0.93,0.25 1.65,0.86 1.65,1.81 v 3.37 z m -0.73,0 v -3.37 c 0,-0.57 -0.49,-0.94 -1.12,-1.12 -0.28,-0.07 -0.57,-0.12 -0.87,-0.12 -0.3,0 -0.59,0.04 -0.87,0.12 -0.62,0.17 -1.12,0.54 -1.12,1.12 v 3.37 c 0,0.65 0.65,1.07 1.41,1.2 0.54,0.09 1.09,0.06 1.6,-0.12 0.55,-0.18 0.97,-0.55 0.97,-1.08 z"
             id="path443"
             style="fill:#949698" />
          <path
             class="st6"
             d="m 74.99,141.2 c -1.19,0.07 -1.78,-0.3 -1.78,-1.6 v -8.62 h 0.73 v 8.63 c 0,0.75 0.3,0.93 1.06,0.93 v 0.66 z"
             id="path445"
             style="fill:#949698" />
          <path
             class="st6"
             d="m 76.79,134.03 v 5.15 c 0,0.87 1,1.33 1.99,1.33 0.99,0 1.99,-0.46 1.99,-1.44 v -5.05 h 0.73 v 7.11 h -0.73 v -0.68 c -0.54,0.6 -1.29,0.75 -1.97,0.77 -1.35,0 -2.73,-0.62 -2.73,-2.05 v -5.15 h 0.72 z"
             id="path447"
             style="fill:#949698" />
          <path
             class="st6"
             d="m 84.95,141.92 0.35,-0.73 c -0.22,-0.01 -0.42,-0.06 -0.62,-0.1 -0.9,-0.25 -1.65,-0.86 -1.65,-1.86 v -3.32 c 0,-0.99 0.77,-1.58 1.65,-1.83 0.33,-0.09 0.7,-0.15 1.06,-0.15 0.35,0 0.71,0.06 1.06,0.15 0.93,0.26 1.65,0.86 1.65,1.83 h -0.73 c 0,-0.58 -0.49,-0.96 -1.13,-1.13 -0.26,-0.07 -0.57,-0.12 -0.86,-0.12 -0.3,0 -0.6,0.04 -0.87,0.12 -0.54,0.15 -1.12,0.49 -1.12,1.15 v 3.31 c 0,0.65 0.57,1 1.12,1.16 0.54,0.15 1.19,0.15 1.73,0 h 0.01 c 0.62,-0.17 1.12,-0.55 1.12,-1.13 h 0.73 c 0,0.96 -0.73,1.57 -1.65,1.81 v 0.01 c -0.32,0.07 -0.64,0.12 -0.97,0.13 l -0.17,0.39 c 0.93,-0.03 1.31,0.44 1.29,0.81 -0.04,0.94 -1.86,1.19 -2.41,0.46 l 0.39,-0.3 c 0.33,0.33 1.32,0.29 1.32,-0.17 0,-0.46 -0.91,-0.41 -1.29,-0.42 v -0.07 z"
             id="path449"
             style="fill:#949698" />
          <path
             class="st6"
             d="m 95.2,139.25 c 0,0.9 -0.62,1.48 -1.47,1.77 -0.62,0.2 -1.29,0.23 -1.94,0.13 -1.09,-0.19 -2.02,-0.81 -2.02,-1.9 v -3.37 c 0,-0.96 0.73,-1.57 1.65,-1.81 0.35,-0.1 0.7,-0.15 1.06,-0.15 0.36,0 0.73,0.04 1.06,0.15 0.93,0.25 1.65,0.86 1.65,1.81 v 3.37 z m -0.73,0 v -3.37 c 0,-0.57 -0.49,-0.94 -1.12,-1.12 -0.28,-0.07 -0.57,-0.12 -0.87,-0.12 -0.3,0 -0.59,0.04 -0.87,0.12 -0.62,0.17 -1.12,0.54 -1.12,1.12 v 3.37 c 0,0.65 0.65,1.07 1.41,1.2 0.54,0.09 1.09,0.06 1.6,-0.12 0.55,-0.18 0.97,-0.55 0.97,-1.08 z m -3.29,-6.73 c 0.07,-0.39 0.46,-0.77 0.86,-0.8 0.54,-0.06 0.86,0.46 1.13,0.44 0.19,-0.01 0.29,-0.13 0.33,-0.32 l 0.45,0.19 c -0.07,0.39 -0.36,0.65 -0.77,0.68 -0.51,0.03 -0.75,-0.46 -1.09,-0.45 -0.22,0.01 -0.42,0.19 -0.46,0.41 z"
             id="path451"
             style="fill:#949698" />
          <path
             class="st6"
             d="m 97.36,139.17 c 0,0.23 0.04,0.42 0.17,0.61 0.25,0.33 0.7,0.57 1.2,0.65 0.39,0.07 0.75,0.07 1.15,0 0.54,-0.07 1.03,-0.29 1.35,-0.74 l 0.62,0.38 c -0.42,0.68 -1.13,0.97 -1.87,1.09 -0.44,0.07 -0.83,0.09 -1.26,0.01 -0.74,-0.12 -1.41,-0.45 -1.78,-0.96 -0.23,-0.33 -0.32,-0.7 -0.32,-1.1 v -3.22 c 0,-0.96 0.73,-1.55 1.67,-1.81 0.68,-0.19 1.42,-0.19 2.1,0 1.89,0.57 2.21,3.08 0.45,4 -1.02,0.55 -2.51,0.35 -3.48,0.35 z m 0,-1.38 c 0.62,-0.03 2.16,0.13 3.13,-0.33 1.23,-0.58 1,-2.32 -0.29,-2.68 -0.55,-0.15 -1.18,-0.15 -1.73,0 -0.62,0.17 -1.12,0.55 -1.12,1.12 v 1.89 z"
             id="path453"
             style="fill:#949698" />
          <path
             class="st6"
             d="m 103.78,139.37 c 0.52,1.25 2.15,1.25 3.03,1 0.64,-0.17 1.13,-0.57 1.13,-1.15 0.01,-1 -1,-1.13 -2.02,-1.26 -1.33,-0.17 -2.66,-0.33 -2.64,-2 0.01,-1 0.74,-1.62 1.67,-1.9 1.15,-0.32 3,-0.19 3.56,1.04 l -0.58,0.38 c -0.54,-0.91 -1.87,-0.97 -2.79,-0.71 -0.64,0.19 -1.13,0.58 -1.13,1.19 -0.01,1 1,1.13 2.02,1.26 1.32,0.17 2.66,0.35 2.64,2 -0.01,0.99 -0.74,1.6 -1.67,1.86 -1.26,0.36 -3.35,0.12 -3.85,-1.31 z"
             id="path455"
             style="fill:#949698" />
          <path
             class="st6"
             d="m 118.68,130.92 c 0,3.4 0,6.81 0,10.22 h -0.67 v -0.8 c -0.58,0.83 -2.03,1.1 -3.11,0.81 -0.93,-0.25 -1.65,-0.86 -1.65,-1.81 v -3.21 c 0,-2.16 3.51,-2.68 4.7,-1.28 v -3.93 z m -0.72,5.08 c 0,-1.58 -3.96,-1.73 -3.96,0.1 v 3.24 h -0.01 c 0,0.57 0.49,0.94 1.13,1.12 0.26,0.07 0.57,0.1 0.86,0.1 0.91,0 1.99,-0.44 1.99,-1.54 V 136 Z"
             id="path457"
             style="fill:#949698" />
          <path
             class="st6"
             d="m 120.86,139.17 c 0,0.23 0.04,0.42 0.17,0.61 0.25,0.33 0.7,0.57 1.2,0.65 0.39,0.07 0.75,0.07 1.15,0 0.54,-0.07 1.03,-0.29 1.35,-0.74 l 0.62,0.38 c -0.42,0.68 -1.13,0.97 -1.87,1.09 -0.44,0.07 -0.83,0.09 -1.26,0.01 -0.74,-0.12 -1.41,-0.45 -1.78,-0.96 -0.23,-0.33 -0.32,-0.7 -0.32,-1.1 v -3.22 c 0,-0.96 0.73,-1.55 1.67,-1.81 0.68,-0.19 1.42,-0.19 2.1,0 1.89,0.57 2.21,3.08 0.45,4 -1.02,0.55 -2.51,0.35 -3.48,0.35 z m 0,-1.38 c 0.62,-0.03 2.16,0.13 3.13,-0.33 1.23,-0.58 1,-2.32 -0.29,-2.68 -0.55,-0.15 -1.18,-0.15 -1.73,0 -0.62,0.17 -1.12,0.55 -1.12,1.12 v 1.89 z"
             id="path459"
             style="fill:#949698" />
          <path
             class="st6"
             d="m 129.9,130.98 h 6.25 v 0.64 h -2.76 l -0.03,9.52 h -0.74 l 0.03,-9.52 h -2.76 v -0.64 z"
             id="path461"
             style="fill:#949698" />
          <path
             class="st6"
             d="m 137.54,140.17 h 0.87 v 0.99 h -0.87 z"
             id="path463"
             style="fill:#949698" />
          <path
             class="st6"
             d="m 141.18,130.97 v 10.17 h -0.73 c 0,-3.4 0,-6.78 0,-10.17 z"
             id="path465"
             style="fill:#949698" />
          <path
             class="st6"
             d="m 143.11,140.17 h 0.87 v 0.99 h -0.87 z"
             id="path467"
             style="fill:#949698" />
          <path
             class="st6"
             d="m 150.03,139.17 c 0,0.23 0.04,0.42 0.17,0.61 0.25,0.33 0.7,0.57 1.2,0.65 0.39,0.07 0.75,0.07 1.15,0 0.54,-0.07 1.03,-0.29 1.35,-0.74 l 0.62,0.38 c -0.42,0.68 -1.13,0.97 -1.87,1.09 -0.44,0.07 -0.83,0.09 -1.26,0.01 -0.74,-0.12 -1.41,-0.45 -1.78,-0.96 -0.23,-0.33 -0.32,-0.7 -0.32,-1.1 v -3.22 c 0,-0.96 0.73,-1.55 1.67,-1.81 0.68,-0.19 1.42,-0.19 2.1,0 1.89,0.57 2.21,3.08 0.45,4 -1.02,0.55 -2.51,0.35 -3.48,0.35 z m 0,-1.38 c 0.62,-0.03 2.16,0.13 3.13,-0.33 1.23,-0.58 1,-2.32 -0.29,-2.68 -0.55,-0.15 -1.18,-0.15 -1.73,0 -0.62,0.17 -1.12,0.55 -1.12,1.12 v 1.89 z"
             id="path469"
             style="fill:#949698" />
          <path
             class="st6"
             d="m 159.08,130.98 h 6.25 v 0.64 h -2.76 l -0.03,9.52 h -0.74 l 0.03,-9.52 h -2.76 v -0.64 z"
             id="path471"
             style="fill:#949698" />
          <path
             class="st6"
             d="m 165.69,139.17 c 0,0.23 0.04,0.42 0.17,0.61 0.25,0.33 0.7,0.57 1.2,0.65 0.39,0.07 0.75,0.07 1.15,0 0.54,-0.07 1.03,-0.29 1.35,-0.74 l 0.62,0.38 c -0.42,0.68 -1.13,0.97 -1.87,1.09 -0.44,0.07 -0.83,0.09 -1.26,0.01 -0.74,-0.12 -1.41,-0.45 -1.78,-0.96 -0.23,-0.33 -0.32,-0.7 -0.32,-1.1 v -3.22 c 0,-0.96 0.73,-1.55 1.67,-1.81 0.68,-0.19 1.42,-0.19 2.1,0 1.89,0.57 2.21,3.08 0.45,4 -1.02,0.55 -2.51,0.35 -3.48,0.35 z m 0,-1.38 c 0.62,-0.03 2.16,0.13 3.13,-0.33 1.23,-0.58 1,-2.32 -0.29,-2.68 -0.55,-0.15 -1.18,-0.15 -1.73,0 -0.62,0.17 -1.12,0.55 -1.12,1.12 v 1.89 z"
             id="path473"
             style="fill:#949698" />
          <path
             class="st6"
             d="m 173.49,141.2 c -1.19,0.07 -1.78,-0.3 -1.78,-1.6 v -8.62 h 0.73 v 8.63 c 0,0.75 0.3,0.93 1.06,0.93 v 0.66 z"
             id="path475"
             style="fill:#949698" />
          <path
             class="st6"
             d="m 175.32,139.17 c 0,0.23 0.04,0.42 0.17,0.61 0.25,0.33 0.7,0.57 1.2,0.65 0.39,0.07 0.75,0.07 1.15,0 0.54,-0.07 1.03,-0.29 1.35,-0.74 l 0.62,0.38 c -0.42,0.68 -1.13,0.97 -1.87,1.09 -0.44,0.07 -0.83,0.09 -1.26,0.01 -0.74,-0.12 -1.41,-0.45 -1.78,-0.96 -0.23,-0.33 -0.32,-0.7 -0.32,-1.1 v -3.22 c 0,-0.96 0.73,-1.55 1.67,-1.81 0.68,-0.19 1.42,-0.19 2.1,0 1.89,0.57 2.21,3.08 0.45,4 -1.02,0.55 -2.51,0.35 -3.48,0.35 z m 0,-1.38 c 0.62,-0.03 2.16,0.13 3.13,-0.33 1.23,-0.58 1,-2.32 -0.29,-2.68 -0.55,-0.15 -1.18,-0.15 -1.73,0 -0.62,0.17 -1.12,0.55 -1.12,1.12 v 1.89 z"
             id="path477"
             style="fill:#949698" />
          <path
             class="st6"
             d="m 186.71,139.27 c 0,0.96 -0.73,1.57 -1.65,1.81 v 0.01 c -0.68,0.17 -1.44,0.17 -2.12,0 -0.9,-0.25 -1.65,-0.86 -1.65,-1.86 v -3.32 c 0,-0.99 0.77,-1.58 1.65,-1.83 0.33,-0.09 0.7,-0.15 1.06,-0.15 0.35,0 0.71,0.06 1.06,0.15 0.93,0.26 1.65,0.86 1.65,1.83 h -0.73 c 0,-0.58 -0.49,-0.96 -1.13,-1.13 -0.26,-0.07 -0.57,-0.12 -0.86,-0.12 -0.3,0 -0.6,0.04 -0.87,0.12 -0.54,0.15 -1.12,0.49 -1.12,1.15 v 3.31 c 0,0.65 0.57,1 1.12,1.16 0.54,0.15 1.19,0.15 1.73,0 h 0.01 c 0.62,-0.17 1.12,-0.55 1.12,-1.13 z"
             id="path479"
             style="fill:#949698" />
          <path
             class="st6"
             d="m 193.46,139.25 c 0,0.9 -0.62,1.48 -1.47,1.77 -0.62,0.2 -1.29,0.23 -1.94,0.13 -1.09,-0.19 -2.02,-0.81 -2.02,-1.9 v -3.37 c 0,-0.96 0.73,-1.57 1.65,-1.81 0.35,-0.1 0.7,-0.15 1.06,-0.15 0.36,0 0.73,0.04 1.06,0.15 0.93,0.25 1.65,0.86 1.65,1.81 v 3.37 z m -0.73,0 v -3.37 c 0,-0.57 -0.49,-0.94 -1.12,-1.12 -0.28,-0.07 -0.57,-0.12 -0.87,-0.12 -0.3,0 -0.59,0.04 -0.87,0.12 -0.62,0.17 -1.12,0.54 -1.12,1.12 v 3.37 c 0,0.65 0.65,1.07 1.41,1.2 0.54,0.09 1.09,0.06 1.6,-0.12 0.55,-0.18 0.97,-0.55 0.97,-1.08 z"
             id="path481"
             style="fill:#949698" />
          <path
             class="st6"
             d="m 199.93,141.14 c -0.25,0 -0.48,0 -0.73,0 v -5.25 c -0.06,-0.9 -0.9,-1.32 -1.74,-1.31 -0.93,0.03 -1.86,0.6 -1.86,1.49 v 5.06 h -0.74 v -7.12 h 0.74 v 0.68 c 0.54,-0.6 1.29,-0.77 1.97,-0.77 0.88,0 1.73,0.35 2.03,1.03 0.39,-0.68 1.31,-1 2.13,-1 1.26,0.01 2.52,0.65 2.52,2.02 v 5.17 h -0.74 v -5.18 c 0,-0.93 -0.9,-1.33 -1.8,-1.33 -0.87,0 -1.74,0.39 -1.8,1.26 v 5.25 z"
             id="path483"
             style="fill:#949698" />
          <path
             class="st6"
             d="m 206.54,134.03 v 5.15 c 0,0.87 1,1.33 1.99,1.33 0.99,0 1.99,-0.46 1.99,-1.44 v -5.05 h 0.73 v 7.11 h -0.73 v -0.68 c -0.54,0.6 -1.29,0.75 -1.97,0.77 -1.35,0 -2.73,-0.62 -2.73,-2.05 v -5.15 h 0.72 z"
             id="path485"
             style="fill:#949698" />
          <path
             class="st6"
             d="m 217.48,141.14 v -5.19 c 0,-0.86 -0.99,-1.32 -1.97,-1.32 -0.98,0 -1.99,0.45 -1.99,1.44 v 5.08 h -0.74 V 134 h 0.74 v 0.67 c 0.54,-0.58 1.29,-0.75 1.97,-0.75 1.35,-0.01 2.73,0.62 2.73,2.05 v 5.18 h -0.74 z"
             id="path487"
             style="fill:#949698" />
          <path
             class="st6"
             d="m 219.82,130.95 h 0.83 v 1.29 h -0.83 z m 0.04,3.06 h 0.74 v 7.12 h -0.74 z"
             id="path489"
             style="fill:#949698" />
          <path
             class="st6"
             d="m 227.63,139.27 c 0,0.96 -0.73,1.57 -1.65,1.81 v 0.01 c -0.68,0.17 -1.44,0.17 -2.12,0 -0.9,-0.25 -1.65,-0.86 -1.65,-1.86 v -3.32 c 0,-0.99 0.77,-1.58 1.65,-1.83 0.33,-0.09 0.7,-0.15 1.06,-0.15 0.35,0 0.71,0.06 1.06,0.15 0.93,0.26 1.65,0.86 1.65,1.83 h -0.73 c 0,-0.58 -0.49,-0.96 -1.13,-1.13 -0.26,-0.07 -0.57,-0.12 -0.86,-0.12 -0.3,0 -0.6,0.04 -0.87,0.12 -0.54,0.15 -1.12,0.49 -1.12,1.15 v 3.31 c 0,0.65 0.57,1 1.12,1.16 0.54,0.15 1.19,0.15 1.73,0 h 0.01 c 0.62,-0.17 1.12,-0.55 1.12,-1.13 z"
             id="path491"
             style="fill:#949698" />
          <path
             class="st6"
             d="m 233.26,135.94 c 0,-0.22 -0.04,-0.42 -0.17,-0.6 -0.25,-0.35 -0.7,-0.57 -1.22,-0.67 -0.39,-0.07 -0.74,-0.06 -1.15,0 -0.52,0.09 -1.03,0.3 -1.33,0.75 l -0.62,-0.39 c 0.86,-1.38 3.96,-1.45 4.92,-0.13 0.23,0.33 0.3,0.7 0.3,1.09 v 3.82 c 0,0.54 0.35,0.68 0.71,0.68 v 0.65 c -0.61,0.04 -1.09,-0.13 -1.31,-0.58 -0.62,0.61 -1.41,0.75 -2.12,0.75 -0.35,0 -0.71,-0.06 -1.06,-0.15 -1.97,-0.54 -2.21,-2.92 -0.73,-3.89 0.9,-0.61 2.34,-0.7 3.77,-0.42 v -0.91 z m 0,1.6 c -1.07,-0.28 -2.48,-0.3 -3.31,0.28 -1.02,0.71 -0.93,2.28 0.46,2.67 0.26,0.07 0.55,0.1 0.86,0.1 0.75,0 1.99,-0.29 1.99,-1.22 z"
             id="path493"
             style="fill:#949698" />
          <path
             class="st6"
             d="m 237.64,141.92 0.35,-0.73 c -0.22,-0.01 -0.42,-0.06 -0.62,-0.1 -0.9,-0.25 -1.65,-0.86 -1.65,-1.86 v -3.32 c 0,-0.99 0.77,-1.58 1.65,-1.83 0.33,-0.09 0.7,-0.15 1.06,-0.15 0.35,0 0.71,0.06 1.06,0.15 0.93,0.26 1.65,0.86 1.65,1.83 h -0.73 c 0,-0.58 -0.49,-0.96 -1.13,-1.13 -0.26,-0.07 -0.57,-0.12 -0.86,-0.12 -0.3,0 -0.6,0.04 -0.87,0.12 -0.54,0.15 -1.12,0.49 -1.12,1.15 v 3.31 c 0,0.65 0.57,1 1.12,1.16 0.54,0.15 1.19,0.15 1.73,0 h 0.01 c 0.62,-0.17 1.12,-0.55 1.12,-1.13 h 0.73 c 0,0.96 -0.73,1.57 -1.65,1.81 v 0.01 c -0.32,0.07 -0.64,0.12 -0.97,0.13 l -0.17,0.39 c 0.93,-0.03 1.31,0.44 1.29,0.81 -0.04,0.94 -1.86,1.19 -2.41,0.46 l 0.39,-0.3 c 0.33,0.33 1.32,0.29 1.32,-0.17 0,-0.46 -0.91,-0.41 -1.29,-0.42 v -0.07 z"
             id="path495"
             style="fill:#949698" />
          <path
             class="st6"
             d="m 247.89,139.25 c 0,0.9 -0.62,1.48 -1.47,1.77 -0.62,0.2 -1.29,0.23 -1.94,0.13 -1.09,-0.19 -2.02,-0.81 -2.02,-1.9 v -3.37 c 0,-0.96 0.73,-1.57 1.65,-1.81 0.35,-0.1 0.7,-0.15 1.06,-0.15 0.36,0 0.73,0.04 1.06,0.15 0.93,0.25 1.65,0.86 1.65,1.81 v 3.37 z m -0.72,0 v -3.37 c 0,-0.57 -0.49,-0.94 -1.12,-1.12 -0.28,-0.07 -0.57,-0.12 -0.87,-0.12 -0.3,0 -0.59,0.04 -0.87,0.12 -0.62,0.17 -1.12,0.54 -1.12,1.12 v 3.37 c 0,0.65 0.65,1.07 1.41,1.2 0.54,0.09 1.09,0.06 1.6,-0.12 0.55,-0.18 0.97,-0.55 0.97,-1.08 z m -3.3,-6.73 c 0.07,-0.39 0.46,-0.77 0.86,-0.8 0.54,-0.06 0.86,0.46 1.13,0.44 0.19,-0.01 0.29,-0.13 0.33,-0.32 l 0.45,0.19 c -0.07,0.39 -0.36,0.65 -0.77,0.68 -0.51,0.03 -0.75,-0.46 -1.09,-0.45 -0.22,0.01 -0.42,0.19 -0.46,0.41 z"
             id="path497"
             style="fill:#949698" />
          <path
             class="st6"
             d="m 250.06,139.17 c 0,0.23 0.04,0.42 0.17,0.61 0.25,0.33 0.7,0.57 1.2,0.65 0.39,0.07 0.75,0.07 1.15,0 0.54,-0.07 1.03,-0.29 1.35,-0.74 l 0.62,0.38 c -0.42,0.68 -1.13,0.97 -1.87,1.09 -0.44,0.07 -0.83,0.09 -1.26,0.01 -0.74,-0.12 -1.41,-0.45 -1.78,-0.96 -0.23,-0.33 -0.32,-0.7 -0.32,-1.1 v -3.22 c 0,-0.96 0.73,-1.55 1.67,-1.81 0.68,-0.19 1.42,-0.19 2.1,0 1.89,0.57 2.21,3.08 0.45,4 -1.02,0.55 -2.51,0.35 -3.48,0.35 z m 0,-1.38 c 0.62,-0.03 2.16,0.13 3.13,-0.33 1.23,-0.58 1,-2.32 -0.29,-2.68 -0.55,-0.15 -1.18,-0.15 -1.73,0 -0.62,0.17 -1.12,0.55 -1.12,1.12 v 1.89 z"
             id="path499"
             style="fill:#949698" />
          <path
             class="st6"
             d="m 256.47,139.37 c 0.52,1.25 2.15,1.25 3.03,1 0.64,-0.17 1.13,-0.57 1.13,-1.15 0.01,-1 -1,-1.13 -2.02,-1.26 -1.33,-0.17 -2.66,-0.33 -2.64,-2 0.01,-1 0.74,-1.62 1.67,-1.9 1.15,-0.32 3,-0.19 3.56,1.04 l -0.58,0.38 c -0.54,-0.91 -1.87,-0.97 -2.79,-0.71 -0.64,0.19 -1.13,0.58 -1.13,1.19 -0.01,1 1,1.13 2.02,1.26 1.32,0.17 2.66,0.35 2.64,2 -0.01,0.99 -0.74,1.6 -1.67,1.86 -1.26,0.36 -3.35,0.12 -3.85,-1.31 z"
             id="path501"
             style="fill:#949698" />
        </g>
      </g>
    </g>
  </g>
</svg>
