<?xml version="1.0" encoding="UTF-8" standalone="no"?>
<!-- Created with Inkscape (http://www.inkscape.org/) -->

<svg
   width="290"
   height="80"
   id="svg3948"
   version="1.1"
   inkscape:version="1.2.2 (b0a8486541, 2022-12-01)"
   sodipodi:docname="logo-ictl-290-80.svg"
   inkscape:export-filename="/home/phls/Dropbox/debian-brasil/logo-debian-brasil.png"
   inkscape:export-xdpi="96"
   inkscape:export-ydpi="96"
   xmlns:inkscape="http://www.inkscape.org/namespaces/inkscape"
   xmlns:sodipodi="http://sodipodi.sourceforge.net/DTD/sodipodi-0.dtd"
   xmlns="http://www.w3.org/2000/svg"
   xmlns:svg="http://www.w3.org/2000/svg"
   xmlns:rdf="http://www.w3.org/1999/02/22-rdf-syntax-ns#"
   xmlns:cc="http://creativecommons.org/ns#"
   xmlns:dc="http://purl.org/dc/elements/1.1/">
  <defs
     id="defs3950">
    <clipPath
       clipPathUnits="userSpaceOnUse"
       id="clipPath16">
      <path
         inkscape:connector-curvature="0"
         d="M 0,800 H 1280 V 0 H 0 Z"
         id="path18" />
    </clipPath>
    <clipPath
       clipPathUnits="userSpaceOnUse"
       id="clipPath38">
      <path
         inkscape:connector-curvature="0"
         d="M 0,800 H 1280 V 0 H 0 Z"
         id="path40" />
    </clipPath>
    <clipPath
       clipPathUnits="userSpaceOnUse"
       id="clipPath56">
      <path
         inkscape:connector-curvature="0"
         d="M 0,800 H 1280 V 0 H 0 Z"
         id="path58" />
    </clipPath>
    <clipPath
       clipPathUnits="userSpaceOnUse"
       id="clipPath80">
      <path
         inkscape:connector-curvature="0"
         d="M 0,800 H 1280 V 0 H 0 Z"
         id="path82" />
    </clipPath>
    <clipPath
       clipPathUnits="userSpaceOnUse"
       id="clipPath100">
      <path
         inkscape:connector-curvature="0"
         d="M 0,800 H 1280 V 0 H 0 Z"
         id="path102" />
    </clipPath>
  </defs>
  <sodipodi:namedview
     id="base"
     pagecolor="#ffffff"
     bordercolor="#666666"
     borderopacity="1.0"
     inkscape:pageopacity="0.0"
     inkscape:pageshadow="2"
     inkscape:zoom="2.8"
     inkscape:cx="211.96429"
     inkscape:cy="46.428571"
     inkscape:document-units="px"
     inkscape:current-layer="g4457"
     showgrid="false"
     inkscape:window-width="1920"
     inkscape:window-height="1003"
     inkscape:window-x="1080"
     inkscape:window-y="0"
     inkscape:window-maximized="1"
     inkscape:showpageshadow="2"
     inkscape:pagecheckerboard="0"
     inkscape:deskcolor="#d1d1d1" />
  <metadata
     id="metadata3953">
    <rdf:RDF>
      <cc:Work
         rdf:about="">
        <dc:format>image/svg+xml</dc:format>
        <dc:type
           rdf:resource="http://purl.org/dc/dcmitype/StillImage" />
      </cc:Work>
    </rdf:RDF>
  </metadata>
  <g
     inkscape:label="Camada 1"
     inkscape:groupmode="layer"
     id="layer1"
     transform="translate(0,-622.5197)">
    <g
       id="g4457"
       transform="translate(-201.18066,-543.63188)">
      <g
         id="g5212"
         transform="matrix(3.0934937,0,0,3.0934937,-990.36596,-1137.4315)">
        <g
           id="text1963"
           style="font-style:normal;font-variant:normal;font-weight:normal;font-stretch:normal;font-size:5.21973px;line-height:1.25;font-family:Lato;-inkscape-font-specification:'Lato, Normal';font-variant-ligatures:normal;font-variant-caps:normal;font-variant-numeric:normal;font-feature-settings:normal;text-align:start;letter-spacing:0px;word-spacing:0px;writing-mode:lr-tb;text-anchor:start;opacity:1;vector-effect:none;fill:#0a469d;fill-opacity:1;stroke:none;stroke-width:0.108356;stroke-linecap:butt;stroke-linejoin:miter;stroke-miterlimit:4;stroke-dasharray:none;stroke-dashoffset:0;stroke-opacity:1"
           aria-label="Instituto para Conservação de Tecnologias Livres">
          <path
             id="path4790"
             style="font-style:normal;font-variant:normal;font-weight:normal;font-stretch:normal;font-size:5.21973px;font-family:Lato;-inkscape-font-specification:'Lato, Normal';font-variant-ligatures:normal;font-variant-caps:normal;font-variant-numeric:normal;font-feature-settings:normal;text-align:start;writing-mode:lr-tb;text-anchor:start;vector-effect:none;fill:#0a469d;fill-opacity:1;stroke:none;stroke-width:0.108356;stroke-linecap:butt;stroke-linejoin:miter;stroke-miterlimit:4;stroke-dasharray:none;stroke-dashoffset:0;stroke-opacity:1"
             d="m 416.30518,761.28589 h -0.50632 v -3.73994 h 0.50632 z"
             inkscape:connector-curvature="0" />
          <path
             id="path4792"
             style="font-style:normal;font-variant:normal;font-weight:normal;font-stretch:normal;font-size:5.21973px;font-family:Lato;-inkscape-font-specification:'Lato, Normal';font-variant-ligatures:normal;font-variant-caps:normal;font-variant-numeric:normal;font-feature-settings:normal;text-align:start;writing-mode:lr-tb;text-anchor:start;vector-effect:none;fill:#0a469d;fill-opacity:1;stroke:none;stroke-width:0.108356;stroke-linecap:butt;stroke-linejoin:miter;stroke-miterlimit:4;stroke-dasharray:none;stroke-dashoffset:0;stroke-opacity:1"
             d="m 417.10633,761.28589 v -2.6438 h 0.27925 q 0.0992,0 0.12266,0.0966 l 0.0365,0.28709 q 0.17225,-0.19053 0.38626,-0.30797 0.21401,-0.11744 0.49327,-0.11744 0.21662,0 0.38104,0.0731 0.16703,0.0705 0.27664,0.20357 0.11223,0.1305 0.16964,0.3158 0.0574,0.1853 0.0574,0.40975 v 1.68336 h -0.46716 v -1.68336 q 0,-0.30014 -0.13833,-0.46456 -0.13571,-0.16703 -0.41497,-0.16703 -0.20878,0 -0.38887,0.0992 -0.17747,0.0992 -0.32623,0.26882 v 1.94696 z"
             inkscape:connector-curvature="0" />
          <path
             id="path4794"
             style="font-style:normal;font-variant:normal;font-weight:normal;font-stretch:normal;font-size:5.21973px;font-family:Lato;-inkscape-font-specification:'Lato, Normal';font-variant-ligatures:normal;font-variant-caps:normal;font-variant-numeric:normal;font-feature-settings:normal;text-align:start;writing-mode:lr-tb;text-anchor:start;vector-effect:none;fill:#0a469d;fill-opacity:1;stroke:none;stroke-width:0.108356;stroke-linecap:butt;stroke-linejoin:miter;stroke-miterlimit:4;stroke-dasharray:none;stroke-dashoffset:0;stroke-opacity:1"
             d="m 421.56185,759.07794 q -0.0313,0.0574 -0.0966,0.0574 -0.0392,0 -0.0887,-0.0287 -0.0496,-0.0287 -0.12266,-0.0626 -0.0705,-0.0365 -0.16964,-0.0652 -0.0992,-0.0313 -0.23489,-0.0313 -0.11744,0 -0.2114,0.0313 -0.094,0.0287 -0.16181,0.0809 -0.0652,0.0522 -0.10178,0.12267 -0.0339,0.0679 -0.0339,0.14876 0,0.10178 0.0574,0.16964 0.06,0.0679 0.1566,0.11744 0.0966,0.0496 0.21923,0.0887 0.12266,0.0365 0.25054,0.0809 0.1305,0.0417 0.25316,0.094 0.12266,0.0522 0.21923,0.13049 0.0966,0.0783 0.15398,0.19313 0.06,0.11223 0.06,0.27143 0,0.18269 -0.0652,0.33928 -0.0652,0.15398 -0.19313,0.26882 -0.12788,0.11222 -0.31318,0.17747 -0.1853,0.0652 -0.42802,0.0652 -0.27665,0 -0.5011,-0.0887 -0.22444,-0.0913 -0.38104,-0.23228 l 0.10962,-0.17747 q 0.0209,-0.0339 0.0496,-0.0522 0.0287,-0.0183 0.0731,-0.0183 0.047,0 0.0992,0.0365 0.0522,0.0365 0.12527,0.0809 0.0757,0.0444 0.18269,0.0809 0.10701,0.0365 0.26621,0.0365 0.13571,0 0.2375,-0.0339 0.10178,-0.0365 0.16964,-0.0966 0.0679,-0.06 0.0992,-0.13832 0.0339,-0.0783 0.0339,-0.16703 0,-0.10962 -0.06,-0.18008 -0.0574,-0.0731 -0.15398,-0.12267 -0.0966,-0.0522 -0.22184,-0.0887 -0.12266,-0.0391 -0.25315,-0.0809 -0.12789,-0.0418 -0.25316,-0.0939 -0.12267,-0.0548 -0.21923,-0.13572 -0.0966,-0.0809 -0.15659,-0.19835 -0.0574,-0.12005 -0.0574,-0.28969 0,-0.15137 0.0626,-0.2897 0.0626,-0.14093 0.18269,-0.24533 0.12005,-0.107 0.29491,-0.16964 0.17486,-0.0626 0.39931,-0.0626 0.26099,0 0.46717,0.0835 0.20879,0.0809 0.36016,0.22445 z"
             inkscape:connector-curvature="0" />
          <path
             id="path4796"
             style="font-style:normal;font-variant:normal;font-weight:normal;font-stretch:normal;font-size:5.21973px;font-family:Lato;-inkscape-font-specification:'Lato, Normal';font-variant-ligatures:normal;font-variant-caps:normal;font-variant-numeric:normal;font-feature-settings:normal;text-align:start;writing-mode:lr-tb;text-anchor:start;vector-effect:none;fill:#0a469d;fill-opacity:1;stroke:none;stroke-width:0.108356;stroke-linecap:butt;stroke-linejoin:miter;stroke-miterlimit:4;stroke-dasharray:none;stroke-dashoffset:0;stroke-opacity:1"
             d="m 423.09695,761.32765 q -0.31319,0 -0.48283,-0.17486 -0.16703,-0.17487 -0.16703,-0.50371 v -1.61812 h -0.3184 q -0.0418,0 -0.0705,-0.0235 -0.0287,-0.0261 -0.0287,-0.0783 v -0.1853 l 0.43324,-0.0548 0.107,-0.81689 q 0.008,-0.0391 0.0339,-0.0626 0.0287,-0.0261 0.0731,-0.0261 h 0.23489 v 0.91084 h 0.76469 v 0.33667 h -0.76469 v 1.5868 q 0,0.16703 0.0809,0.24794 0.0809,0.0809 0.20879,0.0809 0.0731,0 0.12527,-0.0183 0.0548,-0.0209 0.094,-0.0444 0.0392,-0.0235 0.0652,-0.0418 0.0287,-0.0209 0.0496,-0.0209 0.0365,0 0.0652,0.0444 l 0.13571,0.22184 q -0.12005,0.11222 -0.28969,0.17747 -0.16964,0.0626 -0.34972,0.0626 z"
             inkscape:connector-curvature="0" />
          <path
             id="path4798"
             style="font-style:normal;font-variant:normal;font-weight:normal;font-stretch:normal;font-size:5.21973px;font-family:Lato;-inkscape-font-specification:'Lato, Normal';font-variant-ligatures:normal;font-variant-caps:normal;font-variant-numeric:normal;font-feature-settings:normal;text-align:start;writing-mode:lr-tb;text-anchor:start;vector-effect:none;fill:#0a469d;fill-opacity:1;stroke:none;stroke-width:0.108356;stroke-linecap:butt;stroke-linejoin:miter;stroke-miterlimit:4;stroke-dasharray:none;stroke-dashoffset:0;stroke-opacity:1"
             d="m 424.78227,758.64209 v 2.6438 h -0.46456 v -2.6438 z m 0.0992,-0.82993 q 0,0.0679 -0.0287,0.12788 -0.0261,0.0574 -0.0731,0.1044 -0.0444,0.0444 -0.10701,0.0705 -0.06,0.0261 -0.12788,0.0261 -0.0679,0 -0.12789,-0.0261 -0.0574,-0.0261 -0.10178,-0.0705 -0.0444,-0.047 -0.0705,-0.1044 -0.0261,-0.06 -0.0261,-0.12788 0,-0.0679 0.0261,-0.12789 0.0261,-0.0626 0.0705,-0.107 0.0444,-0.047 0.10178,-0.0731 0.06,-0.0261 0.12789,-0.0261 0.0678,0 0.12788,0.0261 0.0626,0.0261 0.10701,0.0731 0.047,0.0444 0.0731,0.107 0.0287,0.06 0.0287,0.12789 z"
             inkscape:connector-curvature="0" />
          <path
             id="path4800"
             style="font-style:normal;font-variant:normal;font-weight:normal;font-stretch:normal;font-size:5.21973px;font-family:Lato;-inkscape-font-specification:'Lato, Normal';font-variant-ligatures:normal;font-variant-caps:normal;font-variant-numeric:normal;font-feature-settings:normal;text-align:start;writing-mode:lr-tb;text-anchor:start;vector-effect:none;fill:#0a469d;fill-opacity:1;stroke:none;stroke-width:0.108356;stroke-linecap:butt;stroke-linejoin:miter;stroke-miterlimit:4;stroke-dasharray:none;stroke-dashoffset:0;stroke-opacity:1"
             d="m 426.35724,761.32765 q -0.31319,0 -0.48283,-0.17486 -0.16703,-0.17487 -0.16703,-0.50371 v -1.61812 h -0.3184 q -0.0418,0 -0.0705,-0.0235 -0.0287,-0.0261 -0.0287,-0.0783 v -0.1853 l 0.43324,-0.0548 0.10701,-0.81689 q 0.008,-0.0391 0.0339,-0.0626 0.0287,-0.0261 0.0731,-0.0261 h 0.23489 v 0.91084 h 0.76469 v 0.33667 h -0.76469 v 1.5868 q 0,0.16703 0.0809,0.24794 0.0809,0.0809 0.20879,0.0809 0.0731,0 0.12528,-0.0183 0.0548,-0.0209 0.094,-0.0444 0.0392,-0.0235 0.0652,-0.0418 0.0287,-0.0209 0.0496,-0.0209 0.0365,0 0.0652,0.0444 l 0.13572,0.22184 q -0.12006,0.11222 -0.2897,0.17747 -0.16964,0.0626 -0.34972,0.0626 z"
             inkscape:connector-curvature="0" />
          <path
             id="path4802"
             style="font-style:normal;font-variant:normal;font-weight:normal;font-stretch:normal;font-size:5.21973px;font-family:Lato;-inkscape-font-specification:'Lato, Normal';font-variant-ligatures:normal;font-variant-caps:normal;font-variant-numeric:normal;font-feature-settings:normal;text-align:start;writing-mode:lr-tb;text-anchor:start;vector-effect:none;fill:#0a469d;fill-opacity:1;stroke:none;stroke-width:0.108356;stroke-linecap:butt;stroke-linejoin:miter;stroke-miterlimit:4;stroke-dasharray:none;stroke-dashoffset:0;stroke-opacity:1"
             d="m 427.85987,758.64209 v 1.68598 q 0,0.30013 0.13571,0.46455 0.13832,0.16443 0.42019,0.16443 0.20357,0 0.38365,-0.0966 0.18008,-0.0966 0.33145,-0.26882 v -1.94957 h 0.46456 v 2.6438 h -0.27665 q -0.0992,0 -0.12527,-0.0966 l -0.0365,-0.28447 q -0.17225,0.19052 -0.38626,0.30796 -0.21401,0.11484 -0.49065,0.11484 -0.21662,0 -0.38365,-0.0705 -0.16442,-0.0731 -0.27665,-0.20357 -0.11222,-0.13049 -0.16964,-0.31579 -0.0548,-0.1853 -0.0548,-0.40975 V 758.642 Z"
             inkscape:connector-curvature="0" />
          <path
             id="path4804"
             style="font-style:normal;font-variant:normal;font-weight:normal;font-stretch:normal;font-size:5.21973px;font-family:Lato;-inkscape-font-specification:'Lato, Normal';font-variant-ligatures:normal;font-variant-caps:normal;font-variant-numeric:normal;font-feature-settings:normal;text-align:start;writing-mode:lr-tb;text-anchor:start;vector-effect:none;fill:#0a469d;fill-opacity:1;stroke:none;stroke-width:0.108356;stroke-linecap:butt;stroke-linejoin:miter;stroke-miterlimit:4;stroke-dasharray:none;stroke-dashoffset:0;stroke-opacity:1"
             d="m 431.13859,761.32765 q -0.31318,0 -0.48282,-0.17486 -0.16703,-0.17487 -0.16703,-0.50371 v -1.61812 h -0.31841 q -0.0417,0 -0.0705,-0.0235 -0.0287,-0.0261 -0.0287,-0.0783 v -0.1853 l 0.43324,-0.0548 0.107,-0.81689 q 0.008,-0.0391 0.0339,-0.0626 0.0287,-0.0261 0.0731,-0.0261 h 0.23488 v 0.91084 h 0.76469 v 0.33667 h -0.76469 v 1.5868 q 0,0.16703 0.0809,0.24794 0.0809,0.0809 0.20879,0.0809 0.0731,0 0.12527,-0.0183 0.0548,-0.0209 0.094,-0.0444 0.0392,-0.0235 0.0652,-0.0418 0.0287,-0.0209 0.0496,-0.0209 0.0365,0 0.0652,0.0444 l 0.13571,0.22184 q -0.12005,0.11222 -0.28969,0.17747 -0.16965,0.0626 -0.34973,0.0626 z"
             inkscape:connector-curvature="0" />
          <path
             id="path4806"
             style="font-style:normal;font-variant:normal;font-weight:normal;font-stretch:normal;font-size:5.21973px;font-family:Lato;-inkscape-font-specification:'Lato, Normal';font-variant-ligatures:normal;font-variant-caps:normal;font-variant-numeric:normal;font-feature-settings:normal;text-align:start;writing-mode:lr-tb;text-anchor:start;vector-effect:none;fill:#0a469d;fill-opacity:1;stroke:none;stroke-width:0.108356;stroke-linecap:butt;stroke-linejoin:miter;stroke-miterlimit:4;stroke-dasharray:none;stroke-dashoffset:0;stroke-opacity:1"
             d="m 433.31718,758.60034 q 0.28969,0 0.52197,0.0966 0.23228,0.0966 0.3967,0.27404 0.16442,0.17747 0.25055,0.43063 0.0887,0.25054 0.0887,0.56112 0,0.31318 -0.0887,0.56373 -0.0861,0.25054 -0.25055,0.42802 -0.16442,0.17747 -0.3967,0.27403 -0.23228,0.094 -0.52197,0.094 -0.29231,0 -0.52719,-0.094 -0.23228,-0.0966 -0.3967,-0.27403 -0.16442,-0.17748 -0.25316,-0.42802 -0.0861,-0.25055 -0.0861,-0.56373 0,-0.31058 0.0861,-0.56112 0.0887,-0.25316 0.25316,-0.43063 0.16442,-0.17747 0.3967,-0.27404 0.23488,-0.0966 0.52719,-0.0966 z m 0,2.35932 q 0.39148,0 0.58461,-0.26099 0.19313,-0.2636 0.19313,-0.73337 0,-0.47239 -0.19313,-0.73599 -0.19313,-0.26359 -0.58461,-0.26359 -0.19835,0 -0.34711,0.0679 -0.14615,0.0679 -0.24533,0.19574 -0.0966,0.12789 -0.14615,0.3158 -0.047,0.1853 -0.047,0.42019 0,0.46977 0.19313,0.73337 0.19574,0.26099 0.59244,0.26099 z"
             inkscape:connector-curvature="0" />
          <path
             id="path4808"
             style="font-style:normal;font-variant:normal;font-weight:normal;font-stretch:normal;font-size:5.21973px;font-family:Lato;-inkscape-font-specification:'Lato, Normal';font-variant-ligatures:normal;font-variant-caps:normal;font-variant-numeric:normal;font-feature-settings:normal;text-align:start;writing-mode:lr-tb;text-anchor:start;vector-effect:none;fill:#0a469d;fill-opacity:1;stroke:none;stroke-width:0.108356;stroke-linecap:butt;stroke-linejoin:miter;stroke-miterlimit:4;stroke-dasharray:none;stroke-dashoffset:0;stroke-opacity:1"
             d="m 436.49477,762.18107 v -3.53898 h 0.27926 q 0.0992,0 0.12266,0.0966 l 0.0392,0.31318 q 0.16964,-0.20618 0.38887,-0.33145 0.21923,-0.12527 0.50109,-0.12527 0.22967,0 0.41497,0.0887 0.1853,0.0861 0.3158,0.25838 0.13049,0.16964 0.20096,0.4228 0.0705,0.25315 0.0705,0.582 0,0.2923 -0.0783,0.54546 -0.0783,0.25055 -0.22706,0.43585 -0.14615,0.18269 -0.36016,0.28969 -0.2114,0.1044 -0.47761,0.1044 -0.24272,0 -0.41758,-0.0809 -0.17225,-0.0809 -0.30535,-0.22967 v 1.16922 z m 1.17966,-3.21013 q -0.22706,0 -0.39931,0.10439 -0.16964,0.1044 -0.31318,0.29492 v 1.27883 q 0.12527,0.17225 0.27664,0.24272 0.15399,0.0705 0.3419,0.0705 0.3706,0 0.56895,-0.2636 0.19835,-0.2636 0.19835,-0.75164 0,-0.25838 -0.047,-0.44368 -0.0444,-0.1853 -0.13049,-0.30274 -0.0861,-0.12006 -0.2114,-0.17486 -0.12528,-0.0548 -0.28448,-0.0548 z"
             inkscape:connector-curvature="0" />
          <path
             id="path4810"
             style="font-style:normal;font-variant:normal;font-weight:normal;font-stretch:normal;font-size:5.21973px;font-family:Lato;-inkscape-font-specification:'Lato, Normal';font-variant-ligatures:normal;font-variant-caps:normal;font-variant-numeric:normal;font-feature-settings:normal;text-align:start;writing-mode:lr-tb;text-anchor:start;vector-effect:none;fill:#0a469d;fill-opacity:1;stroke:none;stroke-width:0.108356;stroke-linecap:butt;stroke-linejoin:miter;stroke-miterlimit:4;stroke-dasharray:none;stroke-dashoffset:0;stroke-opacity:1"
             d="m 441.10143,761.28589 q -0.0679,0 -0.1044,-0.0209 -0.0365,-0.0235 -0.0574,-0.0887 l -0.0522,-0.24793 q -0.10439,0.0939 -0.20618,0.16964 -0.0992,0.0731 -0.20879,0.12527 -0.107,0.0496 -0.23228,0.0757 -0.12266,0.0287 -0.27403,0.0287 -0.15398,0 -0.2897,-0.0418 -0.13571,-0.0444 -0.2375,-0.13049 -0.0992,-0.0861 -0.1592,-0.21662 -0.0574,-0.13311 -0.0574,-0.31319 0,-0.15659 0.0861,-0.30013 0.0861,-0.14615 0.27926,-0.25838 0.19313,-0.11222 0.5037,-0.18269 0.31058,-0.0731 0.76208,-0.0835 v -0.20618 q 0,-0.30797 -0.1331,-0.46456 -0.1331,-0.1592 -0.38887,-0.1592 -0.17225,0 -0.2897,0.0444 -0.11483,0.0417 -0.20096,0.0966 -0.0835,0.0522 -0.14615,0.0966 -0.06,0.0417 -0.12005,0.0417 -0.047,0 -0.0809,-0.0235 -0.0339,-0.0261 -0.0574,-0.0626 l -0.0835,-0.14876 q 0.21923,-0.2114 0.47239,-0.3158 0.25315,-0.10439 0.56112,-0.10439 0.22183,0 0.39409,0.0731 0.17225,0.0731 0.28969,0.20357 0.11744,0.1305 0.17747,0.3158 0.06,0.1853 0.06,0.40714 v 1.69119 z m -0.99697,-0.28448 q 0.12266,0 0.22445,-0.0235 0.10178,-0.0261 0.19052,-0.0705 0.0913,-0.047 0.17225,-0.11223 0.0835,-0.0678 0.16181,-0.15137 v -0.54807 q -0.32101,0.0104 -0.54807,0.0522 -0.22445,0.0391 -0.36799,0.10439 -0.14093,0.0652 -0.20618,0.15398 -0.0626,0.0887 -0.0626,0.19835 0,0.1044 0.0339,0.18008 0.0339,0.0757 0.0913,0.12528 0.06,0.047 0.13832,0.0705 0.0809,0.0209 0.17225,0.0209 z"
             inkscape:connector-curvature="0" />
          <path
             id="path4812"
             style="font-style:normal;font-variant:normal;font-weight:normal;font-stretch:normal;font-size:5.21973px;font-family:Lato;-inkscape-font-specification:'Lato, Normal';font-variant-ligatures:normal;font-variant-caps:normal;font-variant-numeric:normal;font-feature-settings:normal;text-align:start;writing-mode:lr-tb;text-anchor:start;vector-effect:none;fill:#0a469d;fill-opacity:1;stroke:none;stroke-width:0.108356;stroke-linecap:butt;stroke-linejoin:miter;stroke-miterlimit:4;stroke-dasharray:none;stroke-dashoffset:0;stroke-opacity:1"
             d="m 442.01015,761.28589 v -2.6438 h 0.26621 q 0.0757,0 0.10439,0.0287 0.0287,0.0287 0.0392,0.0992 l 0.0287,0.40192 q 0.12527,-0.27143 0.30796,-0.4228 0.1853,-0.15398 0.4489,-0.15398 0.0835,0 0.1592,0.0183 0.0783,0.0183 0.13832,0.0574 l -0.0339,0.34712 q -0.0157,0.0652 -0.0783,0.0652 -0.0365,0 -0.107,-0.0157 -0.0705,-0.0157 -0.15921,-0.0157 -0.12527,0 -0.22444,0.0392 -0.0992,0.0365 -0.17748,0.10962 -0.0757,0.0705 -0.13571,0.17486 -0.06,0.10439 -0.10961,0.2401 v 1.67032 z"
             inkscape:connector-curvature="0" />
          <path
             id="path4814"
             style="font-style:normal;font-variant:normal;font-weight:normal;font-stretch:normal;font-size:5.21973px;font-family:Lato;-inkscape-font-specification:'Lato, Normal';font-variant-ligatures:normal;font-variant-caps:normal;font-variant-numeric:normal;font-feature-settings:normal;text-align:start;writing-mode:lr-tb;text-anchor:start;vector-effect:none;fill:#0a469d;fill-opacity:1;stroke:none;stroke-width:0.108356;stroke-linecap:butt;stroke-linejoin:miter;stroke-miterlimit:4;stroke-dasharray:none;stroke-dashoffset:0;stroke-opacity:1"
             d="m 445.54636,761.28589 q -0.0679,0 -0.1044,-0.0209 -0.0365,-0.0235 -0.0574,-0.0887 l -0.0522,-0.24793 q -0.1044,0.0939 -0.20618,0.16964 -0.0992,0.0731 -0.20879,0.12527 -0.10701,0.0496 -0.23228,0.0757 -0.12266,0.0287 -0.27404,0.0287 -0.15398,0 -0.28969,-0.0418 -0.13571,-0.0444 -0.2375,-0.13049 -0.0992,-0.0861 -0.1592,-0.21662 -0.0574,-0.13311 -0.0574,-0.31319 0,-0.15659 0.0861,-0.30013 0.0861,-0.14615 0.27925,-0.25838 0.19313,-0.11222 0.50371,-0.18269 0.31057,-0.0731 0.76208,-0.0835 v -0.20618 q 0,-0.30797 -0.1331,-0.46456 -0.13311,-0.1592 -0.38887,-0.1592 -0.17225,0 -0.2897,0.0444 -0.11483,0.0417 -0.20096,0.0966 -0.0835,0.0522 -0.14615,0.0966 -0.06,0.0417 -0.12005,0.0417 -0.047,0 -0.0809,-0.0235 -0.0339,-0.0261 -0.0574,-0.0626 l -0.0835,-0.14876 q 0.21923,-0.2114 0.47238,-0.3158 0.25316,-0.10439 0.56112,-0.10439 0.22184,0 0.39409,0.0731 0.17225,0.0731 0.2897,0.20357 0.11744,0.1305 0.17747,0.3158 0.06,0.1853 0.06,0.40714 v 1.69119 z m -0.99697,-0.28448 q 0.12266,0 0.22445,-0.0235 0.10178,-0.0261 0.19052,-0.0705 0.0913,-0.047 0.17225,-0.11223 0.0835,-0.0678 0.16181,-0.15137 v -0.54807 q -0.32101,0.0104 -0.54807,0.0522 -0.22445,0.0391 -0.36799,0.10439 -0.14094,0.0652 -0.20618,0.15398 -0.0626,0.0887 -0.0626,0.19835 0,0.1044 0.0339,0.18008 0.0339,0.0757 0.0913,0.12528 0.06,0.047 0.13833,0.0705 0.0809,0.0209 0.17225,0.0209 z"
             inkscape:connector-curvature="0" />
          <path
             id="path4816"
             style="font-style:normal;font-variant:normal;font-weight:normal;font-stretch:normal;font-size:5.21973px;font-family:Lato;-inkscape-font-specification:'Lato, Normal';font-variant-ligatures:normal;font-variant-caps:normal;font-variant-numeric:normal;font-feature-settings:normal;text-align:start;writing-mode:lr-tb;text-anchor:start;vector-effect:none;fill:#0a469d;fill-opacity:1;stroke:none;stroke-width:0.108356;stroke-linecap:butt;stroke-linejoin:miter;stroke-miterlimit:4;stroke-dasharray:none;stroke-dashoffset:0;stroke-opacity:1"
             d="m 450.52574,760.51337 q 0.0418,0 0.0731,0.0339 l 0.20096,0.21662 q -0.22966,0.2662 -0.55851,0.41496 -0.32623,0.14877 -0.79079,0.14877 -0.40192,0 -0.73076,-0.13833 -0.32884,-0.14093 -0.56112,-0.39148 -0.23228,-0.25315 -0.36016,-0.60549 -0.12789,-0.35233 -0.12789,-0.77513 0,-0.42279 0.13311,-0.77513 0.1331,-0.35233 0.37321,-0.60548 0.24272,-0.25316 0.57939,-0.39148 0.33667,-0.14094 0.74381,-0.14094 0.39931,0 0.70466,0.12789 0.30536,0.12788 0.53764,0.34711 l -0.16703,0.23228 q -0.0157,0.0261 -0.0418,0.0444 -0.0235,0.0157 -0.0652,0.0157 -0.047,0 -0.11483,-0.0496 -0.0679,-0.0522 -0.17747,-0.11484 -0.10962,-0.0626 -0.27404,-0.11222 -0.16442,-0.0522 -0.40453,-0.0522 -0.28969,0 -0.5298,0.10179 -0.24011,0.0992 -0.41497,0.28969 -0.17225,0.19052 -0.26882,0.46456 -0.0966,0.27403 -0.0966,0.61853 0,0.34973 0.0992,0.62376 0.10179,0.27404 0.27404,0.46456 0.17486,0.18791 0.40975,0.28708 0.2375,0.0992 0.51153,0.0992 0.16703,0 0.30014,-0.0183 0.13571,-0.0209 0.24793,-0.0626 0.11484,-0.0417 0.2114,-0.10439 0.0992,-0.0652 0.19574,-0.15398 0.0444,-0.0391 0.0887,-0.0391 z"
             inkscape:connector-curvature="0" />
          <path
             id="path4818"
             style="font-style:normal;font-variant:normal;font-weight:normal;font-stretch:normal;font-size:5.21973px;font-family:Lato;-inkscape-font-specification:'Lato, Normal';font-variant-ligatures:normal;font-variant-caps:normal;font-variant-numeric:normal;font-feature-settings:normal;text-align:start;writing-mode:lr-tb;text-anchor:start;vector-effect:none;fill:#0a469d;fill-opacity:1;stroke:none;stroke-width:0.108356;stroke-linecap:butt;stroke-linejoin:miter;stroke-miterlimit:4;stroke-dasharray:none;stroke-dashoffset:0;stroke-opacity:1"
             d="m 452.34065,758.60034 q 0.2897,0 0.52198,0.0966 0.23227,0.0966 0.3967,0.27404 0.16442,0.17747 0.25054,0.43063 0.0887,0.25054 0.0887,0.56112 0,0.31318 -0.0887,0.56373 -0.0861,0.25054 -0.25054,0.42802 -0.16443,0.17747 -0.3967,0.27403 -0.23228,0.094 -0.52198,0.094 -0.2923,0 -0.52719,-0.094 -0.23228,-0.0966 -0.3967,-0.27403 -0.16442,-0.17748 -0.25316,-0.42802 -0.0861,-0.25055 -0.0861,-0.56373 0,-0.31058 0.0861,-0.56112 0.0887,-0.25316 0.25316,-0.43063 0.16442,-0.17747 0.3967,-0.27404 0.23489,-0.0966 0.52719,-0.0966 z m 0,2.35932 q 0.39148,0 0.58461,-0.26099 0.19313,-0.2636 0.19313,-0.73337 0,-0.47239 -0.19313,-0.73599 -0.19313,-0.26359 -0.58461,-0.26359 -0.19835,0 -0.34711,0.0679 -0.14615,0.0679 -0.24533,0.19574 -0.0966,0.12789 -0.14615,0.3158 -0.047,0.1853 -0.047,0.42019 0,0.46977 0.19313,0.73337 0.19574,0.26099 0.59244,0.26099 z"
             inkscape:connector-curvature="0" />
          <path
             id="path4820"
             style="font-style:normal;font-variant:normal;font-weight:normal;font-stretch:normal;font-size:5.21973px;font-family:Lato;-inkscape-font-specification:'Lato, Normal';font-variant-ligatures:normal;font-variant-caps:normal;font-variant-numeric:normal;font-feature-settings:normal;text-align:start;writing-mode:lr-tb;text-anchor:start;vector-effect:none;fill:#0a469d;fill-opacity:1;stroke:none;stroke-width:0.108356;stroke-linecap:butt;stroke-linejoin:miter;stroke-miterlimit:4;stroke-dasharray:none;stroke-dashoffset:0;stroke-opacity:1"
             d="m 454.18273,761.28589 v -2.6438 h 0.27926 q 0.0992,0 0.12266,0.0966 l 0.0365,0.28709 q 0.17225,-0.19053 0.38626,-0.30797 0.21401,-0.11744 0.49326,-0.11744 0.21662,0 0.38104,0.0731 0.16703,0.0705 0.27665,0.20357 0.11222,0.1305 0.16964,0.3158 0.0574,0.1853 0.0574,0.40975 v 1.68336 h -0.46717 v -1.68336 q 0,-0.30014 -0.13832,-0.46456 -0.13571,-0.16703 -0.41497,-0.16703 -0.20879,0 -0.38887,0.0992 -0.17747,0.0992 -0.32623,0.26882 v 1.94696 z"
             inkscape:connector-curvature="0" />
          <path
             id="path4822"
             style="font-style:normal;font-variant:normal;font-weight:normal;font-stretch:normal;font-size:5.21973px;font-family:Lato;-inkscape-font-specification:'Lato, Normal';font-variant-ligatures:normal;font-variant-caps:normal;font-variant-numeric:normal;font-feature-settings:normal;text-align:start;writing-mode:lr-tb;text-anchor:start;vector-effect:none;fill:#0a469d;fill-opacity:1;stroke:none;stroke-width:0.108356;stroke-linecap:butt;stroke-linejoin:miter;stroke-miterlimit:4;stroke-dasharray:none;stroke-dashoffset:0;stroke-opacity:1"
             d="m 458.63826,759.07794 q -0.0313,0.0574 -0.0966,0.0574 -0.0392,0 -0.0887,-0.0287 -0.0496,-0.0287 -0.12267,-0.0626 -0.0705,-0.0365 -0.16964,-0.0652 -0.0992,-0.0313 -0.23489,-0.0313 -0.11744,0 -0.21139,0.0313 -0.094,0.0287 -0.16182,0.0809 -0.0652,0.0522 -0.10178,0.12267 -0.0339,0.0679 -0.0339,0.14876 0,0.10178 0.0574,0.16964 0.06,0.0679 0.15659,0.11744 0.0966,0.0496 0.21923,0.0887 0.12266,0.0365 0.25055,0.0809 0.13049,0.0417 0.25315,0.094 0.12267,0.0522 0.21923,0.13049 0.0966,0.0783 0.15398,0.19313 0.06,0.11223 0.06,0.27143 0,0.18269 -0.0652,0.33928 -0.0652,0.15398 -0.19313,0.26882 -0.12788,0.11222 -0.31318,0.17747 -0.1853,0.0652 -0.42802,0.0652 -0.27664,0 -0.50109,-0.0887 -0.22445,-0.0913 -0.38104,-0.23228 l 0.10961,-0.17747 q 0.0209,-0.0339 0.0496,-0.0522 0.0287,-0.0183 0.0731,-0.0183 0.047,0 0.0992,0.0365 0.0522,0.0365 0.12527,0.0809 0.0757,0.0444 0.18269,0.0809 0.10701,0.0365 0.26621,0.0365 0.13571,0 0.2375,-0.0339 0.10178,-0.0365 0.16964,-0.0966 0.0679,-0.06 0.0992,-0.13832 0.0339,-0.0783 0.0339,-0.16703 0,-0.10962 -0.06,-0.18008 -0.0574,-0.0731 -0.15399,-0.12267 -0.0966,-0.0522 -0.22184,-0.0887 -0.12266,-0.0391 -0.25315,-0.0809 -0.12789,-0.0418 -0.25316,-0.0939 -0.12266,-0.0548 -0.21923,-0.13572 -0.0966,-0.0809 -0.15659,-0.19835 -0.0574,-0.12005 -0.0574,-0.28969 0,-0.15137 0.0626,-0.2897 0.0626,-0.14093 0.18269,-0.24533 0.12005,-0.107 0.29492,-0.16964 0.17486,-0.0626 0.3993,-0.0626 0.26099,0 0.46717,0.0835 0.20879,0.0809 0.36016,0.22445 z"
             inkscape:connector-curvature="0" />
          <path
             id="path4824"
             style="font-style:normal;font-variant:normal;font-weight:normal;font-stretch:normal;font-size:5.21973px;font-family:Lato;-inkscape-font-specification:'Lato, Normal';font-variant-ligatures:normal;font-variant-caps:normal;font-variant-numeric:normal;font-feature-settings:normal;text-align:start;writing-mode:lr-tb;text-anchor:start;vector-effect:none;fill:#0a469d;fill-opacity:1;stroke:none;stroke-width:0.108356;stroke-linecap:butt;stroke-linejoin:miter;stroke-miterlimit:4;stroke-dasharray:none;stroke-dashoffset:0;stroke-opacity:1"
             d="m 460.44478,758.60034 q 0.23749,0 0.43845,0.0809 0.20357,0.0783 0.34973,0.22967 0.14876,0.14876 0.23227,0.3706 0.0835,0.21923 0.0835,0.5011 0,0.10961 -0.0235,0.14615 -0.0235,0.0365 -0.0887,0.0365 h -1.76687 q 0.005,0.25054 0.0679,0.43584 0.0626,0.1853 0.17225,0.31058 0.10962,0.12266 0.26099,0.1853 0.15137,0.06 0.33928,0.06 0.17486,0 0.30014,-0.0391 0.12788,-0.0418 0.21923,-0.0887 0.0913,-0.047 0.15137,-0.0861 0.0626,-0.0418 0.107,-0.0418 0.0574,0 0.0887,0.0444 l 0.13049,0.16964 q -0.0861,0.10439 -0.20618,0.18269 -0.12005,0.0757 -0.25837,0.12527 -0.13572,0.0496 -0.28187,0.0731 -0.14615,0.0261 -0.2897,0.0261 -0.27403,0 -0.50631,-0.0914 -0.22967,-0.094 -0.39931,-0.27142 -0.16703,-0.18009 -0.26099,-0.44368 -0.094,-0.2636 -0.094,-0.60549 0,-0.27665 0.0835,-0.51675 0.0861,-0.24011 0.24532,-0.41497 0.1592,-0.17747 0.38887,-0.27665 0.22967,-0.10178 0.51676,-0.10178 z m 0.0104,0.34189 q -0.33668,0 -0.52981,0.19574 -0.19313,0.19313 -0.24011,0.53763 h 1.44587 q 0,-0.16181 -0.047,-0.29491 -0.0444,-0.13572 -0.1331,-0.23228 -0.0861,-0.0992 -0.2114,-0.15137 -0.12527,-0.0548 -0.28447,-0.0548 z"
             inkscape:connector-curvature="0" />
          <path
             id="path4826"
             style="font-style:normal;font-variant:normal;font-weight:normal;font-stretch:normal;font-size:5.21973px;font-family:Lato;-inkscape-font-specification:'Lato, Normal';font-variant-ligatures:normal;font-variant-caps:normal;font-variant-numeric:normal;font-feature-settings:normal;text-align:start;writing-mode:lr-tb;text-anchor:start;vector-effect:none;fill:#0a469d;fill-opacity:1;stroke:none;stroke-width:0.108356;stroke-linecap:butt;stroke-linejoin:miter;stroke-miterlimit:4;stroke-dasharray:none;stroke-dashoffset:0;stroke-opacity:1"
             d="m 462.11428,761.28589 v -2.6438 h 0.2662 q 0.0757,0 0.1044,0.0287 0.0287,0.0287 0.0391,0.0992 l 0.0287,0.40192 q 0.12528,-0.27143 0.30797,-0.4228 0.1853,-0.15398 0.44889,-0.15398 0.0835,0 0.15921,0.0183 0.0783,0.0183 0.13832,0.0574 l -0.0339,0.34712 q -0.0157,0.0652 -0.0783,0.0652 -0.0365,0 -0.107,-0.0157 -0.0705,-0.0157 -0.1592,-0.0157 -0.12528,0 -0.22445,0.0392 -0.0992,0.0365 -0.17747,0.10962 -0.0757,0.0705 -0.13571,0.17486 -0.06,0.10439 -0.10962,0.2401 v 1.67032 z"
             inkscape:connector-curvature="0" />
          <path
             id="path4828"
             style="font-style:normal;font-variant:normal;font-weight:normal;font-stretch:normal;font-size:5.21973px;font-family:Lato;-inkscape-font-specification:'Lato, Normal';font-variant-ligatures:normal;font-variant-caps:normal;font-variant-numeric:normal;font-feature-settings:normal;text-align:start;writing-mode:lr-tb;text-anchor:start;vector-effect:none;fill:#0a469d;fill-opacity:1;stroke:none;stroke-width:0.108356;stroke-linecap:butt;stroke-linejoin:miter;stroke-miterlimit:4;stroke-dasharray:none;stroke-dashoffset:0;stroke-opacity:1"
             d="m 463.70254,758.64209 h 0.37843 q 0.0574,0 0.094,0.0287 0.0365,0.0287 0.0496,0.0679 l 0.67074,1.70163 q 0.0313,0.0966 0.0548,0.18791 0.0235,0.0914 0.0444,0.18269 0.0209,-0.0913 0.0444,-0.18269 0.0235,-0.0913 0.0574,-0.18791 l 0.67856,-1.70163 q 0.0157,-0.0418 0.0522,-0.0679 0.0365,-0.0287 0.0861,-0.0287 h 0.36277 l -1.07788,2.6438 h -0.41758 z"
             inkscape:connector-curvature="0" />
          <path
             id="path4830"
             style="font-style:normal;font-variant:normal;font-weight:normal;font-stretch:normal;font-size:5.21973px;font-family:Lato;-inkscape-font-specification:'Lato, Normal';font-variant-ligatures:normal;font-variant-caps:normal;font-variant-numeric:normal;font-feature-settings:normal;text-align:start;writing-mode:lr-tb;text-anchor:start;vector-effect:none;fill:#0a469d;fill-opacity:1;stroke:none;stroke-width:0.108356;stroke-linecap:butt;stroke-linejoin:miter;stroke-miterlimit:4;stroke-dasharray:none;stroke-dashoffset:0;stroke-opacity:1"
             d="m 468.32151,761.28589 q -0.0678,0 -0.10439,-0.0209 -0.0365,-0.0235 -0.0574,-0.0887 l -0.0522,-0.24793 q -0.1044,0.0939 -0.20618,0.16964 -0.0992,0.0731 -0.20879,0.12527 -0.10701,0.0496 -0.23228,0.0757 -0.12266,0.0287 -0.27404,0.0287 -0.15398,0 -0.28969,-0.0418 -0.13572,-0.0444 -0.2375,-0.13049 -0.0992,-0.0861 -0.1592,-0.21662 -0.0574,-0.13311 -0.0574,-0.31319 0,-0.15659 0.0861,-0.30013 0.0861,-0.14615 0.27925,-0.25838 0.19313,-0.11222 0.50371,-0.18269 0.31057,-0.0731 0.76208,-0.0835 v -0.20618 q 0,-0.30797 -0.13311,-0.46456 -0.1331,-0.1592 -0.38887,-0.1592 -0.17225,0 -0.28969,0.0444 -0.11484,0.0417 -0.20096,0.0966 -0.0835,0.0522 -0.14615,0.0966 -0.06,0.0417 -0.12006,0.0417 -0.047,0 -0.0809,-0.0235 -0.0339,-0.0261 -0.0574,-0.0626 l -0.0835,-0.14876 q 0.21923,-0.2114 0.47239,-0.3158 0.25316,-0.10439 0.56112,-0.10439 0.22184,0 0.39409,0.0731 0.17225,0.0731 0.2897,0.20357 0.11744,0.1305 0.17747,0.3158 0.06,0.1853 0.06,0.40714 v 1.69119 z m -0.99696,-0.28448 q 0.12266,0 0.22444,-0.0235 0.10179,-0.0261 0.19052,-0.0705 0.0913,-0.047 0.17226,-0.11223 0.0835,-0.0678 0.16181,-0.15137 v -0.54807 q -0.32102,0.0104 -0.54807,0.0522 -0.22445,0.0391 -0.368,0.10439 -0.14093,0.0652 -0.20617,0.15398 -0.0626,0.0887 -0.0626,0.19835 0,0.1044 0.0339,0.18008 0.0339,0.0757 0.0913,0.12528 0.06,0.047 0.13832,0.0705 0.0809,0.0209 0.17226,0.0209 z"
             inkscape:connector-curvature="0" />
          <path
             id="path4832"
             style="font-style:normal;font-variant:normal;font-weight:normal;font-stretch:normal;font-size:5.21973px;font-family:Lato;-inkscape-font-specification:'Lato, Normal';font-variant-ligatures:normal;font-variant-caps:normal;font-variant-numeric:normal;font-feature-settings:normal;text-align:start;writing-mode:lr-tb;text-anchor:start;vector-effect:none;fill:#0a469d;fill-opacity:1;stroke:none;stroke-width:0.108356;stroke-linecap:butt;stroke-linejoin:miter;stroke-miterlimit:4;stroke-dasharray:none;stroke-dashoffset:0;stroke-opacity:1"
             d="m 469.96361,761.94618 q 0.0157,0 0.0365,0.008 0.0209,0.0104 0.0496,0.0209 0.0313,0.0131 0.0705,0.0209 0.0418,0.0104 0.0992,0.0104 0.10962,0 0.16443,-0.0444 0.0548,-0.0444 0.0548,-0.11222 0,-0.0992 -0.10961,-0.14093 -0.10962,-0.0392 -0.30797,-0.0652 l 0.10701,-0.32623 q -0.22706,-0.0209 -0.42019,-0.12006 -0.19052,-0.10178 -0.33145,-0.27403 -0.13833,-0.17225 -0.21662,-0.41497 -0.0783,-0.24272 -0.0783,-0.54546 0,-0.29492 0.0809,-0.54547 0.0835,-0.25054 0.24011,-0.43062 0.1592,-0.18269 0.38887,-0.28448 0.23227,-0.10178 0.53241,-0.10178 0.27925,0 0.49065,0.0913 0.21401,0.0887 0.37843,0.25316 l -0.12266,0.16703 q -0.0209,0.0287 -0.0418,0.0444 -0.0209,0.0157 -0.0574,0.0157 -0.0392,0 -0.0861,-0.0313 -0.047,-0.0339 -0.11744,-0.0731 -0.0679,-0.0391 -0.16965,-0.0705 -0.0992,-0.0339 -0.24532,-0.0339 -0.19574,0 -0.34451,0.0705 -0.14876,0.0679 -0.25054,0.19835 -0.0992,0.1305 -0.15137,0.3158 -0.0496,0.1853 -0.0496,0.41497 0,0.2401 0.0548,0.42801 0.0548,0.18531 0.15398,0.31319 0.10178,0.12527 0.24271,0.19313 0.14355,0.0652 0.32102,0.0652 0.16964,0 0.27925,-0.0391 0.10962,-0.0418 0.18008,-0.0914 0.0731,-0.0496 0.12006,-0.0887 0.0496,-0.0418 0.0966,-0.0418 0.0574,0 0.0887,0.0444 l 0.13049,0.16964 q -0.15137,0.1853 -0.36799,0.28186 -0.21401,0.0966 -0.46195,0.11745 l -0.047,0.16703 q 0.24271,0.0496 0.34972,0.14093 0.10961,0.0914 0.10961,0.23228 0,0.0835 -0.0418,0.15137 -0.0418,0.0679 -0.11745,0.11484 -0.0731,0.047 -0.17747,0.0705 -0.10178,0.0261 -0.22706,0.0261 -0.107,0 -0.20618,-0.0235 -0.0966,-0.0209 -0.17486,-0.0574 l 0.0418,-0.14354 q 0.0157,-0.047 0.06,-0.047 z"
             inkscape:connector-curvature="0" />
          <path
             id="path4834"
             style="font-style:normal;font-variant:normal;font-weight:normal;font-stretch:normal;font-size:5.21973px;font-family:Lato;-inkscape-font-specification:'Lato, Normal';font-variant-ligatures:normal;font-variant-caps:normal;font-variant-numeric:normal;font-feature-settings:normal;text-align:start;writing-mode:lr-tb;text-anchor:start;vector-effect:none;fill:#0a469d;fill-opacity:1;stroke:none;stroke-width:0.108356;stroke-linecap:butt;stroke-linejoin:miter;stroke-miterlimit:4;stroke-dasharray:none;stroke-dashoffset:0;stroke-opacity:1"
             d="m 471.52961,761.28589 z m 1.8791,0 q -0.0679,0 -0.10439,-0.0209 -0.0365,-0.0235 -0.0574,-0.0887 l -0.0522,-0.24793 q -0.10439,0.0939 -0.20618,0.16964 -0.0992,0.0731 -0.20879,0.12527 -0.107,0.0496 -0.23227,0.0757 -0.12267,0.0287 -0.27404,0.0287 -0.15398,0 -0.2897,-0.0418 -0.13571,-0.0444 -0.23749,-0.13049 -0.0992,-0.0861 -0.15921,-0.21662 -0.0574,-0.13311 -0.0574,-0.31319 0,-0.15659 0.0861,-0.30013 0.0861,-0.14615 0.27926,-0.25838 0.19313,-0.11222 0.5037,-0.18269 0.31058,-0.0731 0.76208,-0.0835 v -0.20618 q 0,-0.30797 -0.1331,-0.46456 -0.1331,-0.1592 -0.38887,-0.1592 -0.17225,0 -0.28969,0.0444 -0.11484,0.0417 -0.20096,0.0966 -0.0835,0.0522 -0.14616,0.0966 -0.06,0.0417 -0.12005,0.0417 -0.047,0 -0.0809,-0.0235 -0.0339,-0.0261 -0.0574,-0.0626 l -0.0835,-0.14876 q 0.21923,-0.2114 0.47239,-0.3158 0.25315,-0.10439 0.56112,-0.10439 0.22184,0 0.39409,0.0731 0.17225,0.0731 0.28969,0.20357 0.11745,0.1305 0.17747,0.3158 0.06,0.1853 0.06,0.40714 v 1.69119 z m -0.99697,-0.28448 q 0.12267,0 0.22445,-0.0235 0.10179,-0.0261 0.19052,-0.0705 0.0914,-0.047 0.17225,-0.11223 0.0835,-0.0678 0.16181,-0.15137 v -0.54807 q -0.32101,0.0104 -0.54807,0.0522 -0.22445,0.0391 -0.36799,0.10439 -0.14093,0.0652 -0.20618,0.15398 -0.0626,0.0887 -0.0626,0.19835 0,0.1044 0.0339,0.18008 0.0339,0.0757 0.0914,0.12528 0.06,0.047 0.13832,0.0705 0.0809,0.0209 0.17225,0.0209 z m 0.51154,-3.17359 q 0.094,0 0.14354,-0.0548 0.0522,-0.0548 0.0548,-0.16964 h 0.28186 q 0,0.12266 -0.0339,0.22706 -0.0313,0.10178 -0.094,0.17486 -0.06,0.0731 -0.14615,0.11483 -0.0835,0.0391 -0.18792,0.0391 -0.0913,0 -0.17225,-0.0365 -0.0783,-0.0392 -0.14876,-0.0835 -0.0705,-0.0444 -0.1331,-0.0809 -0.0626,-0.0391 -0.12267,-0.0391 -0.18791,0 -0.19313,0.22967 h -0.28969 q 0,-0.12527 0.0339,-0.22706 0.0339,-0.10439 0.0966,-0.17747 0.0626,-0.0757 0.14877,-0.11483 0.0861,-0.0418 0.18791,-0.0418 0.0913,0 0.16964,0.0391 0.0809,0.0365 0.15137,0.0809 0.0705,0.0444 0.13049,0.0835 0.0626,0.0365 0.12267,0.0365 z"
             inkscape:connector-curvature="0" />
          <path
             id="path4836"
             style="font-style:normal;font-variant:normal;font-weight:normal;font-stretch:normal;font-size:5.21973px;font-family:Lato;-inkscape-font-specification:'Lato, Normal';font-variant-ligatures:normal;font-variant-caps:normal;font-variant-numeric:normal;font-feature-settings:normal;text-align:start;writing-mode:lr-tb;text-anchor:start;vector-effect:none;fill:#0a469d;fill-opacity:1;stroke:none;stroke-width:0.108356;stroke-linecap:butt;stroke-linejoin:miter;stroke-miterlimit:4;stroke-dasharray:none;stroke-dashoffset:0;stroke-opacity:1"
             d="m 475.43185,758.60034 q 0.28969,0 0.52197,0.0966 0.23228,0.0966 0.3967,0.27404 0.16442,0.17747 0.25055,0.43063 0.0887,0.25054 0.0887,0.56112 0,0.31318 -0.0887,0.56373 -0.0861,0.25054 -0.25055,0.42802 -0.16442,0.17747 -0.3967,0.27403 -0.23228,0.094 -0.52197,0.094 -0.29231,0 -0.5272,-0.094 -0.23227,-0.0966 -0.39669,-0.27403 -0.16443,-0.17748 -0.25316,-0.42802 -0.0861,-0.25055 -0.0861,-0.56373 0,-0.31058 0.0861,-0.56112 0.0887,-0.25316 0.25316,-0.43063 0.16442,-0.17747 0.39669,-0.27404 0.23489,-0.0966 0.5272,-0.0966 z m 0,2.35932 q 0.39148,0 0.58461,-0.26099 0.19313,-0.2636 0.19313,-0.73337 0,-0.47239 -0.19313,-0.73599 -0.19313,-0.26359 -0.58461,-0.26359 -0.19835,0 -0.34711,0.0679 -0.14616,0.0679 -0.24533,0.19574 -0.0966,0.12789 -0.14615,0.3158 -0.047,0.1853 -0.047,0.42019 0,0.46977 0.19313,0.73337 0.19574,0.26099 0.59244,0.26099 z"
             inkscape:connector-curvature="0" />
          <path
             id="path4838"
             style="font-style:normal;font-variant:normal;font-weight:normal;font-stretch:normal;font-size:5.21973px;font-family:Lato;-inkscape-font-specification:'Lato, Normal';font-variant-ligatures:normal;font-variant-caps:normal;font-variant-numeric:normal;font-feature-settings:normal;text-align:start;writing-mode:lr-tb;text-anchor:start;vector-effect:none;fill:#0a469d;fill-opacity:1;stroke:none;stroke-width:0.108356;stroke-linecap:butt;stroke-linejoin:miter;stroke-miterlimit:4;stroke-dasharray:none;stroke-dashoffset:0;stroke-opacity:1"
             d="m 417.59967,767.81055 q -0.0992,0 -0.12527,-0.0966 l -0.0418,-0.32102 q -0.16964,0.20618 -0.38887,0.33146 -0.21662,0.12266 -0.49848,0.12266 -0.22706,0 -0.41236,-0.0861 -0.1853,-0.0887 -0.3158,-0.25838 -0.13049,-0.16964 -0.20096,-0.4228 -0.0705,-0.25316 -0.0705,-0.582 0,-0.2923 0.0783,-0.54285 0.0783,-0.25316 0.22445,-0.43846 0.14615,-0.1853 0.35755,-0.28969 0.21401,-0.10701 0.48022,-0.10701 0.24272,0 0.41497,0.0835 0.17486,0.0809 0.31057,0.22967 v -1.46675 h 0.46456 v 3.84433 z m -0.90301,-0.33928 q 0.22967,0 0.39931,-0.10439 0.17225,-0.1044 0.31579,-0.29492 v -1.27622 q -0.13049,-0.17225 -0.28186,-0.24272 -0.15138,-0.0705 -0.33929,-0.0705 -0.36799,0 -0.56634,0.2636 -0.19835,0.2636 -0.19835,0.75164 0,0.25838 0.0444,0.44368 0.0444,0.18269 0.13049,0.30274 0.0861,0.11745 0.2114,0.17225 0.12528,0.0548 0.28448,0.0548 z"
             inkscape:connector-curvature="0" />
          <path
             id="path4840"
             style="font-style:normal;font-variant:normal;font-weight:normal;font-stretch:normal;font-size:5.21973px;font-family:Lato;-inkscape-font-specification:'Lato, Normal';font-variant-ligatures:normal;font-variant-caps:normal;font-variant-numeric:normal;font-feature-settings:normal;text-align:start;writing-mode:lr-tb;text-anchor:start;vector-effect:none;fill:#0a469d;fill-opacity:1;stroke:none;stroke-width:0.108356;stroke-linecap:butt;stroke-linejoin:miter;stroke-miterlimit:4;stroke-dasharray:none;stroke-dashoffset:0;stroke-opacity:1"
             d="m 419.69825,765.125 q 0.2375,0 0.43846,0.0809 0.20356,0.0783 0.34972,0.22967 0.14876,0.14876 0.23228,0.3706 0.0835,0.21922 0.0835,0.50109 0,0.10961 -0.0235,0.14615 -0.0235,0.0365 -0.0887,0.0365 h -1.76688 q 0.005,0.25055 0.0679,0.43585 0.0626,0.1853 0.17226,0.31057 0.10961,0.12267 0.26098,0.1853 0.15137,0.06 0.33928,0.06 0.17487,0 0.30014,-0.0392 0.12788,-0.0418 0.21923,-0.0887 0.0913,-0.047 0.15137,-0.0861 0.0626,-0.0418 0.107,-0.0418 0.0574,0 0.0887,0.0444 l 0.13049,0.16964 q -0.0861,0.1044 -0.20618,0.18269 -0.12005,0.0757 -0.25837,0.12528 -0.13572,0.0496 -0.28187,0.0731 -0.14615,0.0261 -0.28969,0.0261 -0.27404,0 -0.50632,-0.0913 -0.22967,-0.094 -0.39931,-0.27143 -0.16703,-0.18008 -0.26098,-0.44368 -0.094,-0.26359 -0.094,-0.60549 0,-0.27664 0.0835,-0.51675 0.0861,-0.24011 0.24532,-0.41497 0.15921,-0.17747 0.38887,-0.27664 0.22967,-0.10179 0.51676,-0.10179 z m 0.0104,0.34189 q -0.33668,0 -0.52981,0.19574 -0.19313,0.19313 -0.2401,0.53764 h 1.44586 q 0,-0.16182 -0.047,-0.29492 -0.0444,-0.13571 -0.1331,-0.23228 -0.0861,-0.0992 -0.2114,-0.15137 -0.12527,-0.0548 -0.28447,-0.0548 z"
             inkscape:connector-curvature="0" />
          <path
             id="path4842"
             style="font-style:normal;font-variant:normal;font-weight:normal;font-stretch:normal;font-size:5.21973px;font-family:Lato;-inkscape-font-specification:'Lato, Normal';font-variant-ligatures:normal;font-variant-caps:normal;font-variant-numeric:normal;font-feature-settings:normal;text-align:start;writing-mode:lr-tb;text-anchor:start;vector-effect:none;fill:#0a469d;fill-opacity:1;stroke:none;stroke-width:0.108356;stroke-linecap:butt;stroke-linejoin:miter;stroke-miterlimit:4;stroke-dasharray:none;stroke-dashoffset:0;stroke-opacity:1"
             d="m 425.18892,764.07062 v 0.4254 h -1.21098 v 3.31453 h -0.50371 v -3.31453 h -1.21358 v -0.4254 z"
             inkscape:connector-curvature="0" />
          <path
             id="path4844"
             style="font-style:normal;font-variant:normal;font-weight:normal;font-stretch:normal;font-size:5.21973px;font-family:Lato;-inkscape-font-specification:'Lato, Normal';font-variant-ligatures:normal;font-variant-caps:normal;font-variant-numeric:normal;font-feature-settings:normal;text-align:start;writing-mode:lr-tb;text-anchor:start;vector-effect:none;fill:#0a469d;fill-opacity:1;stroke:none;stroke-width:0.108356;stroke-linecap:butt;stroke-linejoin:miter;stroke-miterlimit:4;stroke-dasharray:none;stroke-dashoffset:0;stroke-opacity:1"
             d="m 426.08019,765.125 q 0.23749,0 0.43845,0.0809 0.20357,0.0783 0.34972,0.22967 0.14877,0.14876 0.23228,0.3706 0.0835,0.21922 0.0835,0.50109 0,0.10961 -0.0235,0.14615 -0.0235,0.0365 -0.0887,0.0365 h -1.76687 q 0.005,0.25055 0.0678,0.43585 0.0626,0.1853 0.17225,0.31057 0.10962,0.12267 0.26099,0.1853 0.15137,0.06 0.33928,0.06 0.17486,0 0.30014,-0.0392 0.12788,-0.0418 0.21923,-0.0887 0.0913,-0.047 0.15137,-0.0861 0.0626,-0.0418 0.107,-0.0418 0.0574,0 0.0887,0.0444 l 0.13049,0.16964 q -0.0861,0.1044 -0.20618,0.18269 -0.12005,0.0757 -0.25838,0.12528 -0.13571,0.0496 -0.28186,0.0731 -0.14615,0.0261 -0.2897,0.0261 -0.27403,0 -0.50631,-0.0913 -0.22967,-0.094 -0.39931,-0.27143 -0.16703,-0.18008 -0.26099,-0.44368 -0.094,-0.26359 -0.094,-0.60549 0,-0.27664 0.0835,-0.51675 0.0861,-0.24011 0.24533,-0.41497 0.1592,-0.17747 0.38887,-0.27664 0.22967,-0.10179 0.51676,-0.10179 z m 0.0104,0.34189 q -0.33667,0 -0.5298,0.19574 -0.19313,0.19313 -0.24011,0.53764 h 1.44587 q 0,-0.16182 -0.047,-0.29492 -0.0444,-0.13571 -0.1331,-0.23228 -0.0861,-0.0992 -0.2114,-0.15137 -0.12527,-0.0548 -0.28448,-0.0548 z"
             inkscape:connector-curvature="0" />
          <path
             id="path4846"
             style="font-style:normal;font-variant:normal;font-weight:normal;font-stretch:normal;font-size:5.21973px;font-family:Lato;-inkscape-font-specification:'Lato, Normal';font-variant-ligatures:normal;font-variant-caps:normal;font-variant-numeric:normal;font-feature-settings:normal;text-align:start;writing-mode:lr-tb;text-anchor:start;vector-effect:none;fill:#0a469d;fill-opacity:1;stroke:none;stroke-width:0.108356;stroke-linecap:butt;stroke-linejoin:miter;stroke-miterlimit:4;stroke-dasharray:none;stroke-dashoffset:0;stroke-opacity:1"
             d="m 429.58964,765.63653 q -0.0209,0.0287 -0.0418,0.0444 -0.0209,0.0157 -0.0574,0.0157 -0.0391,0 -0.0861,-0.0313 -0.047,-0.0339 -0.11745,-0.0731 -0.0679,-0.0392 -0.16964,-0.0705 -0.0992,-0.0339 -0.24532,-0.0339 -0.19574,0 -0.34451,0.0705 -0.14876,0.0679 -0.25054,0.19835 -0.0992,0.13049 -0.15138,0.31579 -0.0496,0.1853 -0.0496,0.41497 0,0.24011 0.0548,0.42802 0.0548,0.1853 0.15399,0.31318 0.10178,0.12528 0.24271,0.19313 0.14355,0.0652 0.32102,0.0652 0.16964,0 0.27925,-0.0392 0.10962,-0.0418 0.18008,-0.0913 0.0731,-0.0496 0.12006,-0.0887 0.0496,-0.0418 0.0966,-0.0418 0.0574,0 0.0887,0.0444 l 0.13049,0.16964 q -0.0861,0.10701 -0.19574,0.18269 -0.10961,0.0757 -0.2375,0.12789 -0.12527,0.0496 -0.26359,0.0731 -0.13833,0.0235 -0.28187,0.0235 -0.24794,0 -0.46194,-0.0913 -0.2114,-0.0914 -0.368,-0.2636 -0.15659,-0.17486 -0.24532,-0.42802 -0.0887,-0.25316 -0.0887,-0.57678 0,-0.29491 0.0809,-0.54546 0.0835,-0.25055 0.24011,-0.43063 0.1592,-0.18269 0.38887,-0.28447 0.23227,-0.10179 0.53241,-0.10179 0.27925,0 0.49065,0.0914 0.21401,0.0887 0.37843,0.25315 z"
             inkscape:connector-curvature="0" />
          <path
             id="path4848"
             style="font-style:normal;font-variant:normal;font-weight:normal;font-stretch:normal;font-size:5.21973px;font-family:Lato;-inkscape-font-specification:'Lato, Normal';font-variant-ligatures:normal;font-variant-caps:normal;font-variant-numeric:normal;font-feature-settings:normal;text-align:start;writing-mode:lr-tb;text-anchor:start;vector-effect:none;fill:#0a469d;fill-opacity:1;stroke:none;stroke-width:0.108356;stroke-linecap:butt;stroke-linejoin:miter;stroke-miterlimit:4;stroke-dasharray:none;stroke-dashoffset:0;stroke-opacity:1"
             d="m 430.23721,767.81055 v -2.64379 h 0.27926 q 0.0992,0 0.12266,0.0966 l 0.0365,0.28709 q 0.17225,-0.19052 0.38626,-0.30796 0.21401,-0.11745 0.49326,-0.11745 0.21662,0 0.38104,0.0731 0.16704,0.0705 0.27665,0.20357 0.11222,0.13049 0.16964,0.31579 0.0574,0.1853 0.0574,0.40975 v 1.68336 h -0.46717 v -1.68336 q 0,-0.30014 -0.13832,-0.46456 -0.13571,-0.16703 -0.41497,-0.16703 -0.20879,0 -0.38887,0.0992 -0.17747,0.0992 -0.32623,0.26881 v 1.94696 z"
             inkscape:connector-curvature="0" />
          <path
             id="path4850"
             style="font-style:normal;font-variant:normal;font-weight:normal;font-stretch:normal;font-size:5.21973px;font-family:Lato;-inkscape-font-specification:'Lato, Normal';font-variant-ligatures:normal;font-variant-caps:normal;font-variant-numeric:normal;font-feature-settings:normal;text-align:start;writing-mode:lr-tb;text-anchor:start;vector-effect:none;fill:#0a469d;fill-opacity:1;stroke:none;stroke-width:0.108356;stroke-linecap:butt;stroke-linejoin:miter;stroke-miterlimit:4;stroke-dasharray:none;stroke-dashoffset:0;stroke-opacity:1"
             d="m 434.26733,765.125 q 0.2897,0 0.52198,0.0966 0.23227,0.0966 0.3967,0.27403 0.16442,0.17747 0.25054,0.43063 0.0887,0.25055 0.0887,0.56112 0,0.31318 -0.0887,0.56373 -0.0861,0.25055 -0.25054,0.42802 -0.16443,0.17747 -0.3967,0.27404 -0.23228,0.0939 -0.52198,0.0939 -0.2923,0 -0.52719,-0.0939 -0.23228,-0.0966 -0.3967,-0.27404 -0.16442,-0.17747 -0.25316,-0.42802 -0.0861,-0.25055 -0.0861,-0.56373 0,-0.31057 0.0861,-0.56112 0.0887,-0.25316 0.25316,-0.43063 0.16442,-0.17747 0.3967,-0.27403 0.23489,-0.0966 0.52719,-0.0966 z m 0,2.35932 q 0.39148,0 0.58461,-0.26099 0.19313,-0.26359 0.19313,-0.73337 0,-0.47238 -0.19313,-0.73598 -0.19313,-0.2636 -0.58461,-0.2636 -0.19835,0 -0.34711,0.0679 -0.14615,0.0679 -0.24533,0.19574 -0.0966,0.12788 -0.14615,0.31579 -0.047,0.1853 -0.047,0.42019 0,0.46978 0.19313,0.73337 0.19574,0.26099 0.59244,0.26099 z"
             inkscape:connector-curvature="0" />
          <path
             id="path4852"
             style="font-style:normal;font-variant:normal;font-weight:normal;font-stretch:normal;font-size:5.21973px;font-family:Lato;-inkscape-font-specification:'Lato, Normal';font-variant-ligatures:normal;font-variant-caps:normal;font-variant-numeric:normal;font-feature-settings:normal;text-align:start;writing-mode:lr-tb;text-anchor:start;vector-effect:none;fill:#0a469d;fill-opacity:1;stroke:none;stroke-width:0.108356;stroke-linecap:butt;stroke-linejoin:miter;stroke-miterlimit:4;stroke-dasharray:none;stroke-dashoffset:0;stroke-opacity:1"
             d="m 436.58963,763.96622 v 3.84433 h -0.46456 v -3.84433 z"
             inkscape:connector-curvature="0" />
          <path
             id="path4854"
             style="font-style:normal;font-variant:normal;font-weight:normal;font-stretch:normal;font-size:5.21973px;font-family:Lato;-inkscape-font-specification:'Lato, Normal';font-variant-ligatures:normal;font-variant-caps:normal;font-variant-numeric:normal;font-feature-settings:normal;text-align:start;writing-mode:lr-tb;text-anchor:start;vector-effect:none;fill:#0a469d;fill-opacity:1;stroke:none;stroke-width:0.108356;stroke-linecap:butt;stroke-linejoin:miter;stroke-miterlimit:4;stroke-dasharray:none;stroke-dashoffset:0;stroke-opacity:1"
             d="m 438.45739,765.125 q 0.2897,0 0.52197,0.0966 0.23228,0.0966 0.3967,0.27403 0.16442,0.17747 0.25055,0.43063 0.0887,0.25055 0.0887,0.56112 0,0.31318 -0.0887,0.56373 -0.0861,0.25055 -0.25055,0.42802 -0.16442,0.17747 -0.3967,0.27404 -0.23227,0.0939 -0.52197,0.0939 -0.2923,0 -0.52719,-0.0939 -0.23228,-0.0966 -0.3967,-0.27404 -0.16442,-0.17747 -0.25316,-0.42802 -0.0861,-0.25055 -0.0861,-0.56373 0,-0.31057 0.0861,-0.56112 0.0887,-0.25316 0.25316,-0.43063 0.16442,-0.17747 0.3967,-0.27403 0.23489,-0.0966 0.52719,-0.0966 z m 0,2.35932 q 0.39148,0 0.58461,-0.26099 0.19313,-0.26359 0.19313,-0.73337 0,-0.47238 -0.19313,-0.73598 -0.19313,-0.2636 -0.58461,-0.2636 -0.19835,0 -0.34711,0.0679 -0.14615,0.0679 -0.24533,0.19574 -0.0966,0.12788 -0.14615,0.31579 -0.047,0.1853 -0.047,0.42019 0,0.46978 0.19313,0.73337 0.19574,0.26099 0.59244,0.26099 z"
             inkscape:connector-curvature="0" />
          <path
             id="path4856"
             style="font-style:normal;font-variant:normal;font-weight:normal;font-stretch:normal;font-size:5.21973px;font-family:Lato;-inkscape-font-specification:'Lato, Normal';font-variant-ligatures:normal;font-variant-caps:normal;font-variant-numeric:normal;font-feature-settings:normal;text-align:start;writing-mode:lr-tb;text-anchor:start;vector-effect:none;fill:#0a469d;fill-opacity:1;stroke:none;stroke-width:0.108356;stroke-linecap:butt;stroke-linejoin:miter;stroke-miterlimit:4;stroke-dasharray:none;stroke-dashoffset:0;stroke-opacity:1"
             d="m 441.22075,765.12239 q 0.17225,0 0.32101,0.0391 0.14877,0.0365 0.27143,0.10961 h 0.71771 v 0.17225 q 0,0.0861 -0.10961,0.10962 l -0.30014,0.0418 q 0.0887,0.16964 0.0887,0.37843 0,0.19313 -0.0757,0.35233 -0.0731,0.15659 -0.20357,0.26882 -0.13049,0.11222 -0.31318,0.17225 -0.18269,0.06 -0.3967,0.06 -0.18791,0 -0.35233,-0.0444 -0.0835,0.0522 -0.12789,0.11222 -0.0417,0.06 -0.0417,0.11744 0,0.094 0.0757,0.14355 0.0783,0.047 0.20357,0.0679 0.12528,0.0209 0.28448,0.0261 0.16181,0.005 0.32884,0.0183 0.16964,0.0104 0.32884,0.0392 0.16182,0.0287 0.28709,0.0939 0.12527,0.0652 0.20096,0.18008 0.0783,0.11484 0.0783,0.29753 0,0.16964 -0.0861,0.32884 -0.0835,0.1592 -0.24272,0.28187 -0.1592,0.12527 -0.39148,0.19835 -0.22967,0.0757 -0.51936,0.0757 -0.2897,0 -0.50632,-0.0574 -0.21661,-0.0574 -0.36016,-0.15399 -0.14354,-0.0966 -0.21662,-0.22444 -0.0705,-0.12528 -0.0705,-0.2636 0,-0.19574 0.12266,-0.33145 0.12267,-0.13572 0.33406,-0.21662 -0.11744,-0.0522 -0.1853,-0.13832 -0.0679,-0.0887 -0.0679,-0.2375 0,-0.0574 0.0209,-0.11745 0.0209,-0.0626 0.0626,-0.12266 0.0444,-0.06 0.10701,-0.11483 0.0626,-0.0548 0.14615,-0.0966 -0.19574,-0.10961 -0.30535,-0.2923 -0.10962,-0.18269 -0.10962,-0.4228 0,-0.19313 0.0731,-0.34972 0.0757,-0.15921 0.20879,-0.26882 0.1331,-0.11222 0.31579,-0.17225 0.1853,-0.06 0.40453,-0.06 z m 0.83777,2.83171 q 0,-0.0966 -0.0548,-0.1566 -0.0548,-0.06 -0.14876,-0.094 -0.0913,-0.0339 -0.21401,-0.047 -0.12267,-0.0157 -0.26099,-0.0235 -0.13571,-0.008 -0.27664,-0.0157 -0.14094,-0.008 -0.27143,-0.0261 -0.14615,0.0679 -0.24011,0.16965 -0.0913,0.10178 -0.0913,0.24271 0,0.0887 0.0444,0.16442 0.047,0.0783 0.14093,0.13311 0.094,0.0574 0.23489,0.0887 0.14354,0.0339 0.33667,0.0339 0.18791,0 0.33667,-0.0339 0.14876,-0.0339 0.25055,-0.0966 0.10439,-0.0626 0.1592,-0.14876 0.0548,-0.0861 0.0548,-0.19052 z m -0.83777,-1.43543 q 0.14093,0 0.24794,-0.0392 0.107,-0.0391 0.18008,-0.10961 0.0731,-0.0705 0.10961,-0.16703 0.0365,-0.0992 0.0365,-0.21662 0,-0.24272 -0.14876,-0.38626 -0.14615,-0.14355 -0.42541,-0.14355 -0.28187,0 -0.43063,0.14355 -0.14615,0.14354 -0.14615,0.38626 0,0.11744 0.0365,0.21662 0.0391,0.0966 0.11222,0.16703 0.0731,0.0705 0.18008,0.10961 0.10701,0.0392 0.24794,0.0392 z"
             inkscape:connector-curvature="0" />
          <path
             id="path4858"
             style="font-style:normal;font-variant:normal;font-weight:normal;font-stretch:normal;font-size:5.21973px;font-family:Lato;-inkscape-font-specification:'Lato, Normal';font-variant-ligatures:normal;font-variant-caps:normal;font-variant-numeric:normal;font-feature-settings:normal;text-align:start;writing-mode:lr-tb;text-anchor:start;vector-effect:none;fill:#0a469d;fill-opacity:1;stroke:none;stroke-width:0.108356;stroke-linecap:butt;stroke-linejoin:miter;stroke-miterlimit:4;stroke-dasharray:none;stroke-dashoffset:0;stroke-opacity:1"
             d="m 443.50194,765.16676 v 2.64379 h -0.46456 v -2.64379 z m 0.0992,-0.82994 q 0,0.0679 -0.0287,0.12789 -0.0261,0.0574 -0.0731,0.10439 -0.0444,0.0444 -0.10701,0.0705 -0.06,0.0261 -0.12788,0.0261 -0.0679,0 -0.12789,-0.0261 -0.0574,-0.0261 -0.10178,-0.0705 -0.0444,-0.047 -0.0705,-0.10439 -0.0261,-0.06 -0.0261,-0.12789 0,-0.0679 0.0261,-0.12788 0.0261,-0.0626 0.0705,-0.10701 0.0444,-0.047 0.10178,-0.0731 0.06,-0.0261 0.12789,-0.0261 0.0679,0 0.12788,0.0261 0.0626,0.0261 0.10701,0.0731 0.047,0.0444 0.0731,0.10701 0.0287,0.06 0.0287,0.12788 z"
             inkscape:connector-curvature="0" />
          <path
             id="path4860"
             style="font-style:normal;font-variant:normal;font-weight:normal;font-stretch:normal;font-size:5.21973px;font-family:Lato;-inkscape-font-specification:'Lato, Normal';font-variant-ligatures:normal;font-variant-caps:normal;font-variant-numeric:normal;font-feature-settings:normal;text-align:start;writing-mode:lr-tb;text-anchor:start;vector-effect:none;fill:#0a469d;fill-opacity:1;stroke:none;stroke-width:0.108356;stroke-linecap:butt;stroke-linejoin:miter;stroke-miterlimit:4;stroke-dasharray:none;stroke-dashoffset:0;stroke-opacity:1"
             d="m 445.94599,767.81055 q -0.0679,0 -0.10439,-0.0209 -0.0365,-0.0235 -0.0574,-0.0887 l -0.0522,-0.24794 q -0.10439,0.094 -0.20617,0.16964 -0.0992,0.0731 -0.20879,0.12528 -0.10701,0.0496 -0.23228,0.0757 -0.12267,0.0287 -0.27404,0.0287 -0.15398,0 -0.28969,-0.0418 -0.13572,-0.0444 -0.2375,-0.13049 -0.0992,-0.0861 -0.1592,-0.21662 -0.0574,-0.1331 -0.0574,-0.31318 0,-0.1566 0.0861,-0.30014 0.0861,-0.14615 0.27925,-0.25837 0.19313,-0.11223 0.50371,-0.1827 0.31057,-0.0731 0.76208,-0.0835 v -0.20618 q 0,-0.30796 -0.13311,-0.46456 -0.1331,-0.1592 -0.38887,-0.1592 -0.17225,0 -0.28969,0.0444 -0.11484,0.0418 -0.20096,0.0966 -0.0835,0.0522 -0.14615,0.0966 -0.06,0.0418 -0.12006,0.0418 -0.047,0 -0.0809,-0.0235 -0.0339,-0.0261 -0.0574,-0.0626 l -0.0835,-0.14876 q 0.21923,-0.2114 0.47239,-0.31579 0.25316,-0.1044 0.56112,-0.1044 0.22184,0 0.39409,0.0731 0.17225,0.0731 0.2897,0.20357 0.11744,0.13049 0.17747,0.31579 0.06,0.1853 0.06,0.40714 v 1.69119 z m -0.99696,-0.28447 q 0.12266,0 0.22444,-0.0235 0.10179,-0.0261 0.19052,-0.0705 0.0913,-0.047 0.17225,-0.11222 0.0835,-0.0679 0.16182,-0.15137 v -0.54808 q -0.32102,0.0104 -0.54808,0.0522 -0.22444,0.0392 -0.36799,0.1044 -0.14093,0.0652 -0.20618,0.15398 -0.0626,0.0887 -0.0626,0.19835 0,0.10439 0.0339,0.18008 0.0339,0.0757 0.0913,0.12527 0.06,0.047 0.13832,0.0705 0.0809,0.0209 0.17226,0.0209 z"
             inkscape:connector-curvature="0" />
          <path
             id="path4862"
             style="font-style:normal;font-variant:normal;font-weight:normal;font-stretch:normal;font-size:5.21973px;font-family:Lato;-inkscape-font-specification:'Lato, Normal';font-variant-ligatures:normal;font-variant-caps:normal;font-variant-numeric:normal;font-feature-settings:normal;text-align:start;writing-mode:lr-tb;text-anchor:start;vector-effect:none;fill:#0a469d;fill-opacity:1;stroke:none;stroke-width:0.108356;stroke-linecap:butt;stroke-linejoin:miter;stroke-miterlimit:4;stroke-dasharray:none;stroke-dashoffset:0;stroke-opacity:1"
             d="m 448.39454,765.60261 q -0.0313,0.0574 -0.0966,0.0574 -0.0392,0 -0.0887,-0.0287 -0.0496,-0.0287 -0.12267,-0.0626 -0.0705,-0.0365 -0.16964,-0.0652 -0.0992,-0.0313 -0.23489,-0.0313 -0.11744,0 -0.2114,0.0313 -0.094,0.0287 -0.16181,0.0809 -0.0652,0.0522 -0.10178,0.12266 -0.0339,0.0679 -0.0339,0.14876 0,0.10179 0.0574,0.16964 0.06,0.0679 0.15659,0.11745 0.0966,0.0496 0.21923,0.0887 0.12266,0.0365 0.25054,0.0809 0.1305,0.0418 0.25316,0.094 0.12266,0.0522 0.21923,0.13049 0.0966,0.0783 0.15398,0.19313 0.06,0.11222 0.06,0.27142 0,0.1827 -0.0652,0.33929 -0.0652,0.15398 -0.19313,0.26881 -0.12788,0.11223 -0.31318,0.17747 -0.1853,0.0652 -0.42802,0.0652 -0.27665,0 -0.50109,-0.0887 -0.22445,-0.0914 -0.38104,-0.23228 l 0.10961,-0.17747 q 0.0209,-0.0339 0.0496,-0.0522 0.0287,-0.0183 0.0731,-0.0183 0.047,0 0.0992,0.0365 0.0522,0.0365 0.12527,0.0809 0.0757,0.0444 0.18269,0.0809 0.10701,0.0365 0.26621,0.0365 0.13571,0 0.2375,-0.0339 0.10178,-0.0365 0.16964,-0.0966 0.0678,-0.06 0.0992,-0.13832 0.0339,-0.0783 0.0339,-0.16703 0,-0.10961 -0.06,-0.18008 -0.0574,-0.0731 -0.15398,-0.12266 -0.0966,-0.0522 -0.22184,-0.0887 -0.12266,-0.0391 -0.25315,-0.0809 -0.12789,-0.0417 -0.25316,-0.0939 -0.12266,-0.0548 -0.21923,-0.13571 -0.0966,-0.0809 -0.15659,-0.19835 -0.0574,-0.12006 -0.0574,-0.2897 0,-0.15137 0.0626,-0.28969 0.0626,-0.14094 0.18269,-0.24533 0.12005,-0.10701 0.29491,-0.16964 0.17487,-0.0626 0.39931,-0.0626 0.26099,0 0.46717,0.0835 0.20879,0.0809 0.36016,0.22445 z"
             inkscape:connector-curvature="0" />
          <path
             id="path4864"
             style="font-style:normal;font-variant:normal;font-weight:normal;font-stretch:normal;font-size:5.21973px;font-family:Lato;-inkscape-font-specification:'Lato, Normal';font-variant-ligatures:normal;font-variant-caps:normal;font-variant-numeric:normal;font-feature-settings:normal;text-align:start;writing-mode:lr-tb;text-anchor:start;vector-effect:none;fill:#0a469d;fill-opacity:1;stroke:none;stroke-width:0.108356;stroke-linecap:butt;stroke-linejoin:miter;stroke-miterlimit:4;stroke-dasharray:none;stroke-dashoffset:0;stroke-opacity:1"
             d="m 451.06679,767.38514 h 1.61812 v 0.42541 h -2.12182 v -3.73993 h 0.5037 z"
             inkscape:connector-curvature="0" />
          <path
             id="path4866"
             style="font-style:normal;font-variant:normal;font-weight:normal;font-stretch:normal;font-size:5.21973px;font-family:Lato;-inkscape-font-specification:'Lato, Normal';font-variant-ligatures:normal;font-variant-caps:normal;font-variant-numeric:normal;font-feature-settings:normal;text-align:start;writing-mode:lr-tb;text-anchor:start;vector-effect:none;fill:#0a469d;fill-opacity:1;stroke:none;stroke-width:0.108356;stroke-linecap:butt;stroke-linejoin:miter;stroke-miterlimit:4;stroke-dasharray:none;stroke-dashoffset:0;stroke-opacity:1"
             d="m 453.62536,765.16676 v 2.64379 h -0.46456 v -2.64379 z m 0.0992,-0.82994 q 0,0.0679 -0.0287,0.12789 -0.0261,0.0574 -0.0731,0.10439 -0.0444,0.0444 -0.10701,0.0705 -0.06,0.0261 -0.12788,0.0261 -0.0679,0 -0.12788,-0.0261 -0.0574,-0.0261 -0.10179,-0.0705 -0.0444,-0.047 -0.0705,-0.10439 -0.0261,-0.06 -0.0261,-0.12789 0,-0.0679 0.0261,-0.12788 0.0261,-0.0626 0.0705,-0.10701 0.0444,-0.047 0.10179,-0.0731 0.06,-0.0261 0.12788,-0.0261 0.0679,0 0.12788,0.0261 0.0626,0.0261 0.10701,0.0731 0.047,0.0444 0.0731,0.10701 0.0287,0.06 0.0287,0.12788 z"
             inkscape:connector-curvature="0" />
          <path
             id="path4868"
             style="font-style:normal;font-variant:normal;font-weight:normal;font-stretch:normal;font-size:5.21973px;font-family:Lato;-inkscape-font-specification:'Lato, Normal';font-variant-ligatures:normal;font-variant-caps:normal;font-variant-numeric:normal;font-feature-settings:normal;text-align:start;writing-mode:lr-tb;text-anchor:start;vector-effect:none;fill:#0a469d;fill-opacity:1;stroke:none;stroke-width:0.108356;stroke-linecap:butt;stroke-linejoin:miter;stroke-miterlimit:4;stroke-dasharray:none;stroke-dashoffset:0;stroke-opacity:1"
             d="m 454.0807,765.16676 h 0.37843 q 0.0574,0 0.094,0.0287 0.0365,0.0287 0.0496,0.0679 l 0.67074,1.70164 q 0.0313,0.0966 0.0548,0.18791 0.0235,0.0913 0.0444,0.18269 0.0209,-0.0914 0.0444,-0.18269 0.0235,-0.0914 0.0574,-0.18791 l 0.67856,-1.70164 q 0.0157,-0.0417 0.0522,-0.0679 0.0365,-0.0287 0.0861,-0.0287 h 0.36278 l -1.07788,2.64379 h -0.41758 z"
             inkscape:connector-curvature="0" />
          <path
             id="path4870"
             style="font-style:normal;font-variant:normal;font-weight:normal;font-stretch:normal;font-size:5.21973px;font-family:Lato;-inkscape-font-specification:'Lato, Normal';font-variant-ligatures:normal;font-variant-caps:normal;font-variant-numeric:normal;font-feature-settings:normal;text-align:start;writing-mode:lr-tb;text-anchor:start;vector-effect:none;fill:#0a469d;fill-opacity:1;stroke:none;stroke-width:0.108356;stroke-linecap:butt;stroke-linejoin:miter;stroke-miterlimit:4;stroke-dasharray:none;stroke-dashoffset:0;stroke-opacity:1"
             d="m 457.08009,767.81055 v -2.64379 h 0.2662 q 0.0757,0 0.1044,0.0287 0.0287,0.0287 0.0392,0.0992 l 0.0287,0.40192 q 0.12527,-0.27142 0.30796,-0.4228 0.1853,-0.15398 0.4489,-0.15398 0.0835,0 0.1592,0.0183 0.0783,0.0183 0.13832,0.0574 l -0.0339,0.34711 q -0.0157,0.0652 -0.0783,0.0652 -0.0365,0 -0.10701,-0.0157 -0.0705,-0.0157 -0.1592,-0.0157 -0.12527,0 -0.22445,0.0392 -0.0992,0.0365 -0.17747,0.10961 -0.0757,0.0705 -0.13571,0.17486 -0.06,0.1044 -0.10962,0.24011 v 1.67031 z"
             inkscape:connector-curvature="0" />
          <path
             id="path4872"
             style="font-style:normal;font-variant:normal;font-weight:normal;font-stretch:normal;font-size:5.21973px;font-family:Lato;-inkscape-font-specification:'Lato, Normal';font-variant-ligatures:normal;font-variant-caps:normal;font-variant-numeric:normal;font-feature-settings:normal;text-align:start;writing-mode:lr-tb;text-anchor:start;vector-effect:none;fill:#0a469d;fill-opacity:1;stroke:none;stroke-width:0.108356;stroke-linecap:butt;stroke-linejoin:miter;stroke-miterlimit:4;stroke-dasharray:none;stroke-dashoffset:0;stroke-opacity:1"
             d="m 459.95746,765.125 q 0.2375,0 0.43846,0.0809 0.20357,0.0783 0.34972,0.22967 0.14877,0.14876 0.23228,0.3706 0.0835,0.21922 0.0835,0.50109 0,0.10961 -0.0235,0.14615 -0.0235,0.0365 -0.0887,0.0365 h -1.76688 q 0.005,0.25055 0.0679,0.43585 0.0626,0.1853 0.17225,0.31057 0.10962,0.12267 0.26099,0.1853 0.15137,0.06 0.33928,0.06 0.17486,0 0.30013,-0.0392 0.12789,-0.0418 0.21923,-0.0887 0.0913,-0.047 0.15138,-0.0861 0.0626,-0.0418 0.107,-0.0418 0.0574,0 0.0887,0.0444 l 0.13049,0.16964 q -0.0861,0.1044 -0.20618,0.18269 -0.12005,0.0757 -0.25838,0.12528 -0.13571,0.0496 -0.28186,0.0731 -0.14616,0.0261 -0.2897,0.0261 -0.27403,0 -0.50631,-0.0913 -0.22967,-0.094 -0.39931,-0.27143 -0.16703,-0.18008 -0.26099,-0.44368 -0.094,-0.26359 -0.094,-0.60549 0,-0.27664 0.0835,-0.51675 0.0861,-0.24011 0.24533,-0.41497 0.1592,-0.17747 0.38887,-0.27664 0.22967,-0.10179 0.51675,-0.10179 z m 0.0104,0.34189 q -0.33667,0 -0.5298,0.19574 -0.19313,0.19313 -0.24011,0.53764 h 1.44587 q 0,-0.16182 -0.047,-0.29492 -0.0444,-0.13571 -0.1331,-0.23228 -0.0861,-0.0992 -0.2114,-0.15137 -0.12528,-0.0548 -0.28448,-0.0548 z"
             inkscape:connector-curvature="0" />
          <path
             id="path4874"
             style="font-style:normal;font-variant:normal;font-weight:normal;font-stretch:normal;font-size:5.21973px;font-family:Lato;-inkscape-font-specification:'Lato, Normal';font-variant-ligatures:normal;font-variant-caps:normal;font-variant-numeric:normal;font-feature-settings:normal;text-align:start;writing-mode:lr-tb;text-anchor:start;vector-effect:none;fill:#0a469d;fill-opacity:1;stroke:none;stroke-width:0.108356;stroke-linecap:butt;stroke-linejoin:miter;stroke-miterlimit:4;stroke-dasharray:none;stroke-dashoffset:0;stroke-opacity:1"
             d="m 463.16678,765.60261 q -0.0313,0.0574 -0.0966,0.0574 -0.0392,0 -0.0887,-0.0287 -0.0496,-0.0287 -0.12266,-0.0626 -0.0705,-0.0365 -0.16964,-0.0652 -0.0992,-0.0313 -0.23489,-0.0313 -0.11744,0 -0.2114,0.0313 -0.094,0.0287 -0.16181,0.0809 -0.0652,0.0522 -0.10178,0.12266 -0.0339,0.0679 -0.0339,0.14876 0,0.10179 0.0574,0.16964 0.06,0.0679 0.1566,0.11745 0.0966,0.0496 0.21922,0.0887 0.12267,0.0365 0.25055,0.0809 0.13049,0.0418 0.25316,0.094 0.12266,0.0522 0.21923,0.13049 0.0966,0.0783 0.15398,0.19313 0.06,0.11222 0.06,0.27142 0,0.1827 -0.0652,0.33929 -0.0652,0.15398 -0.19313,0.26881 -0.12788,0.11223 -0.31318,0.17747 -0.1853,0.0652 -0.42802,0.0652 -0.27665,0 -0.5011,-0.0887 -0.22444,-0.0914 -0.38104,-0.23228 l 0.10962,-0.17747 q 0.0209,-0.0339 0.0496,-0.0522 0.0287,-0.0183 0.0731,-0.0183 0.047,0 0.0992,0.0365 0.0522,0.0365 0.12527,0.0809 0.0757,0.0444 0.18269,0.0809 0.107,0.0365 0.26621,0.0365 0.13571,0 0.23749,-0.0339 0.10179,-0.0365 0.16965,-0.0966 0.0679,-0.06 0.0992,-0.13832 0.0339,-0.0783 0.0339,-0.16703 0,-0.10961 -0.06,-0.18008 -0.0574,-0.0731 -0.15398,-0.12266 -0.0966,-0.0522 -0.22184,-0.0887 -0.12266,-0.0391 -0.25316,-0.0809 -0.12788,-0.0417 -0.25315,-0.0939 -0.12267,-0.0548 -0.21923,-0.13571 -0.0966,-0.0809 -0.15659,-0.19835 -0.0574,-0.12006 -0.0574,-0.2897 0,-0.15137 0.0626,-0.28969 0.0626,-0.14094 0.18269,-0.24533 0.12005,-0.10701 0.29491,-0.16964 0.17486,-0.0626 0.39931,-0.0626 0.26099,0 0.46717,0.0835 0.20879,0.0809 0.36016,0.22445 z"
             inkscape:connector-curvature="0" />
        </g>
        <g
           id="text1643-0-6"
           style="font-style:normal;font-variant:normal;font-weight:normal;font-stretch:normal;font-size:11px;line-height:1.25;font-family:Lato;-inkscape-font-specification:'Lato, Normal';font-variant-ligatures:normal;font-variant-caps:normal;font-variant-numeric:normal;font-feature-settings:normal;text-align:start;letter-spacing:0px;word-spacing:0px;writing-mode:lr-tb;text-anchor:start;opacity:1;vector-effect:none;fill:#0a469d;fill-opacity:1;stroke:none;stroke-width:0.153968;stroke-linecap:butt;stroke-linejoin:miter;stroke-miterlimit:4;stroke-dasharray:none;stroke-dashoffset:0;stroke-opacity:1"
           aria-label="ICTL">
          <path
             id="path4781"
             style="font-style:normal;font-variant:normal;font-weight:bold;font-stretch:normal;font-size:11px;font-family:Lato;-inkscape-font-specification:'Lato, Normal';font-variant-ligatures:normal;font-variant-caps:normal;font-variant-numeric:normal;font-feature-settings:normal;text-align:start;writing-mode:lr-tb;text-anchor:start;vector-effect:none;fill:#0a469d;fill-opacity:1;stroke:none;stroke-width:0.153968;stroke-linecap:butt;stroke-linejoin:miter;stroke-miterlimit:4;stroke-dasharray:none;stroke-dashoffset:0;stroke-opacity:1"
             d="m 417.26231,754.5376 h -1.485 v -7.95298 h 1.485 z"
             inkscape:connector-curvature="0" />
          <path
             id="path4783"
             style="font-style:normal;font-variant:normal;font-weight:bold;font-stretch:normal;font-size:11px;font-family:Lato;-inkscape-font-specification:'Lato, Normal';font-variant-ligatures:normal;font-variant-caps:normal;font-variant-numeric:normal;font-feature-settings:normal;text-align:start;writing-mode:lr-tb;text-anchor:start;vector-effect:none;fill:#0a469d;fill-opacity:1;stroke:none;stroke-width:0.153968;stroke-linecap:butt;stroke-linejoin:miter;stroke-miterlimit:4;stroke-dasharray:none;stroke-dashoffset:0;stroke-opacity:1"
             d="m 424.50442,752.6621 q 0.121,0 0.2145,0.0935 l 0.583,0.6325 q -0.484,0.5995 -1.1935,0.9185 -0.704,0.319 -1.694,0.319 -0.88549,0 -1.59499,-0.3025 -0.704,-0.3025 -1.2045,-0.8415 -0.5005,-0.539 -0.77,-1.287 -0.264,-0.748 -0.264,-1.63349 0,-0.8965 0.286,-1.639 0.286,-0.748 0.803,-1.287 0.5225,-0.539 1.243,-0.83599 0.72049,-0.3025 1.59499,-0.3025 0.869,0 1.54,0.286 0.6765,0.28599 1.1495,0.74799 l -0.495,0.6875 q -0.044,0.066 -0.1155,0.1155 -0.066,0.0495 -0.187,0.0495 -0.0825,0 -0.1705,-0.044 -0.088,-0.0495 -0.1925,-0.1155 -0.1045,-0.0715 -0.242,-0.154 -0.1375,-0.0825 -0.319,-0.1485 -0.1815,-0.0715 -0.4235,-0.1155 -0.2365,-0.0495 -0.55,-0.0495 -0.5335,0 -0.97899,0.1925 -0.44,0.187 -0.759,0.55 -0.319,0.3575 -0.495,0.88 -0.176,0.517 -0.176,1.1825 0,0.671 0.187,1.19349 0.1925,0.5225 0.517,0.88 0.3245,0.3575 0.7645,0.55 0.43999,0.187 0.94599,0.187 0.3025,0 0.5445,-0.033 0.2475,-0.033 0.451,-0.1045 0.209,-0.0715 0.3905,-0.1815 0.187,-0.1155 0.3685,-0.2805 0.055,-0.0495 0.1155,-0.077 0.0605,-0.033 0.1265,-0.033 z"
             inkscape:connector-curvature="0" />
          <path
             id="path4785"
             style="font-style:normal;font-variant:normal;font-weight:bold;font-stretch:normal;font-size:11px;font-family:Lato;-inkscape-font-specification:'Lato, Normal';font-variant-ligatures:normal;font-variant-caps:normal;font-variant-numeric:normal;font-feature-settings:normal;text-align:start;writing-mode:lr-tb;text-anchor:start;vector-effect:none;fill:#0a469d;fill-opacity:1;stroke:none;stroke-width:0.153968;stroke-linecap:butt;stroke-linejoin:miter;stroke-miterlimit:4;stroke-dasharray:none;stroke-dashoffset:0;stroke-opacity:1"
             d="m 432.32274,746.58462 v 1.21549 h -2.398 v 6.73749 h -1.47949 v -6.73749 h -2.398 v -1.21549 z"
             inkscape:connector-curvature="0" />
          <path
             id="path4787"
             style="font-style:normal;font-variant:normal;font-weight:bold;font-stretch:normal;font-size:11px;font-family:Lato;-inkscape-font-specification:'Lato, Normal';font-variant-ligatures:normal;font-variant-caps:normal;font-variant-numeric:normal;font-feature-settings:normal;text-align:start;writing-mode:lr-tb;text-anchor:start;vector-effect:none;fill:#0a469d;fill-opacity:1;stroke:none;stroke-width:0.153968;stroke-linecap:butt;stroke-linejoin:miter;stroke-miterlimit:4;stroke-dasharray:none;stroke-dashoffset:0;stroke-opacity:1"
             d="m 434.84293,753.3166 h 3.179 v 1.221 h -4.65849 v -7.95298 h 1.47949 z"
             inkscape:connector-curvature="0" />
        </g>
        <g
           transform="translate(-0.26458334,48.099151)"
           id="use4436">
          <g
             transform="translate(58.128739,-24.930969)"
             id="g2299">
            <g
               id="g2297">
              <path
                 inkscape:connector-curvature="0"
                 transform="matrix(0.26458333,0,0,0.26458333,-58.128739,19.165153)"
                 id="path2283"
                 d="m 1520.2129,2660.8574 c -1.3488,-0.034 -2.6615,1.0054 -2.6582,2.586 v 4.0839 h -5.1524 c -8.5361,0 -15.455,6.921 -15.455,15.4571 v 31.0605 c -3.9241,1.8466 -6.6543,5.8304 -6.6543,10.4434 0,6.3592 5.1779,11.539 11.5371,11.539 6.3592,0 11.5449,-5.1798 11.5449,-11.539 0,-4.402 -2.486,-8.2389 -6.125,-10.1856 v -31.3203 c 0,-2.8453 2.307,-5.1503 5.1523,-5.1504 h 5.1524 v 4.084 c 5e-4,2.2962 2.7787,3.446 4.4004,1.8203 l 9.2324,-9.2383 c 1.0056,-1.0059 1.0056,-2.6366 0,-3.6425 l -9.2324,-9.2383 c -0.5074,-0.5087 -1.1291,-0.7444 -1.7422,-0.7598 z"
                 style="opacity:1;vector-effect:none;fill:#0a469d;fill-opacity:1;stroke:none;stroke-width:0.100241;stroke-linecap:butt;stroke-linejoin:miter;stroke-miterlimit:4;stroke-dasharray:none;stroke-dashoffset:0;stroke-opacity:1;marker:none" />
              <path
                 inkscape:connector-curvature="0"
                 id="path2285"
                 d="m 351.12032,723.10284 a 3.2328546,3.2328546 0 0 0 -1.67501,6.03189 v 10.56321 a 3.2328546,3.2328546 0 1 0 3.23312,0 v -10.56321 a 3.2328546,3.2328546 0 0 0 -1.55811,-6.03189 z m -0.002,1.65065 a 1.5136615,1.5136615 0 0 1 1.51383,1.51384 1.5136615,1.5136615 0 0 1 -1.51383,1.51339 1.5136615,1.5136615 0 0 1 -1.5134,-1.51339 1.5136615,1.5136615 0 0 1 1.5134,-1.51384 z m -0.0567,16.209 a 1.5136615,1.5136615 0 0 1 1.51383,1.51382 1.5136615,1.5136615 0 0 1 -1.51383,1.5134 1.5136615,1.5136615 0 0 1 -1.5134,-1.5134 1.5136615,1.5136615 0 0 1 1.5134,-1.51382 z"
                 style="opacity:1;vector-effect:none;fill:#0a469d;fill-opacity:1;stroke:none;stroke-width:0.0262535;stroke-linecap:butt;stroke-linejoin:miter;stroke-miterlimit:4;stroke-dasharray:none;stroke-dashoffset:0;stroke-opacity:1;marker:none" />
              <g
                 id="g2293">
                <path
                   inkscape:connector-curvature="0"
                   style="color:#000000;font-style:normal;font-variant:normal;font-weight:normal;font-stretch:normal;font-size:medium;line-height:normal;font-family:sans-serif;font-variant-ligatures:normal;font-variant-position:normal;font-variant-caps:normal;font-variant-numeric:normal;font-variant-alternates:normal;font-feature-settings:normal;text-indent:0;text-align:start;text-decoration:none;text-decoration-line:none;text-decoration-style:solid;text-decoration-color:#000000;letter-spacing:normal;word-spacing:normal;text-transform:none;writing-mode:lr-tb;direction:ltr;text-orientation:mixed;dominant-baseline:auto;baseline-shift:baseline;text-anchor:start;white-space:normal;shape-padding:0;clip-rule:nonzero;display:inline;overflow:visible;visibility:visible;opacity:1;isolation:auto;mix-blend-mode:normal;color-interpolation:sRGB;color-interpolation-filters:linearRGB;solid-color:#000000;solid-opacity:1;vector-effect:none;fill:#73e206;fill-opacity:1;fill-rule:nonzero;stroke:none;stroke-width:0.173502;stroke-linecap:butt;stroke-linejoin:miter;stroke-miterlimit:4;stroke-dasharray:none;stroke-dashoffset:0;stroke-opacity:1;color-rendering:auto;image-rendering:auto;shape-rendering:auto;text-rendering:auto;enable-background:accumulate"
                   d="m 339.23058,737.90818 c 1.16931,0 2.11135,0.94204 2.11135,2.11135 0,1.16931 -0.94204,2.11135 -2.11135,2.11135 -1.1693,0 -2.10962,-0.94204 -2.10962,-2.11135 0,-1.16931 0.94032,-2.11135 2.10962,-2.11135 z"
                   id="path2287" />
                <circle
                   r="2.2746642"
                   cy="726.35199"
                   cx="351.06186"
                   id="circle2289"
                   style="opacity:1;vector-effect:none;fill:#73e206;fill-opacity:1;stroke:none;stroke-width:0.196613;stroke-linecap:butt;stroke-linejoin:miter;stroke-miterlimit:4;stroke-dasharray:none;stroke-dashoffset:0;stroke-opacity:1" />
                <circle
                   style="opacity:1;vector-effect:none;fill:#73e206;fill-opacity:1;stroke:none;stroke-width:0.196613;stroke-linecap:butt;stroke-linejoin:miter;stroke-miterlimit:4;stroke-dasharray:none;stroke-dashoffset:0;stroke-opacity:1"
                   id="circle2291"
                   cx="351.06186"
                   cy="742.4975"
                   r="2.2746642" />
              </g>
              <path
                 style="opacity:1;vector-effect:none;fill:#0a469d;fill-opacity:1;stroke:none;stroke-width:0.0265221;stroke-linecap:butt;stroke-linejoin:miter;stroke-miterlimit:4;stroke-dasharray:none;stroke-dashoffset:0;stroke-opacity:1"
                 inkscape:connector-curvature="0"
                 d="m 344.54077,740.84117 c -0.31297,-0.2838 -0.80098,-0.26523 -1.12985,0 -0.36315,0.47449 -1.34014,1.49204 -2.34111,2.01222 -0.27315,0.14194 -0.5481,0.24685 -0.81284,0.29358 -1.1934,0.26732 -2.2916,0.22297 -3.58529,-0.27839 -0.23158,-0.0854 -0.4313,-0.13896 -0.22418,-0.32605 0.0779,-0.0385 0.19052,-0.0386 0.31432,-0.0252 l 2.07669,0.22788 c 0.41918,0.0461 0.81423,-0.2891 0.88318,-0.70549 0.0875,-0.53045 -0.32345,-0.94081 -0.83811,-0.99192 l -4.24353,-0.42156 c -0.71259,-0.0707 -1.40832,0.24666 -1.96528,0.69753 l -1.2333,0.99989 h -1.46932 c -0.23338,0 -0.42435,0.19098 -0.42435,0.42435 v 2.54614 c 0,0.23339 0.19097,0.42437 0.42435,0.42437 h 9.4631 c 0.85707,0 1.27115,-0.41589 1.91644,-0.80948 1.18463,-0.72257 2.3365,-1.7861 3.15459,-2.77102 0.40314,-0.32092 0.43497,-0.93624 0.0344,-1.29694 z"
                 class=""
                 id="path2295"
                 sodipodi:nodetypes="ccscccsscssccsssscsccc" />
            </g>
          </g>
        </g>
      </g>
    </g>
  </g>
</svg>
