<?xml version="1.0" encoding="UTF-8" standalone="no"?>
<!-- Created with Inkscape (http://www.inkscape.org/) -->
<svg xmlns:dc="http://purl.org/dc/elements/1.1/" xmlns:cc="http://creativecommons.org/ns#" xmlns:rdf="http://www.w3.org/1999/02/22-rdf-syntax-ns#" xmlns:svg="http://www.w3.org/2000/svg" xmlns="http://www.w3.org/2000/svg" xmlns:xlink="http://www.w3.org/1999/xlink" xmlns:sodipodi="http://sodipodi.sourceforge.net/DTD/sodipodi-0.dtd" xmlns:inkscape="http://www.inkscape.org/namespaces/inkscape" width="155" height="155" id="svg2" sodipodi:version="0.32" inkscape:version="0.46+devel r" version="1.0" sodipodi:docname="DebConf_logo.svg" inkscape:output_extension="org.inkscape.output.svg.inkscape">
  <defs id="defs4">
    <linearGradient inkscape:collect="always" id="linearGradient3043">
      <stop style="stop-color:#2e3436;stop-opacity:1;" offset="0" id="stop3045"/>
      <stop style="stop-color:#2e3436;stop-opacity:0;" offset="1" id="stop3047"/>
    </linearGradient>
    <linearGradient inkscape:collect="always" id="linearGradient3032">
      <stop style="stop-color:#2e3436;stop-opacity:1;" offset="0" id="stop3034"/>
      <stop style="stop-color:#2e3436;stop-opacity:0;" offset="1" id="stop3036"/>
    </linearGradient>
    <inkscape:path-effect effect="skeletal" id="path-effect3018" is_visible="true" prop_scale="2.5" pattern="m 9.5032522,-8.2699719 c 0,0.3264765 -0.0662411,0.6221982 -0.1732925,0.8363006 -0.1070514,0.2141024 -0.2549108,0.3465857 -0.4181498,0.3465857 -0.1632379,0 -0.3110996,-0.1324833 -0.418151,-0.3465857 -0.1070514,-0.2141024 -0.1732925,-0.5098241 -0.1732925,-0.8363006 0,-0.3264766 0.0662411,-0.6221982 0.1732925,-0.8363005 0.1070514,-0.2141025 0.2549131,-0.3465857 0.418151,-0.3465857 0.163239,0 0.3110984,0.1324832 0.4181498,0.3465857 0.1070514,0.2141023 0.1732925,0.5098239 0.1732925,0.8363005 z" scale_y_rel="false" prop_units="false" vertical_pattern="false"/>
    <inkscape:path-effect pattern="m 30.609443,28.203932 199.999997,5 0,-10" id="path-effect3001" effect="skeletal" is_visible="true" prop_scale="1"/>
    <inkscape:path-effect id="path-effect2999" effect="spiro" is_visible="true"/>
    <inkscape:path-effect effect="skeletal" id="path-effect2970" pattern="m 163.1714,-135.15068 311.27127,7.78178 0,-15.56357" is_visible="true" prop_scale="1"/>
    <inkscape:path-effect effect="spiro" id="path-effect2968"/>
    <inkscape:path-effect effect="skeletal" id="path-effect2890" pattern="m -468.57143,79.285714 200,5 0,-10" is_visible="true" copytype="single_stretched" prop_scale="1" scale_y_rel="false" spacing="0" normal_offset="0" tang_offset="0" prop_units="false" vertical_pattern="false"/>
    <inkscape:path-effect effect="spiro" id="path-effect2888" is_visible="true"/>
    <inkscape:path-effect effect="skeletal" id="path-effect2884" pattern="m 0,5 200,5 0,-10 z" is_visible="true" copytype="single_stretched" prop_scale="1" scale_y_rel="false" spacing="0" normal_offset="0" tang_offset="0" prop_units="false" vertical_pattern="false"/>
    <inkscape:path-effect effect="spiro" id="path-effect2882" is_visible="true"/>
    <inkscape:path-effect effect="skeletal" id="path-effect2801" pattern="m -491.42857,367.85714 200,5 0,-10" is_visible="true" copytype="single_stretched" prop_scale="1" scale_y_rel="false" spacing="0" normal_offset="0" tang_offset="0" prop_units="false" vertical_pattern="false"/>
    <inkscape:path-effect effect="spiro" id="path-effect2799" is_visible="true"/>
    <inkscape:path-effect effect="spiro" id="path-effect2497" is_visible="true"/>
    <inkscape:path-effect effect="spiro" id="path-effect2493" is_visible="true"/>
    <inkscape:path-effect effect="spiro" id="path-effect2489" is_visible="true"/>
    <inkscape:path-effect effect="spiro" id="path-effect2485" is_visible="true"/>
    <inkscape:perspective sodipodi:type="inkscape:persp3d" inkscape:vp_x="0 : 526.18109 : 1" inkscape:vp_y="0 : 1000 : 0" inkscape:vp_z="744.09448 : 526.18109 : 1" inkscape:persp3d-origin="372.04724 : 350.78739 : 1" id="perspective10"/>
    <inkscape:perspective id="perspective2861" inkscape:persp3d-origin="0.5 : 0.33333333 : 1" inkscape:vp_z="1 : 0.5 : 1" inkscape:vp_y="0 : 1000 : 0" inkscape:vp_x="0 : 0.5 : 1" sodipodi:type="inkscape:persp3d"/>
    <inkscape:path-effect is_visible="true" effect="spiro" id="path-effect2799-9"/>
    <inkscape:path-effect vertical_pattern="false" prop_units="false" tang_offset="0" normal_offset="0" spacing="0" scale_y_rel="false" prop_scale="1" copytype="single_stretched" is_visible="true" effect="skeletal" id="path-effect2801-6" pattern="m -94.28571,-79.868136 200,5 0,-10"/>
    <inkscape:perspective id="perspective2956" inkscape:persp3d-origin="0.5 : 0.33333333 : 1" inkscape:vp_z="1 : 0.5 : 1" inkscape:vp_y="0 : 1000 : 0" inkscape:vp_x="0 : 0.5 : 1" sodipodi:type="inkscape:persp3d"/>
    <inkscape:perspective id="perspective2979" inkscape:persp3d-origin="0.5 : 0.33333333 : 1" inkscape:vp_z="1 : 0.5 : 1" inkscape:vp_y="0 : 1000 : 0" inkscape:vp_x="0 : 0.5 : 1" sodipodi:type="inkscape:persp3d"/>
    <inkscape:path-effect is_visible="true" effect="spiro" id="path-effect2968-9"/>
    <inkscape:path-effect vertical_pattern="false" prop_units="false" tang_offset="0" normal_offset="0" spacing="0" scale_y_rel="false" prop_scale="1" copytype="single_stretched" is_visible="true" effect="skeletal" id="path-effect2970-4" pattern="m -104.23947,-30.892144 199.999999,5 0,-10"/>
    <linearGradient inkscape:collect="always" xlink:href="#linearGradient3032" id="linearGradient3038" x1="62" y1="-75.923576" x2="62" y2="-150.37289" gradientUnits="userSpaceOnUse" gradientTransform="translate(0,2)"/>
    <linearGradient inkscape:collect="always" xlink:href="#linearGradient3043" id="linearGradient3049" x1="49" y1="63.969704" x2="49" y2="146.03075" gradientUnits="userSpaceOnUse" gradientTransform="translate(0,2)"/>
  </defs>
  <sodipodi:namedview id="base" pagecolor="#ffffff" bordercolor="#666666" borderopacity="1.0" inkscape:pageopacity="1" inkscape:pageshadow="2" inkscape:zoom="0.5" inkscape:cx="79.139768" inkscape:cy="51.508371" inkscape:document-units="px" inkscape:current-layer="layer1" showgrid="false" inkscape:window-width="1024" inkscape:window-height="711" inkscape:window-x="0" inkscape:window-y="28"/>
  <metadata id="metadata7">
    <rdf:RDF>
      <cc:Work rdf:about="">
        <dc:format>image/svg+xml</dc:format>
        <dc:type rdf:resource="http://purl.org/dc/dcmitype/StillImage"/>
      </cc:Work>
    </rdf:RDF>
  </metadata>
  <g inkscape:label="Camada 1" inkscape:groupmode="layer" id="layer1">
    <path style="font-size:29.31162834px;font-style:normal;font-variant:normal;font-weight:bold;font-stretch:normal;text-align:start;line-height:125%;writing-mode:lr-tb;text-anchor:start;fill:#2e3436;fill-opacity:1;stroke:none;font-family:Bitstream Vera Sans;-inkscape-font-specification:Bitstream Vera Sans Bold" d="m 15.600229,114.7188 0,13.03853 1.9751,0 c 2.251792,0 3.969268,-0.55818 5.152434,-1.67455 1.192677,-1.11635 1.789023,-2.73841 1.78904,-4.86618 -1.7e-05,-2.11821 -0.591592,-3.73073 -1.774727,-4.83757 -1.183166,-1.1068 -2.905414,-1.66021 -5.166747,-1.66023 l -1.9751,0 m -5.510243,-4.16488 5.810801,0 c 3.244114,2e-05 5.658123,0.23379 7.242033,0.7013 1.593421,0.45802 2.957861,1.24042 4.093324,2.34722 1.001841,0.96372 1.746081,2.07531 2.232721,3.33477 0.486596,1.2595 0.729906,2.68596 0.729928,4.27939 -2.2e-05,1.61253 -0.243332,3.0533 -0.729928,4.32232 -0.48664,1.25949 -1.23088,2.37107 -2.232721,3.33477 -1.145005,1.10682 -2.518986,1.89399 -4.121948,2.36153 -1.602994,0.45799 -4.007461,0.68699 -7.213409,0.68699 l -5.810801,0 0,-21.36829 m 40.103117,13.31046 0,1.45985 -11.97941,0 c 0.124033,1.20224 0.558173,2.10392 1.30242,2.70503 0.744233,0.60112 1.78426,0.90168 3.120086,0.90168 1.078183,0 2.18023,-0.15744 3.306146,-0.47231 1.135428,-0.32441 2.299496,-0.81103 3.492205,-1.45986 l 0,3.9502 c -1.211793,0.458 -2.423568,0.80149 -3.635329,1.03049 -1.211789,0.23854 -2.423564,0.35781 -3.635329,0.35781 -2.900637,0 -5.15721,-0.7347 -6.769726,-2.2041 -1.602982,-1.47894 -2.404471,-3.54945 -2.40447,-6.21155 -1e-06,-2.61437 0.787176,-4.67057 2.361533,-6.1686 1.583891,-1.49801 3.759361,-2.24702 6.526417,-2.24704 2.518955,2e-05 4.53222,0.75857 6.039798,2.27566 1.517089,1.51712 2.275641,3.54469 2.275659,6.08274 m -5.266933,-1.70317 c -1.3e-05,-0.97323 -0.286259,-1.75563 -0.858739,-2.34722 -0.562963,-0.60111 -1.302432,-0.90166 -2.21841,-0.90168 -0.992329,2e-05 -1.798589,0.28149 -2.418781,0.84443 -0.620208,0.55342 -1.00664,1.35491 -1.159298,2.40447 l 6.655228,0 m 17.661402,6.45486 c 1.097266,0 1.93215,-0.40075 2.504656,-1.20224 0.58202,-0.80148 0.873037,-1.96555 0.873052,-3.49221 -1.5e-05,-1.52663 -0.291032,-2.6907 -0.873052,-3.4922 -0.572506,-0.80148 -1.40739,-1.20222 -2.504656,-1.20224 -1.097287,2e-05 -1.941713,0.40553 -2.53328,1.21655 -0.582042,0.8015 -0.873059,1.9608 -0.873051,3.47789 -8e-06,1.51712 0.291009,2.68118 0.873051,3.49221 0.591567,0.80149 1.435993,1.20224 2.53328,1.20224 m -3.406331,-10.37644 c 0.706066,-0.93505 1.488472,-1.62204 2.34722,-2.06097 0.858728,-0.44844 1.846277,-0.67266 2.96265,-0.67268 1.975085,2e-05 3.597146,0.78719 4.866188,2.36153 1.269007,1.56483 1.903519,3.58286 1.903538,6.05411 -1.9e-05,2.47127 -0.634531,4.49408 -1.903538,6.06843 -1.269042,1.56481 -2.891103,2.34722 -4.866188,2.34722 -1.116373,0 -2.103922,-0.21946 -2.96265,-0.65837 -0.858748,-0.44845 -1.641154,-1.14021 -2.34722,-2.07528 l 0,2.31859 -5.123811,0 0,-22.26997 5.123811,0 0,8.58739 m 33.061455,12.50897 c -1.011423,0.52479 -2.065763,0.92076 -3.163023,1.18792 -1.097293,0.26717 -2.242277,0.40075 -3.434956,0.40075 -3.559006,0 -6.37853,-0.99232 -8.458581,-2.97696 -2.080059,-1.99418 -3.120086,-4.69444 -3.120085,-8.10078 -1e-06,-3.41586 1.040026,-6.11611 3.120085,-8.10077 2.080051,-1.99416 4.899575,-2.99125 8.458581,-2.99127 1.192679,2e-05 2.337663,0.1336 3.434956,0.40074 1.09726,0.26719 2.1516,0.66316 3.163023,1.18792 l 0,4.42251 c -1.020964,-0.69652 -2.027597,-1.20699 -3.0199,-1.53142 -0.992336,-0.32439 -2.037134,-0.4866 -3.134397,-0.48662 -1.96557,2e-05 -3.511299,0.62976 -4.637192,1.88923 -1.12591,1.2595 -1.68886,2.99606 -1.688853,5.20968 -7e-06,2.20411 0.562943,3.9359 1.688853,5.19538 1.125893,1.25948 2.671622,1.88922 4.637192,1.88922 1.097263,0 2.142061,-0.1622 3.134397,-0.48662 0.992303,-0.32441 1.998936,-0.83488 3.0199,-1.53142 l 0,4.42251 m 11.979414,-11.57867 c -1.13546,2e-05 -2.00374,0.4103 -2.60485,1.23086 -0.59158,0.81105 -0.88737,1.98466 -0.88736,3.52083 -1e-05,1.5362 0.29578,2.71458 0.88736,3.53515 0.60111,0.81103 1.46939,1.21655 2.60485,1.21654 1.11635,1e-05 1.97031,-0.40551 2.5619,-1.21654 0.59156,-0.82057 0.88735,-1.99895 0.88736,-3.53515 -1e-05,-1.53617 -0.2958,-2.70978 -0.88736,-3.52083 -0.59159,-0.82056 -1.44555,-1.23084 -2.5619,-1.23086 m 0,-3.66395 c 2.75749,2e-05 4.90911,0.74426 6.45485,2.23272 1.55525,1.4885 2.33289,3.54947 2.33291,6.18292 -2e-05,2.63348 -0.77766,4.69445 -2.33291,6.18293 -1.54574,1.48848 -3.69736,2.23272 -6.45485,2.23272 -2.76706,0 -4.932989,-0.74424 -6.497797,-2.23272 -1.555274,-1.48848 -2.332909,-3.54945 -2.332908,-6.18293 -1e-06,-2.63345 0.777634,-4.69442 2.332908,-6.18292 1.564808,-1.48846 3.730737,-2.2327 6.497797,-2.23272 m 28.63894,6.65523 0,9.761 -5.15243,0 0,-1.58867 0,-5.88236 c -2e-05,-1.38351 -0.03341,-2.33767 -0.10019,-2.86246 -0.05726,-0.52478 -0.16222,-0.91121 -0.31487,-1.1593 -0.20039,-0.33394 -0.47232,-0.59156 -0.8158,-0.77287 -0.34351,-0.19081 -0.73471,-0.28623 -1.17361,-0.28624 -1.06867,1e-05 -1.90832,0.41507 -2.51897,1.24517 -0.61067,0.82058 -0.916,1.9608 -0.91599,3.42064 l 0,7.88609 -5.12381,0 0,-16.0298 5.12381,0 0,2.34722 c 0.77286,-0.93505 1.59343,-1.62204 2.46172,-2.06097 0.86827,-0.44844 1.82719,-0.67266 2.87678,-0.67268 1.85104,2e-05 3.25365,0.56774 4.20782,1.70317 0.96368,1.13545 1.44552,2.78614 1.44554,4.95206 m 15.3285,-12.50897 0,3.3634 -2.83384,0 c -0.72517,2e-05 -1.23087,0.1336 -1.51711,0.40074 -0.28625,0.25764 -0.42937,0.71087 -0.42937,1.35967 l 0,1.11636 4.37957,0 0,3.66396 -4.37957,0 0,12.36584 -5.12381,0 0,-12.36584 -2.54759,0 0,-3.66396 2.54759,0 0,-1.11636 c 0,-1.74608 0.48662,-3.03419 1.45986,-3.86432 0.97323,-0.83964 2.48079,-1.25946 4.52269,-1.25949 l 3.92158,0" id="text2962"/>
    <path style="fill:#d70751;fill-opacity:1;stroke:none" d="m 84.428986,57.681487 c 0.014861,-0.199709 0.599562,-0.319243 1.628921,-0.587439 1.029361,-0.268195 2.539973,-0.705862 4.131476,-1.773116 1.366438,-0.914303 2.809498,-2.337673 3.728186,-4.299862 0.721243,-1.534458 1.118868,-3.434982 0.885718,-5.387765 -0.196651,-1.67408 -0.871997,-3.42945 -2.040894,-4.87433 0,0 0,-1e-06 0,-1e-06 -1.251895,-1.569217 -3.174579,-2.820446 -5.351453,-3.36164 -1.973767,-0.496517 -4.2396,-0.388207 -6.353238,0.34756 -1.076465,0.372711 -2.125235,0.923029 -3.103165,1.624809 -0.802544,0.57592 -1.557226,1.253668 -2.235603,2.013421 -1.415573,1.582799 -2.507007,3.58765 -3.173479,5.788671 -1.160737,3.8389 -0.886939,8.415162 1.014871,12.303601 1.746775,3.608878 4.996691,6.758571 8.931887,8.384798 3.317674,1.389456 7.248982,1.727923 10.963215,0.90986 3.564775,-0.77795 7.024272,-2.680603 9.759982,-5.371243 2.64735,-2.596915 4.6533,-6.016053 5.74099,-9.74345 1.0604,-3.622757 1.23738,-7.610359 0.55089,-11.487324 -0.81632,-4.60799 -2.9147,-9.11171 -6.00537,-12.834058 -0.01884,-0.0227 -0.03773,-0.045368 -0.05664,-0.068003 -3.12078,-3.741278 -7.223173,-6.634125 -11.659278,-8.415601 -4.628186,-1.886591 -9.709379,-2.479207 -14.623689,-2.015451 -4.914307,0.463757 -9.660321,1.983624 -13.745532,4.335401 -5.144567,2.934988 -9.320374,7.220012 -12.365268,12.009609 -3.044895,4.789598 -4.958495,10.082677 -5.721442,15.265725 -0.619624,4.137351 -0.528972,8.234483 0.061757,12.111564 0.590728,3.877081 1.681531,7.534402 3.090338,10.864858 1.549015,3.661907 3.482031,6.928085 5.595324,9.748092 2e-06,1e-06 2e-06,1e-06 3e-06,2e-06 3.068965,4.092923 6.509872,7.282431 9.773213,9.743269 3.26334,2.460839 6.354757,4.199784 8.949346,5.47378 2.594586,1.273994 4.698054,2.090786 6.123069,2.679516 1.425015,0.58873 2.175055,0.95678 2.128916,1.19035 -0.046138,0.23358 -0.888334,0.32391 -2.466465,0.16433 -1.578132,-0.15958 -3.896458,-0.57543 -6.799824,-1.5156 -2.903365,-0.940169 -6.397708,-2.412214 -10.153854,-4.73967 -3.756144,-2.327457 -7.779462,-5.517659 -11.480133,-9.836685 -1e-06,-1e-06 -2e-06,-2e-06 -2e-06,-2e-06 C 47.596021,83.347734 45.218976,79.826256 43.266627,75.796177 41.49099,72.130872 40.067312,68.045258 39.214237,63.633241 38.361162,59.221226 38.07891,54.482418 38.615751,49.586107 39.305403,43.42229 41.35925,37.114371 44.846304,31.34228 c 3.487054,-5.772091 8.407901,-11.006759 14.668515,-14.793077 5.014299,-3.010751 10.80315,-4.970701 16.866817,-5.59451 6.063665,-0.623809 12.400802,0.089209 18.376849,2.41789 5.660035,2.231834 10.852305,5.882077 14.892885,10.702164 0.02448,0.029241 0.0489,0.058524 0.07329,0.087845 3.99866,4.808228 6.65831,10.585464 7.70939,16.613729 0.88456,5.071134 0.59344,10.282138 -0.85783,15.136661 -1.50018,5.007038 -4.2602,9.534556 -7.94179,13.074477 -3.82592,3.671853 -8.59817,6.156578 -13.631236,7.178036 -5.26877,1.061959 -10.683439,0.435233 -15.391306,-1.647196 -5.59998,-2.498736 -9.903964,-6.977958 -12.238337,-12.175908 -2.509323,-5.630484 -2.598556,-11.827884 -0.778116,-17.114403 1.03522,-3.007885 2.701715,-5.70913 4.824432,-7.888308 1.02377,-1.050005 2.153804,-1.963123 3.353811,-2.726407 1.462253,-0.93009 3.028152,-1.63745 4.640967,-2.108047 3.189131,-0.927075 6.478814,-0.841058 9.389149,0.074514 3.229066,1.02177 5.849259,3.07573 7.55343,5.553312 0,1e-06 0,4e-06 0,4e-06 1.564622,2.297266 2.283061,4.864568 2.338533,7.259025 0.061,2.793649 -0.764048,5.273209 -1.962097,7.19348 -1.533622,2.451977 -3.604107,3.946474 -5.449499,4.764791 -2.151553,0.951927 -3.970638,1.02758 -5.140465,0.919801 -1.169833,-0.10778 -1.729574,-0.388957 -1.71471,-0.588666 z" id="path2966-0"/>
    <path id="path3041" d="m 15.600229,149.27071 0,-13.03853 1.9751,0 c 2.251792,0 3.969268,0.55818 5.152434,1.67455 1.192677,1.11635 1.789023,2.73841 1.78904,4.86618 -1.7e-05,2.11821 -0.591592,3.73073 -1.774727,4.83757 -1.183166,1.1068 -2.905414,1.66021 -5.166747,1.66023 l -1.9751,0 m -5.510243,4.16488 5.810801,0 c 3.244114,-2e-05 5.658123,-0.23379 7.242033,-0.7013 1.593421,-0.45802 2.957861,-1.24042 4.093324,-2.34722 1.001841,-0.96372 1.746081,-2.07531 2.232721,-3.33477 0.486596,-1.2595 0.729906,-2.68596 0.729928,-4.27939 -2.2e-05,-1.61253 -0.243332,-3.0533 -0.729928,-4.32232 -0.48664,-1.25949 -1.23088,-2.37107 -2.232721,-3.33477 -1.145005,-1.10682 -2.518986,-1.89399 -4.121948,-2.36153 -1.602994,-0.45799 -4.007461,-0.68699 -7.213409,-0.68699 l -5.810801,0 0,21.36829 m 40.103117,-13.31046 0,-1.45985 -11.97941,0 c 0.124033,-1.20224 0.558173,-2.10392 1.30242,-2.70503 0.744233,-0.60112 1.78426,-0.90168 3.120086,-0.90168 1.078183,0 2.18023,0.15744 3.306146,0.47231 1.135428,0.32441 2.299496,0.81103 3.492205,1.45986 l 0,-3.9502 c -1.211793,-0.458 -2.423568,-0.80149 -3.635329,-1.03049 -1.211789,-0.23854 -2.423564,-0.35781 -3.635329,-0.35781 -2.900637,0 -5.15721,0.7347 -6.769726,2.2041 -1.602982,1.47894 -2.404471,3.54945 -2.40447,6.21155 -1e-06,2.61437 0.787176,4.67057 2.361533,6.1686 1.583891,1.49801 3.759361,2.24702 6.526417,2.24704 2.518955,-2e-05 4.53222,-0.75857 6.039798,-2.27566 1.517089,-1.51712 2.275641,-3.54469 2.275659,-6.08274 m -5.266933,1.70317 c -1.3e-05,0.97323 -0.286259,1.75563 -0.858739,2.34722 -0.562963,0.60111 -1.302432,0.90166 -2.21841,0.90168 -0.992329,-2e-05 -1.798589,-0.28149 -2.418781,-0.84443 -0.620208,-0.55342 -1.00664,-1.35491 -1.159298,-2.40447 l 6.655228,0 m 17.661402,-6.45486 c 1.097266,0 1.93215,0.40075 2.504656,1.20224 0.58202,0.80148 0.873037,1.96555 0.873052,3.49221 -1.5e-05,1.52663 -0.291032,2.6907 -0.873052,3.4922 -0.572506,0.80148 -1.40739,1.20222 -2.504656,1.20224 -1.097287,-2e-05 -1.941713,-0.40553 -2.53328,-1.21655 -0.582042,-0.8015 -0.873059,-1.9608 -0.873051,-3.47789 -8e-06,-1.51712 0.291009,-2.68118 0.873051,-3.49221 0.591567,-0.80149 1.435993,-1.20224 2.53328,-1.20224 m -3.406331,10.37644 c 0.706066,0.93505 1.488472,1.62204 2.34722,2.06097 0.858728,0.44844 1.846277,0.67266 2.96265,0.67268 1.975085,-2e-05 3.597146,-0.78719 4.866188,-2.36153 1.269007,-1.56483 1.903519,-3.58286 1.903538,-6.05411 -1.9e-05,-2.47127 -0.634531,-4.49408 -1.903538,-6.06843 -1.269042,-1.56481 -2.891103,-2.34722 -4.866188,-2.34722 -1.116373,0 -2.103922,0.21946 -2.96265,0.65837 -0.858748,0.44845 -1.641154,1.14021 -2.34722,2.07528 l 0,-2.31859 -5.123811,0 0,22.26997 5.123811,0 0,-8.58739 m 33.061455,-12.50897 c -1.011423,-0.52479 -2.065763,-0.92076 -3.163023,-1.18792 -1.097293,-0.26717 -2.242277,-0.40075 -3.434956,-0.40075 -3.559006,0 -6.37853,0.99232 -8.458581,2.97696 -2.080059,1.99418 -3.120086,4.69444 -3.120085,8.10078 -1e-06,3.41586 1.040026,6.11611 3.120085,8.10077 2.080051,1.99416 4.899575,2.99125 8.458581,2.99127 1.192679,-2e-05 2.337663,-0.1336 3.434956,-0.40074 1.09726,-0.26719 2.1516,-0.66316 3.163023,-1.18792 l 0,-4.42251 c -1.020964,0.69652 -2.027597,1.20699 -3.0199,1.53142 -0.992336,0.32439 -2.037134,0.4866 -3.134397,0.48662 -1.96557,-2e-05 -3.511299,-0.62976 -4.637192,-1.88923 -1.12591,-1.2595 -1.68886,-2.99606 -1.688853,-5.20968 -7e-06,-2.20411 0.562943,-3.9359 1.688853,-5.19538 1.125893,-1.25948 2.671622,-1.88922 4.637192,-1.88922 1.097263,0 2.142061,0.1622 3.134397,0.48662 0.992303,0.32441 1.998936,0.83488 3.0199,1.53142 l 0,-4.42251 m 11.979414,11.57867 c -1.13546,-2e-05 -2.00374,-0.4103 -2.60485,-1.23086 -0.59158,-0.81105 -0.88737,-1.98466 -0.88736,-3.52083 -1e-05,-1.5362 0.29578,-2.71458 0.88736,-3.53515 0.60111,-0.81103 1.46939,-1.21655 2.60485,-1.21654 1.11635,-1e-05 1.97031,0.40551 2.5619,1.21654 0.59156,0.82057 0.88735,1.99895 0.88736,3.53515 -1e-05,1.53617 -0.2958,2.70978 -0.88736,3.52083 -0.59159,0.82056 -1.44555,1.23084 -2.5619,1.23086 m 0,3.66395 c 2.75749,-2e-05 4.90911,-0.74426 6.45485,-2.23272 1.55525,-1.4885 2.33289,-3.54947 2.33291,-6.18292 -2e-05,-2.63348 -0.77766,-4.69445 -2.33291,-6.18293 -1.54574,-1.48848 -3.69736,-2.23272 -6.45485,-2.23272 -2.76706,0 -4.932989,0.74424 -6.497797,2.23272 -1.555274,1.48848 -2.332909,3.54945 -2.332908,6.18293 -1e-06,2.63345 0.777634,4.69442 2.332908,6.18292 1.564808,1.48846 3.730737,2.2327 6.497797,2.23272 m 28.63894,-6.65523 0,-9.761 -5.15243,0 0,1.58867 0,5.88236 c -2e-05,1.38351 -0.03341,2.33767 -0.10019,2.86246 -0.05726,0.52478 -0.16222,0.91121 -0.31487,1.1593 -0.20039,0.33394 -0.47232,0.59156 -0.8158,0.77287 -0.34351,0.19081 -0.73471,0.28623 -1.17361,0.28624 -1.06867,-1e-05 -1.90832,-0.41507 -2.51897,-1.24517 -0.61067,-0.82058 -0.916,-1.9608 -0.91599,-3.42064 l 0,-7.88609 -5.12381,0 0,16.0298 5.12381,0 0,-2.34722 c 0.77286,0.93505 1.59343,1.62204 2.46172,2.06097 0.86827,0.44844 1.82719,0.67266 2.87678,0.67268 1.85104,-2e-05 3.25365,-0.56774 4.20782,-1.70317 0.96368,-1.13545 1.44552,-2.78614 1.44554,-4.95206 m 15.3285,12.50897 0,-3.3634 -2.83384,0 c -0.72517,-2e-05 -1.23087,-0.1336 -1.51711,-0.40074 -0.28625,-0.25764 -0.42937,-0.71087 -0.42937,-1.35967 l 0,-1.11636 4.37957,0 0,-3.66396 -4.37957,0 0,-12.36584 -5.12381,0 0,12.36584 -2.54759,0 0,3.66396 2.54759,0 0,1.11636 c 0,1.74608 0.48662,3.03419 1.45986,3.86432 0.97323,0.83964 2.48079,1.25946 4.52269,1.25949 l 3.92158,0" style="font-size:29.31162833999999862px;font-style:normal;font-variant:normal;font-weight:bold;font-stretch:normal;text-align:start;line-height:125%;writing-mode:lr-tb;text-anchor:start;fill:url(#linearGradient3049);fill-opacity:1;stroke:none;font-family:Bitstream Vera Sans;-inkscape-font-specification:Bitstream Vera Sans Bold"/>
  </g>
</svg>