<?xml version="1.0" encoding="UTF-8" standalone="no"?>
<!-- Created with Inkscape (http://www.inkscape.org/) -->

<svg
   xmlns:dc="http://purl.org/dc/elements/1.1/"
   xmlns:cc="http://creativecommons.org/ns#"
   xmlns:rdf="http://www.w3.org/1999/02/22-rdf-syntax-ns#"
   xmlns:svg="http://www.w3.org/2000/svg"
   xmlns="http://www.w3.org/2000/svg"
   xmlns:sodipodi="http://sodipodi.sourceforge.net/DTD/sodipodi-0.dtd"
   xmlns:inkscape="http://www.inkscape.org/namespaces/inkscape"
   width="1200"
   height="900"
   viewBox="0 0 317.50001 238.12499"
   version="1.1"
   id="svg8"
   inkscape:version="0.92.1 r15371"
   sodipodi:docname="background.svg"
   inkscape:export-filename="/home/terceiro/talks/template/background.png"
   inkscape:export-xdpi="90"
   inkscape:export-ydpi="90">
  <defs
     id="defs2" />
  <sodipodi:namedview
     id="base"
     pagecolor="#ffffff"
     bordercolor="#666666"
     borderopacity="1.0"
     inkscape:pageopacity="1"
     inkscape:pageshadow="2"
     inkscape:zoom="1.5242079"
     inkscape:cx="1113.0423"
     inkscape:cy="161.26463"
     inkscape:document-units="mm"
     inkscape:current-layer="g5624"
     showgrid="false"
     units="px"
     inkscape:window-width="1366"
     inkscape:window-height="704"
     inkscape:window-x="0"
     inkscape:window-y="27"
     inkscape:window-maximized="1" />
  <metadata
     id="metadata5">
    <rdf:RDF>
      <cc:Work
         rdf:about="">
        <dc:format>image/svg+xml</dc:format>
        <dc:type
           rdf:resource="http://purl.org/dc/dcmitype/StillImage" />
        <dc:title></dc:title>
      </cc:Work>
    </rdf:RDF>
  </metadata>
  <g
     inkscape:label="Camada 1"
     inkscape:groupmode="layer"
     id="layer1"
     transform="translate(0,-58.875014)">
    <g
       id="g5624"
       transform="matrix(0.26458333,0,0,0.26458333,-27.119922,17.173243)">
      <g
         id="logoGroup_1_"
         style="opacity:0.8;fill:#babdb6"
         transform="translate(194.04642,493.7633)"
         inkscape:export-xdpi="90"
         inkscape:export-ydpi="90">
        <g
           enable-background="new    "
           id="logo_1_"
           style="fill:#babdb6">
          <path
             id="path5481"
             d="m 1022.329,448.932 c -3.476,0.046 0.66,1.788 5.203,2.49 1.258,-0.982 2.392,-1.971 3.399,-2.936 -2.82,0.691 -5.698,0.709 -8.602,0.446"
             inkscape:connector-curvature="0"
             style="fill:#babdb6" />
          <path
             id="path5483"
             d="m 1040.999,444.277 c 2.077,-2.867 3.584,-5.991 4.118,-9.226 -0.466,2.303 -1.716,4.291 -2.897,6.399 -6.502,4.099 -0.615,-2.43 0,-4.915 -6.989,8.807 -0.966,5.279 -1.218,7.742"
             inkscape:connector-curvature="0"
             style="fill:#babdb6" />
          <path
             id="path5485"
             d="m 1047.896,426.338 c 0.423,-6.261 -1.229,-4.277 -1.787,-1.896 0.646,0.345 1.159,4.421 1.787,1.896"
             inkscape:connector-curvature="0"
             style="fill:#babdb6" />
          <path
             id="path5487"
             d="m 1009.134,340.712 c 1.859,0.335 4.015,0.588 3.703,1.036 2.037,-0.455 2.5,-0.856 -3.703,-1.036"
             inkscape:connector-curvature="0"
             style="fill:#babdb6" />
          <path
             id="path5489"
             d="m 1012.835,341.743 -1.303,0.274 1.224,-0.115 0.079,-0.159"
             inkscape:connector-curvature="0"
             style="fill:#babdb6" />
          <path
             id="path5491"
             d="m 1070.743,428.717 c 0.208,5.623 -1.646,8.354 -3.322,13.19 l -3.008,1.499 c -2.464,4.777 0.246,3.036 -1.522,6.835 -3.842,3.416 -11.656,10.688 -14.147,11.354 -1.827,-0.041 1.232,-2.156 1.639,-2.981 -5.148,3.531 -4.13,5.3 -11.995,7.45 l -0.231,-0.516 c -19.396,9.128 -46.332,-8.956 -45.983,-33.63 -0.203,1.567 -0.588,1.178 -1.017,1.809 -1.003,-12.692 5.87,-25.438 17.439,-30.653 11.318,-5.6 24.597,-3.312 32.698,4.26 -4.453,-5.834 -13.317,-12.018 -23.823,-11.449 -10.293,0.169 -19.926,6.713 -23.139,13.811 -5.274,3.323 -5.889,12.796 -8.185,14.532 -3.091,22.723 5.812,32.535 20.888,44.083 2.363,1.604 0.668,1.844 0.981,3.063 -5.007,-2.339 -9.588,-5.88 -13.354,-10.213 2,2.921 4.154,5.765 6.946,8.006 -4.726,-1.598 -11.034,-11.438 -12.869,-11.838 8.142,14.569 33.007,25.55 46.048,20.101 -6.034,0.225 -13.691,0.126 -20.463,-2.381 -2.849,-1.466 -6.715,-4.495 -6.027,-5.058 17.784,6.639 36.143,5.025 51.526,-7.307 3.912,-3.048 8.191,-8.231 9.425,-8.303 -1.863,2.801 0.32,1.347 -1.113,3.813 3.894,-6.288 -1.695,-2.562 4.026,-10.854 l 2.119,2.905 c -0.79,-5.224 6.487,-11.56 5.741,-19.813 1.671,-2.525 1.858,2.718 0.089,8.52 2.459,-6.442 0.654,-7.475 1.28,-12.796 0.672,1.789 1.575,3.691 2.035,5.571 -1.601,-6.225 1.638,-10.477 2.44,-14.099 -0.794,-0.349 -2.468,2.75 -2.854,-4.598 0.059,-3.197 0.891,-1.676 1.212,-2.463 -0.621,-0.362 -2.265,-2.812 -3.266,-7.506 0.722,-1.102 1.938,2.861 2.921,3.02 -0.629,-3.73 -1.725,-6.579 -1.775,-9.444 -2.88,-6.03 -1.02,0.807 -3.357,-2.587 -3.073,-9.582 2.543,-2.223 2.933,-6.575 4.649,6.743 7.299,17.193 8.52,21.521 -0.933,-5.276 -2.43,-10.389 -4.269,-15.338 1.417,0.601 -2.287,-10.856 1.839,-3.27 -4.396,-16.171 -18.81,-31.28 -32.066,-38.367 1.617,1.482 3.671,3.346 2.938,3.64 -6.6,-3.918 -5.44,-4.23 -6.386,-5.891 -5.369,-2.184 -5.728,0.181 -9.272,0.01 -10.128,-5.375 -12.078,-4.804 -21.4,-8.17 l 0.42,1.99 c -6.701,-2.24 -7.813,0.835 -15.068,0.006 -0.432,-0.348 2.328,-1.249 4.601,-1.579 -6.483,0.858 -6.179,-1.28 -12.523,0.239 1.559,-1.096 3.218,-1.83 4.884,-2.758 -5.286,0.324 -12.629,3.077 -10.362,0.564 -8.633,3.854 -23.95,9.257 -32.549,17.318 l -0.269,-1.807 c -3.938,4.732 -17.178,14.123 -18.235,20.258 l -1.051,0.239 c -2.052,3.473 -3.382,7.407 -5.005,10.974 -2.685,4.573 -3.934,1.762 -3.551,2.477 -5.272,10.693 -7.896,19.672 -10.158,27.048 1.613,2.403 0.038,14.506 0.651,24.188 -2.647,47.829 33.564,94.274 73.15,104.989 5.802,2.085 14.429,2.004 21.764,2.21 -8.656,-2.474 -9.774,-1.313 -18.211,-4.255 -6.081,-2.864 -7.42,-6.129 -11.729,-9.875 l 1.707,3.014 c -8.449,-2.993 -4.911,-3.705 -11.796,-5.879 l 1.827,-2.376 c -2.738,-0.206 -7.256,-4.612 -8.493,-7.062 l -3.001,0.121 c -3.6,-4.438 -5.521,-7.643 -5.374,-10.127 l -0.974,1.729 c -1.098,-1.879 -13.247,-16.664 -6.943,-13.224 -1.171,-1.068 -2.73,-1.739 -4.414,-4.811 l 1.28,-1.46 c -3.026,-3.9 -5.587,-8.913 -5.389,-10.578 1.618,2.185 2.739,2.594 3.85,2.968 -7.657,-19.007 -8.088,-1.043 -13.893,-19.345 l 1.23,-0.099 c -0.941,-1.429 -1.516,-2.955 -2.271,-4.468 l 0.534,-5.319 c -5.513,-6.367 -1.536,-27.11 -0.741,-38.483 0.551,-4.626 4.6,-9.55 7.686,-17.272 l -1.88,-0.325 c 3.599,-6.254 20.493,-25.142 28.332,-24.174 3.793,-4.764 -0.758,-0.018 -1.5,-1.214 8.337,-8.622 10.952,-6.088 16.575,-7.647 6.063,-3.593 -5.202,1.408 -2.326,-1.363 10.482,-2.679 7.426,-6.086 21.104,-7.445 1.441,0.817 -3.344,1.265 -4.543,2.326 8.732,-4.273 27.636,-3.294 39.919,2.372 14.246,6.666 30.249,26.347 30.883,44.858 l 0.72,0.19 c -0.358,7.359 1.132,15.874 -1.462,23.693 l 1.754,-3.719"
             inkscape:connector-curvature="0"
             style="fill:#babdb6" />
          <path
             id="path5493"
             d="m 984.355,453.701 -0.491,2.439 c 2.284,3.105 4.103,6.478 7.021,8.892 -2.101,-4.088 -3.658,-5.785 -6.53,-11.331"
             inkscape:connector-curvature="0"
             style="fill:#babdb6" />
          <path
             id="path5495"
             d="m 989.759,453.491 c -1.215,-1.334 -1.929,-2.946 -2.734,-4.552 0.771,2.821 2.344,5.243 3.803,7.713 l -1.069,-3.161"
             inkscape:connector-curvature="0"
             style="fill:#babdb6" />
          <path
             id="path5497"
             d="m 1085.408,432.702 -0.499,1.285 c -0.934,6.655 -2.969,13.243 -6.065,19.348 3.422,-6.444 5.627,-13.49 6.564,-20.633"
             inkscape:connector-curvature="0"
             style="fill:#babdb6" />
          <path
             id="path5499"
             d="m 1009.825,339.042 c 2.352,-0.857 5.78,-0.472 8.281,-1.04 -3.256,0.277 -6.494,0.439 -9.689,0.844 l 1.408,0.196"
             inkscape:connector-curvature="0"
             style="fill:#babdb6" />
          <path
             id="path5501"
             d="m 927.238,382.957 c 0.543,5.015 -3.771,6.962 0.951,3.651 2.54,-5.712 -0.983,-1.576 -0.951,-3.651"
             inkscape:connector-curvature="0"
             style="fill:#babdb6" />
          <path
             id="path5503"
             d="m 921.68,406.178 c 1.085,-3.343 1.291,-5.353 1.705,-7.288 -3.013,3.85 -1.391,4.669 -1.705,7.288"
             inkscape:connector-curvature="0"
             style="fill:#babdb6" />
        </g>
      </g>
    </g>
  </g>
</svg>
