<?xml version="1.0" encoding="UTF-8"?>
<svg id="svg140" width="320" height="150" version="1.1" viewBox="0 0 84.667 39.687" xmlns="http://www.w3.org/2000/svg">
 <g id="layer1" transform="translate(-35.688 -39.435)">
  <g id="g4022" transform="matrix(.86054 0 0 .86054 8.5208 8.6143)">
   <path id="path4969" d="m102.81 67.589c-1.109-0.014-1.827 0.1757-1.827 0.1757l-1 0.1174c-2.1065 0.8662 0.82 2.1323 0.944 2.2274 0 0 0.09 0 0.1 0.014-0.382 0.068-0.78 0.1392-1.2024 0.2031-1.29 0.2015-2.6421 0.6379-4.0324 1.3446-0.9796 0.498-1.8657 1.0727-2.6402 1.6468-1.0584 0.7809-1.877 1.5519-2.51 2.2922-0.5419 0.6286-0.8884 1.189-1.0844 1.6077-0.099 0.2091-0.16 0.3809-0.1895 0.5179-0.016 0.068-0.023 0.1276-0.019 0.1883 0 0.03 0 0.062 0.023 0.1015 0.019 0.038 0.057 0.086 0.1117 0.1073 0.064 0.026 0.1246 0.014 0.1584 0 0.035-0.016 0.055-0.03 0.074-0.049 0.039-0.035 0.071-0.073 0.1102-0.1189 0.077-0.096 0.1749-0.2275 0.303-0.3948 0.2566-0.3337 0.6337-0.8024 1.1739-1.3318 0.6594-0.6399 1.4518-1.3009 2.4876-2.0145 0.7584-0.5201 1.6087-1.0503 2.5221-1.5168 1.3019-0.6643 2.523-1.0925 3.695-1.3292 0.972-0.1976 2.178-0.5351 2.775-0.6952 0.444-0.1189 0.708-0.1869 1.019-0.2492 0.149-0.029 0.27-0.046 0.379-0.061 1.499 0.1247 3.123 0.2746 3.948 0.4038 0.428 0.067 0.984 0.1812 1.235 0.2538l0.457 0.132-0.04-0.1582c-0.03-0.1146-0.09-0.1849-0.213-0.2555-0.541-0.3043-0.654-0.3877-0.691-0.5129-0.04-0.1262-0.03-0.1291 0.145-0.1852 0.101-0.032 0.359-0.077 0.579-0.1015l0.405-0.043-0.213-0.1648c-0.309-0.2392-1.295-0.763-1.986-1.0552-0.594-0.2512-0.937-0.15-1.85-0.4935-1.181-0.4436-2.279-0.5783-3.141-0.5894zm5.751 1.6828c0.314-0.019 0.68 0.2456 0.61 0.49-0.04 0.1462-0.187 0.1276-0.262-0.035-0.06-0.1203-0.09-0.1435-0.235-0.157-0.09-0.014-0.203 0-0.242 0.026-0.09 0.054-0.236-0.055-0.207-0.1554 0.01-0.042 0.104-0.1058 0.205-0.1421 0.04-0.014 0.08-0.023 0.13-0.026zm-16.667-1.5345c-0.1842-0.6229-0.3979-1.3611-0.023-1.8941 0.091-0.1319 0.2358-0.228 0.395-0.2576 0.1504-0.028 0.3081 0 0.4505 0.052 0.3359 0.1348 0.6133 0.3825 0.8864 0.6205 0.282 0.2453 0.5505 0.5054 0.8086 0.7751 0.049 0.052 0.1015 0.1029 0.1516 0.1535 0.019 0.02 0.051 0.038 0.057 0.065h-0.014c-0.016 0-0.023 0-0.039-0.014-0.054-0.016-0.03 0.2579-0.084 0.2404-1.1727-0.5788-1.7661 0.048-2.5931 0.2499zm1.9624-1.5339c-0.1058-0.272-0.2424-0.4927-0.2638-0.7835-0.014-0.1566 0-0.3249 0.085-0.4547 0.059-0.088 0.1618-0.1421 0.2674-0.1523 0.1116-0.015 0.224 0.017 0.3252 0.062 0.3737 0.1689 0.6464 0.4999 0.9199 0.8058 0.1841 0.2182 0.1435 0.2262 0.3057 0.3651-0.5531 0-1.0982 0.062-1.6399 0.1568z" fill="#f95" opacity=".99"/>
   <path id="path3779" d="m95.73 51.204c0.1174-0.1676 0.1782-0.3663-0.058-0.5966-0.1319-0.129 0.1593-0.4085 0.058-0.5655-0.1087-0.1571-0.2565-0.2303-0.4507-0.2198l-0.8704 0.084-0.878 0.084c-0.7071 0.073-1.2898 0.1262-1.7482 0.1363-0.023-3.6747-0.03-6.5958-0.03-8.763 0.3494-0.022 0.7536-0.052 1.2119-0.1044l1.22-0.1261c1.0023-0.1044 1.8182-0.157 2.4321-0.1675 0.1864 0 0.334-0.084 0.4506-0.2618 0.1015-0.157-0.03-0.3559-0.03-0.5862 0-0.2198 0.132-0.4188 0.03-0.576-0.116-0.1779-0.2642-0.2615-0.4506-0.2511-0.6449 0-1.6006 0.072-2.8672 0.2094l-0.7226 0.074-0.7149 0.062c-0.5283 0.052-1.0101 0.072-1.4373 0.072-0.311 0.015-0.5052 0.2095-0.5752 0.6074-0.078 0.3872 0.2062 0.6428 0.4158 0.8626l-0.1982 5.6701 0.031 5.6221c0.023 4.9728 0.039 8.7104 0.039 11.234 0 0.2615 0.062 0.4604 0.1943 0.6175 0.116 0.1362 0.2998-0.2332 0.4629-0.2332 0.1711 0 0.2753 0.3693 0.3919 0.2332 0.1319-0.1571 0.1941-0.356 0.1941-0.6175 0-1.7276 0-3.7167-0.014-5.9468l-0.03-5.9463c0.4584-0.022 1.0411-0.064 1.7482-0.1363l0.8703-0.094 0.8702-0.084c0.1944-0.014 0.342-0.1145 0.4508-0.2931zm-8.9434-1.9578 0.093 4.7006c0.039 1.8533-0.045 1.6473-0.022 2.9347l-4.3213-16.168-0.2253-0.9421c-0.055-0.2094-0.1476-0.3664-0.2876-0.4712-0.1247-0.094-0.6372 0.1044-0.7848 0.1261-0.1476 0.022 0.1015-0.1362 0 0-0.1088 0.1468-0.1631 0.3351-0.1553 0.5653 0.039 3.1931 0.054 7.1716 0.039 11.935l-0.023 5.957c-0.014 2.3974-0.016 4.3866-0.016 5.9676 0 0.2616 0.062 0.4605 0.1941 0.6071 0.116 0.1363 0.2645-0.1747 0.4276-0.1747 0.1708 0 0.3107 0.3108 0.4272 0.1747 0.132-0.1466 0.1943-0.3455 0.1943-0.6071l0.016-4.6275 0.016-4.617c0.016-3.8632 0.059-5.6447 0.051-7.9479l4.3857 16.648 0.2331 0.9318c0.054 0.2198 0.1476 0.3768 0.2797 0.4816 0.1319 0.094 0.637-0.094 0.7846-0.1261 0.1476-0.022-0.1015 0.1363 0 0 0.1015-0.157 0.1555-0.3455 0.1555-0.5758 0-2.6905-0.055-6.7213-0.1555-12.092l-0.062-3.0256-0.046-3.0256c-0.039-2.2403-0.054-4.2609-0.054-6.0512 0-0.2511-0.062-0.4503-0.1943-0.607-0.116-0.1363-0.2642 0.1363-0.4273 0.1363-0.1711 0-0.3187-0.273-0.4352-0.1363-0.132 0.1567-0.1942 0.3559-0.1942 0.607 0.014 2.4813 0.039 5.6222 0.1088 9.4223zm-13.302 6.5748-0.014-1.4448-0.016-1.4448 0.1088-6.1875v-0.5442l-0.014-0.5653c0.014-0.4502 0.032-0.8167 0.07-1.1099 0.1319-0.9106 0.4349-1.696 0.909-2.3346 0.536-0.7327 1.1188-0.9841 1.7482-0.7536 0.7536 0.272 1.2277 1.0782 1.422 2.4078 0.07 0.4711 0.1087 1.0468 0.116 1.7274 0.014 0.2199 0.014 0.5025 0 0.8269v0.3877c-0.014 0.1466-0.014 0.272-0.014 0.3664 0 0.9422 0 2.2928 0.014 4.062l0.014 2.0309v2.031c0 0.3455 0.014 0.848 0.023 1.4971l0.016 0.7644 0.014 0.7642c0.014 1.2146-0.062 2.2197-0.1941 3.0046-0.1406 0.8062-0.5129 1.3612-1.1268 1.6647-0.536 0.2723-1.1267 0.3036-1.756 0.084-0.5671-0.1988-0.9401-0.7957-1.1189-1.8007-0.062-0.3559-0.1087-0.7958-0.1319-1.3192-0.014-0.1675-0.014-0.3768-0.016-0.6386l-0.014-0.2931-0.015-0.2827c-0.023-0.7223-0.039-1.6855-0.039-2.8999zm4.6929 7.7158c0.3887-0.555 0.6451-1.2773 0.7771-2.1566 0.116-0.8062 0.171-1.8217 0.171-3.0361l-0.016-0.7748-0.014-0.7749c-0.016-0.6592-0.023-1.1617-0.023-1.518v-2.031l-0.014-2.0309c-0.015-1.8009-0.015-3.1514 0-4.062v-0.8271l-0.015-0.8376c-0.016-0.6282-0.054-1.183-0.1087-1.6542-0.1477-1.2248-0.4818-2.1985-1.0024-2.9417-0.474-0.6596-1.049-1.0575-1.7249-1.1725-0.6762-0.1261-1.3055 0.042-1.8884 0.5025-0.4893 0.3873-0.9245 1.005-1.3052 1.853-0.3653 0.8164-0.5829 1.6225-0.6526 2.4183-0.032 0.3036-0.046 0.6804-0.055 1.1308v1.1199l-0.1087 6.1875 0.016 1.3821 0.014 1.3922c0 1.1935 0.014 2.115 0.03 2.7746l0.015 0.3243v0.3245c0.014 0.2619 0.016 0.4816 0.023 0.6596 0.023 0.5234 0.055 0.9737 0.1015 1.361 0.1247 1.0366 0.3808 1.8426 0.7615 2.4186 0.7537 1.1411 1.9036 1.5179 3.45 1.1098 0.6372-0.1676 1.1577-0.5447 1.5617-1.1413zm-7.9798-2.3555c-0.046-0.1883 0.1476 0.1145 0 0-0.1476-0.116-0.5827-0.6073-0.7459-0.5759-0.171 0.032-0.3107 0.157-0.4118 0.3768l-0.1943 0.398-0.1942 0.3977c-0.1476 0.2931-0.9479 0.9424-1.0878 1.1411-0.1553 0.2198 0.2796-0.052 0 0-0.1015 0.022-0.2253 0.032-0.3729 0.032h-0.1865l-0.1787-0.014c-0.4818-0.015-0.8781-0.1043-1.1888-0.2722-0.412-0.2198-0.6917-0.5862-0.8469-1.0887-0.132-0.4294-0.21-0.9424-0.241-1.5494-0.016-0.2201-0.023-0.4921-0.023-0.7958v-0.3977l0.014-0.398v-2.6384l-0.014-2.6275c-0.014-1.3926 0-3.8528 0.016-6.1664l-0.016-0.6388c-0.014-0.5338 0-0.9631 0.014-1.2877 0.03-1.005 0.1708-1.811 0.4117-2.4288 0.2177-0.5548 0.623-0.6437 1.0658-0.853 0.4197-0.199 0.7835-0.487 1.2342-0.2986 0.4273 0.1779 0.8157 0.6072 1.1654 1.2982 0.3342 0.6595 0.5128 1.2983 0.5362 1.9158 0.014 0.2514 0.086 0.4502 0.2176 0.6073 0.116 0.1363 0.193-0.1377 0.3637-0.1377 0.1634 0 0.3744 0.2734 0.491 0.1377 0.1246-0.1465 0.1786-0.3455 0.1709-0.6073-0.023-0.848-0.202-1.6438-0.5362-2.3974-0.3186-0.7328-0.7304-1.3297-1.2354-1.8007-0.5206-0.4712-1.0801-0.7433-1.6628-0.8063-0.6293-0.062-1.2277 0.1262-1.7948 0.5761-0.5594 0.4394-0.9714 1.0991-1.2356 1.9787-0.2096 0.6804-0.3418 1.5388-0.4039 2.5857-0.054 0.9946-0.086 2.209-0.078 3.6643l0.016 1.8426c0.014 0.7748 0.016 1.3818 0.016 1.8321l0.014 3.3084v3.3185c0 0.9109 0.03 1.6332 0.1015 2.1776 0.1015 0.8061 0.3031 1.4763 0.5906 2.0101 0.5829 1.0994 1.6472 1.6333 3.2091 1.6229 0.6916-0.014 1.2509-0.2198 1.6626-0.6388 0.2332-0.2407 0.4663-0.5756 0.6994-1.005 0.086-0.1466 0.1787-0.3351 0.2952-0.5757l0.2722-0.5759c0.1087-0.2198 0.1406-0.4291 0.085-0.6489zm-10.529-14.105c-0.074 0.789-1.6606 2.4996-1.9881 2.9914-0.3355 0.4815 0.5892-0.2356 0 0-0.4499 0.1741-0.9218-0.3239-1.5681-0.283-0.065-3.6367-0.1745-5.9969-0.1745-8.2814 0.9817 0.103 1.7426 0.3074 2.2745 0.6147 0.7445 0.4405 1.2108 1.3933 1.3991 2.8685 0.099 0.7683 0.1145 1.4649 0.057 2.0898zm-0.1635 13.912c-0.7446 0.7888-1.8408 1.2599-3.3053 1.393-0.015-2.3151 0-5.3854-0.077-9.8417l0.3471-0.2182 0.3928 0.091c0.319 0.072 0.5808 0.1435 0.8017 0.2052 0.5972 0.1741 1.3417 0.5315 1.759 0.7775 0.9574 0.5531 1.2602 1.4862 1.3664 3.1049 0.1305 1.926-0.2944 3.4216-1.2845 4.4872zm-4.7535-9.0152c0.09 4.7228-0.022 8.9443-0.022 11.3 0 0.2356-0.094 0.4185 0.2381 0.305 0.2172 0.2065 0.1102 0.032 0.2172 0.2065 0.1232 0.1945 0.2863 0.2869 0.5072 0.2763 1.972-0.091 3.5183-0.6863 4.6228-1.803 1.2682-1.2599 1.8654-3.1038 1.8-5.5215-0.058-2.1104-0.6627-3.647-1.8328-4.6201-0.409-0.3381-0.9162-0.6251-1.5136-0.8507 0.4338-0.2661 0.8183-0.6041 1.1373-1.0038 0.9-1.127 1.2438-2.8888 1.0228-5.2964-0.1718-1.8952-0.761-3.2474-1.7592-4.0567-0.5071-0.42-1.17-0.707-1.98-0.8811-0.3026-0.061-0.6546-0.1131-1.0717-0.1537l-0.5237 0.044h-0.5019c-0.311-0.03-0.521-0.016-0.6107 0.3432-0.09 0.3381-0.049 0.8299 0.1392 1.0859-0.015 0.061 0-0.071 0 0 0 2.3666 0.041 5.9008 0.1305 10.624zm-9.1719 10.859c0 0.1741 0.033 0.3278 0.1058 0.4507 0.015 0.2152 0.065 0.3994 0.172 0.543 0.1145 0.1536 0.2699 0.2354 0.4662 0.2354 0.3845 0 0.8266-0.02 1.3336-0.051l1.3338-0.091c1.1126-0.072 2.0045-0.093 2.6673-0.062 0.2045 0.014 0.3599-0.061 0.4745-0.2252 0.1058-0.1536-0.046-0.3001-0.046-0.5151s0.1527-0.448 0.046-0.6017c-0.1146-0.1741-0.27-0.2663-0.4745-0.2766-0.6301-0.03-1.4238-0.015-2.3809 0.051l-1.1946 0.071s-0.4936-0.029-0.8208-0.019c0-4.2923-0.3902-7.5309-0.423-9.887h3.2482c0.1966 0 0.352-0.083 0.4747-0.2564 0.1058-0.1536 0-0.3379 0-0.5531 0-0.2254 0.1029-0.4098 0-0.5635-0.1232-0.1638-0.2781-0.2458-0.4747-0.2458h-3.2727c-0.056-3.2884 0.2945-5.9287 0.1392-8.6947l4.4429-0.3819c0.2037-0.017 0.36-0.081 0.4745-0.256 0.1058-0.1537-0.028-0.319-0.028-0.5341 0-0.2255 0.1334-0.4289 0.028-0.5826-0.1145-0.1639-0.27-0.2459-0.4745-0.2459h-5.5965c-0.2044 0-0.3683 0.093-0.4908 0.2664-0.1232 0.1435-0.18 0.3381-0.1719 0.584 0.2944 4.8659 0.4419 12.14 0.4419 21.841zm-5.3264-1.803c-0.81 0.7684-1.7756 1.219-2.9046 1.3521 0.041-1.5263 0.081-3.2475 0.1059-5.1733l0.056-5.1736c0.049-4.5383 0.1059-7.9905 0.1717-10.347 0.014-0.051 0.014-0.1029 0-0.1536 0.9409-0.081 1.743 0.061 2.4219 0.42 0.8264 0.4406 0.8264 1.4631 0.9246 2.4568 0.1058 1.0245 0.6546 3.7206 0.6872 5.0934 0.014 0.5019-0.015-0.7071 0 0l0.017 1.803 0.017 1.598 0.014 1.5982c0 1.209-0.5591 3.3432-0.5998 4.2653-0.065 1.342-0.014 1.3897-0.9056 2.2605zm1.099-20.392c-0.9408-0.543-2.5798-0.8344-3.8318-0.7217-0.2128 0.015-0.4827 0.051-0.8017 0.1232-0.2618 0.051-0.2688 0.4516-0.318 0.7487-0.041 0.2868-0.1893 0.665-0.026 0.9006-0.04 0.093 0.015-0.1334 0 0-0.04 1.5674-0.081 3.3397-0.1145 5.3065l-0.056 5.3068c-0.057 4.7021-0.1146 8.2365-0.18 10.603 0 0.093 0.015 0.1845 0.025 0.2664-0.014 0.2355 0.1363 0.2965 0.2428 0.4605 0.1146 0.1946 0.1827 0.4205 0.3873 0.4306 1.4972 0.041 2.8308-0.43 4.0008-1.4136 1.26-1.0553 2.0129-2.4689 2.2581-4.2411 0.049-0.3586 0.081-0.7787 0.099-1.2807l0.014-0.6454v-0.6453c0.017-1.1883 0.017-2.5713 0.014-4.1592l-0.014-0.9937-0.014-1.004c-0.014-0.7684-0.017-1.4343-0.033-1.9975-0.041-1.5063-0.1232-2.8379-0.2454-3.9853-0.1555-1.4239-0.2672-2.3925-1.4046-3.0584z" fill="#008000"/>
   <path id="path3782" d="m105 39.54c-0.03-0.341-0.304-0.4495-0.683-0.6493-0.428-0.2-0.891-0.3752-1.352-0.1755-1.103 0.4585-2.107 0.7758-3.029 0.9758-0.3784 0.083-0.4866 0.3578-0.6347 0.5928-0.1481 0.2234-0.088 0.4058 0 0.6527 0.099 0.2469 0.032 0.3532 0.3115 0.4824 0.2962 0.1406 0.6422 0.1647 1.0202 0.083 0.593-0.129 1.202-0.2821 1.811-0.4819 0.08 2.8564 0.114 6.8297 0.06 11.896l-0.03 2.974-0.02 2.974c-0.02 2.2454 0 4.2202 0.03 5.9481 0 0.2939 0.132 0.5173 0.412 0.6936 0.247 0.1528 0.598 0.087 0.96 0.087 0.345 0 0.62 0.065 0.867-0.087 0.28-0.1763 0.411-0.3997 0.395-0.6936-0.03-1.7985-0.05-3.8674-0.03-6.2302l0.03-3.1151 0.03-3.1149c0.05-5.2312 0-9.3924-0.116-12.461 0-0.129 0.04-0.245-0.04-0.3507z" fill="#cd0000"/>
   <path id="path3785" d="m38.556 74.817c-0.019-0.052-0.099-0.029-0.159-0.062-0.061-0.032-0.08-0.1044-0.1476-0.096-0.071 0.014-0.1276 0.042-0.1694 0.103l-0.08 0.1087-0.08 0.1088c-0.061 0.081-0.1204 0.1496-0.1789 0.2044-0.064 0.061-0.1536 0.094-0.2686 0.1087-0.042 0-0.093 0.014-0.1532 0.014h-0.151c-0.1982 0-0.3611-0.028-0.4889-0.075-0.1693-0.061-0.2844-0.1612-0.3481-0.2994-0.055-0.1174-0.087-0.2592-0.099-0.4261 0-0.061-0.014-0.1363-0.014-0.2189v-3.8918c0.014-0.2764 0.071-0.4983 0.1694-0.6682 0.09-0.1525 0.2269-0.2563 0.409-0.3139 0.1725-0.055 0.3514-0.055 0.5366 0 0.1758 0.049 0.3354 0.1671 0.4793 0.3573 0.1377 0.1813 0.2108 0.3569 0.2205 0.5268 0 0.07 0.035 0.1247 0.09 0.1671 0.048 0.036 0.1392-0.019 0.2093-0.019 0.068 0 0.094 0.058 0.1421 0.019 0.052-0.041 0.074-0.094 0.071-0.1671-0.015-0.2332-0.083-0.452-0.2206-0.6593-0.1319-0.2016-0.3004-0.3657-0.5078-0.4955-0.2142-0.1304-0.4441-0.2042-0.6838-0.2215-0.2588-0.017-0.5048 0.033-0.7381 0.1583-0.2299 0.1204-0.3991 0.3025-0.5078 0.5442-0.087 0.1873-0.1407 0.4233-0.1662 0.7112-0.022 0.2738-0.035 0.6077-0.032 1.008v2.8335c0 0.2505 0.014 0.4493 0.042 0.5989 0.042 0.2218 0.1232 0.406 0.2428 0.553 0.2397 0.3023 0.6772 0.4491 1.3192 0.4464 0.2846 0 0.5145-0.061 0.6837-0.1759 0.096-0.067 0.1918-0.1583 0.2875-0.2765 0.036-0.041 0.074-0.091 0.1218-0.1583l0.1116-0.1582c0.045-0.061 0.058-0.1174 0.035-0.1787z"/>
   <path id="path3787" d="m41.897 70.172-0.014-0.3628c-0.014-0.285-0.027-0.5241-0.052-0.7229-0.014-0.069-0.042-0.1232-0.099-0.1668-0.055-0.036-0.1102 0-0.177 0-0.071 0-0.1334-0.045-0.1743 0-0.048 0.039-0.071 0.094-0.061 0.1668 0.032 0.2678 0.055 0.5933 0.064 0.9791l0.015 0.4896c0 0.2102 0.014 0.3745 0.014 0.4895 0.041 1.3332 0.061 2.3498 0.061 3.0497 0 0.1203 0 0.2217-0.014 0.3021-0.014 0.1146-0.025 0.216-0.055 0.3054-0.068 0.2245-0.1948 0.3801-0.3863 0.4693-0.1887 0.091-0.4027 0.1087-0.6422 0.055-0.099-0.02-0.1821-0.078-0.2524-0.1671-0.048-0.067-0.093-0.1555-0.1319-0.265-0.074-0.2189-0.1044-0.4982-0.1015-0.8351v-0.2159l0.015-0.2129c0.014-0.1816 0.014-0.3228 0.014-0.4176v-1.3392c0-0.4838-0.014-0.8638-0.014-1.1372 0-0.5501 0.022-1.0684 0.061-1.5495 0-0.073-0.019-0.1276-0.071-0.1668-0.045-0.036-0.097 0.029-0.1644 0.029-0.07 0-0.1362-0.067-0.187-0.029-0.055 0.039-0.086 0.094-0.093 0.1668-0.044 0.5904-0.064 1.3505-0.055 2.2751v2.4792c-0.014 0.6134 0.064 1.0655 0.2237 1.3621 0.1117 0.2044 0.2843 0.3484 0.5207 0.4319 0.214 0.072 0.4504 0.088 0.7155 0.052 0.4951-0.07 0.8242-0.3253 0.9841-0.7687 0.061-0.1699 0.1015-0.3774 0.1203-0.6221 0-0.094 0.014-0.2044 0.014-0.3226v-0.3137c-0.014-0.9388-0.038-1.9812-0.08-3.1272z"/>
   <path id="path3789" d="m44.376 71.802c-0.1916 0.1958-0.5174 0.3743-0.9743 0.5326 0-1.2238 0.014-2.1943 0.014-2.9082 0.3995 0.067 0.7125 0.1611 0.933 0.288 0.163 0.091 0.2779 0.2331 0.3417 0.4203 0.046 0.142 0.071 0.3195 0.068 0.5326-0.014 0.507-0.1378 0.8841-0.3803 1.1347zm-0.297 1.4801 0.098 0.314 0.1015 0.3139c0.038 0.1087 0.087 0.236 0.145 0.3828l0.077 0.1902 0.077 0.1899c0.129 0.3111 0.2172 0.5673 0.2652 0.7717 0.016 0.07 0.058 0.1175 0.1174 0.1436 0.055 0.026 0.099-0.014 0.1666-0.025 0.067-0.017 0.1334-0.014 0.1719-0.058 0.042-0.055 0.055-0.1145 0.038-0.1844-0.052-0.2073-0.1377-0.4636-0.2619-0.7717l-0.077-0.1899-0.077-0.1903c-0.061-0.1474-0.1088-0.2734-0.146-0.3801-0.032-0.094-0.071-0.2072-0.1117-0.3397l-0.1087-0.3369c-0.086-0.2735-0.1663-0.4982-0.2428-0.6681 0.1821-0.1059 0.3321-0.2217 0.4568-0.3484 0.3034-0.3139 0.4697-0.7892 0.4984-1.4284 0.028-0.5701-0.1502-0.9934-0.5335-1.2699-0.195-0.1392-0.4441-0.2476-0.7475-0.3253-0.1175-0.032-0.2556-0.061-0.4122-0.086-0.093-0.014-0.2299-0.033-0.4122-0.061-0.129-0.017-0.1421 0.075-0.2025 0.182-0.061 0.1058-0.1363 0.1435-0.059 0.2096v1.5437l-0.014 1.5404c-0.014 1.3621-0.014 2.3873-0.014 3.0813 0 0.073 0.025 0.1276 0.08 0.1698 0.046 0.036 0.1087 0.014 0.1755 0.014 0.071 0 0.1291 0.026 0.1758-0.014 0.055-0.042 0.08-0.097 0.08-0.1698 0-0.6221 0-1.5091 0.014-2.6579 0.1791-0.061 0.3323-0.1146 0.46-0.1642 0.067 0.1642 0.1407 0.3716 0.2205 0.622z"/>
   <path id="path3791" d="m46.606 68.788c-0.048-0.036-0.097-0.019-0.1685-0.019-0.067 0-0.1363-0.017-0.1828 0.019-0.055 0.042-0.08 0.097-0.083 0.167-0.015 0.9445 0 2.0186 0.014 3.2222l0.029 1.6097 0.036 1.6098c0 0.073 0.028 0.1261 0.083 0.1699 0.048 0.036 0.1088 0.014 0.1759 0.014 0.07 0 0.129 0.026 0.1757-0.014 0.055-0.042 0.08-0.097 0.077-0.1699l-0.032-1.6098-0.028-1.6097c-0.016-1.2036-0.022-2.2777-0.014-3.2222 0-0.07-0.025-0.1247-0.08-0.167z"/>
   <path id="path3793" d="m48.922 75.652c0.046 0.036 0.1145 0 0.1831 0 0.071 0 0.1203 0.035 0.1685 0 0.055-0.042 0.08-0.097 0.077-0.1698l-0.022-1.4255-0.025-1.8314c-0.016-1.1087-0.019-2.059 0-2.8538v-0.014c0.3355-0.014 0.6101-0.017 0.8242-0.026 0.077 0 0.1378-0.028 0.1853-0.078 0.041-0.046 0-0.091 0-0.1527 0-0.064 0.038-0.1247 0-0.167-0.048-0.046-0.1087-0.067-0.1853-0.064-0.6901 0.026-1.4599 0.042-2.3097 0.055-0.08 0-0.1406 0.023-0.1884 0.073-0.041 0.042 0 0.1058 0 0.1701 0 0.061-0.038 0.1058 0 0.1494 0.049 0.045 0.1087 0.07 0.1884 0.07 0.3226 0 0.6485-0.014 0.9743-0.017-0.016 0.7976-0.016 1.7479 0 2.8537l0.025 1.8285 0.025 1.4255c0 0.073 0.028 0.1261 0.083 0.1698z"/>
   <path id="path3795" d="m51.616 68.788c-0.048-0.036-0.099 0.015-0.1685 0.015-0.068 0-0.1363-0.054-0.183-0.015-0.055 0.042-0.08 0.097-0.083 0.167-0.014 0.9445 0 2.0186 0.014 3.2222l0.029 1.6097 0.035 1.6098c0 0.073 0.028 0.1261 0.083 0.1699 0.046 0.036 0.1218 0 0.1903 0 0.071 0 0.113 0.045 0.1612 0 0.055-0.042 0.08-0.097 0.077-0.1699l-0.031-1.6098-0.028-1.6097c-0.016-1.2036-0.022-2.2777-0.014-3.2222 0-0.07-0.025-0.1247-0.08-0.167z"/>
   <path id="path3797" d="m54.034 75.071c-0.2363 0.1363-0.4887 0.1988-0.7537 0.1959 0-0.7402 0-1.7214-0.042-3.0518 0.3993 0.041 0.6773 0.061 0.8912 0.1634 0.3099 0.1499 0.4856 0.4551 0.5302 0.9128 0.014 0.1363 0.022 0.2393 0.025 0.3141 0.015 0.1174 0.015 0.2246 0 0.3195-0.014 0.2391-0.055 0.4435-0.1377 0.6162-0.1059 0.2162-0.278 0.3946-0.521 0.5299zm0.2781-4.017c-0.1821 0.3313-0.5196 0.4422-1.0821 0.5286-0.035-1.0136-0.09-1.7381-0.097-2.3657 0.278 0 0.5047 0.026 0.6836 0.078 0.2813 0.081 0.4762 0.3081 0.5879 0.6824 0.1175 0.3974 0.09 0.7574-0.093 1.077zm0.2044 0.9992c-0.1058-0.075-0.2331-0.1392-0.3833-0.1872 0.2076-0.1087 0.3802-0.2505 0.5112-0.4203 0.2842-0.3659 0.3864-0.8323 0.3003-1.3937-0.035-0.2333-0.1117-0.4436-0.2301-0.6308-0.1319-0.2043-0.3003-0.36-0.5079-0.4722-0.1757-0.094-0.3929-0.1527-0.6581-0.1786-0.1058-0.014-0.2203-0.017-0.3514-0.017h-0.345c-0.1015 0-0.132 0.055-0.1772 0.1333-0.038 0.075-0.081 0.1421-0.042 0.2158-0.014 0.023-0.014 0.049-0.014 0.075 0 0.4635 0.019 0.9934 0.035 1.5894l0.022 0.7948 0.025 0.7948c0.045 1.3563 0.068 2.4189 0.068 3.1819 0 0.1001 0.08 0.1146 0.1789 0.152 0.093 0.03 0.1502 0.078 0.2301 0.032 0.3291 0.032 0.6547-0.03 0.9776-0.1843 0.3033-0.1475 0.5525-0.3512 0.7442-0.6076 0.1564-0.2101 0.2524-0.4779 0.2875-0.7976 0.022-0.2102 0.019-0.4923-0.016-0.8438-0.052-0.5586-0.2685-0.9705-0.655-1.2383z"/>
   <path id="path3799" d="m57.567 70.129c0.055 0.2535 0.1203 0.57 0.1947 0.9532l0.096 0.4751 0.096 0.475 0.3035 1.5033h-0.6676l-0.3354 0.014h-0.3323c0.163-0.8639 0.3768-2.0042 0.6453-3.4182zm1.2458 3.5277-0.3513-1.7481-0.1534-0.7745-0.1566-0.7746c-0.1261-0.596-0.2428-1.1087-0.361-1.5407-0.029-0.1088-0.1145-0.045-0.2588-0.048-0.1435 0-0.2267-0.068-0.2491 0.048l-0.313 1.6528-0.3133 1.6501c-0.2393 1.2672-0.4439 2.3699-0.6134 3.3058-0.014 0.072 0 0.1334 0.052 0.1872 0.042 0.049 0.1261 0.03 0.1918 0.049 0.071 0.017 0.1015 0.064 0.1566 0.038 0.061-0.029 0.099-0.078 0.1116-0.1476l0.2811-1.5379c0.1117 0 0.2367 0.015 0.3771 0l0.3802-0.014c0.3355-0.014 0.5879-0.014 0.7572 0l0.3162 1.5779c0.016 0.07 0.055 0.1174 0.1146 0.1476 0.055 0.026 0.09-0.032 0.1564-0.051 0.071-0.014 0.1534 0.014 0.1918-0.036 0.045-0.055 0.061-0.1146 0.048-0.1872l-0.3133-1.5459c0.032-0.09 0.016-0.1729-0.052-0.2504z"/>
   <path id="path3801" d="m62.35 73.839 1.5491-0.014 0.058 0.4109-1.6209-0.035z"/>
   <path id="path3807" d="m70.327 71.109c-0.028 0.2216-0.1087 0.4001-0.2364 0.5384-0.132 0.1363-0.3099 0.2362-0.5401 0.3023-0.1756 0.049-0.3177-0.068-0.5699-0.056-0.025-1.0223-0.1102-1.7088-0.1102-2.3508 0.3835 0.028 0.6804 0.086 0.8883 0.1729 0.2905 0.1246 0.4728 0.3915 0.5461 0.8061 0.038 0.216 0.045 0.4118 0.022 0.5876zm-0.064 3.9104c-0.2905 0.2217-0.6393 0.2406-1.2112 0.278 0-0.6509-0.099-1.4874-0.1304-2.7401l0.1564 0.025 0.1532 0.026c0.1233 0.02 0.2269 0.039 0.3131 0.058 0.2332 0.049 0.4346 0.1058 0.5976 0.1758 0.3736 0.1555 0.5812 0.4608 0.6228 0.9156 0.052 0.5414-0.1145 0.962-0.5015 1.2614zm-1.8559-2.534c0.035 1.3275 0.052 2.3209 0.052 2.9832 0 0.067 0.022 0.1174 0.07 0.1612-0.014 0.067 0 0.1276 0.048 0.1757 0.046 0.055 0.1117 0.081 0.1981 0.078 0.7698-0.026 1.3738-0.1928 1.8052-0.5068 0.4949-0.3541 0.7282-0.8725 0.7025-1.5519-0.022-0.5934-0.2587-1.0252-0.7156-1.2988-0.1596-0.094-0.3577-0.1757-0.5909-0.2391 0.1693-0.075 0.3195-0.1699 0.4442-0.2821 0.3511-0.3166 0.4855-0.812 0.3991-1.4888-0.067-0.5327-0.2969-0.9128-0.6868-1.1403-0.1981-0.1174-0.4568-0.1988-0.773-0.2478-0.1174-0.017-0.2556-0.032-0.4184-0.042l-0.2046-0.014-0.2011-0.014c-0.1218-0.014-0.1406 0.081-0.1757 0.1819-0.035 0.094-0.071 0.1349 0 0.2069v0.055c0 0.665 0.016 1.6588 0.052 2.9862z"/>
   <path id="path3809" d="m73.713 71.978c-0.1918 0.1957-0.4311 0.1818-0.8879 0.3401 0-1.2238-0.077-2.0016-0.074-2.7158 0.3992 0.067 0.7124 0.1614 0.9328 0.2879 0.1629 0.091 0.2779 0.2332 0.3418 0.4205 0.048 0.1421 0.071 0.3197 0.068 0.5328-0.014 0.5067-0.1377 0.8839-0.3802 1.1345zm-0.2972 1.48 0.099 0.3138 0.1014 0.3141c0.038 0.1087 0.086 0.2361 0.1436 0.383l0.077 0.1899 0.077 0.1901c0.129 0.311 0.2171 0.5672 0.2651 0.7716 0.016 0.07 0.058 0.1174 0.1175 0.145 0.055 0.026 0.1072-0.032 0.1748-0.051 0.067-0.017 0.1261 0.014 0.1637-0.033 0.041-0.055 0.055-0.1145 0.038-0.1841-0.052-0.2074-0.1377-0.4637-0.262-0.7718l-0.077-0.19-0.077-0.1901c-0.061-0.146-0.1087-0.2736-0.1476-0.3802-0.032-0.094-0.071-0.2073-0.1116-0.3396l-0.1087-0.337c-0.087-0.2736-0.1662-0.4981-0.2429-0.6681 0.1821-0.1058 0.3322-0.2216 0.4569-0.3484 0.3035-0.314 0.4696-0.7891 0.4984-1.4282 0.029-0.5702-0.1502-0.9935-0.5335-1.27-0.1949-0.1392-0.4443-0.2477-0.7476-0.3252-0.1174-0.032-0.2557-0.061-0.4121-0.087-0.093-0.014-0.2301-0.033-0.4121-0.061-0.1276-0.017-0.3258 0.014-0.2843 0.1334 0.056 0.1632-0.055 0.1928 0.022 0.2592v1.5432l-0.014 1.5407c-0.015 1.362-0.015 2.3873-0.015 3.0812 0 0.072 0.025 0.1276 0.08 0.1699 0.046 0.036 0.1087 0 0.1759 0 0.071 0 0.1275 0.043 0.1755 0 0.055-0.042 0.08-0.097 0.08-0.1699 0-0.6221 0-1.5088 0.014-2.6578 0.1789-0.061 0.3321-0.1146 0.46-0.1643 0.068 0.1643 0.1406 0.3715 0.2204 0.622z"/>
   <path id="path3811" d="m77.039 70.305c0.055 0.2533 0.1203 0.5701 0.1948 0.953l0.096 0.4752 0.096 0.4751 0.253 1.4768c-0.371-0.1377-0.3234 0.023-0.6172 0.032l-0.3353 0.014c-0.1233 0-0.1756-0.07-0.2748-0.072 0.163-0.8638 0.3193-1.9342 0.5878-3.3479zm1.2458 3.5274-0.3514-1.7479-0.1533-0.7746-0.1565-0.7746c-0.1262-0.5962-0.2429-1.1087-0.3611-1.5405-0.028-0.1087-0.1072-0.088-0.2515-0.091-0.1435 0-0.234-0.023-0.2565 0.091l-0.3131 1.6528-0.3131 1.6501c-0.2395 1.267-0.444 2.3697-0.6134 3.3056-0.014 0.072 0 0.1333 0.052 0.1873 0.041 0.049 0.096 0.03 0.163 0.049 0.071 0.017 0.1305 0.064 0.1853 0.038 0.061-0.028 0.099-0.078 0.1116-0.1462l0.2811-1.5375c0.1117 0 0.2363 0.014 0.3771 0l0.3802-0.014c0.3355-0.014 0.5879-0.014 0.7572 0l0.3161 1.578c0.016 0.07 0.048 0.074 0.1073 0.1029 0.055 0.025 0.1174 0.029 0.1851 0.015 0.071-0.015 0.1319 0 0.1702-0.055 0.045-0.055 0.061-0.1145 0.048-0.1872l-0.313-1.559c0.032-0.09 0.016-0.1726-0.052-0.2504z"/>
   <path id="path3813" d="m79.624 69.234c0.1918 0 0.4761-0.014 0.8529-0.028l0.4282-0.02c0.1564 0 0.3002-0.014 0.4281-0.014 0.077 0 0.1377 0.023 0.1853 0.072 0.041 0.042 0.032 0.086 0.032 0.1496 0 0.064 0.014 0.1232-0.032 0.167-0.048 0.049-0.1088 0.072-0.1853 0.075-0.1853 0-0.4377 0.014-0.7541 0.023l-0.3737 0.02-0.2903 0.055 1.6928 5.7473v0.02c0.022 0.072 0 0.142-0.045 0.2016-0.052 0.061-0.1174 0.091-0.2044 0.091h-1.7057c-0.08 0-0.1407-0.023-0.1888-0.073-0.042-0.042 0-0.097 0-0.1582 0-0.064-0.046-0.1145 0-0.1585 0.048-0.049 0.1087-0.075 0.1888-0.075l1.2548-0.078-1.6672-5.7237v-0.02c-0.027-0.097 0-0.1758 0.083-0.2361 0.08-0.055 0.1693-0.067 0.2618-0.036z"/>
   <path id="path3815" d="m83.163 68.964c-0.049-0.036-0.1043 0.042-0.1757 0.042-0.068 0-0.1276-0.08-0.1756-0.042-0.055 0.042-0.08 0.097-0.083 0.167-0.015 0.9444 0 2.0186 0.014 3.2221l0.028 1.6097 0.035 1.6099c0 0.073 0.028 0.1276 0.083 0.1699 0.046 0.036 0.1232-0.014 0.1902-0.014 0.071 0 0.1131 0.054 0.1614 0.014 0.055-0.042 0.08-0.097 0.077-0.1699l-0.032-1.6099-0.028-1.6097c-0.016-1.2035-0.022-2.2777-0.014-3.2221 0-0.07-0.025-0.1233-0.08-0.167z"/>
   <path id="path3817" d="m86.258 75.998c0.077 0 0.1377-0.02 0.1854-0.067 0.042-0.042 0-0.087 0-0.1496 0-0.061 0.038-0.1233 0-0.1672-0.048-0.049-0.1087-0.078-0.1854-0.081l-1.5227-0.129c0.016-0.187-0.038-0.3301-0.029-0.5923v-0.6669l0.028-1.6097c0.019-1.2412 0.028-2.3497 0.032-3.3288 0-0.073-0.025-0.1276-0.08-0.1699-0.048-0.038-0.116 0.032-0.1862 0.032-0.067 0-0.1218-0.071-0.1685-0.032-0.055 0.042-0.08 0.097-0.08 0.1699 0 0.93-0.014 2.0099-0.028 3.2395l-0.028 1.6097v0.8264c-0.014 0.3197-0.029 0.5933-0.058 0.8235-0.015 0.052 0 0.1015 0.049 0.1392 0.025 0.022 0.016 0.014 0.025 0.022 0.055 0.042 0.1146 0.067 0.182 0.07z"/>
   <path id="path4875" d="m94.036 64.597h-0.1174c-0.1657 0.016-0.323 0.099-0.4231 0.2448-0.1333 0.1959-0.1348 0.4153-0.1218 0.5898 0.014 0.1204 0.031 0.2366 0.058 0.3505-0.1852-0.1485-0.3878-0.2893-0.6286-0.3857-0.09-0.036-0.1857-0.061-0.285-0.074-0.099-0.014-0.2023-0.014-0.3054 0.014-0.2286 0.042-0.4269 0.1751-0.5574 0.3624-0.2298 0.3304-0.2727 0.7175-0.2397 1.0813 0 0.025 0.014 0.051 0.014 0.075-0.3487 0.1348-0.6755 0.2801-0.9766 0.4339-1.7109 0.8732-2.348 1.841-2.3025 1.8873 0.073 0.072 0.882-0.7184 2.5265-1.4062 0.2727-0.1146 0.5643-0.2213 0.8712-0.322 0.035 0.1247 0.068 0.2466 0.1015 0.3614 0.1657-0.014 0.3323-0.016 0.4876-0.1435-0.091-0.3109-0.1853-0.6375-0.2121-0.932-0.03-0.2941 0.014-0.5422 0.15-0.7446 0.054-0.078 0.1436-0.1363 0.2332-0.1534 0.093-0.017 0.2048 0 0.3099 0.039 0.2804 0.113 0.5391 0.3362 0.8137 0.5752 0.275 0.2397 0.5377 0.4944 0.7917 0.7596 0.043 0.049 0.093 0.094 0.1363 0.1392 0.051 0.054 0.1044 0.1116 0.1276 0.1406 0 0 0.03 0.023 0.1189 0.023 0.03 0 0.059 0 0.1116-0.023 0.052-0.023 0.1527-0.1203 0.1527-0.2356v-0.059c-0.094-0.1515-0.1585-0.221-0.2717-0.3359-0.019-0.017-0.035-0.035-0.052-0.054 1.4562-0.1815 3.0355-0.214 4.7893-0.077 0.3368 0.026 0.6705 0.058 0.9995 0.094 2.44 0.2687 4.471 0.7533 6.198 1.3398 0.965 0.3281 1.688 0.637 2.323 0.967 1.039 0.547 1.512 1.0367 1.574 0.9865 0.07-0.059-0.307-0.6761-1.354-1.3621-0.613-0.4055-1.36-0.7951-2.324-1.1815-1.732-0.6945-3.835-1.2613-6.327-1.549-0.337-0.039-0.6795-0.073-1.0263-0.1-0.6812-0.054-1.3399-0.078-1.9785-0.075-0.5911 0-1.1635 0.029-1.7194 0.077-0.116-0.1203-0.2275-0.2508-0.3459-0.3834-0.2694-0.3013-0.5575-0.6619-0.9908-0.8579-0.094-0.042-0.2014-0.075-0.3169-0.083zm-0.023 0.4294c0.051 0 0.1088 0.017 0.1668 0.045 0.3138 0.142 0.5712 0.443 0.849 0.7534 0.043 0.049 0.088 0.099 0.1319 0.1496-0.407 0.046-0.8032 0.1059-1.1906 0.1761-0.081-0.2448-0.1512-0.5339-0.1666-0.7458-0.014-0.1378 0-0.2546 0.049-0.3183 0.019-0.029 0.065-0.055 0.1117-0.059h0.049zm2.6429 2.2171c-0.3893 0-0.7419 0.1967-0.8362 0.4532-0.1073 0.2908 0.1549 0.5622 0.5847 0.6059 0.4291 0.043 0.8642-0.1567 0.9712-0.4477 0.1058-0.2909-0.1557-0.5623-0.585-0.6059h-0.1348zm0.3051 0.3024c0.03 0 0.058 0 0.086 0.014 0.03 0 0.056 0.017 0.085 0.042 0.031 0.025 0.052 0.071 0.052 0.1159 0 0.09-0.058 0.1291-0.1058 0.1591-0.048 0.03-0.1029 0.051-0.1643 0.064-0.062 0.014-0.1189 0.014-0.1737 0-0.03 0-0.056-0.017-0.084-0.042-0.031-0.025-0.054-0.071-0.054-0.1159 0-0.09 0.058-0.1291 0.1044-0.1594 0.049-0.03 0.1029-0.052 0.1645-0.065 0.031 0 0.059-0.014 0.088-0.014zm11.327 1.7992c-0.111 0.067-0.189 0.1015-0.1 0.2085 0.07 0.044 0.11 0.061 0.18 0.02 0.21-0.1058 0.322-0.065 0.412 0 0.09 0.057 0.07 0.055 0.19 0.239 0.03 0.1474 0.203 0.1319 0.2-0.046-0.07-0.1605-0.07-0.211-0.168-0.3083-0.178-0.1944-0.402-0.2332-0.717-0.1102zm1.581 0.7094c-0.452 0.014-0.931 0.1594-0.945 0.1595l1.371-0.1087c-0.13-0.041-0.275-0.054-0.426-0.051zm-0.931 0.1771 0.951 1.0111c0.18-0.5781-0.677-0.6823-0.951-1.0111zm-3.3 0.4626c-0.615 0-1.286 0.049-2.006 0.1451-1.507 0.2023-3.119 0.6491-4.7553 1.4049-0.1734 0.08-0.3452 0.1631-0.5144 0.2479-1.7419 0.8731-3.2525 1.9628-4.4517 2.9333-2.4945 2.0185-3.9104 3.6208-3.8548 3.6852 0.1363 0.1554 1.7274-1.2617 4.2757-3.1409 1.2171-0.8972 2.7205-1.9284 4.3902-2.7561 0.1631-0.08 0.3273-0.1591 0.4937-0.2361 1.5676-0.7239 3.0926-1.1772 4.5256-1.4204 3.574-0.6096 6.151-0.045 6.18-0.2019 0-0.028-1.616-0.6883-4.283-0.661z"/>
   <path id="path1105" d="m114.96 44.802c-0.03 0.1464 1.443-0.3809 3.285 1.493 0.733 0.7429 1.43 1.9005 1.586 3.3715 0.116 1.1532-0.101 2.4877-0.851 3.6864-0.645 1.0284-1.67 1.9296-2.975 2.4072-1.283 0.4645-2.786 0.4996-4.207 0-1.3-0.4572-2.494-1.3362-3.359-2.5377-0.808-1.1224-1.319-2.4879-1.455-3.9384-0.121-1.3728 0.07-2.794 0.575-4.1362 0.771-2.0556 2.276-3.9296 4.333-5.0679 1.676-0.9231 3.686-1.3129 5.65-1.0053 0.338 0.059 0.673 0.132 1.002 0.2198 2.711 0.7971 4.8 2.8659 5.941 5.2043 1.218 2.4924 1.494 5.241 1.288 7.7157-0.425 5.1882-2.814 9.4489-5.405 12.294-3.749 4.1178-7.328 5.3554-9.23 5.815-0.377 0.091-0.772 0.1319-1.119 0.1363-0.49 0-0.88-0.059-0.97-0.1562-0.03-0.083 0.365 0 0.869 0 0.358 0.014 0.769-0.016 1.114-0.1545 1.827-0.73 5.292-2.4066 8.601-6.2931 2.379-2.7911 4.548-6.8863 4.87-11.74 0.151-2.312-0.116-4.8352-1.227-7.0211-1.028-2.0293-2.85-3.8491-5.113-4.4805-0.273-0.074-0.551-0.1464-0.834-0.1846-1.643-0.2579-3.362 0.073-4.78 0.844-1.75 0.9493-3.069 2.5728-3.754 4.3412-0.445 1.1591-0.635 2.3825-0.539 3.5516 0.106 1.2308 0.515 2.4001 1.176 3.3465 0.704 1.011 1.687 1.7743 2.753 2.1714 1.16 0.4352 2.417 0.4454 3.477 0.087 1.08-0.3575 1.973-1.0859 2.543-1.9284 0.665-0.9801 0.915-2.1215 0.858-3.1193-0.07-1.2762-0.622-2.3428-1.228-3.0593-1.405-1.66-2.891-1.7712-2.875-1.8695z" fill="#cd0000"/>
  </g>
 </g>
</svg>
