<?xml version="1.0" encoding="UTF-8" standalone="no"?>
<!-- Created with Inkscape (http://www.inkscape.org/) -->

<svg
   xmlns:dc="http://purl.org/dc/elements/1.1/"
   xmlns:cc="http://creativecommons.org/ns#"
   xmlns:rdf="http://www.w3.org/1999/02/22-rdf-syntax-ns#"
   xmlns:svg="http://www.w3.org/2000/svg"
   xmlns="http://www.w3.org/2000/svg"
   xmlns:sodipodi="http://sodipodi.sourceforge.net/DTD/sodipodi-0.dtd"
   xmlns:inkscape="http://www.inkscape.org/namespaces/inkscape"
   version="1.1"
   id="svg2"
   xml:space="preserve"
   width="150"
   height="100"
   viewBox="0 0 150 100"
   sodipodi:docname="logo-cafe-familiar.svg"
   inkscape:version="0.92.2 (5c3e80d, 2017-08-06)"
   inkscape:export-filename="/home/phls/phls/eventos/minidebconf/2018/logos/logo-cafe-familiar.png"
   inkscape:export-xdpi="96"
   inkscape:export-ydpi="96"><metadata
     id="metadata8"><rdf:RDF><cc:Work
         rdf:about=""><dc:format>image/svg+xml</dc:format><dc:type
           rdf:resource="http://purl.org/dc/dcmitype/StillImage" /><dc:title /></cc:Work></rdf:RDF></metadata><defs
     id="defs6" /><sodipodi:namedview
     pagecolor="#ffffff"
     bordercolor="#666666"
     borderopacity="1"
     objecttolerance="10"
     gridtolerance="10"
     guidetolerance="10"
     inkscape:pageopacity="0"
     inkscape:pageshadow="2"
     inkscape:window-width="1920"
     inkscape:window-height="1019"
     id="namedview4"
     showgrid="false"
     inkscape:zoom="4.7572177"
     inkscape:cx="30.36303"
     inkscape:cy="70.505775"
     inkscape:window-x="0"
     inkscape:window-y="0"
     inkscape:window-maximized="1"
     inkscape:current-layer="g10" /><g
     id="g10"
     inkscape:groupmode="layer"
     inkscape:label="Logo Café Familiar da Terra"
     transform="matrix(1.3333333,0,0,-1.3333333,0,100.00005)"><g
       id="g12"
       transform="matrix(0.10538305,0,0,0.10538305,25.66581,-4.6912093)"><path
         d="m 193.7531,335.9653 c 0.2078,-0.6732 0.4346,-1.4522 0.6784,-2.325 -0.2166,1.0772 -0.3359,1.6484 -0.3223,1.6552 1.7302,-5.5894 4.7338,-18.2974 7.6861,-34.6598 10.8808,-55.2773 48.693,-104.6834 105.3326,-57.6023 5.656,3.0941 11.1311,6.06 21.3027,1.6059 -6.147,3.4024 -10.9438,4.125 -15.1081,3.6819 l 0.2573,0.2353 -0.1346,-0.0136 c 4.572,4.1848 8.8608,8.5042 13.0167,12.8559 4.6485,2.5467 9.1913,4.9468 17.1638,1.9143 -5.2776,2.6455 -9.3875,2.9866 -12.9892,2.4072 l 0.3101,0.3305 -0.116,-0.0187 c 5.5418,5.9201 10.9404,11.8318 16.5895,17.479 3.9189,2.0576 8.034,3.6036 14.4451,1.5035 -4.1882,1.9057 -7.6266,2.3286 -10.6744,2.0335 l 0.4637,0.44 -0.1859,-0.017 c 12.7831,12.1827 27.2077,22.7565 47.3734,28.8878 l -0.5165,-0.5828 0.0511,0.0153 c -1.0517,-1.1797 -2.054,-2.3473 -3.0155,-3.503 -2.3658,-2.8877 -4.4626,-5.7019 -6.336,-8.4549 2.2246,2.5568 5.3679,4.9144 9.6072,5.8161 9.3245,2.3525 18.2823,-2.6524 20.1404,-4.2188 1.9823,-1.1047 9.5457,-8.3988 9.6072,-17.7007 0.341,-9.1454 -5.3578,-15.9295 -5.5401,-16.482 -0.3274,-0.3118 0.762,1.1472 1.9245,3.7281 -1.241,-2.3542 -2.4052,-3.8233 -2.4854,-4.0654 -0.6784,-0.648 4.7355,6.3156 4.231,15.0976 -0.1789,8.9782 -7.7749,15.58 -9.413,16.4698 -1.27,1.2342 -10.4103,7.4835 -19.992,4.9298 -1.7489,-0.4108 -3.2847,-1.0772 -4.6315,-1.8922 -2.683,-1.9414 -5.0984,-4.7846 -7.2581,-8.0815 -0.7432,-1.4437 -1.0485,-2.4052 -1.0244,-2.2791 0.0459,0.2781 0.1465,0.6718 0.305,1.1492 -5.2861,-8.5402 -8.9425,-19.6458 -11.0767,-26.2256 -1.0244,-4.2358 -2.2178,-9.4215 -3.566,-15.73 -6.1469,-19.6033 -17.4622,-30.0217 -34.1081,-38.0642 -12.4694,-6.486 -23.8085,-8.5127 -30.6491,-9.3583 l -0.0904,-0.0119 -0.324,-0.0391 -0.0884,-0.0102 -0.3121,-0.0374 -0.0868,-0.0103 -0.3036,-0.0343 -0.0867,-0.0102 -0.2917,-0.0323 -0.3665,-0.0391 -0.0833,-0.0102 -0.2713,-0.0292 -0.3424,-0.0357 -0.0803,-0.008 -0.2505,-0.0255 -0.0769,-0.008 -0.5437,-0.0564 -0.0765,-0.008 -0.2149,-0.0204 -0.0751,-0.009 -0.2026,-0.0204 -0.0752,-0.009 -0.1907,-0.0204 -0.0718,-0.009 -0.1788,-0.0187 -0.0734,-0.007 -0.1653,-0.0187 h -0.007 l -0.0632,-0.008 c -5.0151,-0.2336 -19.7822,-1.1268 -38.5518,3.5898 -2.0797,0.4501 -4.1918,1.0366 -6.3158,1.7524 -17.2525,5.7804 -35.3676,20.1282 -43.4781,39.3817 -9.7387,20.8899 -11.861,42.9988 -13.8569,58.7767 -1.8751,15.9176 -4.2038,26.0583 -4.1474,26.0855"
         style="fill:#200006;fill-opacity:1;fill-rule:evenodd;stroke:none"
         id="path14"
         inkscape:connector-curvature="0" /><path
         d="m 269.2511,266.6339 v 0 c 0.2693,6.3989 5.7359,11.7788 13.6114,14.409 3.3307,-2.7547 7.5583,-4.4713 12.2102,-4.64 4.6503,-0.1721 8.9938,1.2342 12.5173,3.7366 22.8724,-9.5493 -19.2436,-28.0272 -27.0936,-30.0608 l 0.4825,13.2157 0.002,0.0224 h -0.002 c 0.0221,0.9255 -0.7025,1.701 -1.6348,1.735 -0.9289,0.0343 -1.7115,-0.6868 -1.7558,-1.6126 v 0 l -0.002,-0.0204 -0.513,-14.0766 c -0.0596,-0.0102 -0.1177,-0.0238 -0.1755,-0.0323 -2.6286,-0.4382 -5.385,-0.6375 -8.2998,-0.5508 l 0.6528,17.8748 z m 23.7282,-4.0264 v 0.5454 h -0.6715 l 5.3884,8.9918 2.9012,-9.648 h -3.1671 l -0.1312,-3.6105 h 0.5487 l 0.1636,3.1793 3.2287,-0.0938 -3.3923,11.3579 -6.048,-10.1118 -2.5245,8.4549 -6.8783,-11.5027 1.5991,-0.1176 v 0.593 h -0.728 l 5.8453,9.7435 3.1417,-10.4559 h -3.4316 l -0.1398,-3.9138 h 0.5916 l 0.1772,3.4467 3.4979,-0.104 -0.9904,3.3207 z"
         style="fill:#200006;fill-opacity:1;fill-rule:evenodd;stroke:none"
         id="path16"
         inkscape:connector-curvature="0" /><path
         d="m 219.3361,329.3838 c -1.9364,6.2595 17.3548,14.6546 34.5784,17.8918 5.5537,1.2135 11.143,2.1818 16.3576,2.9386 -0.4773,1.1353 -0.8472,2.3063 -1.0961,3.4997 -0.5505,2.6524 -0.525,5.0199 -0.2336,7.0554 -13.5346,-1.0689 -107.6576,-10.1392 -53.6975,-32.3708 41.3509,-17.6578 88.789,-6.762 130.7332,-5.6832 3.2182,0.8252 -32.521,-6.1432 -72.2423,-6.9069 -19.8128,-0.2727 -40.6945,1.6994 -57.0538,7.2054 -8.1142,2.9829 -15.0486,6.0735 -20.217,10.2158 -2.4375,2.0217 -4.9861,4.9314 -4.6349,8.6338 0.4995,3.5813 2.5469,4.9671 3.5048,5.9354 7.0826,6.7451 38.9338,14.6886 74.402,16.4393 0.5386,1.7149 1.1523,3.0053 1.4454,3.8046 0.8473,1.9466 4.6724,6.8627 10.3147,9.3685 5.5044,2.7905 12.1559,4.2906 18.0947,6.4078 6.0157,1.9193 11.2694,5.5074 13.0388,10.294 1.7694,4.6485 1.1438,8.3749 1.2427,8.9135 -0.2951,0.5352 1.0296,-2.1784 0.7926,-7.2788 0.1942,-5.3149 -4.6758,-12.1691 -10.891,-15.7796 -11.8556,-6.1092 -21.1918,-12.4112 -22.767,-15.3924 4.2701,0.0425 8.5606,-0.0102 12.8358,-0.1758 4.2293,-0.1006 8.4345,-0.2778 12.5802,-0.5266 8.9373,2.9522 17.2185,6.1214 19.2846,7.5889 2.0336,0.9683 11.2199,5.8008 13.4513,15.2172 2.5449,9.0105 0.1601,18.1624 0.2146,18.8717 -0.4125,0.8061 2.8468,-7.8634 1.3756,-17.8268 -1.0873,-10.5636 -11.2164,-17.5882 -13.2534,-18.2991 -1.546,-1.2546 -8.5674,-3.5983 -16.3899,-5.8689 15.5648,-1.1678 30.0268,-3.4211 41.2348,-6.7385 15.8377,-3.7193 22.9767,-13.047 22.0989,-13.5414 -5.0321,11.4942 -36.7518,17.5269 -70.3313,18.3246 -4.9929,-1.3552 -9.6585,-4.6587 -8.8214,-8.714 l 0.0442,-0.2863 c 5.4513,0 23.137,-1.7081 39.5459,-5.7923 17.3905,-3.4911 31.4946,-12.8236 31.4246,-14.5658 1.7047,-0.1826 -11.9203,8.0663 -29.8293,8.8962 -17.3667,1.9143 -36.3699,0.9119 -40.587,0.9343 -1.5361,0.008 -5.2452,0.1602 -10.2705,0.254 0.6698,-0.5559 1.3756,-1.0876 2.1121,-1.5888 11.4993,-8.4702 26.13,-8.8061 25.9001,-8.5759 -3.5475,-1.2308 -17.9379,-2.1547 -30.8077,4.9742 -2.5708,1.3124 -5.0474,3.109 -7.1833,5.2517 -7.255,-0.051 -15.6113,-0.341 -23.7456,-1.1794 -9.6057,-0.9241 -18.9402,-2.6031 -25.198,-5.2042 -6.8558,-2.4242 -7.4576,-6.7317 -7.357,-6.6209"
         style="fill:#200006;fill-opacity:1;fill-rule:evenodd;stroke:none"
         id="path18"
         inkscape:connector-curvature="0" /><g
         id="g20"><path
           d="m 79.0469,520.5251 0.6591,1.4758 0.4085,1.6574 c 0,0.1814 0.2041,0.4311 0.6352,0.7948 0.4085,0.3628 0.6355,0.6582 0.6134,0.9309 1.0667,4.1315 2.1563,6.9466 3.2692,8.4453 l 1.5891,3.9954 c 0.1814,0.8853 0.5899,1.5891 1.249,2.1342 0.6352,0.5216 0.9533,0.9984 0.9533,1.3847 0,0.2727 -0.4547,0.6582 -1.3627,1.1807 -0.9079,0.4994 -1.362,0.9762 -1.362,1.4303 0,0.4312 1.453,1.2935 4.3821,2.588 0,1.2481 0.6811,2.5424 1.9975,3.9274 0.3181,0.2498 0.4768,0.5678 0.4768,0.9307 0,1.0666 0.2041,1.9298 0.6582,2.588 l 0.5222,1.5213 c 0.1817,0.5446 0.5451,1.135 1.1123,1.7706 0.5451,0.6355 0.8178,1.2716 0.8178,1.9071 v 0.5224 c -0.5681,0.0454 -1.385,-0.7038 -2.4523,-2.2708 -1.1123,0 -2.0202,-0.8169 -2.7241,-2.4514 -0.3636,-0.9309 -1.1806,-1.5213 -2.4749,-1.794 -0.5672,-1.0667 -1.5208,-1.7932 -2.8607,-2.2017 -0.9527,0.5899 -1.4295,1.0667 -1.4295,1.4751 l 0.5899,4.1094 c 0,0.9309 2.27,3.2692 6.7878,6.9922 0.2727,0 1.135,0.8405 2.5883,2.5206 l 3.6783,4.1315 c 1.9746,1.9981 3.4962,3.4506 4.5173,4.3812 1.9071,3.0204 2.8607,5.0176 2.8607,5.9939 0.8852,0.7948 1.6571,2.4522 2.2926,4.9493 0.6364,2.5197 1.249,4.3356 1.7941,5.4714 0.5442,1.1123 0.8852,1.952 0.9536,2.4971 1.7932,5.3574 3.0875,8.7176 3.9274,10.1024 l 0.6808,2.2025 0.9993,0.7942 c 0.0683,0.2268 0.1584,0.908 0.2497,2.0665 0.4995,0.1587 0.9989,1.135 1.5435,2.9282 0.5221,1.7711 1.0445,2.9738 1.5896,3.6555 0.5216,0.6582 0.8853,1.3618 1.0667,2.0886 0.1814,0.7265 0.7265,1.4531 1.6347,2.2017 0.908,0.7265 1.8159,1.0902 2.7468,1.0902 0.3181,0 0.8402,-0.4541 1.567,-1.3629 0.7265,-0.9079 1.1804,-1.9519 1.3391,-3.1323 0.1358,-1.1806 0.2727,-1.9755 0.3628,-2.3839 0.0913,-0.4312 0.1367,-0.9992 0.1367,-1.7031 l 0.1131,-1.9298 c 0,-0.3628 -0.1585,-1.4752 -0.5216,-3.382 -0.3634,-1.9072 -0.6134,-3.2692 -0.7719,-4.1097 -0.1587,-0.8169 -0.6128,-1.362 -1.362,-1.6118 -0.7495,-0.2724 -1.135,-0.5451 -1.135,-0.8169 0,-0.2498 0.1814,-0.4765 0.5442,-0.6134 0.3637,-0.1585 0.5224,-0.2951 0.5224,-0.3629 0,-0.1822 -0.2497,-0.7721 -0.7494,-1.7711 -0.5222,-0.9992 -0.999,-1.6344 -1.4304,-1.9071 0.25,-0.5216 0.3866,-0.8396 0.3866,-0.9306 0,-0.2044 -0.3183,-0.9082 -0.9535,-2.0886 -0.6591,-1.1806 -1.1807,-1.9528 -1.567,-2.3613 -0.4085,-0.4084 -0.7943,-1.3164 -1.2033,-2.7238 -0.3858,-1.4303 -1.4077,-2.611 -3.0651,-3.5872 -0.6126,-0.6355 -1.1577,-1.6574 -1.6118,-3.0648 -0.4768,-1.4304 -1.1577,-2.3156 -2.0429,-2.6567 l -0.8623,-1.2707 v -0.2724 c 0,-0.6582 -0.2271,-1.385 -0.6591,-2.1799 -0.4541,-0.8169 -0.8852,-1.7475 -1.3394,-2.8377 -0.4311,-1.0894 -0.8623,-1.8159 -1.2489,-2.1569 -0.1814,-1.0211 -0.4986,-1.952 -0.9306,-2.7695 -0.4541,-0.8169 -0.726,-1.5434 -0.817,-2.1569 l -0.4541,-0.5215 c -0.885,-0.1367 -1.3391,-0.5681 -1.3391,-1.2717 l 0.2719,-1.476 c 0,-0.0226 -0.4085,-0.7713 -1.2033,-2.1787 l -0.2492,-1.3402 c -0.227,-1.112 -0.659,-1.8385 -1.2716,-2.2243 -0.6126,-0.3864 -1.0219,-1.2033 -1.2033,-2.4976 l -0.2727,-1.5891 c 0,-0.091 0.0456,-0.2271 0.1369,-0.4085 0.0901,0 0.3628,0.2497 0.794,0.7265 0.6361,-0.2041 0.9762,-0.318 1.0675,-0.318 0.2724,0 0.5222,0.1814 0.7713,0.5677 0.2498,0.3632 0.6361,0.6582 1.1585,0.817 l 0.2719,0.1366 c 0.227,0.6355 0.5451,0.9536 0.9989,0.9984 0.4314,0.0456 0.8178,0.2497 1.135,0.6364 0.2954,0.3855 0.5451,0.5669 0.7268,0.5669 0.091,0 0.4082,-0.1814 0.9306,-0.5443 h 0.1367 l 0.5898,0.2719 -0.1357,1.0672 c 0,0.4541 0.2041,0.7265 0.6125,0.8626 0.3858,0.1366 0.6812,0.3637 0.8626,0.6582 l 2.4523,1.6126 c 1.0672,0.4312 1.8615,0.908 2.3609,1.4295 0.5225,0.4995 1.0667,0.8632 1.6575,1.0903 0.6125,0.227 1.0666,0.4994 1.4074,0.8396 0.341,0.318 1.0666,0.5451 2.2252,0.6361 1.2937,1.0896 2.2929,1.8615 2.9967,2.2473 l 0.5222,0.7265 c 0.0904,0.0904 0.2718,0.1814 0.5445,0.2727 0.2498,0.0901 0.6134,0.3628 1.0219,0.794 0.4312,0.4541 0.8167,0.6809 1.1577,0.6809 0.8852,0 1.3393,-0.4539 1.3393,-1.3391 0,-1.4531 -0.6584,-2.6337 -1.9975,-3.519 l -0.1367,-0.2041 c -0.227,-1.7713 -0.7713,-2.6566 -1.6795,-2.6566 -0.182,0 -0.4765,-0.3855 -0.9314,-1.135 -0.4987,0.0913 -0.7714,0.1369 -0.8623,0.1369 -0.3632,-0.5451 -0.7943,-1.0219 -1.3394,-1.476 h -0.4085 c -0.7038,0 -3.5872,-2.0659 -8.6046,-6.1752 -0.2727,-0.2724 -0.4997,-0.4541 -0.6811,-0.5451 l -1.2716,0.1366 c 0,-0.091 -0.2498,-0.5222 -0.7943,-1.3173 -0.6582,-0.2267 -1.4074,-0.6582 -2.2022,-1.2707 -0.7943,-0.6135 -1.3848,-1.0219 -1.7706,-1.2033 -0.3637,-0.1815 -0.7038,-0.4768 -1.0219,-0.8853 -0.318,-0.432 -0.7265,-0.7265 -1.2716,-0.9079 l -0.8626,-0.7949 h -0.3855 c -0.3637,0 -0.7948,-0.227 -1.3172,-0.6582 -0.4995,-0.4541 -0.7487,-0.8631 -0.7487,-1.2716 0,-0.1817 0.2044,-0.5224 0.5899,-1.0667 0.3629,0.2716 1.5891,-1.0675 3.723,-4.0184 2.1343,-2.9517 3.2018,-5.7897 3.2018,-8.4909 0,-1.9981 -0.2954,-3.2919 -0.9088,-3.8826 -0.5899,-0.6126 -0.8853,-1.0437 -0.8853,-1.2934 0,-0.1817 0.0683,-0.7039 0.2041,-1.5444 v -0.2718 c 0,-0.432 -0.2497,-0.7038 -0.7713,-0.7948 -0.4994,-0.091 -0.7948,-0.2498 -0.8858,-0.5225 v -1.6571 l -0.2497,-0.7943 c -0.5899,-0.318 -1.1807,-1.3626 -1.7932,-3.1331 -1.3167,-1.3847 -2.2703,-2.1569 -2.8381,-2.3383 l -0.1358,-0.2497 0.1358,-1.8159 c 0,-0.432 -0.2041,-0.7951 -0.6125,-1.0448 -0.3867,-0.2725 -0.9309,-0.8397 -1.6118,-1.7028 -0.6818,-0.8626 -1.3856,-1.4752 -2.0894,-1.8389 -0.1588,-0.8396 -0.4989,-1.4303 -1.0211,-1.7932 -0.4997,-0.3407 -1.0219,-0.8631 -1.5443,-1.5213 l -0.4085,-0.2727 c -0.3855,-0.0901 -0.7721,-0.5669 -1.1123,-1.453 l -0.5451,-0.1358 c -0.6126,-1.0667 -1.2033,-1.8389 -1.8159,-2.293 -0.5907,-0.4767 -1.0219,-0.9079 -1.2716,-1.3169 l -1.0667,-0.6582 c -0.3863,-0.7943 -1.2033,-1.7031 -2.4522,-2.7241 -0.0904,0 -0.2727,0.1357 -0.5224,0.4084 h -0.2041 c -0.1815,0 -0.3402,-0.1814 -0.4768,-0.5451 -0.1131,-0.3401 -0.3629,-0.6811 -0.7265,-0.9983 -0.3402,-0.2954 -0.7039,-0.7492 -1.0667,-1.3173 l -0.2498,-0.2724 c -0.5898,0 -1.4986,-0.7713 -2.7467,-2.3383 -0.8405,-0.1587 -1.567,-0.4768 -2.1799,-0.9309 -0.9306,-1.0667 -1.5888,-1.5888 -1.9298,-1.5888 -0.0456,0 -0.5442,0.3628 -1.476,1.0893 -0.9306,0.7492 -1.3847,1.9072 -1.3847,3.4969 0,0.4084 -0.2719,0.8623 -0.794,1.4074 -0.0913,0.4767 -0.1823,1.1806 -0.2727,2.1115 v 0.6126 c 0,0.5224 0.1814,1.1576 0.5224,1.8615 l 0.4085,1.3847 c 0.091,0.3637 0.2271,0.6582 0.4085,0.8853 0.1593,0.2049 0.4311,0.8404 0.7492,1.8844 0.341,1.0446 0.7265,2.0665 1.1806,3.0875 l 0.114,0.6809 c 0.4986,2.1115 0.8852,3.1561 1.2024,3.1105 0.2727,0.6811 0.5451,1.5661 0.7948,2.6793 0.2727,1.0893 0.4542,1.9973 0.5681,2.7238 0.1131,0.7038 0.4312,1.2716 0.9754,1.7257 z m 13.7126,12.7817 0.2727,-2.8607 c 0,-0.1814 -0.3631,-1.0219 -1.0896,-2.5651 -0.7492,-1.5216 -1.226,-2.7467 -1.4304,-3.6776 -0.2268,-0.9306 -0.7265,-1.4074 -1.4757,-1.4074 h -0.6582 c -0.0913,-0.1823 -0.1366,-0.341 -0.1366,-0.5225 l 0.1366,-1.476 c 0,-0.5669 -0.1596,-1.5888 -0.4768,-3.0418 -0.2954,-1.476 -0.7495,-2.4066 -1.3172,-2.7924 l -0.4085,-0.4768 c -0.091,-0.6582 -0.4312,-1.7257 -1.0219,-3.1561 -0.6126,-1.4522 -1.1123,-2.5651 -1.4978,-3.382 -0.4085,-0.8405 -0.7039,-1.8389 -0.9309,-3.0648 -0.2271,-1.2263 -0.5222,-1.9982 -0.8632,-2.3613 -0.2718,-1.2487 -0.5442,-2.2706 -0.8169,-3.0875 -0.2498,-0.8178 -0.5908,-1.9298 -0.9763,-3.2919 0.0683,-0.1814 0.2041,-0.2727 0.3855,-0.2727 0.2727,0 0.6134,0.4768 0.9992,1.4534 0.1815,0.1814 0.4768,0.318 0.908,0.3855 0.4093,0.0456 0.7721,0.5224 1.0902,1.4303 l 0.136,0.2498 c 0.4768,0.0912 0.8405,0.341 1.0673,0.7721 0.2044,0.4085 0.4541,0.6809 0.7259,0.7722 0.2725,0.0901 0.5678,0.2945 0.9315,0.6582 l 0.4541,0.1358 c 0.1814,0.0912 0.3402,0.318 0.4768,0.7265 0.1358,0.4085 0.2945,0.7038 0.4538,0.9309 h 0.9309 l 0.2724,0.1366 c 0.3632,1.4074 0.7943,2.3383 1.2938,2.7468 0.5224,0.4311 0.9079,0.9306 1.1806,1.4987 0.2497,0.5899 0.5678,1.021 0.9536,1.339 0.3855,0.2954 0.6582,0.8853 0.8396,1.7249 0.7948,0.9315 1.2946,1.6574 1.5214,2.2025 0.227,0.5222 0.5224,0.9763 0.9309,1.3173 l 0.1357,0.4759 -0.2715,0.7949 v 0.2724 c 0,0.341 0.5215,1.2263 1.5661,2.6566 1.0437,1.4074 1.6801,2.5881 1.9525,3.5416 0.2719,0.9536 0.4989,1.7249 0.726,2.2927 0.2276,0.5899 0.409,1.2489 0.5451,1.9746 0.1139,0.7265 0.3637,1.3173 0.7265,1.794 0.341,0.4542 0.5224,1.0894 0.5224,1.8842 0,1.385 -0.6134,3.1105 -1.8618,5.1991 -0.091,0.0904 -0.1814,0.3401 -0.2497,0.7942 -0.091,0.4539 -0.5222,0.9536 -1.2943,1.567 -0.7943,0.5899 -1.3394,0.885 -1.7022,0.885 l -0.5224,-0.2497 c -0.091,-0.091 -0.3634,-0.2268 -0.8402,-0.4085 -0.4541,-0.1814 -0.7039,-0.5905 -0.7039,-1.2716 v -0.2498 l 0.1367,-1.4757 c 0,-0.3858 -0.5678,-0.9082 -1.7258,-1.5208 z m 75.6459,22.2483 1.044,0.9306 c 0.6583,0 1.0676,0.2954 1.1807,0.9088 0.1366,0.5899 0.6134,1.0667 1.4303,1.4295 0.8176,0.341 1.567,1.0676 2.2706,2.1569 0.7038,1.0902 1.4298,1.6345 2.179,1.6345 0.2727,0 0.5678,-0.2268 0.9309,-0.6582 0.3407,-0.4539 0.5221,-0.794 0.5221,-1.0667 0,-1.4757 -0.4538,-2.9744 -1.3391,-4.5179 l -0.2497,-1.8615 -0.4768,-0.8852 c -0.6582,-0.3408 -1.0902,-0.7266 -1.2946,-1.1129 -0.2041,-0.4085 -0.7265,-0.8853 -1.5661,-1.4752 l -0.6582,-0.9309 c -0.9763,-0.318 -1.6348,-0.8175 -1.9528,-1.5213 -0.3402,-0.7265 -0.7948,-1.1123 -1.4074,-1.2033 -0.5899,-0.091 -1.2489,-0.5225 -1.9528,-1.3391 -0.4538,-0.2044 -0.9754,-0.4085 -1.5891,-0.5908 l -0.1358,-0.6582 c -0.4541,-0.4541 -1.1576,-0.7948 -2.1112,-1.0666 -0.9309,-0.2727 -1.6574,-0.5225 -2.1115,-0.7722 -0.4768,-0.2497 -0.7949,-0.3637 -0.9763,-0.3637 -0.8405,0 -1.6118,0.1596 -2.3156,0.4998 -0.7036,0.3407 -1.4531,0.5448 -2.2023,0.6361 -0.25,0.2497 -0.4084,0.5442 -0.4541,0.8623 -0.0456,0.2953 -0.2727,0.7038 -0.6808,1.2262 -0.3858,0.4995 -0.5908,1.2033 -0.5908,2.0886 l 0.2724,1.2708 c 0,0.1596 -0.1131,0.3863 -0.3401,0.659 -0.2268,0.2498 -0.3408,0.4768 -0.3408,0.6582 0,0.1814 0.0457,0.3181 0.1367,0.4085 0.0904,0.0683 0.1358,0.2041 0.1358,0.3864 0,0.227 -0.0454,0.4759 -0.1358,0.7256 -0.091,0.2727 -0.1367,0.4998 -0.1367,0.6591 l 0.4085,3.2692 c 0,0.2724 -0.0904,0.3855 -0.2718,0.3855 -0.1593,0 -0.4995,-0.2041 -0.9536,-0.6582 -0.4768,-0.4538 -1.0219,-0.6582 -1.6345,-0.6582 -0.3636,-0.2724 -0.6363,-0.8405 -0.8631,-1.6801 -0.3631,-0.4312 -0.7943,-0.8405 -1.3394,-1.2033 l -0.2724,-0.3855 c -0.0913,-0.3184 -0.4085,-0.5681 -0.9992,-0.7722 -0.5672,-0.2044 -0.9763,-0.4541 -1.1806,-0.7721 l -0.6809,-0.6583 -1.2711,0.1358 c -0.0683,-0.0901 -0.318,-0.4768 -0.7265,-1.1576 -0.3863,-0.7039 -0.9079,-1.2708 -1.5213,-1.7022 l -5.0624,-4.1321 c -0.5451,-0.3631 -1.3173,-0.7951 -2.3383,-1.3394 l -0.4094,-0.3863 c -3.5416,-2.361 -6.0613,-3.5416 -7.5143,-3.5416 -1.2036,0 -2.611,0.3407 -4.2001,0.9989 -1.5888,0.6582 -2.4514,1.4533 -2.588,2.4069 l -0.6809,2.7238 c -0.3858,0.6134 -0.5899,1.476 -0.5899,2.588 0,0.5451 0.0448,0.8861 0.1358,1.0676 v 0.4084 l -0.1358,2.1796 c 0,0.5451 0.4311,0.8169 1.2708,0.8169 l -0.1358,1.7941 c 0,0.1814 0.3855,0.8623 1.1576,2.0885 0.7722,1.226 1.2938,1.9299 1.5662,2.1113 l 0.6582,0.8623 c -0.0448,0.5224 0.2727,1.0902 0.9309,1.703 0.6817,0.5905 1.2033,1.2033 1.6126,1.8159 0.4085,0.6361 1.1577,1.3173 2.27,2.0665 l 1.9973,1.9975 c 1.567,1.5662 3.27,2.7922 5.0859,3.7231 0.2727,0.091 0.817,0.5451 1.6348,1.3399 0.8166,0.7943 1.7702,1.3847 2.815,1.7705 1.0438,0.3629 2.0656,0.8396 3.0649,1.4304 0.9989,0.5669 1.7932,0.8623 2.3609,0.8623 h 0.5446 c 0.182,0 1.3626,0.5451 3.5416,1.6574 h 0.3863 c 0.1815,0 0.6129,-0.1814 1.2711,-0.5224 h 0.1366 l 1.0667,0.5224 c 0.182,0.091 0.409,0.1366 0.6809,0.1366 2.7476,0 4.2681,-1.9071 4.5408,-5.6985 0.091,-0.7948 0.3181,-1.2033 0.6582,-1.2033 0.4541,0 1.0902,0.817 1.9072,2.4293 0.8175,1.6118 2.5653,2.4288 5.2217,2.4288 1.9071,0 2.8607,-1.2255 2.8607,-3.6548 0,-2.8834 -1.2716,-5.6301 -3.837,-8.1955 -0.1814,-0.3637 -0.318,-0.7492 -0.4085,-1.2033 l -0.9309,-2.7247 v -0.136 c 0,-0.2497 -0.1814,-0.6353 -0.5677,-1.0894 -0.3858,-0.4768 -0.5673,-0.8861 -0.5673,-1.226 l 0.1361,-1.68 -0.2727,-1.8616 c 0,-0.8404 0.1596,-1.385 0.4768,-1.6574 1.4077,0.3629 2.4296,0.9536 3.0651,1.7705 0.6352,0.8176 1.0902,1.2717 1.3391,1.3627 l 0.659,0.2718 c 0.4085,0.6591 0.8623,1.2033 1.4074,1.6574 z m -22.0895,-0.0229 c 0.1587,0.9762 0.7038,1.7027 1.6118,2.2252 0.9079,0.4994 1.453,1.0218 1.6344,1.5661 0.8397,0.6134 2.043,1.7257 3.6094,3.3148 1.567,1.5897 2.3391,2.5654 2.3391,2.9288 0,0.1131 -0.0912,0.1817 -0.25,0.1817 h -0.1366 l -0.5451,-0.3183 -1.1803,0.1366 -1.2711,-0.1366 -0.9079,0.4541 -0.8632,-0.1358 -1.3394,0.2724 c -0.7038,0 -1.3164,-0.1366 -1.8158,-0.4312 -0.4998,-0.2953 -1.476,-0.6134 -2.9064,-0.9535 -1.453,-0.3637 -2.7468,-0.9763 -3.8818,-1.8389 -1.1576,-0.8631 -1.9981,-1.2943 -2.5205,-1.2943 -0.3172,-0.6582 -1.3391,-1.6117 -3.1096,-2.8607 -1.0676,-0.3401 -1.7484,-1.1123 -2.0665,-2.3156 -1.135,-0.9306 -1.7252,-1.453 -1.7252,-1.5888 l -0.4538,-1.135 c -0.3637,-0.3181 -0.7948,-0.5681 -1.3399,-0.7722 -0.5216,-0.1814 -0.8396,-0.6582 -0.9309,-1.3847 -0.0904,-0.7265 -0.3855,-1.3847 -0.8853,-1.9981 -0.5221,-0.5899 -0.7721,-1.0667 -0.7721,-1.4304 0,-2.1563 0.432,-3.2465 1.2719,-3.2465 0.3407,0 1.0893,0.227 2.2252,0.7038 1.135,0.4541 1.7702,0.7722 1.9516,0.9536 0.1817,0.1814 0.5224,0.3637 1.0675,0.5451 l 1.2481,0.6582 c 0.1823,0.1814 0.3867,0.2727 0.5908,0.318 0.227,0.0457 0.4541,0.2044 0.6809,0.4315 0.2043,0.2497 0.6128,0.5221 1.1806,0.8166 0.5899,0.2727 1.0219,0.6591 1.3394,1.158 0.7492,0.432 1.9525,1.1129 3.6326,2.0438 l 1.3847,1.0667 c 0.9765,0.4538 1.5664,0.8175 1.7935,1.1349 0.2267,0.3181 0.6582,0.6135 1.3399,0.9307 z m 57.1198,13.0317 1.8615,0.8623 c 0.6356,0.3863 1.2263,0.9762 1.8162,1.7257 l 2.3156,1.6571 c 1.3399,0.9083 2.2022,1.3394 2.6107,1.3394 l 1.0675,-0.3858 c 0.0905,0 0.3629,0.2727 0.8397,0.817 0.4541,0.5677 0.9992,0.8404 1.6347,0.8404 0.7948,0 1.8842,-0.5907 3.2689,-1.7932 1.385,-1.2033 2.0659,-2.2708 2.0659,-3.2014 l -0.2718,-2.2473 c 0,-0.3637 0.1814,-1.3621 0.5442,-2.9974 v -0.5216 l -0.2724,-1.6117 0.2724,-1.6572 -0.7492,-3.2471 c 0,-0.8396 0.2954,-1.271 0.8632,-1.271 0.7495,0.7038 1.4077,1.135 1.9298,1.271 l 0.9309,0.9307 c 0.3402,0.341 0.6126,0.5224 0.794,0.5224 0.1596,0 0.3866,0.227 0.6811,0.6355 0.2954,0.432 0.6591,0.7265 1.0903,0.9085 0.4311,0.1588 0.7491,0.4768 0.9308,0.9309 2.4514,2.7012 4.3586,4.2455 5.6756,4.6539 0.1817,0 0.4768,0.2271 0.8852,0.6582 0.4315,0.4539 0.7722,0.7039 1.0219,0.7949 l 1.4525,1.135 0.5907,-0.2727 h 0.1358 c 0.091,0 0.4541,0.227 1.0675,0.6811 0.6126,0.4312 1.0438,0.6582 1.3165,0.6582 1.68,0 3.0421,-0.5672 4.1323,-1.7022 1.0667,-1.1355 1.6118,-1.9981 1.6118,-2.6336 l -0.3181,-1.5214 0.4539,-2.0656 v -1.3394 l -0.3402,-1.4074 c 0,-0.25 0.2044,-0.6363 0.5672,-1.135 0.3864,-0.4767 0.5678,-0.8177 0.5678,-0.9992 -0.5221,-0.5677 -0.7948,-0.9535 -0.7948,-1.1123 l 0.1366,-1.2033 -0.3407,-3.6782 c 0,-0.2945 0.2953,-0.817 0.8623,-1.5205 0.2727,0.1814 0.659,0.3398 1.1358,0.4538 0.4989,0.1361 0.8623,0.2954 1.135,0.4541 0.2727,0.1358 0.4085,0.2271 0.4085,0.2497 0,0.0227 -0.0227,0.0457 -0.0683,0.0457 0.0909,0 0.3636,-0.0913 0.7948,-0.2727 h 0.2727 c 0.3628,0 0.5442,0.3401 0.5899,1.044 0.0453,0.6809 0.4994,1.2489 1.3391,1.7028 l 1.6126,-0.1358 c 0.0901,0.0901 0.2718,0.4538 0.5669,1.0893 0.2727,0.6582 1.2263,1.6118 2.7924,2.8834 1.59,1.2708 2.7924,1.9072 3.6329,1.9072 0.7265,0 1.0667,-0.3181 1.0667,-0.9309 0,-0.1823 -0.0904,-0.6588 -0.2719,-1.4074 0.3629,-0.6134 0.5443,-1.158 0.5443,-1.5897 0,-0.8399 -0.7265,-1.7705 -2.1569,-2.7468 -1.4522,-0.9765 -2.5424,-2.2025 -3.2919,-3.6549 l -0.2718,-0.2725 -1.317,0.1358 c -0.0904,0 -0.3183,-0.3401 -0.6355,-1.0437 -0.341,-0.6817 -0.7265,-1.0675 -1.1806,-1.1579 -0.4312,-0.091 -0.7492,-0.2277 -0.9306,-0.4091 l -1.3851,-0.8626 c -0.2724,-0.1814 -1.1349,-1.0672 -2.6336,-2.702 -1.4757,-1.6117 -2.7247,-2.4284 -3.7457,-2.4284 -0.4541,0 -1.249,0.2268 -2.4069,0.7036 -1.1577,0.4541 -1.9299,0.9309 -2.3154,1.4303 -0.4084,0.4768 -0.9765,1.044 -1.703,1.6574 -0.7265,0.6356 -1.0894,1.8159 -1.0894,3.5417 0,0.0904 0.1131,0.2497 0.3629,0.4541 0.2497,0.2267 0.3636,0.4082 0.3636,0.5442 -1.0218,1.34 -1.5443,2.2935 -1.5443,2.8607 0,0.2724 0.0457,0.5678 0.1369,0.8623 0.0902,0.3181 0.1358,0.6135 0.1358,0.8632 l -0.1358,2.3383 0.2716,1.2033 -0.1358,0.7265 0.4085,3.405 c 0,0.5224 -0.3175,0.7951 -0.9309,0.7951 -0.1814,0 -0.4311,-0.1817 -0.7265,-0.5224 -0.3172,-0.3629 -0.7039,-0.6355 -1.1577,-0.8396 -0.4768,-0.205 -0.9765,-0.8405 -1.4981,-1.9072 -0.7948,-0.4311 -1.3399,-0.8631 -1.6345,-1.2946 -0.2724,-0.4082 -0.4994,-0.6125 -0.6808,-0.6125 -0.0913,0 -0.2727,0.0226 -0.5451,0.1131 -0.5225,-0.3402 -0.7949,-0.7487 -0.7949,-1.1804 v -0.2718 l 0.1367,-0.5224 c 0,-0.4094 -0.3184,-0.7949 -0.9993,-1.135 -0.6582,-0.3637 -1.476,-1.2717 -2.4522,-2.7247 -0.4312,0 -0.7492,-0.0456 -0.9306,-0.1361 l -0.7943,-1.6117 c -0.432,-0.2498 -0.8631,-0.7266 -1.2489,-1.3853 l -0.7949,-0.4085 c -0.3172,-0.5672 -0.6125,-1.0667 -0.9309,-1.4533 l -0.3855,-0.7484 c -1.9071,-2.2481 -3.2462,-3.3831 -3.9957,-3.3831 -0.7492,0 -1.6574,0.9992 -2.702,2.9965 -1.0667,1.9984 -1.6118,3.5419 -1.6118,4.6539 l 0.2727,2.4522 c 0,0.091 -0.1817,0.4542 -0.5224,1.0667 v 0.2724 c 0,0.0913 0.1823,0.5908 0.5224,1.5217 v 1.9973 c 0,0.0912 -0.0456,0.227 -0.136,0.4093 v 0.3172 c 0,0.0913 0.1814,0.4541 0.5442,1.0675 l -0.4082,1.9298 0.2724,1.0667 -0.1357,2.3383 0.2715,2.0659 c 0,0.1137 -0.1358,0.3637 -0.3628,0.6809 -0.2497,0.341 -0.4312,0.4995 -0.5222,0.4995 -0.2953,0 -1.2262,-0.4995 -2.7697,-1.5206 -1.5213,-1.0218 -2.5653,-1.8167 -3.1104,-2.4066 -0.5222,-0.568 -1.249,-1.2489 -2.134,-2.0432 -0.9309,-0.4538 -1.5664,-1.5896 -1.9301,-3.4055 0,-0.0913 -0.0901,-0.1361 -0.2718,-0.1361 0,0.0904 -0.1366,0.1814 -0.4091,0.2727 h -0.2497 c -0.227,0 -0.9309,-0.9536 -2.0886,-2.8607 l -0.2497,-0.2724 -1.271,0.2724 c -1.0676,0 -1.6118,-1.135 -1.6118,-3.3829 0,-0.4085 -0.2724,-0.6811 -0.8405,-0.8169 -0.5451,-0.114 -0.9989,-0.4995 -1.2937,-1.1129 -0.3181,-0.6355 -0.7492,-1.2711 -1.2717,-1.9298 -1.0218,-0.4541 -1.5888,-0.7716 -1.7254,-0.9984 0,-0.0456 -0.4768,-0.7265 -1.4525,-1.9984 -0.9762,-1.2935 -1.4986,-2.043 -1.5896,-2.27 -0.0905,-0.2268 -0.3858,-0.4765 -0.8853,-0.7492 -0.5224,-0.2954 -0.7722,-0.5451 -0.7722,-0.7722 l 0.2041,-1.135 c 0,-0.7035 -0.6808,-1.0666 -2.0429,-1.0666 -2.6563,0 -3.9957,2.7697 -3.9957,8.3086 0,0.6134 0.2954,1.3173 0.8405,2.0886 0.5442,0.7721 1.0896,1.7257 1.6347,2.8377 0.8396,0.8405 1.8386,2.0438 2.9965,3.6556 1.135,1.5891 1.9973,2.6784 2.588,3.2462 l 0.8626,1.385 c 0,0.5451 0.1137,0.9306 0.3407,1.2033 0.2044,0.2724 0.3175,0.5905 0.3175,0.999 0,0.7038 -0.1814,1.0666 -0.5215,1.0666 -0.8405,0 -1.5217,-0.204 -1.9985,-0.6352 -0.4994,-0.4085 -1.0437,-0.7268 -1.6344,-0.8853 -0.5899,-0.1814 -0.9763,-0.4997 -1.1577,-0.9309 -0.6355,-0.2724 -1.2716,-0.8404 -1.9755,-1.7027 -0.6811,-0.8626 -1.135,-1.4077 -1.362,-1.6348 -0.2271,-0.2041 -0.4541,-0.5221 -0.6355,-0.8849 -0.2041,-0.3867 -0.4768,-0.5908 -0.7722,-0.6364 -0.318,-0.0448 -0.6126,-0.2041 -0.8853,-0.4538 -0.2724,-0.2727 -0.6808,-0.4085 -1.2716,-0.4085 -0.4085,0 -0.7713,0.4085 -1.112,1.226 -0.341,0.8169 -0.4998,1.3164 -0.4998,1.4978 0,3.2471 2.1569,6.0395 6.4707,8.3778 0.5899,0.318 1.044,0.6126 1.362,0.9309 0.3402,0.318 0.6812,0.5448 1.044,0.7265 l 0.2724,0.4768 c 0.3411,0.5221 1.6801,1.2708 3.9958,2.247 h 0.9309 l 4.4725,1.135 c 1.9068,0.4541 2.8834,-1.7019 2.8834,-6.4471 l -0.1361,-1.2033 0.2497,-0.5222 c 0.7716,0.7036 1.5435,1.3391 2.3157,1.8842 0.7713,0.5681 1.3393,1.0446 1.7022,1.4987 0.341,0.4541 1.0445,0.8853 2.0664,1.3394 z m 86.9057,26.1076 -0.4085,2.5881 v 0.4084 c 0,2.0668 0.7039,3.2244 2.1342,3.4515 0.2946,0.0448 1.2481,0.3402 2.7925,0.8623 0.7939,-0.1814 1.6344,-0.8853 2.497,-2.0886 0.8631,-1.226 1.2943,-2.2926 1.2943,-3.2235 0,-0.091 -0.0683,-0.2951 -0.2041,-0.5905 -0.1366,-0.318 -0.2271,-0.9079 -0.2727,-1.7705 -0.0227,-0.8632 -0.4768,-1.6126 -1.2943,-2.2708 -0.8169,-0.6353 -1.6801,-0.9536 -2.611,-0.9536 -0.6355,0 -1.4077,0.432 -2.3839,1.2946 -0.9536,0.8623 -1.4522,1.6344 -1.5435,2.2926 z m -28.7419,-33.2813 1.0676,0.9307 h 0.4084 c 0.3181,0 0.7722,0.3401 1.4077,0.9983 l 0.6582,0.2727 c 0.908,1.317 1.6801,2.0883 2.361,2.3153 l 1.0675,0.7949 c 0.1814,0.1817 0.4312,0.341 0.7713,0.4768 0.341,0.136 0.8632,0.568 1.6118,1.2937 0.7265,0.7265 1.3399,1.0902 1.7711,1.0902 0.4541,0 0.8169,-0.0456 1.0896,-0.1366 0.2498,0.5451 0.7949,1.0675 1.5889,1.567 0.8177,0.5224 1.476,1.135 1.9527,1.8388 l 0.8853,0.3855 c 0.7038,0.3637 1.3399,0.8178 1.9071,1.3621 0.5452,0.5677 1.2717,0.8404 2.1796,0.8404 1.2946,0 2.6337,-0.6582 4.0414,-1.9528 1.3847,-1.3164 2.0885,-2.565 2.0885,-3.7683 l -1.135,-5.1991 c -0.7494,-3.8134 -1.5891,-5.8115 -2.52,-5.993 l -0.2724,-1.385 c -0.6134,-0.4538 -0.9309,-0.8175 -0.9309,-1.0672 l 0.4085,-1.6118 c 0,-0.2044 -0.2497,-0.5451 -0.7265,-0.9992 -0.091,0 -0.1358,-0.1358 -0.1358,-0.3855 v -2.7241 c 0,-0.4995 -0.3183,-0.9088 -0.9309,-1.2033 0.0904,-0.091 0.2271,-0.1823 0.3858,-0.2724 0.2724,0.2724 0.8623,0.4082 1.7932,0.4082 l 1.0672,-0.1358 1.4534,1.453 c 0.2945,0.0904 0.7256,0.2945 1.2707,0.6355 0.5451,0.3402 1.476,0.7722 2.7924,1.2938 l 8.6276,6.6747 c 1.1806,1.2033 2.0885,1.7932 2.7011,1.7932 0.6582,0 0.9765,-0.4311 0.9765,-1.2708 0,-0.9765 -0.1814,-1.7713 -0.568,-2.4295 -0.3629,-0.6356 -0.7265,-1.4074 -1.0211,-2.3154 -0.318,-0.9082 -0.6808,-1.5443 -1.0902,-1.8844 -0.4311,-0.3637 -0.7713,-0.7492 -1.044,-1.1807 -0.2497,-0.4084 -0.9762,-1.0219 -2.1568,-1.8158 -1.1577,-0.7949 -2.1569,-1.6127 -2.9739,-2.4293 -0.8175,-0.8178 -1.4987,-1.4077 -2.0438,-1.7714 l -2.8377,-2.0429 -0.4085,-0.6809 c -0.091,-0.0913 -0.4995,-0.2727 -1.226,-0.5681 -0.7265,-0.2718 -1.385,-0.6352 -1.9519,-1.0893 l -1.2033,-0.6582 c -0.2498,-0.1815 -0.7039,-0.2954 -1.2946,-0.3411 -0.5899,-0.0447 -1.112,-0.2945 -1.5661,-0.7713 -0.4312,-0.4538 -0.7949,-0.6808 -1.0446,-0.6808 l -0.9984,0.1357 -1.3402,-0.4084 c -0.7492,0 -1.6571,0.4541 -2.7468,1.362 -1.0893,0.908 -1.6344,1.8845 -1.6344,2.9061 v 0.3858 l 0.1358,0.9309 c 0,0.1814 -0.1358,0.6352 -0.4082,1.3618 -0.25,0.7494 -0.3858,1.1579 -0.3858,1.2489 l 0.1358,0.9309 -0.1358,0.3855 c 0,1.2033 0.0904,1.9528 0.2724,2.2708 0.1587,0.3172 0.2948,0.7487 0.3858,1.2938 0.091,0.5678 0.1814,1.0219 0.2727,1.3617 l 0.3172,1.6801 c 0.1822,0.5225 0.4093,0.8853 0.6809,1.0449 0.0912,0.3628 0.25,0.9536 0.5224,1.8159 l 0.2727,1.1806 0.6582,0.9306 c 0.3637,0.3631 0.5678,0.8399 0.6361,1.4304 0.0674,0.6128 0.2945,1.2489 0.7038,1.9071 0.3855,0.6582 0.5899,1.0667 0.5899,1.2033 0,0.5224 -0.2497,0.7943 -0.7948,0.7943 -0.1815,0 -0.726,-0.3631 -1.6566,-1.0667 l -1.2033,0.4082 c -0.0913,0 -0.341,-0.2268 -0.7265,-0.6809 0,-0.1814 -0.2044,-0.2954 -0.6137,-0.3855 -0.4082,-0.0913 -0.7713,-0.4314 -1.135,-0.9992 l -0.5222,-0.1358 -0.8852,0.3855 h -0.2498 c -0.4541,0 -0.7265,-0.4768 -0.8169,-1.453 -0.4768,-0.7265 -1.1132,-1.1806 -1.9298,-1.4077 l -1.4533,-0.3855 c -0.4995,-0.1823 -0.8397,-0.5908 -1.0667,-1.2033 -0.2268,-0.6364 -0.6818,-1.2033 -1.34,-1.7031 -0.6582,-0.5221 -1.112,-0.7718 -1.339,-0.7718 -1.249,0 -1.8616,0.6808 -1.8616,2.0664 l 0.5451,3.1096 z"
           style="fill:#200006;fill-opacity:1;fill-rule:nonzero;stroke:none"
           id="path22"
           inkscape:connector-curvature="0" /><path
           d="m 309.4347,554.1474 v 0.4768 c 0,0.6134 0.0454,1.0902 0.1358,1.4531 -0.2718,0.7038 -0.4085,1.362 -0.4085,1.9298 0,0.0913 0.2271,0.7038 0.6809,1.8615 l 0.5908,2.0659 c 0.3174,0.7948 0.4768,1.226 0.5224,1.2716 -0.2497,0.7039 -0.3864,1.0894 -0.3864,1.1806 0,1.0211 0.2724,1.8616 0.8632,2.5424 0.5669,0.6582 1.0437,1.5891 1.4522,2.7924 l 1.3172,4.0411 2.2017,5.3348 c 0.0456,0.1366 0.2497,0.4768 0.6134,1.0675 0.3858,0.5673 0.7039,1.0667 0.9309,1.4752 0.2497,0.432 0.5899,1.0446 1.044,1.8394 l 0.6588,0.1361 c 0.1814,0.1814 0.2718,0.3407 0.2718,0.5221 0,0.0904 -0.0904,0.4541 -0.2718,1.0667 l 2.3383,3.8599 1.385,2.8605 c 0.4538,0.7494 0.9306,1.2481 1.4751,1.4751 0.8859,1.6353 1.6572,2.6337 2.3162,2.9747 0.2719,0.8396 0.7487,1.7702 1.4752,2.7465 l 1.2489,0.1139 c 0.2268,0.6356 0.4539,1.0897 0.6582,1.4077 l 0.1367,1.3164 c 0,-0.2497 0.1131,-0.1814 0.3401,0.2498 0.2271,0.4084 0.5451,1.2033 0.9989,2.3609 l 1.7932,2.0659 0.5225,0.9306 c 0.227,0.2954 0.5907,0.9083 1.0675,1.7941 0.6809,0.2497 1.2254,0.7486 1.6792,1.4525 l 1.3856,1.1355 c -0.091,0.4768 0.4541,1.5664 1.5891,3.2465 0.7722,0.3181 1.4531,0.7265 2.0656,1.2033 l 0.9309,0.2724 c 0,1.5435 0.5678,2.6102 1.6574,3.2009 l 0.8176,0.5222 c 0.7038,0.3631 1.0896,0.5224 1.1806,0.5224 l 0.4768,0.1358 c 0.5215,0.1817 1.1576,0.2727 1.8615,0.2727 1.6344,0 3.1325,-0.6135 4.4498,-1.8389 1.3391,-1.2033 1.9973,-2.588 1.9973,-4.155 0,-0.6126 -0.3402,-1.2481 -0.9992,-1.9298 l -0.2716,-0.5216 c -0.6134,-2.4296 -1.0448,-3.6556 -1.3172,-3.6556 -0.1814,0 -0.4312,-0.1357 -0.7266,-0.4084 -0.0904,-1.4531 -0.1814,-2.27 -0.2726,-2.4523 -0.794,-0.1358 -1.2025,-1.135 -1.2025,-2.9965 -0.0913,-0.2724 -0.4093,-0.7265 -0.9536,-1.3617 -0.568,-0.6356 -0.9992,-1.5217 -1.2946,-2.6567 -0.318,-1.135 -0.6582,-1.7027 -0.9989,-1.7027 h -0.7486 l 0.2041,-0.9984 c 0,-0.6134 -0.2951,-1.226 -0.8859,-1.8167 -0.6128,-0.6126 -0.9756,-1.2254 -1.1123,-1.9063 -0.1357,-0.6591 -0.6582,-1.4531 -1.5891,-2.384 l -0.6582,-1.0675 c -0.2724,-0.4538 -0.6361,-0.9079 -1.0672,-1.4074 -0.4541,-0.4768 -0.817,-1.226 -1.135,-2.2473 l -1.7257,-3.2015 c -1.2028,-2.1787 -2.1113,-3.2006 -2.7241,-3.1096 -0.4085,-1.7484 -0.6809,-2.7476 -0.7949,-2.9973 -0.1357,-0.2724 -0.4541,-0.5216 -0.9309,-0.7492 -0.4994,-0.2044 -0.8849,-0.5899 -1.135,-1.158 -0.2724,-0.5442 -0.5669,-0.9535 -0.8623,-1.2251 l -1.2033,-2.4522 c -0.7038,-0.3181 -1.2262,-0.8853 -1.5434,-1.7258 -0.7039,-0.1814 -1.1359,-0.794 -1.3173,-1.8159 -0.1814,-0.1587 -0.4085,-0.5672 -0.6582,-1.1806 l -2.3383,-2.3383 c -1.2033,-0.8396 -1.8388,-1.7932 -1.9298,-2.8834 -0.0913,-1.0893 -0.6585,-1.6344 -1.7258,-1.6344 -0.7486,0 -1.8615,0.3407 -3.3366,0.9989 h -0.114 c -0.1357,-0.6126 -0.4541,-1.3164 -0.9309,-2.0656 l 0.2501,-1.7941 c 0,-0.227 -0.3411,-1.6117 -1.0676,-4.1998 0.3637,-0.6582 0.5451,-1.1123 0.5451,-1.3847 l -0.136,-1.453 0.3401,-1.8162 c 0.2044,-1.453 0.7495,-2.1796 1.59,-2.1796 l 1.5888,-0.2727 c 0.0904,0 0.6355,0.3411 1.6574,0.9993 l 2.4514,1.3399 c 0.0913,0 0.1366,-0.0456 0.1366,-0.1366 0.4542,-0.1814 0.7943,-0.2724 1.0667,-0.2724 0.4315,0 0.6582,0.3634 0.6582,1.0672 v 0.8626 c 0.2727,0.4311 0.5908,0.7035 0.9536,0.7948 0.3866,0.0904 0.7265,0.2945 1.0448,0.5899 0.2954,0.3181 0.5451,0.4768 0.7266,0.4768 h 0.6582 c 0.6582,0 0.9992,0.7722 0.9992,2.3153 0.1814,0.0913 0.4082,0.2727 0.6582,0.5451 h 0.7948 c 0.3629,0 0.7487,0.4315 1.1577,1.2938 0.4311,0.8631 0.7265,1.3855 0.9079,1.567 0.7943,0.0904 1.3394,0.227 1.6574,0.3858 1.4077,2.588 2.4971,3.8596 3.2463,3.8596 h 0.4085 c 0.7494,0.7265 1.1579,1.3391 1.2262,1.9072 0.0683,0.5442 0.2724,0.9079 0.6582,1.0893 0.3637,0.1814 0.7265,0.4085 1.0219,0.6582 0.3181,0.2727 0.5224,0.4093 0.6126,0.4093 0.6582,0 0.9765,-0.2497 0.9765,-0.7265 l -0.1817,-1.8615 0.4541,-1.9984 c 0,-0.1814 -0.1814,-0.5222 -0.5677,-1.0446 -0.3632,-0.4989 -0.5673,-1.0667 -0.5673,-1.6792 0,-1.2946 -0.2041,-1.9755 -0.6582,-2.0665 -0.432,-0.0904 -0.7948,-0.3858 -1.0902,-0.9082 -0.2953,-0.4995 -0.7713,-0.9763 -1.4303,-1.3847 -0.6582,-0.4312 -1.1807,-1.0437 -1.5208,-1.8389 l -1.135,-0.2724 -0.6588,-0.3858 c -0.5216,-1.3847 -1.0896,-2.2252 -1.6795,-2.5424 -0.6134,-0.2953 -1.3399,-1.2262 -2.2252,-2.7929 -0.1358,0 -0.2041,-0.0448 -0.2041,-0.1361 l -1.0675,0.1361 c -0.3858,-0.7039 -0.794,-1.1124 -1.1807,-1.2484 -0.4084,-0.1366 -0.7486,-0.3864 -0.9983,-0.7719 -0.2724,-0.3858 -0.7492,-0.7038 -1.4304,-0.9765 -0.6809,-0.2498 -1.1129,-0.567 -1.2943,-0.9306 -0.1814,-0.3402 -0.4541,-0.5451 -0.7943,-0.5899 -0.3634,-0.0457 -0.6808,-0.205 -0.9989,-0.4995 -0.318,-0.2954 -0.568,-0.4314 -0.7948,-0.4314 -0.0904,0 -0.4085,0.0448 -0.9309,0.136 h -0.2724 c -0.7487,-0.5451 -1.3621,-0.7948 -1.8389,-0.7948 -0.5898,0 -0.9992,-0.0904 -1.271,-0.2718 -0.2724,0.1814 -0.6817,0.3172 -1.226,0.4084 -0.5451,0.0675 -1.1806,0.2954 -1.8845,0.6582 -0.7492,-0.1814 -1.226,-0.2727 -1.4074,-0.2727 -0.7495,0 -1.703,0.7495 -2.838,2.2252 -1.1577,1.4979 -1.7255,2.9512 -1.7255,4.3586 0,0.0456 -0.25,0.3864 -0.7721,1.0446 -0.4989,0.6355 -0.7713,1.3393 -0.7713,2.0885 v 0.6582 l 0.1357,0.7951 v 1.2708 l 0.1367,0.4093 c 0.6582,0.0902 0.9983,0.1585 0.9983,0.2489 z m 13.4856,17.6171 1.3847,0.7948 c 0.1814,0.7265 0.7722,1.5661 1.7479,2.5654 0.9762,0.9992 1.6571,1.4986 2.0437,1.4986 h 0.5443 c 0,0.3172 0.0683,0.6126 0.2049,0.9307 0.1131,0.3183 0.1814,0.7268 0.1814,1.271 0,0.2497 0.6129,0.9989 1.8162,2.1796 l 0.5221,1.2033 c 0.4085,1.1579 1.3848,2.1112 2.9965,2.8607 0.6129,1.2716 1.0897,1.9298 1.3851,1.9298 l 0.5451,0.1131 c 0.1814,0.6809 0.5221,1.2716 1.0666,1.7941 l 0.2498,0.4084 v 1.0667 c 0,0.091 0.318,0.4539 0.9079,1.0902 0.5907,0.6353 1.0219,1.2481 1.2946,1.7932 0.2724,0.5678 0.6352,0.999 1.0893,1.2943 0.4768,0.3175 0.7949,0.8626 0.9763,1.6574 l 1.0675,0.1358 c 0,0.5899 0.0448,0.9536 0.1358,1.135 l 0.1361,0.6582 c 0.2049,0.5451 0.9762,1.9298 2.3162,4.1998 l 1.0666,2.4523 c 0,0.2727 0.1814,0.5907 0.5681,0.9536 0.3628,0.3858 0.5669,0.9309 0.5669,1.6344 l 0.5224,2.2025 c 0,1.0211 -0.1814,1.5208 -0.5224,1.5208 -0.4538,-0.3175 -0.8623,-0.5224 -1.2481,-0.6585 -0.3637,-0.1357 -0.7265,-0.9306 -1.0902,-2.4066 -1.3164,-0.2945 -2.0885,-0.9306 -2.2926,-1.8842 -0.2044,-0.9535 -0.7495,-1.7705 -1.6348,-2.4287 l -0.4538,-0.7948 c -0.0913,-0.4768 -0.5224,-0.9992 -1.2716,-1.5214 -0.7495,-0.5442 -1.4534,-1.4525 -2.1342,-2.7241 -2.2017,-3.0648 -3.428,-4.6993 -3.6547,-4.9263 l -0.6585,-0.7948 -0.999,0.1366 c 0.1815,-0.7039 0.2725,-1.1129 0.2725,-1.2033 0,-0.2727 -0.1367,-0.5224 -0.4091,-0.7722 -0.2718,-0.227 -0.4541,-0.5224 -0.5899,-0.8852 -0.136,-0.3637 -0.4085,-0.7722 -0.7948,-1.226 -0.4085,-0.4768 -0.7716,-1.2263 -1.1123,-2.27 -0.3181,-1.0219 -0.6356,-1.6345 -0.8853,-1.8167 l -0.9309,0.1366 c -0.5904,-0.3637 -0.8631,-0.7265 -0.8631,-1.0675 l 0.1822,-0.9306 c 0,-0.1815 -0.1139,-0.3858 -0.3637,-0.6356 -0.227,-0.2497 -0.4767,-0.7265 -0.6808,-1.4303 -0.2271,-0.7039 -0.7952,-1.7706 -1.6801,-3.2236 -0.8853,-1.4304 -1.5891,-2.9735 -2.0886,-4.5862 -0.4997,-1.6117 -0.9992,-2.6328 -1.4987,-3.0869 0.091,-0.091 0.2276,-0.1366 0.4091,-0.1366 0.5672,0 1.1123,0.6125 1.6574,1.7932 z m 44.5195,22.907 -0.4085,2.5881 v 0.4084 c 0,2.0668 0.7039,3.2244 2.1342,3.4515 0.2946,0.0448 1.2481,0.3402 2.7922,0.8623 0.7942,-0.1814 1.6347,-0.8853 2.497,-2.0886 0.8634,-1.226 1.2946,-2.2926 1.2946,-3.2235 0,-0.091 -0.0683,-0.2951 -0.2044,-0.5905 -0.1366,-0.318 -0.2268,-0.9079 -0.2724,-1.7705 -0.023,-0.8632 -0.4768,-1.6126 -1.2946,-2.2708 -0.8166,-0.6353 -1.6801,-0.9536 -2.6107,-0.9536 -0.6355,0 -1.4077,0.432 -2.3839,1.2946 -0.9536,0.8623 -1.4525,1.6344 -1.5435,2.2926 z m -28.7419,-33.2813 1.0675,0.9307 h 0.4085 c 0.3181,0 0.7722,0.3401 1.4074,0.9983 l 0.6582,0.2727 c 0.9082,1.317 1.6801,2.0883 2.3613,2.3153 l 1.0675,0.7949 c 0.1814,0.1817 0.4312,0.341 0.7713,0.4768 0.3407,0.136 0.8632,0.568 1.6118,1.2937 0.7265,0.7265 1.3399,1.0902 1.7711,1.0902 0.4541,0 0.8169,-0.0456 1.0896,-0.1366 0.2498,0.5451 0.7949,1.0675 1.5888,1.567 0.8178,0.5224 1.476,1.135 1.9528,1.8388 l 0.8853,0.3855 c 0.7036,0.3637 1.3399,0.8178 1.9071,1.3621 0.5451,0.5677 1.2717,0.8404 2.1796,0.8404 1.2943,0 2.6337,-0.6582 4.0411,-1.9528 1.385,-1.3164 2.0885,-2.565 2.0885,-3.7683 l -1.135,-5.1991 c -0.7492,-3.8134 -1.5888,-5.8115 -2.5197,-5.993 l -0.2724,-1.385 c -0.6134,-0.4538 -0.9309,-0.8175 -0.9309,-1.0672 l 0.4085,-1.6118 c 0,-0.2044 -0.2497,-0.5451 -0.7265,-0.9992 -0.0913,0 -0.1361,-0.1358 -0.1361,-0.3855 v -2.7241 c 0,-0.4995 -0.318,-0.9088 -0.9306,-1.2033 0.0904,-0.091 0.2271,-0.1823 0.3855,-0.2724 0.2727,0.2724 0.8626,0.4082 1.7935,0.4082 l 1.0672,-0.1358 1.4531,1.453 c 0.2948,0.0904 0.7259,0.2945 1.271,0.6355 0.5451,0.3402 1.4757,0.7722 2.7924,1.2938 l 8.6276,6.6747 c 1.1803,1.2033 2.0885,1.7932 2.7011,1.7932 0.6582,0 0.9763,-0.4311 0.9763,-1.2708 0,-0.9765 -0.1815,-1.7713 -0.5678,-2.4295 -0.3629,-0.6356 -0.7265,-1.4074 -1.0211,-2.3154 -0.318,-0.9082 -0.6811,-1.5443 -1.0902,-1.8844 -0.4314,-0.3637 -0.7713,-0.7492 -1.044,-1.1807 -0.2497,-0.4084 -0.9762,-1.0219 -2.1569,-1.8158 -1.1576,-0.7949 -2.1568,-1.6127 -2.9738,-2.4293 -0.8175,-0.8178 -1.4987,-1.4077 -2.0438,-1.7714 l -2.8377,-2.0429 -0.4085,-0.6809 c -0.0913,-0.0913 -0.4995,-0.2727 -1.2263,-0.5681 -0.7265,-0.2718 -1.3847,-0.6352 -1.9516,-1.0893 l -1.2036,-0.6582 c -0.2497,-0.1815 -0.7036,-0.2954 -1.2943,-0.3411 -0.5899,-0.0447 -1.1123,-0.2945 -1.5661,-0.7713 -0.4315,-0.4538 -0.7952,-0.6808 -1.0449,-0.6808 l -0.9984,0.1357 -1.3399,-0.4084 c -0.7492,0 -1.6574,0.4541 -2.7468,1.362 -1.0893,0.908 -1.6344,1.8845 -1.6344,2.9061 v 0.3858 l 0.1358,0.9309 c 0,0.1814 -0.1358,0.6352 -0.4085,1.3618 -0.2498,0.7494 -0.3855,1.1579 -0.3855,1.2489 l 0.1357,0.9309 -0.1357,0.3855 c 0,1.2033 0.0901,1.9528 0.2724,2.2708 0.1587,0.3172 0.2945,0.7487 0.3858,1.2938 0.091,0.5678 0.1814,1.0219 0.2724,1.3617 l 0.3175,1.6801 c 0.1822,0.5225 0.409,0.8853 0.6808,1.0449 0.0913,0.3628 0.2498,0.9536 0.5225,1.8159 l 0.2724,1.1806 0.6582,0.9306 c 0.3637,0.3631 0.568,0.8399 0.6364,1.4304 0.0674,0.6128 0.2945,1.2489 0.7038,1.9071 0.3855,0.6582 0.5899,1.0667 0.5899,1.2033 0,0.5224 -0.2497,0.7943 -0.7951,0.7943 -0.1814,0 -0.7257,-0.3631 -1.6566,-1.0667 l -1.2033,0.4082 c -0.091,0 -0.3407,-0.2268 -0.7265,-0.6809 0,-0.1814 -0.2041,-0.2954 -0.6134,-0.3855 -0.4085,-0.0913 -0.7713,-0.4314 -1.135,-0.9992 l -0.5225,-0.1358 -0.8849,0.3855 h -0.25 c -0.4539,0 -0.7266,-0.4768 -0.8167,-1.453 -0.4768,-0.7265 -1.1132,-1.1806 -1.9301,-1.4077 l -1.4531,-0.3855 c -0.4994,-0.1823 -0.8396,-0.5908 -1.0666,-1.2033 -0.2271,-0.6364 -0.6818,-1.2033 -1.34,-1.7031 -0.6582,-0.5221 -1.1123,-0.7718 -1.3393,-0.7718 -1.2487,0 -1.8616,0.6808 -1.8616,2.0664 l 0.5452,3.1096 z m 91.9012,-5.8351 1.044,0.9306 c 0.6582,0 1.0675,0.2954 1.1806,0.9088 0.1367,0.5899 0.6135,1.0667 1.4304,1.4295 0.8175,0.341 1.567,1.0676 2.2706,2.1569 0.7038,1.0902 1.4298,1.6345 2.179,1.6345 0.2726,0 0.5677,-0.2268 0.9309,-0.6582 0.3407,-0.4539 0.5221,-0.794 0.5221,-1.0667 0,-1.4757 -0.4538,-2.9744 -1.3391,-4.5179 l -0.2497,-1.8615 -0.4768,-0.8852 c -0.6582,-0.3408 -1.0902,-0.7266 -1.2946,-1.1129 -0.2041,-0.4085 -0.7265,-0.8853 -1.5661,-1.4752 l -0.6582,-0.9309 c -0.9766,-0.318 -1.6348,-0.8175 -1.9528,-1.5213 -0.3402,-0.7265 -0.7949,-1.1123 -1.4074,-1.2033 -0.5899,-0.091 -1.249,-0.5225 -1.9528,-1.3391 -0.4541,-0.2044 -0.9757,-0.4085 -1.5891,-0.5908 l -0.1358,-0.6582 c -0.4541,-0.4541 -1.1577,-0.7948 -2.1112,-1.0666 -0.9309,-0.2727 -1.6575,-0.5225 -2.1116,-0.7722 -0.4768,-0.2497 -0.7948,-0.3637 -0.9762,-0.3637 -0.8405,0 -1.6118,0.1596 -2.3156,0.4998 -0.7039,0.3407 -1.4531,0.5448 -2.2023,0.6361 -0.25,0.2497 -0.4085,0.5442 -0.4541,0.8623 -0.0456,0.2953 -0.2727,0.7038 -0.6809,1.2262 -0.3858,0.4995 -0.5907,1.2033 -0.5907,2.0886 l 0.2724,1.2708 c 0,0.1596 -0.1131,0.3863 -0.3402,0.659 -0.2267,0.2498 -0.3407,0.4768 -0.3407,0.6582 0,0.1814 0.0457,0.3181 0.1366,0.4085 0.0905,0.0683 0.1358,0.2041 0.1358,0.3864 0,0.227 -0.0453,0.4759 -0.1358,0.7256 -0.0909,0.2727 -0.1366,0.4998 -0.1366,0.6591 l 0.4085,3.2692 c 0,0.2724 -0.0904,0.3855 -0.2719,0.3855 -0.1593,0 -0.4994,-0.2041 -0.9535,-0.6582 -0.4768,-0.4538 -1.0219,-0.6582 -1.6345,-0.6582 -0.3637,-0.2724 -0.6364,-0.8405 -0.8634,-1.6801 -0.3629,-0.4312 -0.794,-0.8405 -1.3391,-1.2033 l -0.2727,-0.3855 c -0.091,-0.3184 -0.4082,-0.5681 -0.9989,-0.7722 -0.5672,-0.2044 -0.9763,-0.4541 -1.1807,-0.7721 l -0.6808,-0.6583 -1.2711,0.1358 c -0.0683,-0.0901 -0.318,-0.4768 -0.7265,-1.1576 -0.3864,-0.7039 -0.908,-1.2708 -1.5214,-1.7022 l -5.0624,-4.1321 c -0.5451,-0.3631 -1.3172,-0.7951 -2.3383,-1.3394 l -0.4093,-0.3863 c -3.5416,-2.361 -6.0613,-3.5416 -7.5146,-3.5416 -1.2033,0 -2.6107,0.3407 -4.1998,0.9989 -1.5889,0.6582 -2.4514,1.4533 -2.5881,2.4069 l -0.6811,2.7238 c -0.3856,0.6134 -0.5899,1.476 -0.5899,2.588 0,0.5451 0.0448,0.8861 0.136,1.0676 v 0.4084 l -0.136,2.1796 c 0,0.5451 0.4314,0.8169 1.271,0.8169 l -0.136,1.7941 c 0,0.1814 0.3858,0.8623 1.1579,2.0885 0.7722,1.226 1.2937,1.9299 1.5662,2.1113 l 0.6582,0.8623 c -0.0448,0.5224 0.2727,1.0902 0.9309,1.703 0.6817,0.5905 1.2033,1.2033 1.6126,1.8159 0.4082,0.6361 1.1577,1.3173 2.27,2.0665 l 1.9973,1.9975 c 1.567,1.5662 3.27,2.7922 5.0859,3.7231 0.2727,0.091 0.8169,0.5451 1.6344,1.3399 0.817,0.7943 1.7706,1.3847 2.8154,1.7705 1.0437,0.3629 2.0656,0.8396 3.0648,1.4304 0.999,0.5669 1.7932,0.8623 2.361,0.8623 h 0.5445 c 0.182,0 1.3627,0.5451 3.5416,1.6574 h 0.3864 c 0.1814,0 0.6126,-0.1814 1.2711,-0.5224 h 0.1366 l 1.0667,0.5224 c 0.182,0.091 0.409,0.1366 0.6809,0.1366 2.7476,0 4.2681,-1.9071 4.5408,-5.6985 0.091,-0.7948 0.318,-1.2033 0.6582,-1.2033 0.4541,0 1.0902,0.817 1.9071,2.4293 0.8175,1.6118 2.5654,2.4288 5.2217,2.4288 1.9072,0 2.8608,-1.2255 2.8608,-3.6548 0,-2.8834 -1.2717,-5.6301 -3.837,-8.1955 -0.1814,-0.3637 -0.3181,-0.7492 -0.4085,-1.2033 l -0.9309,-2.7247 v -0.136 c 0,-0.2497 -0.1814,-0.6353 -0.5678,-1.0894 -0.3858,-0.4768 -0.5672,-0.8861 -0.5672,-1.226 l 0.1361,-1.68 -0.2727,-1.8616 c 0,-0.8404 0.1596,-1.385 0.4768,-1.6574 1.4077,0.3629 2.4295,0.9536 3.0648,1.7705 0.6355,0.8176 1.0902,1.2717 1.3394,1.3627 l 0.659,0.2718 c 0.4085,0.6591 0.8623,1.2033 1.4074,1.6574 z m -22.0895,-0.0229 c 0.1584,0.9762 0.7035,1.7027 1.6118,2.2252 0.9079,0.4994 1.453,1.0218 1.6344,1.5661 0.8396,0.6134 2.0429,1.7257 3.6094,3.3148 1.567,1.5897 2.3388,2.5654 2.3388,2.9288 0,0.1131 -0.091,0.1817 -0.2497,0.1817 h -0.1366 l -0.5451,-0.3183 -1.1807,0.1366 -1.2707,-0.1366 -0.908,0.4541 -0.8631,-0.1358 -1.3394,0.2724 c -0.7038,0 -1.3164,-0.1366 -1.8159,-0.4312 -0.4997,-0.2953 -1.476,-0.6134 -2.9063,-0.9535 -1.4531,-0.3637 -2.7468,-0.9763 -3.8818,-1.8389 -1.1577,-0.8631 -1.9981,-1.2943 -2.5206,-1.2943 -0.3172,-0.6582 -1.339,-1.6117 -3.1096,-2.8607 -1.0675,-0.3401 -1.7484,-1.1123 -2.0664,-2.3156 -1.1353,-0.9306 -1.7252,-1.453 -1.7252,-1.5888 l -0.4538,-1.135 c -0.3637,-0.3181 -0.7948,-0.5681 -1.34,-0.7722 -0.5215,-0.1814 -0.8399,-0.6582 -0.9308,-1.3847 -0.0905,-0.7265 -0.3858,-1.3847 -0.8853,-1.9981 -0.5224,-0.5899 -0.7722,-1.0667 -0.7722,-1.4304 0,-2.1563 0.432,-3.2465 1.2717,-3.2465 0.341,0 1.0896,0.227 2.2254,0.7038 1.135,0.4541 1.7703,0.7722 1.9517,0.9536 0.1817,0.1814 0.5224,0.3637 1.0675,0.5451 l 1.2481,0.6582 c 0.1823,0.1814 0.3864,0.2727 0.5908,0.318 0.227,0.0457 0.4541,0.2044 0.6808,0.4315 0.2044,0.2497 0.6129,0.5221 1.1807,0.8166 0.5899,0.2727 1.0219,0.6591 1.3393,1.158 0.7492,0.432 1.9525,1.1129 3.6326,2.0438 l 1.3848,1.0667 c 0.9765,0.4538 1.5664,0.8175 1.7934,1.1349 0.2268,0.3181 0.6582,0.6135 1.34,0.9307 z m 42.3853,15.12 0.9762,0.25 0.4085,0.8849 c 2.1569,1.2717 3.7012,2.4979 4.6318,3.6556 0.0905,0.1814 0.2954,0.3402 0.6129,0.5224 0.2954,0.1815 0.6355,0.4986 0.9762,0.9306 1.6345,1.6575 3.5873,2.4744 5.8573,2.4744 2.6563,0 4.064,-1.6118 4.2454,-4.858 l 0.4085,-0.9992 c 0.341,-0.6126 0.8405,-1.8842 1.4987,-3.7914 0.6355,-1.9071 0.9535,-3.0877 0.9535,-3.5189 0,-1.2033 -0.3858,-2.4066 -1.135,-3.5872 -0.6134,-0.3172 -2.1112,-1.9746 -4.4498,-4.9938 l -0.6588,-0.4768 c -0.3631,-0.7948 -0.8169,-1.5897 -1.4076,-2.3839 -0.8853,-0.3181 -1.3164,-0.6361 -1.3164,-0.9993 v -1.2033 c 0,-0.091 -0.1132,-0.2724 -0.3181,-0.5221 -0.1814,-0.2727 -0.4768,-0.7943 -0.8169,-1.5435 l -0.5451,-0.7948 c -0.1815,-0.1814 -0.3402,-0.5445 -0.5225,-1.0896 -0.1814,-0.5678 -0.4311,-1.0673 -0.7713,-1.4984 -0.3407,-0.4542 -0.4994,-0.7943 -0.4994,-1.0667 0,-0.6582 0.8623,-0.9992 2.588,-0.9992 0.0904,0 0.4311,0.1357 0.9992,0.4084 l 0.9306,-0.2727 c 0.0904,0 0.3175,0.1367 0.6812,0.432 0.3628,0.2946 0.8852,0.5216 1.6344,0.7039 0.7266,0.1587 1.3621,0.4311 1.9299,0.7943 0.5445,0.3407 1.2254,0.6582 1.9975,0.9306 0.7722,0.2497 1.5214,0.7038 2.2252,1.2946 0.7266,0.5898 1.4074,1.021 2.1113,1.2934 0.6811,0.2727 1.3164,0.6812 1.9292,1.2263 0.5905,0.5451 1.2717,1.0672 2.0209,1.5661 0.7721,0.4768 1.9749,1.5443 3.6093,3.1788 1.0675,0.8396 1.7941,1.3164 2.2025,1.4074 0.091,0 0.4768,0.5899 1.1577,1.7484 0.6812,1.1798 1.476,1.7705 2.3613,1.7705 0.9306,0 1.4074,-0.4311 1.4074,-1.3164 0,-0.4995 -0.2271,-0.9536 -0.6582,-1.4077 v -0.409 l 0.1357,-1.044 c 0.0686,-0.1366 0.114,-0.3407 0.114,-0.6134 0,-0.1588 -0.1587,-0.4312 -0.4995,-0.794 -0.318,-0.341 -0.5677,-0.7949 -0.6811,-1.3621 -0.1358,-0.5451 -0.5678,-0.9088 -1.2717,-1.0902 -0.2718,-0.9762 -0.6125,-1.5208 -1.0437,-1.6574 -0.4084,-0.1358 -0.9992,-0.5899 -1.7484,-1.3391 -0.7495,-0.7495 -1.8161,-1.6344 -3.2009,-2.6563 -1.3847,-1.0213 -2.3156,-1.7932 -2.838,-2.3613 -0.4995,-0.5442 -0.8402,-0.8169 -1.0219,-0.8169 -0.0901,0 -0.2724,0.0904 -0.5221,0.25 -0.2719,0.1814 -0.4542,0.2715 -0.5446,0.2715 -0.2724,0 -0.4311,-0.3171 -0.5221,-0.9306 l -0.2727,-0.6582 c -0.5669,-0.3628 -0.908,-0.5445 -0.9989,-0.5445 l -0.4085,0.1361 h -0.2497 c -0.5446,0 -0.817,-0.1815 -0.817,-0.5908 l 0.4085,-0.6582 v -0.1358 c 0,-0.6134 -0.3637,-0.9309 -1.0675,-0.9309 -0.4768,0 -1.9063,-0.8175 -4.2446,-2.4522 l -1.9528,-0.4082 -1.5891,-0.8626 c -0.5222,0.3175 -0.8632,0.4768 -0.999,0.4768 l -1.0675,-0.341 -1.929,-0.1358 c -0.0456,0 -0.8404,0.4541 -2.4295,1.3391 -1.5662,0.8853 -2.5198,1.7705 -2.8151,2.6566 -0.3181,0.8853 -0.7266,1.7703 -1.2033,2.6785 -0.4995,0.9079 -0.7266,1.544 -0.7266,1.9069 0,2.1342 0.1588,3.6328 0.5222,4.5408 0.3631,0.9309 0.5672,1.5891 0.6585,2.0429 0.091,0.4314 0.3407,0.9079 0.7718,1.4304 0.4315,0.4994 0.7714,1.3393 1.044,2.497 1.2717,2.5659 2.1569,4.1323 2.6564,4.7222 0.4768,0.5678 0.8626,1.2717 1.1123,2.1113 l 0.8861,1.2033 c 0.0675,0.091 0.2041,0.4311 0.3855,1.0219 0.1814,0.6125 0.4085,0.9536 0.6582,1.0445 0.3637,0.6129 0.5451,1.0211 0.5451,1.2028 0,1.2716 -0.5904,1.9298 -1.7257,1.9298 -0.2268,0 -0.4765,-0.2497 -0.7492,-0.7038 -0.2497,-0.4768 -0.8626,-0.9309 -1.8159,-1.3848 -0.9535,-0.4311 -1.5434,-0.7721 -1.7705,-0.9992 -0.2049,-0.2041 -0.6817,-0.4994 -1.4077,-0.8169 -0.7492,-0.3407 -1.3626,-0.8632 -1.9071,-1.567 l -1.1129,-0.5443 c -0.3628,-0.8404 -0.6809,-1.3172 -0.9309,-1.4074 -0.2724,-0.0912 -1.0894,-0.2953 -2.4514,-0.6582 -0.091,-0.0456 -0.318,-0.3183 -0.6582,-0.7951 -0.3637,-0.4994 -0.8632,-0.7265 -1.5443,-0.7265 -0.5222,-0.5451 -1.0437,-1.1577 -1.5888,-1.8842 -0.1815,0 -0.6356,-0.1814 -1.3848,-0.5224 l -1.3172,-0.3402 c -0.3629,-0.2724 -0.7487,-0.6809 -1.1807,-1.2716 -0.4084,-0.5669 -1.2033,-0.8623 -2.3383,-0.8623 -0.6582,0 -0.9983,0.5221 -0.9983,1.5888 0,2.1799 0.7713,3.9274 2.2926,5.199 1.5208,1.2938 2.6337,1.9755 3.3376,2.0659 0.7038,0.091 1.1579,0.3637 1.3393,0.8175 0.1585,0.4312 0.5899,0.7943 1.2935,1.0897 0.682,0.2951 1.476,0.9306 2.3839,1.9298 0.9082,0.9989 1.8845,1.6801 2.9517,2.0203 z"
           style="fill:#200006;fill-opacity:1;fill-rule:nonzero;stroke:none"
           id="path24"
           inkscape:connector-curvature="0" /><path
           d="m 159.0741,462.276 -0.5222,3.3831 c 0,0.2725 0.1131,0.7036 0.3855,1.2717 0.2727,0 0.4998,0.0901 0.6591,0.2718 l -0.3864,1.2033 c 0,1.5441 0.4312,2.8834 1.2943,4.0184 0.8626,1.135 1.3394,1.9069 1.4304,2.2927 0.0904,0.4093 0.726,1.7027 1.9063,3.9053 1.1806,2.2016 2.0438,3.609 2.6337,4.2225 l 0.3866,0.8625 0.5443,0.1367 c 1.0219,1.6344 2.4522,3.1325 4.3137,4.4725 0.6356,0.9754 1.3848,1.7702 2.27,2.3831 0.8861,0.6134 1.4987,1.0672 1.7941,1.3399 0.3172,0.2497 0.7939,0.4311 1.4074,0.5224 l 0.2727,0.1358 c 1.2937,1.2937 2.383,1.9298 3.3139,1.9298 0.3181,0.3175 0.9536,0.6582 1.8842,1.0667 h 0.7266 c 0.2726,0 0.5224,0.091 0.7951,0.2727 0.2724,0.1814 0.5451,0.2724 0.7948,0.2724 0.1814,0 0.6582,-0.1814 1.4074,-0.5451 0.7038,0.7038 1.2937,1.0675 1.7249,1.0675 0.9309,0 1.8845,-0.3637 2.838,-1.0675 0.9536,-0.7038 1.567,-1.5661 1.8389,-2.588 0.2497,-1.0211 0.4768,-1.6118 0.6587,-1.7932 0.1815,-0.1814 0.3632,-0.4085 0.5446,-0.6812 0.3407,0 0.8175,0.8399 1.3847,2.4744 l 0.7948,1.0672 c 1.2263,1.5435 2.043,3.3596 2.4971,5.4488 0.091,0.0904 0.227,0.4541 0.4093,1.0896 0.1814,0.6353 0.6582,1.7476 1.4074,3.2919 1.3164,1.8615 2.2246,3.7684 2.7697,5.7212 l 0.7949,1.1806 c 0.5442,0.3628 0.8396,0.7483 0.8852,1.1803 0.0454,0.4085 0.1814,0.7943 0.4082,1.158 0.2044,0.3628 0.4541,0.794 0.7495,1.2934 0.2954,0.4998 0.5224,0.8626 0.7038,1.0219 0.1815,0.1814 0.4539,0.7943 0.7949,1.8389 0.3628,1.0445 0.794,1.6344 1.2937,1.7484 0.5221,0.136 1.0446,0.3858 1.5661,0.7486 l 0.1367,0.4541 -0.2724,0.9306 c 0,0.5451 0.5899,1.476 1.7702,2.793 1.1806,1.3394 2.0211,2.4287 2.5206,3.2919 0.5215,0.8625 1.385,2.2016 2.5883,3.9957 1.2251,1.7932 2.1112,2.8825 2.6337,3.2692 l 1.5434,1.6118 c 0.7036,1.0216 1.7028,1.5205 2.9736,1.5205 0.9765,0 1.9984,-0.5216 3.0651,-1.5662 1.0672,-1.044 1.5896,-2.0659 1.5896,-3.0878 0,-0.3628 -0.2276,-1.1803 -0.7265,-2.4514 l -0.1366,-0.8175 c 0,-0.7038 -0.2271,-1.5434 -0.7265,-2.5197 -0.4768,-0.9765 -0.7713,-1.7257 -0.8626,-2.2481 l -3.723,-9.1262 c -0.4542,-0.1814 -0.7039,-0.2954 -0.7949,-0.3858 -1.1579,-2.5424 -2.0659,-3.9053 -2.7241,-4.132 v -1.3394 c 0,-0.4768 -0.318,-0.8396 -0.9309,-1.0437 l -0.2724,-0.1369 c -0.4084,-1.7028 -0.9079,-2.9061 -1.5213,-3.6548 -0.6356,-0.7718 -1.0897,-1.5213 -1.3621,-2.2935 -0.2953,-0.7939 -0.7495,-1.2251 -1.362,-1.3164 -0.6356,-0.091 -0.9309,-0.9535 -0.9309,-2.588 -0.1814,-0.8853 -0.6353,-1.3164 -1.3391,-1.3164 -0.6591,0 -1.0902,-0.5908 -1.2716,-1.7484 -0.1814,-1.135 -1.0449,-1.7705 -2.5883,-1.8615 -0.4539,-0.2498 -0.7036,-0.5681 -0.7949,-0.9309 l 0.5224,-1.6572 c 0,-0.2727 -0.8169,-1.2946 -2.4514,-3.1334 l -0.5451,-1.7249 c -0.8404,-0.2951 -1.5216,-2.588 -2.0432,-6.8334 l -0.8175,-4.6089 0.1358,-1.7932 -0.2497,-0.9309 0.7948,-2.7247 -0.1358,-1.5207 c 0,-0.7039 0.2724,-1.0673 0.794,-1.0673 0.2727,0 0.8634,0.4091 1.794,1.2033 l 0.9309,0.4091 c 2.7695,1.4076 4.4726,2.7924 5.1308,4.1315 0.1814,0.1587 0.4994,0.3401 0.9535,0.5224 0.4539,0.1814 0.794,0.4311 1.0216,0.7265 0.2271,0.3175 0.4085,0.5443 0.5216,0.6809 2.6793,1.7705 4.4272,3.3375 5.199,4.6539 0.7952,1.3394 1.6118,2.1342 2.4523,2.4066 l 0.5224,0.5446 c 0.5216,0.4317 0.9536,0.6587 1.3164,0.6587 0.7495,0 1.1123,-0.227 1.1123,-0.6587 l -0.5224,-1.8845 c 0.432,-1.1806 0.6591,-1.8842 0.6591,-2.0429 0,-1.5662 -0.6812,-2.5198 -2.0438,-2.8834 -0.5899,-0.5673 -1.044,-1.2255 -1.3621,-1.9976 -0.3401,-0.7492 -1.044,-1.226 -2.1568,-1.3847 -0.7492,-1.0673 -1.4304,-1.7711 -2.043,-2.1113 -0.6355,-0.341 -0.9309,-0.6809 -0.9309,-1.0219 v -0.6125 c -0.3637,-0.5225 -0.6582,-0.8862 -0.9306,-1.0676 l -1.2719,0.2727 c -0.1584,-0.5224 -0.5669,-1.2719 -1.1803,-2.2025 -0.2271,0.1823 -0.4315,0.2724 -0.5899,0.2724 -0.6356,0 -1.135,-0.3855 -1.5217,-1.135 -0.4084,-0.7492 -0.7035,-1.135 -0.8623,-1.135 h -1.5213 c -0.2271,-0.1366 -0.5899,-0.4082 -1.0667,-0.8623 -0.4997,-0.4547 -1.2946,-0.659 -2.4522,-0.659 l -2.0659,-0.4085 c -1.9299,0 -3.7231,0.6355 -5.3578,1.8845 -1.6345,1.2716 -2.497,2.4293 -2.6107,3.4733 -0.1131,1.0218 -0.4768,2.2935 -1.0896,3.7457 l -0.1367,2.7249 c -0.4768,2.8378 -1.0437,4.2452 -1.6571,4.2452 l -0.1361,-0.8632 -0.5221,-0.2718 c -0.2727,-1.3626 -0.7268,-2.0665 -1.3394,-2.0665 -0.2724,-0.1131 -0.5678,-0.3401 -0.8631,-0.6582 l -0.4085,-0.2724 c -0.1814,-0.0677 -0.4312,-0.4541 -0.7722,-1.1123 -0.3401,-0.6809 -1.2481,-1.6118 -2.7694,-2.7924 -0.6129,-1.6572 -1.0897,-2.4749 -1.4077,-2.4749 l -0.794,0.5451 h -0.1366 c -0.3402,0 -0.6355,-0.5222 -0.8626,-1.5662 -0.227,-1.0446 -0.6582,-1.567 -1.3394,-1.567 -0.1819,0 -0.3407,-0.2945 -0.4994,-0.9079 -0.1593,-0.5899 -0.5451,-0.9763 -1.1577,-1.135 -0.6364,-0.1361 -1.1806,-0.7495 -1.6801,-1.8162 -0.4768,-1.0672 -0.8178,-1.5888 -0.9992,-1.5888 -0.091,0 -0.2271,0.0448 -0.3855,0.1358 l -1.1359,-0.2724 c -0.227,-0.3175 -0.5445,-0.817 -0.9535,-1.5435 -0.3858,-0.1139 -0.7487,-0.2953 -1.0667,-0.5224 -1.3621,-1.3391 -3.2009,-1.9981 -5.4717,-1.9981 -1.5888,0 -2.8605,0.341 -3.7914,1.0218 -0.9535,0.7039 -1.4978,1.2943 -1.6792,1.7711 -0.1823,0.4989 -0.4998,1.1123 -0.9992,1.8389 -0.4995,0.7265 -0.7949,1.6344 -0.9309,2.7011 z m 49.7185,42.0905 -0.6582,-1.9292 c 0.5681,0.0904 1.0902,0.6811 1.5217,1.7932 1.339,1.9071 2.247,3.0877 2.7238,3.5189 0.5907,0 1.0219,0.3628 1.2946,1.1123 0.2945,0.7265 0.8169,1.453 1.5661,2.1569 0,0.2954 0.341,0.9079 0.9992,1.7932 0.6582,0.8858 1.112,1.5213 1.2935,1.8842 0.2043,0.3863 0.6137,0.8861 1.2262,1.4986 0.6356,0.6356 1.226,1.6801 1.7711,3.2015 0.5672,1.4981 1.044,2.406 1.4298,2.7241 0.409,0.318 0.6134,0.9306 0.6134,1.8615 0,1.2943 -0.0912,1.9298 -0.2727,1.9298 -0.4084,0 -0.7038,-0.2497 -0.9079,-0.7721 -0.2044,-0.4995 -0.6355,-1.1577 -1.2946,-1.9525 l -2.27,-3.7908 c -0.8852,-1.4987 -1.453,-2.702 -1.7484,-3.587 -0.2945,-0.8852 -0.6125,-1.4077 -0.9983,-1.567 -0.3864,-0.1587 -0.8405,-0.5898 -1.3627,-1.2937 l -0.9309,-0.9309 c -0.227,-0.5451 -0.4084,-1.1803 -0.5442,-1.9298 l -0.5907,-0.5451 v -1.2481 c 0,-0.5908 -0.3402,-1.1129 -0.9993,-1.567 -0.6582,-0.4768 -0.998,-0.7713 -0.998,-0.9079 z m -23.1335,-26.9932 0.4541,0.8626 c 0.7492,0.2724 1.2489,0.9315 1.453,1.9981 0.3629,0.2725 1.2708,1.4074 2.7241,3.4507 1.4757,2.0435 2.2023,3.1784 2.2023,3.3828 -0.4539,0.4768 -0.9536,0.7039 -1.5214,0.7039 -0.0904,0 -0.3628,-0.0913 -0.8169,-0.2727 -0.432,-0.1814 -0.8859,-0.2954 -1.3626,-0.3855 -0.4542,-0.0913 -0.9536,-0.2727 -1.4752,-0.5451 l -1.6574,0.2724 c -0.4995,0 -1.5897,-0.6356 -3.2692,-1.9299 l -1.5214,0.2725 c -0.2724,0 -0.7038,-0.5905 -1.3391,-1.7255 l -3.3831,-2.7241 h -0.4085 c -0.6125,0 -1.0219,-0.5678 -1.2489,-1.6801 -0.7492,-0.9762 -1.4531,-1.6571 -2.1339,-2.0202 -0.6582,-0.3864 -1.1124,-0.9306 -1.3848,-1.6345 v -0.8631 c -1.2489,-1.3621 -1.8618,-2.4067 -1.8618,-3.1326 -0.9306,-0.8858 -1.5434,-1.8394 -1.8385,-2.8604 -0.2727,-1.0219 -0.6129,-1.8845 -1.0219,-2.5881 0.1814,-0.6137 0.318,-1.385 0.409,-2.2938 0.0905,-0.9079 0.5216,-1.3617 1.3164,-1.3617 1.2938,0 2.7015,0.7718 4.2455,2.3153 0.0904,0.0913 0.4768,0.341 1.135,0.7495 0.6582,0.3863 1.5891,1.1806 2.7697,2.3383 1.1577,1.1806 1.8167,1.794 1.9525,1.8388 0.4315,0.432 0.7039,0.6588 0.7951,0.6588 l 0.5216,0.5445 c 0,0.1593 0.205,0.3637 0.5678,0.5905 0.3855,0.227 0.8853,0.6811 1.4987,1.362 0.6355,0.6812 1.0893,1.0894 1.4303,1.2263 0.3402,0.1358 0.567,0.3172 0.7039,0.5669 0.1358,0.2498 0.3399,0.4768 0.6582,0.7039 0.3172,0.2049 0.4768,0.4541 0.4768,0.7265 l 0.1131,0.7948 z m 82.6381,-4.2908 1.044,0.9306 c 0.6582,0 1.0676,0.2954 1.1807,0.9088 0.1366,0.5899 0.6134,1.0667 1.4303,1.4295 0.8175,0.341 1.567,1.0676 2.2706,2.1569 0.7038,1.0902 1.4298,1.6348 2.179,1.6348 0.2727,0 0.5677,-0.2271 0.9309,-0.6585 0.3407,-0.4539 0.5221,-0.794 0.5221,-1.0664 0,-1.476 -0.4538,-2.9747 -1.3391,-4.5182 l -0.2497,-1.8615 -0.4768,-0.8852 c -0.6582,-0.3408 -1.0902,-0.7266 -1.2946,-1.1129 -0.2041,-0.4085 -0.7265,-0.8853 -1.5661,-1.4752 l -0.6582,-0.9306 c -0.9763,-0.3183 -1.6348,-0.8178 -1.9528,-1.5216 -0.3402,-0.7265 -0.7949,-1.1121 -1.4074,-1.2033 -0.5899,-0.091 -1.249,-0.5222 -1.9528,-1.3391 -0.4538,-0.2044 -0.9754,-0.4085 -1.5888,-0.5908 l -0.1361,-0.6582 c -0.4541,-0.4541 -1.1577,-0.7948 -2.1112,-1.0666 -0.9309,-0.2724 -1.6575,-0.5225 -2.1116,-0.7722 -0.4767,-0.2497 -0.7948,-0.3637 -0.9762,-0.3637 -0.8405,0 -1.6118,0.1596 -2.3156,0.4998 -0.7036,0.3407 -1.4531,0.5451 -2.2023,0.6361 -0.2497,0.2497 -0.4084,0.5442 -0.4541,0.8625 -0.0456,0.2951 -0.2724,0.7036 -0.6809,1.226 -0.3858,0.4995 -0.5907,1.2033 -0.5907,2.0886 l 0.2724,1.2708 c 0,0.1596 -0.1131,0.3866 -0.3399,0.659 -0.227,0.2498 -0.341,0.4768 -0.341,0.6582 0,0.1814 0.0457,0.3181 0.1367,0.4085 0.0904,0.0683 0.1357,0.2041 0.1357,0.3864 0,0.227 -0.0453,0.4759 -0.1357,0.7259 -0.091,0.2724 -0.1367,0.4995 -0.1367,0.6588 l 0.4085,3.2692 c 0,0.2724 -0.0904,0.3855 -0.2718,0.3855 -0.1594,0 -0.4995,-0.2041 -0.9536,-0.6582 -0.4768,-0.4538 -1.0219,-0.6582 -1.6345,-0.6582 -0.3637,-0.2724 -0.6364,-0.8402 -0.8631,-1.6801 -0.3631,-0.4312 -0.7943,-0.8402 -1.3394,-1.2033 l -0.2724,-0.3855 c -0.0913,-0.3181 -0.4085,-0.5681 -0.9992,-0.7722 -0.5672,-0.2041 -0.9763,-0.4541 -1.1807,-0.7721 l -0.6808,-0.6582 -1.2711,0.136 c -0.0683,-0.0904 -0.318,-0.4768 -0.7265,-1.1579 -0.3864,-0.7039 -0.9079,-1.2708 -1.5214,-1.702 l -5.0624,-4.1323 c -0.5451,-0.3628 -1.3172,-0.7948 -2.3383,-1.3394 l -0.4093,-0.3863 c -3.5416,-2.361 -6.0613,-3.5416 -7.5143,-3.5416 -1.2033,0 -2.611,0.341 -4.2001,0.9992 -1.5889,0.6582 -2.4514,1.453 -2.5881,2.4066 l -0.6808,2.7238 c -0.3858,0.6134 -0.5899,1.476 -0.5899,2.588 0,0.5451 0.0448,0.8861 0.1357,1.0676 v 0.4084 l -0.1357,2.1796 c 0,0.5451 0.4311,0.8169 1.2707,0.8169 l -0.1357,1.7941 c 0,0.1814 0.3855,0.8623 1.1576,2.0885 0.7722,1.226 1.2938,1.9299 1.5662,2.1113 l 0.6582,0.8623 c -0.0448,0.5224 0.2727,1.0902 0.9309,1.703 0.6817,0.5908 1.2033,1.2033 1.6126,1.8159 0.4085,0.6364 1.1577,1.3173 2.27,2.0665 l 1.9973,1.9975 c 1.567,1.5662 3.27,2.7925 5.0859,3.7231 0.2727,0.0912 0.8169,0.5451 1.6347,1.3399 0.8167,0.7943 1.7703,1.3847 2.8151,1.7705 1.0437,0.3629 2.0656,0.8396 3.0648,1.4304 0.9993,0.5669 1.7932,0.8623 2.361,0.8623 h 0.5446 c 0.1822,0 1.3626,0.5451 3.5416,1.6574 h 0.3863 c 0.1814,0 0.6129,-0.1814 1.2711,-0.5224 h 0.1366 l 1.0667,0.5224 c 0.1823,0.091 0.409,0.1366 0.6809,0.1366 2.7476,0 4.2684,-1.9071 4.5408,-5.6985 0.091,-0.7948 0.318,-1.2033 0.6582,-1.2033 0.4541,0 1.0902,0.817 1.9071,2.4293 0.8176,1.6118 2.5654,2.4288 5.2217,2.4288 1.9072,0 2.8608,-1.2255 2.8608,-3.6548 0,-2.8834 -1.2717,-5.6301 -3.837,-8.1955 -0.1814,-0.3637 -0.3181,-0.7492 -0.4085,-1.2033 l -0.9309,-2.7246 v -0.1361 c 0,-0.2497 -0.1814,-0.6353 -0.5678,-1.0894 -0.3855,-0.4768 -0.5672,-0.8858 -0.5672,-1.226 l 0.1361,-1.68 -0.2727,-1.8616 c 0,-0.8404 0.1596,-1.3847 0.4768,-1.6574 1.4077,0.3629 2.4296,0.9536 3.0651,1.7705 0.6352,0.8176 1.0902,1.2717 1.3391,1.3627 l 0.659,0.2718 c 0.4085,0.6591 0.8623,1.2033 1.4074,1.6574 z m -22.0895,-0.0229 c 0.1587,0.9765 0.7038,1.703 1.6118,2.2252 0.9079,0.4997 1.453,1.0218 1.6344,1.5664 0.8396,0.6134 2.043,1.7254 3.6094,3.3145 1.567,1.5897 2.3391,2.5654 2.3391,2.9291 0,0.1131 -0.0913,0.1814 -0.25,0.1814 h -0.1366 l -0.5451,-0.3181 -1.1804,0.1367 -1.271,-0.1367 -0.908,0.4539 -0.8631,-0.1358 -1.3394,0.2724 c -0.7038,0 -1.3164,-0.1366 -1.8159,-0.4312 -0.4997,-0.2953 -1.476,-0.6134 -2.9063,-0.9535 -1.4531,-0.3637 -2.7468,-0.9763 -3.8818,-1.8389 -1.1577,-0.8631 -1.9981,-1.2943 -2.5205,-1.2943 -0.3172,-0.6582 -1.3391,-1.6117 -3.1097,-2.8607 -1.0675,-0.3401 -1.7484,-1.112 -2.0664,-2.3156 -1.135,-0.9306 -1.7249,-1.453 -1.7249,-1.5888 l -0.4541,-1.135 c -0.3637,-0.3181 -0.7948,-0.5678 -1.3399,-0.7722 -0.5216,-0.1814 -0.8397,-0.6582 -0.9309,-1.3847 -0.0905,-0.7265 -0.3855,-1.3847 -0.8853,-1.9981 -0.5221,-0.5899 -0.7722,-1.0667 -0.7722,-1.4304 0,-2.156 0.432,-3.2462 1.272,-3.2462 0.3407,0 1.0893,0.2267 2.2251,0.7035 1.135,0.4541 1.7703,0.7722 1.952,0.9536 0.1814,0.1814 0.5221,0.3637 1.0672,0.5451 l 1.2481,0.6582 c 0.1823,0.1814 0.3867,0.2727 0.5908,0.3183 0.227,0.0454 0.4541,0.2041 0.6808,0.4312 0.2044,0.2497 0.6129,0.5221 1.1807,0.8169 0.5899,0.2724 1.0219,0.6588 1.3393,1.1577 0.7492,0.432 1.9525,1.1129 3.6326,2.0438 l 1.3851,1.0667 c 0.9762,0.4538 1.5661,0.8175 1.7931,1.1349 0.2268,0.3181 0.6583,0.6135 1.34,0.9307 z m 83.1141,42.8853 0.9309,0.2724 0.6582,0.6582 h 0.1366 l 0.5899,-0.2724 h 0.1366 c 1.0667,0 2.0203,0.2271 2.8372,0.6361 0.8405,0.4314 1.5214,0.7265 2.0894,0.9082 0.5443,0.1585 0.908,0.2951 1.0211,0.3855 0.1366,0.0913 0.2497,0.1367 0.3407,0.1367 l 1.0896,-0.1367 c 0.3408,0 0.8175,0.6356 1.4304,1.9072 0.5905,1.2489 1.2716,2.1796 2.0208,2.7468 0.7486,0.5907 1.4981,1.6574 2.2473,3.2689 0.1814,0.2052 0.3858,0.568 0.6126,1.0219 0.2044,0.4768 0.3866,0.7038 0.5224,0.7038 0.6582,0 1.2033,0.4085 1.5891,1.2716 1.34,1.5435 2.4293,2.3157 3.2689,2.3157 1.1132,0 1.8845,-1.0676 2.3165,-3.2009 l 0.6582,-2.5203 c 0,-0.0456 -0.091,-0.3631 -0.318,-0.9536 -0.2271,-0.6128 -0.3175,-1.2033 -0.2954,-1.7932 0.0227,-0.6128 0,-0.9992 -0.0675,-1.2033 -0.0683,-0.2044 -0.1139,-0.4314 -0.1139,-0.7038 0,-0.3629 0.3863,-0.5225 1.135,-0.5225 0.2724,0 0.7492,0.1596 1.476,0.5225 l 0.3855,0.1357 c 0.4547,-0.2718 0.8178,-0.4084 1.1358,-0.4084 0.0904,0 0.7265,0.227 1.8842,0.6811 1.1806,0.4312 1.9293,0.6809 2.2473,0.7266 0.2954,0.0456 0.8405,0.227 1.5891,0.5221 h 0.7948 l 0.5452,-0.1814 c 0.1587,0 0.5215,0.1814 1.0893,0.5445 0.5451,0.3864 1.6118,0.6134 3.1561,0.7036 l 0.9306,0.4093 h 0.2719 c 1.4533,0 2.1798,-0.6591 2.1798,-1.9298 0,-0.2727 -0.2044,-0.7265 -0.6129,-1.4077 -0.4311,-0.6582 -0.7721,-1.4074 -1.0445,-2.2479 l -3.0648,-3.8591 c -1.0214,-1.3391 -2.0203,-1.9981 -3.0422,-1.9981 -0.1814,0 -0.7495,0.5907 -1.6801,1.794 0,0.0905 -0.0904,0.1358 -0.2497,0.1358 -0.4541,0 -0.9082,-0.0901 -1.4077,-0.2724 -0.4768,-0.1814 -0.8852,-0.2727 -1.2024,-0.2727 -0.114,0 -1.2946,-0.3172 -3.5198,-0.9754 l -1.5891,-0.2727 c -0.1814,0 -0.6126,-0.091 -1.2708,-0.2724 l -3.3829,-0.6582 c -1.1579,-0.5907 -2.0659,-1.6574 -2.7241,-3.2692 0,-0.091 -0.227,-0.2724 -0.6811,-0.5904 l -2.9974,-5.4488 c -0.9762,-0.2727 -1.6118,-0.8399 -1.9298,-1.7249 l -0.2489,-0.4093 c -0.4997,-0.0904 -0.9315,-0.3628 -1.3399,-0.8396 -0.4085,-0.4541 -0.7722,-0.8178 -1.135,-1.0894 l -1.1806,-1.794 c -0.4995,-0.6126 -0.9763,-1.2938 -1.476,-2.0203 -0.4768,-0.7492 -0.8397,-1.5213 -1.0667,-2.3383 -0.2271,-0.8178 -0.3864,-1.2943 -0.5222,-1.4303 -0.136,-0.1367 -0.2043,-0.3637 -0.2043,-0.7266 l -0.2041,-0.5224 c -0.5225,-0.5451 -0.7952,-1.135 -0.7952,-1.8159 l 0.2727,-1.0445 c -0.6355,-2.1342 -0.9309,-3.2692 -0.9309,-3.405 0,-0.0913 0.0457,-0.3181 0.1361,-0.7265 v -0.4085 c 0,-0.9765 -0.3628,-2.1798 -1.0667,-3.6556 l 0.1358,-1.0666 -0.4085,-2.9747 c 0,-0.4082 0.1367,-1.135 0.4085,-2.2014 -0.1814,-0.1823 -0.2718,-0.3183 -0.2718,-0.4093 0,-1.2254 0.6582,-2.5881 1.9519,-4.0859 1.3173,-1.476 1.9755,-3.7916 1.9755,-6.9474 0,-0.2727 -0.0684,-0.6582 -0.2041,-1.158 -0.1367,-0.5221 -0.2271,-1.0666 -0.2727,-1.6571 -0.0454,-0.6129 -0.3864,-1.2033 -1.0219,-1.7705 -0.6582,-0.5678 -1.1804,-0.8632 -1.6345,-0.8632 -2.3612,0 -4.1088,1.7028 -5.2446,5.1086 -1.1577,3.405 -1.7476,5.6075 -1.7476,6.5838 l 0.1358,2.588 -0.3855,1.3391 0.3855,5.8345 -0.2724,1.4074 1.544,5.7215 v 2.0656 c 0,0.0913 0.3183,0.4314 0.9309,1.0675 0,0.0905 -0.091,0.1358 -0.2727,0.1358 -0.2724,0 -0.6126,-0.2724 -1.0667,-0.8167 -0.4317,-0.5224 -0.9989,-1.0448 -1.6571,-1.5216 l -0.5224,-0.9306 c -0.091,0.091 -0.2724,0.1814 -0.5451,0.2724 -0.2271,-0.091 -0.9536,-1.135 -2.1796,-3.1331 -0.9309,-0.1358 -1.6795,-0.6582 -2.2017,-1.5891 -0.5451,-0.9306 -1.2716,-1.4074 -2.2025,-1.4074 l -0.2727,-0.1367 c -0.1584,-1.271 -0.7939,-1.9292 -1.8615,-1.9292 l -0.2497,-0.1367 c -0.6809,-1.4978 -1.3621,-2.2243 -2.0659,-2.1795 -0.4538,-1.3391 -1.5432,-2.2473 -3.2689,-2.7241 -0.2497,-0.5451 -0.6582,-0.9306 -1.158,-1.2033 -0.4994,-0.2724 -0.8852,-0.5222 -1.0893,-0.7265 -0.2271,-0.2268 -0.432,-0.3402 -0.6134,-0.3402 -0.5672,0 -0.8626,0.6129 -0.8626,1.8618 0,0.3628 0.1587,0.7492 0.4314,1.1577 0.2954,0.4311 0.4312,0.7265 0.4312,0.9079 0,0.091 -0.2041,0.3628 -0.6582,0.7948 0,1.3848 0.3628,2.2474 1.0666,2.5881 0.7039,0.3631 1.226,0.8626 1.5897,1.5434 0.2271,0.5225 0.6582,0.9083 1.3394,1.135 0.6582,0.2044 0.9762,0.4998 0.9762,0.8635 0,0.2945 0.5899,0.9306 1.7476,1.8615 1.1358,0.9306 1.9755,1.7249 2.5206,2.4284 0.5215,0.6812 0.9765,1.0219 1.3166,1.0219 l 0.2725,0.2727 c 0.0909,1.112 0.5224,1.6571 1.2716,1.6571 l 0.6582,0.4085 0.136,0.5224 0.3856,0.2724 h 0.5451 l 0.318,0.2501 c 0.0904,1.112 0.6129,1.9746 1.5664,2.6098 0.9536,0.6137 2.702,2.3613 5.2217,5.222 2.5197,2.8604 3.9501,4.6766 4.2455,5.4941 0.318,0.7948 0.8852,1.8615 1.7028,3.2236 0.8169,1.3399 1.271,2.611 1.362,3.8143 -0.091,0.1814 -0.2271,0.3628 -0.4085,0.5451 l -2.8604,-1.4077 c 0,0.1361 -0.4314,0.3401 -1.3173,0.5899 -0.6811,-0.3855 -1.1579,-0.794 -1.4751,-1.1807 -0.2954,-0.4081 -0.5451,-0.6125 -0.7265,-0.6125 l -0.9309,0.1358 -2.9291,-0.3172 c -2.6107,-0.2271 -4.5856,-0.7722 -5.9255,-1.6127 l -2.7238,-0.794 h -0.5908 c -0.3628,0 -0.8852,-0.227 -1.5891,-0.6582 l -1.5434,0.1358 c -1.4074,-0.7721 -2.4523,-1.135 -3.1332,-1.135 -0.0683,0 -0.3401,0.0457 -0.7948,0.1361 l -6.7881,-1.8615 c -0.5216,-0.1817 -1.7249,-1.0897 -3.5864,-2.7241 l -0.5225,-0.1366 c -0.4538,0 -0.9762,0.4994 -1.5669,1.4986 -0.5899,0.999 -0.908,1.8842 -0.908,2.6791 0,4.4041 3.7687,6.9465 11.3287,7.6504 l 2.7249,1.0675 h 0.1131 l 0.7492,-0.2727 h 0.25 c 0.2724,0 0.7036,0.1814 1.2708,0.4998 0.5678,0.3398 1.8624,0.7483 3.8597,1.2251 l 2.7241,0.7495 0.8631,-0.1361 c 0.4541,0 0.9536,0.1814 1.4981,0.5224 0.5678,0.3629 1.4074,0.6126 2.5203,0.7714 1.1353,0.1595 1.9293,0.318 2.3613,0.4994 l 1.0666,0.2727 c 0.1815,0 0.5451,0.1358 1.1124,0.4538 0.5451,0.3184 1.2716,0.4768 2.1568,0.4768 0.1367,0 0.4539,-0.091 0.999,-0.2724 z m 27.5612,-32.9414 1.385,1.135 c 1.0673,0.0683 1.6572,0.6364 1.7255,1.6574 0.0913,1.0219 0.8396,1.9072 2.2025,2.6564 l 0.794,1.1349 c 0.6811,0.6582 2.4979,1.5214 5.4717,2.5881 0.7492,0.4541 1.2708,0.8404 1.5208,1.2033 0.091,0.0913 0.182,0.1366 0.2724,0.1366 l 1.0675,-0.2724 c 0.567,0 1.3164,0.1587 2.2244,0.4768 0.9079,0.2945 1.794,0.4538 2.6336,0.4538 l 2.7925,0.1361 c 0.1814,0 0.5451,-0.1361 1.1123,-0.4085 0.5451,-0.2497 1.2259,-0.3858 2.0208,-0.3858 0.9762,0 1.8845,-0.4547 2.7011,-1.3399 0.8178,-0.8853 1.2263,-1.7028 1.2263,-2.4514 0,-1.3848 -0.7039,-2.7703 -2.1342,-4.2007 -1.4304,-1.4074 -2.5654,-2.2017 -3.405,-2.3831 -0.7492,-0.7492 -1.3399,-1.226 -1.7484,-1.4303 -0.3858,-0.2041 -0.794,-0.5222 -1.226,-0.9307 -0.4314,-0.432 -0.7716,-0.636 -1.044,-0.636 -0.1587,0 -0.2954,0.0453 -0.3864,0.1593 -0.0904,0.1131 -0.227,0.1814 -0.4084,0.1814 -0.7039,0 -1.4981,-0.8853 -2.3383,-2.6107 l -1.2033,0.1358 c -0.7495,-0.4768 -1.2484,-1.0211 -1.4534,-1.5892 -0.227,-0.5898 -0.7035,-0.8623 -1.4074,-0.8623 -1.6574,-1.6574 -2.7697,-2.4749 -3.3366,-2.4749 -0.0913,0 -0.4093,0.091 -0.9309,0.2724 -0.3637,-0.4311 -0.5451,-0.9079 -0.5451,-1.3847 0,-0.5451 -0.3637,-0.8623 -1.0675,-0.9306 l -0.8623,-0.817 -0.6812,0.1358 -1.3164,-1.3847 c -0.6817,0 -1.3626,-0.2271 -2.0892,-0.6809 -0.0904,-0.5224 -0.2043,-1.2033 -0.3857,-2.0211 -0.1815,-0.8169 -0.2725,-1.2708 -0.2725,-1.362 0,-1.2938 1.1804,-1.9299 3.5187,-1.9299 l 3.2017,0.4542 c 0.8396,0 1.6345,0.2267 2.361,0.6808 0.7265,0.432 1.5208,0.6591 2.3613,0.6591 0.2718,0 0.6808,0.0904 1.2024,0.2724 l 0.6591,-0.2724 c 0.3172,0.6582 0.8852,1.2481 1.7475,1.7932 0.8405,0.5224 1.4987,0.7948 1.9985,0.7948 l 0.6582,0.3858 c 0.1814,0.5451 0.4311,0.885 0.7948,1.0673 l 0.5216,0.4759 c 0.3637,0.341 0.7038,0.5224 0.9989,0.5224 h 0.9309 l 0.2727,0.1367 c 0.5451,1.1349 1.2716,1.8161 2.2252,2.0202 0.9536,0.2044 1.5661,0.5224 1.8159,0.9536 0.227,0.4541 0.6582,0.7038 1.2937,0.7948 0.6134,0.0904 1.1358,0.3858 1.567,0.908 0.4085,0.4997 0.9306,0.9765 1.5434,1.4303 0.6356,0.4312 1.0676,0.7713 1.3173,0.9763 0.2268,0.227 0.4538,0.3401 0.6126,0.3401 0.2727,0 0.4084,-0.2041 0.4084,-0.5899 0,-0.409 0.091,-0.6134 0.2725,-0.6134 0.1817,0 0.2726,0.0913 0.2726,0.2727 0,0.1814 -0.0456,0.4085 -0.1366,0.6582 v 0.4768 c 0,0.6582 0.3407,1.0902 1.0675,1.317 l 2.9736,1.9292 c 0.0913,0.9315 0.3637,1.4758 0.7721,1.6127 0.4315,0.1584 0.7495,0.3398 0.9766,0.5442 0.2041,0.2041 0.4538,0.2954 0.7265,0.2954 0.5669,0 0.8623,-0.341 0.8623,-0.9992 l -0.3402,-1.7249 0.3402,-1.7941 c 0,-0.2724 -0.2041,-0.6352 -0.6355,-1.0893 -0.4082,-0.4768 -0.7265,-1.1806 -0.9533,-2.1342 -0.2271,-0.9533 -0.5224,-1.4757 -0.8626,-1.5432 h -0.4093 c -0.794,-0.8634 -1.4304,-1.3402 -1.8842,-1.4987 -0.4768,-0.1587 -0.8396,-0.4314 -1.1123,-0.8404 l -2.2473,-2.5881 c -0.432,-0.4314 -0.8175,-0.8396 -1.1356,-1.2027 -0.2945,-0.3407 -0.5445,-0.5222 -0.7265,-0.5222 l -0.5216,0.5222 c 0,0.0904 -0.0913,0.136 -0.2727,0.136 -0.4541,0 -0.7265,-0.2497 -0.8405,-0.7948 -0.1131,-0.5216 -0.3401,-0.9983 -0.6808,-1.385 -1.3394,-0.6352 -2.2017,-1.2033 -2.5881,-1.7249 l -0.4084,-0.1366 h -1.2033 c -0.5673,0 -0.9766,-0.4312 -1.1807,-1.2935 -0.227,-0.8634 -0.8626,-1.3629 -1.9071,-1.4986 -1.044,-0.1361 -1.7705,-0.4085 -2.2244,-0.7949 -0.0912,-0.0904 -0.2953,-0.1817 -0.5907,-0.2718 -0.3175,-0.0913 -0.9309,-0.432 -1.8615,-1.0675 l -5.5848,-1.9755 c -0.4312,-0.2271 -0.7266,-0.3402 -0.8623,-0.3402 l -1.8624,-0.2724 c -0.2718,0 -0.5216,0.1814 -0.7943,0.5451 -0.2724,0.3402 -0.4538,0.5225 -0.5221,0.5225 l -1.2036,-0.3867 c -0.885,-0.2724 -1.7249,-0.4085 -2.5197,-0.4085 -0.4538,0 -0.9306,0.1588 -1.4757,0.4768 -0.5225,0.2954 -0.9536,0.5225 -1.249,0.6582 -1.2937,0 -2.2017,0.9992 -2.7241,2.9965 l -0.7948,-0.1357 c -0.1814,0 -0.7713,1.5661 -1.7932,4.7222 -0.2727,0.3628 -0.7038,0.6126 -1.2716,0.7722 -0.5672,0.1584 -0.8626,0.5898 -0.8626,1.2934 0,1.9984 0.4311,3.3375 1.2946,4.0184 0.8623,0.6812 1.3391,1.2033 1.4303,1.5664 l 0.9306,3.4512 c 0.1815,0.1358 0.4085,0.5899 0.6583,1.3394 l 1.5434,2.7921 c 0.1814,0.318 0.5681,1.0902 1.2033,2.3383 z m 13.9626,3.9957 -0.7948,-0.4085 c -0.1817,-0.091 -0.7038,-0.4767 -1.5664,-1.1576 -0.8632,-0.6812 -1.7028,-1.249 -2.5197,-1.6574 -0.8405,-0.4312 -1.6801,-1.5214 -2.5433,-3.3146 -0.8626,-1.7705 -1.2937,-2.7924 -1.2937,-3.0421 0,-0.2727 0.1358,-0.4085 0.4085,-0.4085 l 2.2478,0.9984 c 0.8397,0.4093 1.6348,0.9087 2.3604,1.5213 0.7495,0.6355 1.7941,1.3847 3.1788,2.27 l 0.5224,0.5224 c 0.0902,0.1814 0.4995,0.4995 1.226,0.9763 0.726,0.4768 1.2711,0.9309 1.6348,1.362 l 0.6582,0.2724 c 0.7492,1.2033 1.5205,1.9298 2.2926,2.2025 0.7722,0.2498 1.1807,0.5216 1.1807,0.794 0,0.5225 -0.4312,0.7951 -1.2717,0.7951 -0.3631,0 -0.8852,-0.227 -1.5891,-0.6582 h -1.5434 c -0.1814,0 -0.6582,-0.2727 -1.4531,-0.7951 z"
           style="fill:#200006;fill-opacity:1;fill-rule:nonzero;stroke:none"
           id="path26"
           inkscape:connector-curvature="0" /><path
           d="m 404.3772,488.1798 0.9763,0.2498 0.4085,0.8852 c 2.1568,1.2717 3.7011,2.4976 4.6318,3.6553 0.0904,0.1817 0.2953,0.3402 0.6128,0.5224 0.2951,0.1815 0.6353,0.4989 0.9763,0.9309 1.6344,1.6572 3.5872,2.4741 5.8572,2.4741 2.6563,0 4.064,-1.6118 4.2454,-4.858 l 0.4085,-0.9992 c 0.3407,-0.6126 0.8405,-1.8842 1.4987,-3.7914 0.6352,-1.9071 0.9536,-3.0875 0.9536,-3.5189 0,-1.2033 -0.3858,-2.4066 -1.135,-3.5869 -0.6134,-0.3175 -2.1116,-1.9749 -4.4499,-4.9941 l -0.659,-0.4768 c -0.3628,-0.7948 -0.8167,-1.5897 -1.4074,-2.3839 -0.8853,-0.3181 -1.3164,-0.6361 -1.3164,-0.999 v -1.2033 c 0,-0.0913 -0.1131,-0.2727 -0.3181,-0.5224 -0.1817,-0.2727 -0.4768,-0.794 -0.8169,-1.5435 l -0.5451,-0.7948 c -0.1814,-0.1814 -0.3402,-0.5443 -0.5224,-1.0894 -0.1815,-0.568 -0.4312,-1.0675 -0.7713,-1.4986 -0.3411,-0.4542 -0.4995,-0.7943 -0.4995,-1.0667 0,-0.6582 0.8623,-0.9992 2.588,-0.9992 0.0904,0 0.4312,0.136 0.999,0.4084 l 0.9308,-0.2724 c 0.0905,0 0.3175,0.1367 0.6809,0.432 0.3631,0.2946 0.8853,0.5213 1.6348,0.7036 0.7265,0.1587 1.362,0.4314 1.9298,0.7943 0.5443,0.3407 1.2254,0.6582 1.9976,0.9306 0.7718,0.2497 1.5213,0.7038 2.2252,1.2946 0.7265,0.5898 1.4074,1.021 2.1112,1.2934 0.6809,0.2727 1.3164,0.6812 1.9293,1.2263 0.5904,0.5451 1.2716,1.0672 2.0208,1.5661 0.7722,0.4768 1.9746,1.5443 3.6093,3.1788 1.0673,0.8396 1.7941,1.3164 2.2023,1.4074 0.0913,0 0.4768,0.5899 1.1579,1.7487 0.6809,1.1798 1.4758,1.7702 2.361,1.7702 0.9309,0 1.4077,-0.4311 1.4077,-1.3164 0,-0.4995 -0.2271,-0.9536 -0.6582,-1.4074 v -0.4093 l 0.1358,-1.044 c 0.0683,-0.1366 0.1139,-0.3407 0.1139,-0.6134 0,-0.1585 -0.1587,-0.4312 -0.4994,-0.794 -0.3184,-0.341 -0.5681,-0.7949 -0.6812,-1.3621 -0.1358,-0.5451 -0.5678,-0.9088 -1.2716,-1.0902 -0.2719,-0.9762 -0.6126,-1.5205 -1.044,-1.6571 -0.4082,-0.1361 -0.999,-0.5899 -1.7484,-1.3394 -0.7492,-0.7492 -1.8159,-1.6344 -3.2006,-2.6563 -1.385,-1.0211 -2.3157,-1.7932 -2.8381,-2.3613 -0.4994,-0.5442 -0.8405,-0.8166 -1.0219,-0.8166 -0.0901,0 -0.2724,0.0901 -0.5221,0.2497 -0.2719,0.1814 -0.4541,0.2718 -0.5445,0.2718 -0.2725,0 -0.4312,-0.3174 -0.5222,-0.9309 l -0.2727,-0.6582 c -0.5672,-0.3628 -0.9079,-0.5442 -0.9992,-0.5442 l -0.4082,0.1358 h -0.25 c -0.5443,0 -0.8167,-0.1815 -0.8167,-0.5908 l 0.4082,-0.6582 v -0.1358 c 0,-0.6134 -0.3634,-0.9309 -1.0672,-0.9309 -0.4768,0 -1.9063,-0.8175 -4.2449,-2.4519 l -1.9525,-0.4085 -1.5891,-0.8626 c -0.5221,0.3175 -0.8632,0.4768 -0.9989,0.4768 l -1.0676,-0.3407 -1.9292,-0.1361 c -0.0454,0 -0.8402,0.4541 -2.4293,1.3394 -1.5662,0.8852 -2.5197,1.7702 -2.8151,2.6563 -0.318,0.8853 -0.7265,1.7705 -1.2033,2.6785 -0.4998,0.9079 -0.7265,1.544 -0.7265,1.9071 0,2.134 0.1584,3.6326 0.5221,4.5406 0.3628,0.9309 0.5672,1.5891 0.6582,2.0429 0.0913,0.4314 0.341,0.9082 0.7722,1.4304 0.4311,0.4997 0.7713,1.3393 1.044,2.497 1.2716,2.5662 2.1569,4.1323 2.6563,4.7222 0.4768,0.5678 0.8626,1.2717 1.1123,2.1113 l 0.8859,1.2033 c 0.0677,0.0913 0.2043,0.4311 0.3858,1.0219 0.1814,0.6125 0.4084,0.9536 0.6582,1.0445 0.3637,0.6129 0.5451,1.0214 0.5451,1.2028 0,1.2716 -0.5908,1.9298 -1.7258,1.9298 -0.227,0 -0.4768,-0.2497 -0.7492,-0.7038 -0.2497,-0.4768 -0.8625,-0.9306 -1.8161,-1.3848 -0.9536,-0.4311 -1.5435,-0.7721 -1.7703,-0.9992 -0.2052,-0.2041 -0.682,-0.4994 -1.4076,-0.8166 -0.7492,-0.341 -1.3629,-0.8635 -1.9072,-1.567 l -1.1129,-0.5446 c -0.3628,-0.8401 -0.6811,-1.3169 -0.9309,-1.4074 -0.2724,-0.0912 -1.0893,-0.2953 -2.4514,-0.6582 -0.091,-0.0456 -0.318,-0.318 -0.6582,-0.7948 -0.3637,-0.4997 -0.8631,-0.7265 -1.5443,-0.7265 -0.5221,-0.5451 -1.0437,-1.158 -1.5888,-1.8845 -0.1814,0 -0.6355,-0.1814 -1.385,-0.5224 l -1.317,-0.3399 c -0.3631,-0.2727 -0.7486,-0.6812 -1.1806,-1.2716 -0.4085,-0.5672 -1.2033,-0.8626 -2.3383,-0.8626 -0.6582,0 -0.9984,0.5224 -0.9984,1.5891 0,2.1796 0.7713,3.9271 2.2927,5.1987 1.5208,1.2938 2.6336,1.9755 3.3375,2.0659 0.7038,0.091 1.1577,0.3637 1.3391,0.8176 0.1587,0.4314 0.5899,0.7942 1.2937,1.0896 0.6817,0.2954 1.476,0.9306 2.3839,1.9298 0.908,0.9989 1.8845,1.6801 2.9518,2.0203 z m 48.8787,0 0.9765,0.2498 0.4085,0.8852 c 2.1569,1.2717 3.7009,2.4976 4.6318,3.6553 0.0904,0.1817 0.2954,0.3402 0.6126,0.5224 0.2953,0.1815 0.6355,0.4989 0.9765,0.9309 1.6345,1.6572 3.587,2.4741 5.8572,2.4741 2.6564,0 4.0638,-1.6118 4.2455,-4.858 l 0.4084,-0.9992 c 0.3408,-0.6126 0.8402,-1.8842 1.4984,-3.7914 0.6356,-1.9071 0.9536,-3.0875 0.9536,-3.5189 0,-1.2033 -0.3855,-2.4066 -1.135,-3.5869 -0.6134,-0.3175 -2.1112,-1.9749 -4.4495,-4.9941 l -0.6591,-0.4768 c -0.3628,-0.7948 -0.8169,-1.5897 -1.4074,-2.3839 -0.8852,-0.3181 -1.3167,-0.6361 -1.3167,-0.999 v -1.2033 c 0,-0.0913 -0.1131,-0.2727 -0.318,-0.5224 -0.1814,-0.2727 -0.4768,-0.794 -0.817,-1.5435 l -0.5451,-0.7948 c -0.1814,-0.1814 -0.3401,-0.5443 -0.5221,-1.0894 -0.1814,-0.568 -0.4314,-1.0675 -0.7713,-1.4986 -0.341,-0.4542 -0.4998,-0.7943 -0.4998,-1.0667 0,-0.6582 0.8626,-0.9992 2.5884,-0.9992 0.0901,0 0.4311,0.136 0.9989,0.4084 l 0.9309,-0.2724 c 0.0901,0 0.3172,0.1367 0.6809,0.432 0.3628,0.2946 0.8852,0.5213 1.6347,0.7036 0.7265,0.1587 1.3618,0.4314 1.9298,0.7943 0.5443,0.3407 1.2254,0.6582 1.9973,0.9306 0.7722,0.2497 1.5217,0.7038 2.2252,1.2946 0.7268,0.5898 1.4077,1.021 2.1115,1.2934 0.6809,0.2727 1.3165,0.6812 1.929,1.2263 0.5908,0.5451 1.2716,1.0672 2.0211,1.5661 0.7722,0.4768 1.9746,1.5443 3.6091,3.1788 1.0675,0.8396 1.794,1.3164 2.2025,1.4074 0.0913,0 0.4768,0.5899 1.158,1.7487 0.6808,1.1798 1.4757,1.7702 2.3609,1.7702 0.9309,0 1.4077,-0.4311 1.4077,-1.3164 0,-0.4995 -0.227,-0.9536 -0.6582,-1.4074 v -0.4093 l 0.1358,-1.044 c 0.0683,-0.1366 0.114,-0.3407 0.114,-0.6134 0,-0.1585 -0.1588,-0.4312 -0.4998,-0.794 -0.318,-0.341 -0.5678,-0.7949 -0.6809,-1.3621 -0.1358,-0.5451 -0.5678,-0.9088 -1.2716,-1.0902 -0.2718,-0.9762 -0.6128,-1.5205 -1.044,-1.6571 -0.4085,-0.1361 -0.9989,-0.5899 -1.7484,-1.3394 -0.7492,-0.7492 -1.8159,-1.6344 -3.2009,-2.6563 -1.3847,-1.0211 -2.3153,-1.7932 -2.8378,-2.3613 -0.4994,-0.5442 -0.8404,-0.8166 -1.0218,-0.8166 -0.0905,0 -0.2727,0.0901 -0.5225,0.2497 -0.2718,0.1814 -0.4538,0.2718 -0.5442,0.2718 -0.2727,0 -0.4312,-0.3174 -0.5224,-0.9309 l -0.2725,-0.6582 c -0.5672,-0.3628 -0.9079,-0.5442 -0.9992,-0.5442 l -0.4084,0.1358 h -0.2498 c -0.5442,0 -0.8169,-0.1815 -0.8169,-0.5908 l 0.4085,-0.6582 v -0.1358 c 0,-0.6134 -0.3637,-0.9309 -1.0676,-0.9309 -0.4765,0 -1.9063,-0.8175 -4.2446,-2.4519 l -1.9525,-0.4085 -1.5891,-0.8626 c -0.5224,0.3175 -0.8631,0.4768 -0.9992,0.4768 l -1.0672,-0.3407 -1.9293,-0.1361 c -0.0456,0 -0.8405,0.4541 -2.4293,1.3394 -1.5664,0.8852 -2.52,1.7702 -2.8154,2.6563 -0.318,0.8853 -0.7265,1.7705 -1.2033,2.6785 -0.4994,0.9079 -0.7265,1.544 -0.7265,1.9071 0,2.134 0.1588,3.6326 0.5224,4.5406 0.3629,0.9309 0.5673,1.5891 0.6582,2.0429 0.091,0.4314 0.3411,0.9082 0.7722,1.4304 0.4312,0.4997 0.7713,1.3393 1.0437,2.497 1.2719,2.5662 2.1569,4.1323 2.6567,4.7222 0.4767,0.5678 0.8623,1.2717 1.112,2.1113 l 0.8861,1.2033 c 0.0675,0.0913 0.2044,0.4311 0.3858,1.0219 0.1814,0.6125 0.4085,0.9536 0.6582,1.0445 0.3637,0.6129 0.5451,1.0214 0.5451,1.2028 0,1.2716 -0.5907,1.9298 -1.7257,1.9298 -0.2271,0 -0.4768,-0.2497 -0.7495,-0.7038 -0.2497,-0.4768 -0.8623,-0.9306 -1.8159,-1.3848 -0.9536,-0.4311 -1.5435,-0.7721 -1.7705,-0.9992 -0.205,-0.2041 -0.6817,-0.4994 -1.4074,-0.8166 -0.7495,-0.341 -1.3629,-0.8635 -1.9072,-1.567 l -1.1131,-0.5446 c -0.3629,-0.8401 -0.6809,-1.3169 -0.9306,-1.4074 -0.2727,-0.0912 -1.0894,-0.2953 -2.4514,-0.6582 -0.0913,-0.0456 -0.3184,-0.318 -0.6582,-0.7948 -0.3637,-0.4997 -0.8635,-0.7265 -1.5444,-0.7265 -0.5224,-0.5451 -1.044,-1.158 -1.5891,-1.8845 -0.1814,0 -0.6352,-0.1814 -1.3847,-0.5224 l -1.3172,-0.3399 c -0.3629,-0.2727 -0.7487,-0.6812 -1.1804,-1.2716 -0.4085,-0.5672 -1.2036,-0.8626 -2.3386,-0.8626 -0.6582,0 -0.9983,0.5224 -0.9983,1.5891 0,2.1796 0.7716,3.9271 2.2929,5.1987 1.5205,1.2938 2.6337,1.9755 3.3375,2.0659 0.7036,0.091 1.1577,0.3637 1.3391,0.8176 0.1587,0.4314 0.5899,0.7942 1.2937,1.0896 0.6818,0.2954 1.476,0.9306 2.384,1.9298 0.9079,0.9989 1.8842,1.6801 2.9517,2.0203 z m 86.9065,-15.0973 1.044,0.9306 c 0.6582,0 1.0673,0.2954 1.1804,0.9088 0.1369,0.5899 0.6134,1.0667 1.4303,1.4295 0.8178,0.341 1.567,1.0676 2.2709,2.1569 0.7038,1.0902 1.4295,1.6348 2.179,1.6348 0.2724,0 0.5677,-0.2271 0.9306,-0.6585 0.341,-0.4539 0.5224,-0.794 0.5224,-1.0664 0,-1.476 -0.4541,-2.9747 -1.3391,-4.5182 l -0.25,-1.8615 -0.4768,-0.8852 c -0.6582,-0.3408 -1.0902,-0.7266 -1.2943,-1.1129 -0.2044,-0.4085 -0.7265,-0.8853 -1.5661,-1.4752 l -0.6582,-0.9306 c -0.9766,-0.3183 -1.6348,-0.8178 -1.9528,-1.5216 -0.3402,-0.7265 -0.7949,-1.1121 -1.4077,-1.2033 -0.5899,-0.091 -1.2487,-0.5222 -1.9525,-1.3391 -0.4541,-0.2044 -0.9757,-0.4085 -1.5891,-0.5908 l -0.1358,-0.6582 c -0.4541,-0.4541 -1.1579,-0.7948 -2.1115,-1.0666 -0.9306,-0.2724 -1.6572,-0.5225 -2.1113,-0.7722 -0.4768,-0.2497 -0.7948,-0.3637 -0.9762,-0.3637 -0.8405,0 -1.6118,0.1596 -2.3156,0.4998 -0.7039,0.3407 -1.4531,0.5451 -2.2026,0.6361 -0.2497,0.2497 -0.4084,0.5442 -0.4538,0.8625 -0.0456,0.2951 -0.2727,0.7036 -0.6812,1.226 -0.3855,0.4995 -0.5904,1.2033 -0.5904,2.0886 l 0.2724,1.2708 c 0,0.1596 -0.1131,0.3866 -0.3402,0.659 -0.227,0.2498 -0.3407,0.4768 -0.3407,0.6582 0,0.1814 0.0454,0.3181 0.1366,0.4085 0.0902,0.0683 0.1358,0.2041 0.1358,0.3864 0,0.227 -0.0456,0.4759 -0.1358,0.7259 -0.0912,0.2724 -0.1366,0.4995 -0.1366,0.6588 l 0.4085,3.2692 c 0,0.2724 -0.0904,0.3855 -0.2719,0.3855 -0.1595,0 -0.4997,-0.2041 -0.9535,-0.6582 -0.4768,-0.4538 -1.0219,-0.6582 -1.6348,-0.6582 -0.3634,-0.2724 -0.6361,-0.8402 -0.8631,-1.6801 -0.3628,-0.4312 -0.794,-0.8402 -1.3391,-1.2033 l -0.2727,-0.3855 c -0.091,-0.3181 -0.4085,-0.5681 -0.9989,-0.7722 -0.5672,-0.2041 -0.9766,-0.4541 -1.1807,-0.7721 l -0.6811,-0.6582 -1.2708,0.136 c -0.0683,-0.0904 -0.318,-0.4768 -0.7265,-1.1579 -0.3864,-0.7039 -0.9079,-1.2708 -1.5214,-1.702 l -5.0624,-4.1323 c -0.5451,-0.3628 -1.3172,-0.7948 -2.3383,-1.3394 l -0.4093,-0.3863 c -3.5416,-2.361 -6.0613,-3.5416 -7.5146,-3.5416 -1.2033,0 -2.6107,0.341 -4.1998,0.9992 -1.5891,0.6582 -2.4514,1.453 -2.5881,2.4066 l -0.6811,2.7238 c -0.3855,0.6134 -0.5899,1.476 -0.5899,2.588 0,0.5451 0.0448,0.8861 0.136,1.0676 v 0.4084 l -0.136,2.1796 c 0,0.5451 0.4311,0.8169 1.271,0.8169 l -0.136,1.7941 c 0,0.1814 0.3858,0.8623 1.1579,2.0885 0.7719,1.226 1.2935,1.9299 1.5662,2.1113 l 0.6582,0.8623 c -0.0448,0.5224 0.2727,1.0902 0.9309,1.703 0.6817,0.5908 1.2033,1.2033 1.6123,1.8159 0.4085,0.6364 1.158,1.3173 2.27,2.0665 l 1.9976,1.9975 c 1.567,1.5662 3.2697,2.7925 5.0859,3.7231 0.2724,0.0912 0.8169,0.5451 1.6344,1.3399 0.817,0.7943 1.7706,1.3847 2.8151,1.7705 1.044,0.3629 2.0659,0.8396 3.0651,1.4304 0.999,0.5669 1.7932,0.8623 2.361,0.8623 h 0.5443 c 0.1822,0 1.3629,0.5451 3.5419,1.6574 h 0.3863 c 0.1814,0 0.6126,-0.1814 1.2708,-0.5224 h 0.1366 l 1.0667,0.5224 c 0.1823,0.091 0.4093,0.1366 0.6812,0.1366 2.7476,0 4.2681,-1.9071 4.5408,-5.6985 0.091,-0.7948 0.318,-1.2033 0.6582,-1.2033 0.4538,0 1.0902,0.817 1.9071,2.4293 0.8175,1.6118 2.5654,2.4288 5.2217,2.4288 1.9072,0 2.8608,-1.2255 2.8608,-3.6548 0,-2.8834 -1.2717,-5.6301 -3.837,-8.1955 -0.1814,-0.3637 -0.3183,-0.7492 -0.4085,-1.2033 l -0.9309,-2.7246 v -0.1361 c 0,-0.2497 -0.1814,-0.6353 -0.5678,-1.0894 -0.3858,-0.4768 -0.5672,-0.8858 -0.5672,-1.226 l 0.1361,-1.68 -0.2727,-1.8616 c 0,-0.8404 0.1593,-1.3847 0.4768,-1.6574 1.4077,0.3629 2.4293,0.9536 3.0648,1.7705 0.6355,0.8176 1.0902,1.2717 1.3394,1.3627 l 0.6587,0.2718 c 0.4085,0.6591 0.8626,1.2033 1.4077,1.6574 z m -22.0898,-0.0229 c 0.1587,0.9765 0.7038,1.703 1.6121,2.2252 0.9079,0.4997 1.453,1.0218 1.6344,1.5664 0.8396,0.6134 2.0429,1.7254 3.6091,3.3145 1.567,1.5897 2.3391,2.5654 2.3391,2.9291 0,0.1131 -0.091,0.1814 -0.2497,0.1814 h -0.1366 l -0.5451,-0.3181 -1.1807,0.1367 -1.2707,-0.1367 -0.908,0.4539 -0.8634,-0.1358 -1.3391,0.2724 c -0.7038,0 -1.3164,-0.1366 -1.8161,-0.4312 -0.4995,-0.2953 -1.4758,-0.6134 -2.9061,-0.9535 -1.4531,-0.3637 -2.7468,-0.9763 -3.8818,-1.8389 -1.1579,-0.8631 -1.9981,-1.2943 -2.5206,-1.2943 -0.3174,-0.6582 -1.3393,-1.6117 -3.1096,-2.8607 -1.0675,-0.3401 -1.7487,-1.112 -2.0667,-2.3156 -1.135,-0.9306 -1.7249,-1.453 -1.7249,-1.5888 l -0.4538,-1.135 c -0.3637,-0.3181 -0.7951,-0.5678 -1.3402,-0.7722 -0.5216,-0.1814 -0.8396,-0.6582 -0.9306,-1.3847 -0.0905,-0.7265 -0.3858,-1.3847 -0.8853,-1.9981 -0.5224,-0.5899 -0.7722,-1.0667 -0.7722,-1.4304 0,-2.156 0.432,-3.2462 1.2717,-3.2462 0.341,0 1.0896,0.2267 2.2252,0.7035 1.135,0.4541 1.7705,0.7722 1.9519,0.9536 0.1814,0.1814 0.5224,0.3637 1.0675,0.5451 l 1.2481,0.6582 c 0.1823,0.1814 0.3864,0.2727 0.5908,0.3183 0.227,0.0454 0.4538,0.2041 0.6808,0.4312 0.2044,0.2497 0.6129,0.5221 1.1807,0.8169 0.5899,0.2724 1.0219,0.6588 1.3391,1.1577 0.7494,0.432 1.9527,1.1129 3.6328,2.0438 l 1.3848,1.0667 c 0.9762,0.4538 1.5664,0.8175 1.7932,1.1349 0.227,0.3181 0.6582,0.6135 1.3399,0.9307"
           style="fill:#200006;fill-opacity:1;fill-rule:nonzero;stroke:none"
           id="path28"
           inkscape:connector-curvature="0" /><path
           d="m 186.552,618.514 -1.3516,-3.3117 c -5.2846,-2.6912 -10.9224,-4.0303 -16.9132,-4.0303 -8.5844,0 -15.5613,2.4352 -20.9191,7.3054 -5.3699,4.8833 -8.049,11.2513 -8.049,19.1297 0,5.4181 1.3391,10.1548 4.0184,14.2098 2.6663,4.0546 6.1974,7.086 10.5931,9.0958 4.3835,2.0086 9.3155,3.0191 14.7824,3.0191 3.1657,0 6.2952,-0.3407 9.3884,-0.9983 3.0806,-0.6696 5.6619,-1.4607 7.7323,-2.3981 l 0.256,-0.3538 c -0.5483,-1.3272 -1.0599,-4.6267 -1.5344,-9.887 l -0.256,-0.2803 h -1.6679 l -0.2923,0.2803 -0.3529,6.0758 c -1.7416,1.3762 -3.8364,2.4475 -6.2954,3.2273 -2.4597,0.7667 -5.029,1.1562 -7.6839,1.1562 -4.0306,0 -7.6224,-0.864 -10.8125,-2.5934 -3.1901,-1.7164 -5.6622,-4.2128 -7.4279,-7.4886 -1.7532,-3.2629 -2.63,-7.2694 -2.63,-12.0058 0,-4.7489 1.035,-8.9252 3.1051,-12.5175 2.0574,-3.5918 4.8824,-6.344 8.4628,-8.28 3.5796,-1.9236 7.7681,-2.8857 12.5414,-2.8857 2.1189,0 4.1527,0.2075 6.101,0.6089 1.9479,0.4016 3.5796,0.9011 4.8702,1.4981 1.2906,0.5967 2.5327,1.3147 3.7261,2.1795 z m 9.5947,18.1554 -1.3878,0.3651 -0.2923,0.3532 v 4.4197 c 4.2372,3.1417 8.3529,4.7123 12.3469,4.7123 2.7399,0 5.0045,-0.5116 6.819,-1.5341 1.8017,-1.0227 3.1167,-2.3011 3.9206,-3.8355 0.8039,-1.5344 1.2178,-3.3245 1.2178,-5.3697 l -0.1829,-7.1722 V 617.978 c 0,-1.4485 0.0978,-2.3253 0.3045,-2.6419 0.195,-0.3044 0.4266,-0.5117 0.6939,-0.6211 0.2557,-0.1094 0.7432,-0.195 1.4613,-0.2679 l 2.0338,-0.17 0.2795,-0.3288 v -1.425 l -0.2795,-0.2923 c -1.7416,0.1466 -3.3488,0.2194 -4.8467,0.2194 -1.4363,0 -3.1416,-0.0728 -5.138,-0.2194 l -0.5361,0.5117 0.1344,5.7347 -7.7689,-6.0635 c -1.315,-0.5483 -2.74,-0.8161 -4.2866,-0.8161 -1.8995,0 -3.5311,0.341 -4.9067,1.0346 -1.3644,0.6826 -2.4112,1.6447 -3.1295,2.8865 -0.7311,1.2422 -1.0962,2.7391 -1.0962,4.4929 0,3.4946 1.0962,6.2224 3.2882,8.1947 2.1918,1.9605 8.1584,3.6284 17.8997,5.0046 0,3.5189 -0.7798,6.0029 -2.3505,7.4395 -1.571,1.4372 -3.6777,2.1552 -6.3074,2.1552 -1.3878,0 -2.6421,-0.1942 -3.7749,-0.6089 -1.1197,-0.4014 -1.7781,-0.7302 -1.936,-0.974 -0.1707,-0.2557 -0.8161,-1.7044 -1.9236,-4.3713 z m 16.5484,-5.6379 c -6.6492,-1.1083 -10.8011,-2.3133 -12.445,-3.5923 -1.6435,-1.2906 -2.4596,-3.2752 -2.4596,-5.9658 0,-3.7018 1.8386,-5.565 5.5284,-5.565 3.1658,0 6.2952,1.8388 9.3762,5.4913 z m 32.9734,-16.7303 0.2804,-0.2801 v -1.4978 l -0.2804,-0.3167 c -0.7424,0 -2.1302,0.0366 -4.1762,0.1344 -1.8633,0.0972 -3.7747,0.1457 -5.7473,0.1457 -2.569,0 -5.4306,-0.0972 -8.5972,-0.2801 l -0.2792,0.3167 v 1.4978 l 0.2792,0.2801 c 2.302,0.1459 3.617,0.2559 3.9215,0.3288 0.3166,0.0728 0.5723,0.2194 0.7908,0.4379 0.2075,0.2316 0.366,0.5726 0.4391,1.035 0.0851,0.4631 0.182,1.9973 0.2923,4.6029 0.1091,2.6056 0.1579,4.5788 0.1579,5.9057 v 13.7718 l -4.6024,-0.2438 -0.3166,0.2804 v 0.8889 l 0.2429,0.3651 4.6761,2.3862 v 2.1433 c 0,2.3746 0.1099,4.1763 0.3166,5.394 0.2194,1.2297 0.6208,2.3624 1.1934,3.3974 0.5845,1.0346 1.6072,2.3374 3.0566,3.9203 1.4485,1.5829 2.7269,2.8743 3.8111,3.8849 1.0954,1.0105 2.0452,1.6923 2.8613,2.033 0.8034,0.3532 1.7538,0.5238 2.8494,0.5238 0.9012,0 1.8873,-0.1828 2.9223,-0.536 l -0.0244,-5.8564 -0.8274,-0.3163 c -1.3281,1.1925 -2.8747,1.7892 -4.6398,1.7892 -1.2297,0 -2.3009,-0.2557 -3.2023,-0.7668 -0.9133,-0.5116 -1.5222,-1.3513 -1.8629,-2.5084 -0.3288,-1.1449 -0.4995,-3.0563 -0.4995,-5.7228 v -7.3792 h 3.8231 c 1.9732,0 3.8356,0.0729 5.6015,0.2072 l 0.3167,-0.3894 -0.6455,-3.1417 -0.3166,-0.3529 c -0.718,0.0244 -1.1812,0.0366 -1.3879,0.0366 l -4.6394,0.0363 h -2.7519 v -14.3808 c 0,-0.7545 0.0607,-2.4962 0.1585,-5.2231 0.1094,-2.7278 0.2188,-4.3228 0.3044,-4.7982 0.0972,-0.4742 0.2551,-0.8152 0.4867,-1.0346 0.2194,-0.2194 0.5967,-0.3651 1.1084,-0.4624 0.5111,-0.098 2.1427,-0.1831 4.9067,-0.2559 z m 35.3121,3.4339 -1.1441,-2.5691 c -2.4721,-1.5959 -4.676,-2.6305 -6.6121,-3.1051 -1.9488,-0.4753 -3.6774,-0.7191 -5.1996,-0.7191 -2.8494,0 -5.5528,0.5604 -8.1099,1.6809 -2.5569,1.12 -4.6386,3.0073 -6.2467,5.6742 -1.6073,2.6662 -2.4103,5.8685 -2.4103,9.6312 0,2.4962 0.3166,4.7486 0.9374,6.7584 0.6089,2.0086 1.2665,3.5067 1.9361,4.4807 0.6817,0.974 1.8266,2.0582 3.446,3.2386 1.6195,1.1937 3.3237,2.1433 5.1384,2.8616 1.8023,0.7066 3.7502,1.0717 5.8451,1.0717 2.8612,0 5.3696,-0.6817 7.5495,-2.0216 2.1795,-1.3391 3.7009,-3.0558 4.5779,-5.1503 0.889,-2.0945 1.3269,-4.3228 1.3269,-6.6725 0,-0.7432 -0.0363,-1.4493 -0.1091,-2.1432 l -0.3895,-0.3895 c -1.6194,-0.3529 -3.799,-0.5967 -6.5271,-0.7189 -2.7396,-0.1216 -4.5413,-0.1701 -5.4303,-0.1701 h -11.4457 c 0.0485,-4.9317 1.2784,-8.56 3.7131,-10.8861 2.4233,-2.3253 5.3943,-3.4946 8.9138,-3.4946 1.6679,0 3.263,0.2801 4.7974,0.8527 1.5344,0.5723 3.1538,1.3634 4.8702,2.3867 z m -22.8671,14.587 c 0.4257,-0.0728 2.0696,-0.1587 4.943,-0.2556 2.8616,-0.0851 4.9805,-0.1338 6.3684,-0.1338 3.3,0 5.309,0.0609 6.0278,0.17 0.0244,0.5726 0.0366,1.0114 0.0366,1.3278 0,3.689 -0.7554,6.429 -2.2527,8.219 -1.4978,1.7896 -3.5439,2.6907 -6.1373,2.6907 -2.825,0 -5.0289,-1.0106 -6.6118,-3.0314 -1.5829,-2.0217 -2.374,-5.0167 -2.374,-8.9867 z m 20.1886,32.4987 -10.4845,-13.345 -0.4623,-0.1465 -1.035,0.536 -0.1099,0.4632 5.4555,12.456 5.5641,1.0346 0.4632,-0.1091 z"
           style="fill:#200006;fill-opacity:1;fill-rule:nonzero;stroke:none"
           id="path30"
           inkscape:connector-curvature="0" /></g><path
         d="m 229.6695,218.4616 c -1.2631,-0.3257 -3.873,-0.1448 -5.8297,-2.4616 -1.4012,-2.9778 1.8921,-5.9372 4.9875,-7.7559 6.592,-3.9546 15.768,-6.2764 24.8894,-7.7561 18.3724,-2.9251 36.97,-1.9891 42.0653,-1.8289 4.8035,0.2029 23.6038,0.7228 40.8651,5.5298 8.5178,2.4205 16.9115,5.7002 21.5889,10.5871 2.7411,2.4548 1.5222,6.3414 -0.5862,7.1867 -1.785,1.1438 -3.164,1.4899 -3.4878,1.703 -0.3597,0.1483 0.3683,-0.1346 1.9517,-0.7636 1.3195,-0.3733 4.79,-2.2706 3.8288,-5.9678 -2.9234,-6.3737 -11.8608,-10.0675 -20.4353,-13.2041 -17.6836,-6.1571 -37.991,-7.5396 -42.4706,-7.6331 -4.4816,-0.1604 -26.3503,-0.832 -46.5534,3.5439 -9.9791,2.175 -19.8386,5.4411 -25.3344,10.8343 -3.6445,2.6696 -1.3433,7.4647 1.1693,7.3709 2.1053,0.612 3.3633,0.5454 3.3514,0.6154"
         style="fill:#200006;fill-opacity:1;fill-rule:evenodd;stroke:none"
         id="path32"
         inkscape:connector-curvature="0" /><path
         d="m 204.6677,248.1029 c -5.0134,-1.9771 -20.0005,-4.1507 -29.3656,-17.871 -4.1796,-6.9908 -1.7302,-17.2148 4.877,-23.222 6.7128,-6.1707 16.0354,-9.8765 25.3596,-12.5886 37.9979,-10.2668 65.9608,-11.8846 88.0509,-12.1094 22.0921,-0.2233 51.0469,1.1472 86.5919,14.6699 8.627,3.5541 17.0054,8.085 22.6409,14.6358 6.0786,6.2915 6.7998,15.7862 2.4613,21.7866 -8.6167,11.8522 -19.6032,14.4618 -20.6668,15.4437 -1.7456,0.2233 6.9242,-0.987 18.1253,-9.9275 5.2929,-4.2089 10.8808,-14.1517 6.2323,-23.7317 -4.0811,-9.1658 -12.6672,-15.5562 -21.4631,-20.5645 -36.5695,-19.1922 -71.2534,-20.6991 -90.9029,-20.0086 -19.6509,0.6936 -56.8732,0.5522 -99.0796,16.6351 -10.1001,4.3929 -20.9551,10.2345 -25.5235,20.9344 -5.0595,10.4219 0.9477,22.1548 7.9283,26.2511 13.9011,9.1111 24.9352,9.2305 24.734,9.6667"
         style="fill:#200006;fill-opacity:1;fill-rule:evenodd;stroke:none"
         id="path34"
         inkscape:connector-curvature="0" /><path
         d="m 218.9049,178.0843 c 10.5704,-6.1877 48.3194,-12.014 68.3521,-13.0589 26.1848,-1.3637 58.5114,5.2382 62.7067,6.8474 1.205,0.3682 -12.1218,-3.7707 -27.1242,-6.4145 -14.9581,-2.8024 -27.3815,-3.7449 -35.2398,-3.6837 -7.855,0.065 -21.7204,1.0809 -38.1035,4.6945 -16.7259,3.2083 -30.801,11.3443 -30.5913,11.6152"
         style="fill:#200006;fill-opacity:1;fill-rule:evenodd;stroke:none"
         id="path36"
         inkscape:connector-curvature="0" /><path
         d="m 40.7344,720.6211 c 1.5699,-7.8259 5.7614,-35.1321 5.9168,-62.6786 0.4634,-27.5071 -1.444,-54.8696 -2.0543,-62.4433 -1.4233,-14.3509 -14.7841,-109.3626 -13.6114,-114.0621 -1.7456,-4.4354 5.5792,99.9207 7.2054,112.9595 0.6052,6.5729 4.3554,38.0313 5.1208,68.0037 1.0227,30.001 -2.6031,58.2344 -2.5773,58.2208"
         style="fill:#200006;fill-opacity:1;fill-rule:evenodd;stroke:none"
         id="path38"
         inkscape:connector-curvature="0" /><path
         d="m 473.8995,80.1006 c 5.0882,3.3511 23.6721,15.0695 35.2088,35.3386 12.3058,19.3544 17.3276,43.3435 18.9967,49.5737 1.5698,6.0089 7.3383,29.5699 9.7741,53.2029 2.6884,23.5253 3.1434,46.3383 3.2185,48.3597 -0.1177,2.0401 1.0961,-20.5433 0.1533,-45.2637 -0.542,-24.7541 -5.1803,-51.3082 -6.8133,-57.0809 -1.4304,-5.5514 -8.8847,-34.426 -24.8417,-54.5877 -15.34,-20.8992 -36,-29.336 -35.6964,-29.5426"
         style="fill:#200006;fill-opacity:1;fill-rule:evenodd;stroke:none"
         id="path40"
         inkscape:connector-curvature="0" /><path
         d="m 296.1193,304.8273 c 7.0078,-0.2574 12.4832,-6.1452 12.2275,-13.1544 -0.254,-7.0079 -6.1452,-12.483 -13.1547,-12.2273 -7.0078,0.2557 -12.483,6.1452 -12.2273,13.1545 0.2557,7.0078 6.1469,12.4829 13.1545,12.2272"
         style="fill:#200006;fill-opacity:1;fill-rule:evenodd;stroke:none"
         id="path42"
         inkscape:connector-curvature="0" /><path
         d="m 399.7899,317.6033 c -60.8519,-4.2769 -76.1561,-60.7351 -125.0192,-70.7329 -5.6492,-1.1574 -11.6665,-1.6857 -18.1528,-1.4318 -16.8142,0.6597 -11.3493,-17.5439 5.9185,-13.7151 66.687,14.777 75.2133,75.5994 137.2535,85.8798"
         style="fill:#200006;fill-opacity:1;fill-rule:evenodd;stroke:none"
         id="path44"
         inkscape:connector-curvature="0" /><path
         d="m 338.0295,303.8916 c 3.1193,0.0561 5.6968,-2.4293 5.7546,-5.5502 0.0547,-3.1196 -2.429,-5.6951 -5.5502,-5.7515 -3.1195,-0.0579 -5.6951,2.4273 -5.7512,5.5485 -0.0581,3.1195 2.4273,5.6951 5.5468,5.7532"
         style="fill:#200006;fill-opacity:1;fill-rule:evenodd;stroke:none"
         id="path46"
         inkscape:connector-curvature="0" /><path
         d="m 320.4836,299.1611 c 4.3487,0.0769 7.9367,-3.3837 8.0153,-7.7286 0.0782,-4.3501 -3.382,-7.9402 -7.7307,-8.0184 -4.3466,-0.0768 -7.9367,3.3817 -8.0132,7.7287 -0.0786,4.3483 3.382,7.9381 7.7286,8.0183"
         style="fill:#200006;fill-opacity:1;fill-rule:evenodd;stroke:none"
         id="path48"
         inkscape:connector-curvature="0" /></g></g></svg>