<?xml version="1.0" encoding="UTF-8" standalone="no"?>
<svg
   xmlns:dc="http://purl.org/dc/elements/1.1/"
   xmlns:cc="http://creativecommons.org/ns#"
   xmlns:rdf="http://www.w3.org/1999/02/22-rdf-syntax-ns#"
   xmlns:svg="http://www.w3.org/2000/svg"
   xmlns="http://www.w3.org/2000/svg"
   xmlns:sodipodi="http://sodipodi.sourceforge.net/DTD/sodipodi-0.dtd"
   xmlns:inkscape="http://www.inkscape.org/namespaces/inkscape"
   id="svg2"
   version="1.1"
   viewBox="0 0 150 100"
   sodipodi:docname="logo-globo.svg"
   width="150"
   height="100"
   inkscape:version="1.0 (4035a4fb49, 2020-05-01)"
   inkscape:export-filename="/home/phls/phls/debian/minidebconf-brasil-2020/logo-globo.png"
   inkscape:export-xdpi="96"
   inkscape:export-ydpi="96">
  <metadata
     id="metadata13">
    <rdf:RDF>
      <cc:Work
         rdf:about="">
        <dc:format>image/svg+xml</dc:format>
        <dc:type
           rdf:resource="http://purl.org/dc/dcmitype/StillImage" />
        <dc:title />
      </cc:Work>
    </rdf:RDF>
  </metadata>
  <sodipodi:namedview
     pagecolor="#ffffff"
     bordercolor="#666666"
     borderopacity="1"
     objecttolerance="10"
     gridtolerance="10"
     guidetolerance="10"
     inkscape:pageopacity="0"
     inkscape:pageshadow="2"
     inkscape:window-width="1366"
     inkscape:window-height="704"
     id="namedview11"
     showgrid="false"
     inkscape:zoom="1.34"
     inkscape:cx="-26.492537"
     inkscape:cy="82.5"
     inkscape:window-x="0"
     inkscape:window-y="0"
     inkscape:window-maximized="1"
     inkscape:current-layer="svg2"
     inkscape:document-rotation="0" />
  <defs
     id="defs6">
    <clipPath
       id="clipPath20">
      <path
         id="path18"
         d="m 529.22,627.43 v 409.39 c 0,49.04 -30.453,81.77 -73.117,81.77 -40.7,0 -64.051,-22.45 -73.27,-61.32 -27.406,44.96 -84.289,67.46 -134.12,67.46 -147.39,0 -248.71,-138.01 -248.71,-286.25 0,-146.23 79.996,-266.19 233.48,-266.19 67.074,0 115.11,24.473 145.62,69.492 h 2.011 v -34.746 c 0,-74.676 -51.054,-116.56 -122.24,-116.56 -84.34,0 -136.16,45.968 -182.92,45.968 -28.445,0 -58.945,-36.808 -58.945,-64.347 0,-80.77 170.75,-110.48 230.7,-110.48 166.72,0 281.52,88.973 281.52,265.81 z m -261.21,79.758 c -76.211,0 -113.78,55.664 -113.78,134.36 0,68.476 37.574,148.18 113.78,148.18 80.289,0 113.1,-81.718 113.1,-153.37 0,-71.504 -34.824,-129.18 -113.1,-129.18 z m 410.48,-152.89 c 43.114,0 73.934,33.047 73.934,82.617 v 636.22 c 0,49.57 -30.82,82.68 -73.934,82.68 -43.136,0 -73.933,-33.11 -73.933,-82.68 v -636.22 c 0,-49.57 30.769,-82.617 73.933,-82.617 z m 360.35,2.058 c 159.65,0 265.76,129.76 265.76,283.14 0,149.24 -109.2,285.24 -265.76,285.24 -156.6,0 -265.76,-136 -265.76,-285.24 0,-153.38 106.14,-283.14 265.76,-283.14 z m 0,433.38 c 81.4,0 115.67,-79.707 115.67,-150.24 0,-70.547 -35.3,-148.24 -115.67,-148.24 -80.369,0 -117.41,77.695 -117.41,148.24 -0.027,70.535 36.039,150.24 117.41,150.24 z m 431.8,-366.02 c 27.43,-44.903 84.42,-67.364 134.2,-67.364 147.39,0 248.7,138.02 248.7,276.99 0,143.14 -86.12,291.38 -243.62,291.38 -50.84,0 -97.98,-17.42 -136.64,-51.1 v 200.3 c 0,49.1 -33.1,81.88 -75.84,81.88 -42.68,0 -73.19,-32.78 -73.19,-81.88 v -629.65 c 0,-49.152 30.51,-81.777 73.19,-81.777 40.68,0 64.08,22.461 73.2,61.219 z m 117.47,368.66 c 76.26,0 113.86,-80.715 113.86,-150.25 0,-68.477 -37.6,-148.24 -113.86,-148.24 -80.3,0 -114.83,81.777 -114.83,153.38 0,71.555 36.6,145.11 114.83,145.11 z m 549.25,132.35 c -156.93,0 -262.85,-136 -262.85,-285.24 0,-153.38 102.76,-283.14 262.85,-283.14 160.1,0 266.45,129.76 266.45,283.14 0,149.24 -109.47,285.24 -266.45,285.24 z m 0,-430.84 c -80.55,0 -115.93,77.648 -115.93,148.24 0,70.488 34.37,150.25 115.93,150.25 81.61,0 117.74,-79.758 117.74,-150.25 0,-70.594 -37.19,-148.24 -117.74,-148.24 z M 465.96,150.346 c -41.231,0 -72.954,-33.738 -72.954,-75.199 0,-41.422 31.723,-75.16 72.954,-75.16 41.152,0 74.675,33.738 74.675,75.16 0,41.461 -33.523,75.199 -74.675,75.199 z M 777,375.856 c 40.89,0 69.328,-25.047 101.32,-25.047 30.238,0 48.883,34.844 48.883,61.7 0,62.539 -105.77,77.793 -156.42,77.793 -135.11,0 -229.32,-115.4 -229.32,-245.9 0,-134.09 91.543,-244.04 229.32,-244.04 46.18,0 156.42,22.301 156.42,88.449 0,30.45 -24.871,56.352 -55.133,56.352 -15.098,0 -57.785,-26.801 -89.824,-26.801 -69.274,0 -112.81,62.598 -112.81,126.04 0,66.16 34.692,131.46 107.56,131.46 z m 388.23,114.45 c -131.1,0 -222.52,-113.44 -222.52,-241.81 0,-131.82 88.816,-247.07 222.52,-247.07 133.72,0 222.54,115.25 222.54,247.07 0,128.38 -91.41,241.81 -222.54,241.81 z m 0,-378.14 c -67.23,0 -98.3,75.629 -98.3,136.33 0,60.738 30.19,129.27 98.3,129.27 68.14,0 98.29,-68.535 98.29,-129.27 0,-60.699 -30.97,-136.33 -98.29,-136.33 z m 753.74,378.14 c -43.64,0 -99.57,-24.153 -135.1,-65.247 -33.84,42.903 -79.17,65.247 -132.45,65.247 -47.14,0 -88.03,-19.7 -119.12,-53.645 -4.44,30.402 -25.79,48.242 -58.62,48.242 -37.34,0 -64.73,-28.594 -64.73,-71.551 V 71.912 c 0,-42.898 25,-71.496 62.4,-71.496 37.27,0 64.71,28.598 64.71,71.496 v 226.15 c 0,51.84 24.68,85.844 77.11,85.844 46.29,0 70.86,-34.004 70.86,-85.844 V 71.912 c 0,-42.898 25.06,-71.496 62.4,-71.496 37.28,0 64.71,28.598 64.71,71.496 v 226.15 c 0,51.84 33.16,85.844 80.3,85.844 46.17,0 68.04,-34.004 68.04,-85.844 V 71.912 c 0,-42.898 28.34,-71.496 65.63,-71.496 37.38,0 60.85,28.598 60.85,71.496 v 248.5 c -0.05,112.64 -62.97,169.89 -166.99,169.89 z"
         inkscape:connector-curvature="0"
         style="clip-rule:evenodd" />
    </clipPath>
    <clipPath
       id="clipPath18"
       clipPathUnits="userSpaceOnUse">
      <path
         id="path16"
         d="M 0,596.01 H 596.01 V 0 H 0 Z" />
    </clipPath>
  </defs>
  <g
     id="g12-3"
     transform="matrix(0.15788404,0,0,-0.15788404,28.007742,96.99379)">
    <g
       clip-path="url(#clipPath18)"
       id="g14-6">
      <g
         transform="translate(194.6753,297.6475)"
         id="g20">
        <path
           id="path22-7"
           style="fill:#2056ae;fill-opacity:1;fill-rule:evenodd;stroke:none"
           d="m 0,0 c 0,56.475 45.946,102.546 102.962,102.546 57.017,0 102.963,-46.071 102.963,-102.546 0,-56.475 -45.946,-102.546 -102.963,-102.546 C 45.946,-102.546 0,-56.475 0,0 m 356.313,0 c 0,-139.529 -113.516,-253.351 -253.351,-253.351 -139.835,0 -253.35,113.822 -253.35,253.351 0,139.53 113.515,253.351 253.35,253.351 C 242.797,253.351 356.313,139.53 356.313,0 m -51.137,0 c 0,-32.896 -0.186,-65.36 -3.343,-96.822 -1.72,-17.135 -10.251,-21.064 -26.144,-22.736 -54.946,-5.78 -115.789,-7.119 -172.727,-6.944 -56.937,-0.175 -117.779,1.164 -172.726,6.944 -15.892,1.672 -24.424,5.601 -26.143,22.736 -3.158,31.462 -3.344,63.926 -3.344,96.822 0,32.897 0.186,65.36 3.344,96.823 1.719,17.134 10.251,21.063 26.143,22.735 54.947,5.78 115.789,7.119 172.726,6.944 56.938,0.175 117.781,-1.164 172.727,-6.944 15.893,-1.672 24.424,-5.601 26.144,-22.735 C 304.99,65.36 305.176,32.897 305.176,0" />
      </g>
    </g>
  </g>
</svg>
