%!PS-Adobe-3.0 EPSF-3.0
%%Creator: GIMP PostScript file plugin V 1.17 by Peter Kirchgessner
%%Title: ibm.eps
%%CreationDate: Sat Mar 25 01:33:18 2006
%%DocumentData: Clean7Bit
%%LanguageLevel: 2
%%Pages: 1
%%BoundingBox: 14 14 828 318
%%EndComments
%%BeginProlog
% Use own dictionary to avoid conflicts
10 dict begin
%%EndProlog
%%Page: 1 1
% Translate for offset
14.173228346456694 14.173228346456694 translate
% Translate to begin of first scanline
0 303.01274417447257 translate
813.54330708661428 -303.01274417447257 scale
% Image geometry
443 165 8
% Transformation matrix
[ 443 0 0 165 0 0 ]
% Strings to hold RGB-samples per scanline
/rstr 443 string def
/gstr 443 string def
/bstr 443 string def
{currentfile /ASCII85Decode filter /RunLengthDecode filter rstr readstring pop}
{currentfile /ASCII85Decode filter /RunLengthDecode filter gstr readstring pop}
{currentfile /ASCII85Decode filter /RunLengthDecode filter bstr readstring pop}
true 3
%%BeginData:        12845 ASCII Bytes
colorimage
YlOS!VZ>-E_>qdZ_#W?lJ,~>
YlOS!VZ>-E_>qdZ_#W?lJ,~>
YlOS!VZ>-E_>qdZ_#W?lJ,~>
YlOS!UB&jE_#Va[^]<6kJ,~>
YlOS!UB&jE_#Va[^]<6kJ,~>
YlOS!UB&jE_#Va[^]<6kJ,~>
YlOS!T)dRE_#Va[^]<6kJ,~>
YlOS!T)dRE_#Va[^]<6kJ,~>
YlOS!T)dRE_#Va[^]<6kJ,~>
YlOS!RfM:E_#Va[^]<6kJ,~>
YlOS!RfM:E_#Va[^]<6kJ,~>
YlOS!RfM:E_#Va[^]<6kJ,~>
YlOS!R/l.E^];^\^B!-jJ,~>
YlOS!R/l.E^];^\^B!-jJ,~>
YlOS!R/l.E^];^\^B!-jJ,~>
YlOS!QN6"E^];^\^B!-jJ,~>
YlOS!QN6"E^];^\^B!-jJ,~>
YlOS!QN6"E^];^\^B!-jJ,~>
YlOS!Q2oqE^];^\^B!-jJ,~>
YlOS!Q2oqE^];^\^B!-jJ,~>
YlOS!Q2oqE^];^\^B!-jJ,~>
YlOS!PQ9eE^Au[]^&[$iJ,~>
YlOS!PQ9eE^Au[]^&[$iJ,~>
YlOS!PQ9eE^Au[]^&[$iJ,~>
YlOS!P5s_E^Au[]^&[$iJ,~>
YlOS!P5s_E^Au[]^&[$iJ,~>
YlOS!P5s_E^Au[]^&[$iJ,~>
YlOS!OT=SE^&ZU]^&[$iJ,~>
YlOS!OT=SE^&ZU]^&[$iJ,~>
YlOS!OT=SE^&ZU]^&[$iJ,~>
YlOS!O9"ME^&ZX^]`?phJ,~>
YlOS!O9"ME^&ZX^]`?phJ,~>
YlOS!O9"ME^&ZX^]`?phJ,~>
YlOS!NWAAE^&ZX^]`?phJ,~>
YlOS!NWAAE^&ZX^]`?phJ,~>
YlOS!NWAAE^&ZX^]`?phJ,~>
JcC<$JcEaiJ,~>
JcC<$JcEaiJ,~>
JcC<$JcEaiJ,~>
JcC<$JcEaiJ,~>
JcC<$JcEaiJ,~>
JcC<$JcEaiJ,~>
JcC<$JcEaiJ,~>
JcC<$JcEaiJ,~>
JcC<$JcEaiJ,~>
JcC<$JcEaiJ,~>
JcC<$JcEaiJ,~>
JcC<$JcEaiJ,~>
JcC<$JcEaiJ,~>
JcC<$JcEaiJ,~>
JcC<$JcEaiJ,~>
JcC<$JcEaiJ,~>
JcC<$JcEaiJ,~>
JcC<$JcEaiJ,~>
JcC<$JcEaiJ,~>
JcC<$JcEaiJ,~>
JcC<$JcEaiJ,~>
JcC<$JcEaiJ,~>
JcC<$JcEaiJ,~>
JcC<$JcEaiJ,~>
JcC<$JcEaiJ,~>
JcC<$JcEaiJ,~>
JcC<$JcEaiJ,~>
JcC<$JcEaiJ,~>
JcC<$JcEaiJ,~>
JcC<$JcEaiJ,~>
YlOS!K`L`E\cCLb\H(LdJ,~>
YlOS!K`L`E\cCLb\H(LdJ,~>
YlOS!K`L`E\cCLb\H(LdJ,~>
YlOS!KE1ZE\cCLb\H(LdJ,~>
YlOS!KE1ZE\cCLb\H(LdJ,~>
YlOS!KE1ZE\cCLb\H(LdJ,~>
YlOS!KE1ZE\H(Ic\,bCcJ,~>
YlOS!KE1ZE\H(Ic\,bCcJ,~>
YlOS!KE1ZE\H(Ic\,bCcJ,~>
YlOS!KE1ZE\H(Ic\,bCcJ,~>
YlOS!KE1ZE\H(Ic\,bCcJ,~>
YlOS!KE1ZE\H(Ic\,bCcJ,~>
YlOS!K)kTE\,bFd[fG:bJ,~>
YlOS!K)kTE\,bFd[fG:bJ,~>
YlOS!K)kTE\,bFd[fG:bJ,~>
YlOS!K)kTE\,bFd[fG:bJ,~>
YlOS!K)kTE\,bFd[fG:bJ,~>
YlOS!K)kTE\,bFd[fG:bJ,~>
YlOS!K)kTE\,bFd[fG:bJ,~>
YlOS!K)kTE\,bFd[fG:bJ,~>
YlOS!K)kTE\,bFd[fG:bJ,~>
YlOS!JcPNE[fGCe[K,1aJ,~>
YlOS!JcPNE[fGCe[K,1aJ,~>
YlOS!JcPNE[fGCe[K,1aJ,~>
YlOS!JcPNE[fGCe[K,1aJ,~>
YlOS!JcPNE[fGCe[K,1aJ,~>
YlOS!JcPNE[fGCe[K,1aJ,~>
YlOS!JcPNE[fGCe[K,1aJ,~>
YlOS!JcPNE[fGCe[K,1aJ,~>
YlOS!JcPNE[fGCe[K,1aJ,~>
YlOS!JcPNE[K,@f[/f(`J,~>
YlOS!JcPNE[K,@f[/f(`J,~>
YlOS!JcPNE[K,@f[/f(`J,~>
YlOS!JcPNE[K,@f[/f(`J,~>
YlOS!JcPNE[K,@f[/f(`J,~>
YlOS!JcPNE[K,@f[/f(`J,~>
JcC<$JcEaiJ,~>
JcC<$JcEaiJ,~>
JcC<$JcEaiJ,~>
JcC<$JcEaiJ,~>
JcC<$JcEaiJ,~>
JcC<$JcEaiJ,~>
JcC<$JcEaiJ,~>
JcC<$JcEaiJ,~>
JcC<$JcEaiJ,~>
JcC<$JcEaiJ,~>
JcC<$JcEaiJ,~>
JcC<$JcEaiJ,~>
JcC<$JcEaiJ,~>
JcC<$JcEaiJ,~>
JcC<$JcEaiJ,~>
JcC<$JcEaiJ,~>
JcC<$JcEaiJ,~>
JcC<$JcEaiJ,~>
JcC<$JcEaiJ,~>
JcC<$JcEaiJ,~>
JcC<$JcEaiJ,~>
JcC<$JcEaiJ,~>
JcC<$JcEaiJ,~>
JcC<$JcEaiJ,~>
JcC<$JcEaiJ,~>
JcC<$JcEaiJ,~>
JcC<$JcEaiJ,~>
JcC<$JcEaiJ,~>
JcC<$JcEaiJ,~>
JcC<$JcEaiJ,~>
li5iBaoC2thuDL4iW$t!li5!*aT$b~>
li5iBaoC2thuDL4iW$t!li5!*aT$b~>
li5iBaoC2thuDL4iW$t!li5!*aT$b~>
li5iBaoC2thuDL4iW$t!li5!*aT$b~>
li5iBaoC2thuDL4iW$t!li5!*aT$b~>
li5iBaoC2thuDL4iW$t!li5!*aT$b~>
li5iBaoC2thuDL4iW$pumJk0+aT$b~>
li5iBaoC2thuDL4iW$pumJk0+aT$b~>
li5iBaoC2thuDL4iW$pumJk0+aT$b~>
li5iBaoC2thuDL4iW$pumJk0+aT$b~>
li5iBaoC2thuDL4iW$pumJk0+aT$b~>
li5iBaoC2thuDL4iW$pumJk0+aT$b~>
li5iBaoC2thuDL4iW$pumJk0+aT$b~>
li5iBaoC2thuDL4iW$pumJk0+aT$b~>
li5iBaoC2thuDL4iW$pumJk0+aT$b~>
li5iBaoC2thuDL4iW$mtn,L?,aT$b~>
li5iBaoC2thuDL4iW$mtn,L?,aT$b~>
li5iBaoC2thuDL4iW$mtn,L?,aT$b~>
li5iBaoC2thuDL4iW$mtn,L?,aT$b~>
li5iBaoC2thuDL4iW$mtn,L?,aT$b~>
li5iBaoC2thuDL4iW$mtn,L?,aT$b~>
li5iBaoC2thuDL4iW$mtn,L?,aT$b~>
li5iBaoC2thuDL4iW$mtn,L?,aT$b~>
li5iBaoC2thuDL4iW$mtn,L?,aT$b~>
li5iBaoC2thuDO5i;^arnc-N-aT$b~>
li5iBaoC2thuDO5i;^arnc-N-aT$b~>
li5iBaoC2thuDO5i;^arnc-N-aT$b~>
li5iBaoC2thuDO5i;^arnc-N-aT$b~>
li5iBaoC2thuDO5i;^arnc-N-aT$b~>
li5iBaoC2thuDO5i;^arnc-N-aT$b~>
li5iBaoC2thuDO5i;^arnc-N-aT$b~>
li5iBaoC2thuDO5i;^arnc-N-aT$b~>
li5iBaoC2thuDO5i;^arnc-N-aT$b~>
li5iBaoC2thuDO5i;^^qoDc].aT$b~>
li5iBaoC2thuDO5i;^^qoDc].aT$b~>
li5iBaoC2thuDO5i;^^qoDc].aT$b~>
JcC<$JcEaiJ,~>
JcC<$JcEaiJ,~>
JcC<$JcEaiJ,~>
JcC<$JcEaiJ,~>
JcC<$JcEaiJ,~>
JcC<$JcEaiJ,~>
JcC<$JcEaiJ,~>
JcC<$JcEaiJ,~>
JcC<$JcEaiJ,~>
JcC<$JcEaiJ,~>
JcC<$JcEaiJ,~>
JcC<$JcEaiJ,~>
JcC<$JcEaiJ,~>
JcC<$JcEaiJ,~>
JcC<$JcEaiJ,~>
JcC<$JcEaiJ,~>
JcC<$JcEaiJ,~>
JcC<$JcEaiJ,~>
JcC<$JcEaiJ,~>
JcC<$JcEaiJ,~>
JcC<$JcEaiJ,~>
JcC<$JcEaiJ,~>
JcC<$JcEaiJ,~>
JcC<$JcEaiJ,~>
JcC<$JcEaiJ,~>
JcC<$JcEaiJ,~>
JcC<$JcEaiJ,~>
JcC<$JcEaiJ,~>
JcC<$JcEaiJ,~>
JcC<$JcEaiJ,~>
li5iBao@t5gAeqgqu=D2aT$b~>
li5iBao@t5gAeqgqu=D2aT$b~>
li5iBao@t5gAeqgqu=D2aT$b~>
li5iBao@t5gAeqgqu=D2aT$b~>
li5iBao@t5gAeqgqu=D2aT$b~>
li5iBao@t5gAeqgqu=D2aT$b~>
li5iBaoA"6g&Jhfqu=D2aT$b~>
li5iBaoA"6g&Jhfqu=D2aT$b~>
li5iBaoA"6g&Jhfqu=D2aT$b~>
li5iBaoA%7f`/\drVsS3aT$b~>
li5iBaoA%7f`/\drVsS3aT$b~>
li5iBaoA%7f`/\drVsS3aT$b~>
li5iBaoA%7f`/\drVsS3aT$b~>
li5iBaoA%7f`/\drVsS3aT$b~>
li5iBaoA%7f`/\drVsS3aT$b~>
li5iBaoA(8fDiPbrr:pW!<:pVaT$b~>
li5iBaoA(8fDiPbrr:pW!<:pVaT$b~>
li5iBaoA(8fDiPbrr:pW!<:pVaT$b~>
li5iBaoA+9f)OV-!<;!Xs8V!W!<:pVaT$b~>
li5iBaoA+9f)OV-!<;!Xs8V!W!<:pVaT$b~>
li5iBaoA+9f)OV-!<;!Xs8V!W!<:pVaT$b~>
li5iBaoA.:ec4M,!<;!Xs8V!W!<:pVaT$b~>
li5iBaoA.:ec4M,!<;!Xs8V!W!<:pVaT$b~>
li5iBaoA.:ec4M,!<;!Xs8V!W!<:pVaT$b~>
li5iBaoA1;eGnD+s8V$X!<;!Xs8UsVaT$b~>
li5iBaoA1;eGnD+s8V$X!<;!Xs8UsVaT$b~>
li5iBaoA1;eGnD+s8V$X!<;!Xs8UsVaT$b~>
li5iBaoA4<e,S;*s8Tk7s8UsVaT$b~>
li5iBaoA4<e,S;*s8Tk7s8UsVaT$b~>
li5iBaoA4<e,S;*s8Tk7s8UsVaT$b~>
li5iBaoA7=df82)s8Tk7s8UsVaT$b~>
li5iBaoA7=df82)s8Tk7s8UsVaT$b~>
li5iBaoA7=df82)s8Tk7s8UsVaT$b~>
li5iBaoA:>dJr)(rr9h8rr:jUaT$b~>
li5iBaoA:>dJr)(rr9h8rr:jUaT$b~>
li5iBaoA:>dJr)(rr9h8rr:jUaT$b~>
JcC<$JcEaiJ,~>
JcC<$JcEaiJ,~>
JcC<$JcEaiJ,~>
JcC<$JcEaiJ,~>
JcC<$JcEaiJ,~>
JcC<$JcEaiJ,~>
JcC<$JcEaiJ,~>
JcC<$JcEaiJ,~>
JcC<$JcEaiJ,~>
JcC<$JcEaiJ,~>
JcC<$JcEaiJ,~>
JcC<$JcEaiJ,~>
JcC<$JcEaiJ,~>
JcC<$JcEaiJ,~>
JcC<$JcEaiJ,~>
JcC<$JcEaiJ,~>
JcC<$JcEaiJ,~>
JcC<$JcEaiJ,~>
JcC<$JcEaiJ,~>
JcC<$JcEaiJ,~>
JcC<$JcEaiJ,~>
JcC<$JcEaiJ,~>
JcC<$JcEaiJ,~>
JcC<$JcEaiJ,~>
JcC<$JcEaiJ,~>
JcC<$JcEaiJ,~>
JcC<$JcEaiJ,~>
li5iBaoA:>dJr)(qu=_;qu>ORaT$b~>
li5iBaoA:>dJr)(qu=_;qu>ORaT$b~>
li5iBaoA:>dJr)(qu=_;qu>ORaT$b~>
li5iBaoA7=df82)qu=b<qZ#FQaT$b~>
li5iBaoA7=df82)qu=b<qZ#FQaT$b~>
li5iBaoA7=df82)qu=b<qZ#FQaT$b~>
li5iBaoA4<e,S;*qZ"\<qZ#FQaT$b~>
li5iBaoA4<e,S;*qZ"\<qZ#FQaT$b~>
li5iBaoA4<e,S;*qZ"\<qZ#FQaT$b~>
li5iBaoA1;eGnD+qZ"\<qZ#FQaT$b~>
li5iBaoA1;eGnD+qZ"\<qZ#FQaT$b~>
li5iBaoA1;eGnD+qZ"\<qZ#FQaT$b~>
li5iBaoA.:ec4M,qZ"_=q>]=PaT$b~>
li5iBaoA.:ec4M,qZ"_=q>]=PaT$b~>
li5iBaoA.:ec4M,qZ"_=q>]=PaT$b~>
li5iBaoA+9f)OV-q>\Y=q>]=PaT$b~>
li5iBaoA+9f)OV-q>\Y=q>]=PaT$b~>
li5iBaoA+9f)OV-q>\Y=q>]=PaT$b~>
li5iBaoA(8fDj_.q>\Y=q>]=PaT$b~>
li5iBaoA(8fDj_.q>\Y=q>]=PaT$b~>
li5iBaoA(8fDj_.q>\Y=q>]=PaT$b~>
li5iBaoA%7f`0h/q>\\>q#B4OaT$b~>
li5iBaoA%7f`0h/q>\\>q#B4OaT$b~>
li5iBaoA%7f`0h/q>\\>q#B4OaT$b~>
li5iBaoA%7f`0h/q#AV>q#B4OaT$b~>
li5iBaoA%7f`0h/q#AV>q#B4OaT$b~>
li5iBaoA%7f`0h/q#AV>q#B4OaT$b~>
li5iBaoA"6g&Kq0q#AV>q#B4OaT$b~>
li5iBaoA"6g&Kq0q#AV>q#B4OaT$b~>
li5iBaoA"6g&Kq0q#AV>q#B4OaT$b~>
li5iBao@t5gAg%1p]&S?p]'+NaT$b~>
li5iBao@t5gAg%1p]&S?p]'+NaT$b~>
li5iBao@t5gAg%1p]&S?p]'+NaT$b~>
li5iBao@q4g]-.2p]&S?p]'+NaT$b~>
li5iBao@q4g]-.2p]&S?p]'+NaT$b~>
li5iBao@q4g]-.2p]&S?p]'+NaT$b~>
li5iBao@q4g]-.2p]&V@pAa"MaT$b~>
li5iBao@q4g]-.2p]&V@pAa"MaT$b~>
li5iBao@q4g]-.2p]&V@pAa"MaT$b~>
JcC<$JcEaiJ,~>
JcC<$JcEaiJ,~>
JcC<$JcEaiJ,~>
JcC<$JcEaiJ,~>
JcC<$JcEaiJ,~>
JcC<$JcEaiJ,~>
JcC<$JcEaiJ,~>
JcC<$JcEaiJ,~>
JcC<$JcEaiJ,~>
JcC<$JcEaiJ,~>
JcC<$JcEaiJ,~>
JcC<$JcEaiJ,~>
JcC<$JcEaiJ,~>
JcC<$JcEaiJ,~>
JcC<$JcEaiJ,~>
JcC<$JcEaiJ,~>
JcC<$JcEaiJ,~>
JcC<$JcEaiJ,~>
JcC<$JcEaiJ,~>
JcC<$JcEaiJ,~>
JcC<$JcEaiJ,~>
JcC<$JcEaiJ,~>
JcC<$JcEaiJ,~>
JcC<$JcEaiJ,~>
JcC<$JcEaiJ,~>
JcC<$JcEaiJ,~>
JcC<$JcEaiJ,~>
li5iBaoC2thuDO5i;_[7oDdGCoDd\JaT$b~>
li5iBaoC2thuDO5i;_[7oDdGCoDd\JaT$b~>
li5iBaoC2thuDO5i;_[7oDdGCoDd\JaT$b~>
li5iBaoC2thuDO5i;_[7oDdGCoDd\JaT$b~>
li5iBaoC2thuDO5i;_[7oDdGCoDd\JaT$b~>
li5iBaoC2thuDO5i;_[7oDdGCoDd\JaT$b~>
li5iBaoC2thuDL4iW%d8oDdJDo)ISIaT$b~>
li5iBaoC2thuDL4iW%d8oDdJDo)ISIaT$b~>
li5iBaoC2thuDL4iW%d8oDdJDo)ISIaT$b~>
li5iBaoC2thuDL4iW%d8o)IDDo)ISIaT$b~>
li5iBaoC2thuDL4iW%d8o)IDDo)ISIaT$b~>
li5iBaoC2thuDL4iW%d8o)IDDo)ISIaT$b~>
li5iBaoC2thuDL4iW%d8o)IDDo)ISIaT$b~>
li5iBaoC2thuDL4iW%d8o)IDDo)ISIaT$b~>
li5iBaoC2thuDL4iW%d8o)IDDo)ISIaT$b~>
li5iBaoC2thuDI3ir@m9nc.AEnc.JHaT$b~>
li5iBaoC2thuDI3ir@m9nc.AEnc.JHaT$b~>
li5iBaoC2thuDI3ir@m9nc.AEnc.JHaT$b~>
li5iBaoC2thuDI3ir@m9nc.AEnc.JHaT$b~>
li5iBaoC2thuDI3ir@m9nc.AEnc.JHaT$b~>
li5iBaoC2thuDI3ir@m9nc.AEnc.JHaT$b~>
li5iBaoC2thuDI3ir@m9nc.DFnGhAGaT$b~>
li5iBaoC2thuDI3ir@m9nc.DFnGhAGaT$b~>
li5iBaoC2thuDI3ir@m9nc.DFnGhAGaT$b~>
li5iBaoC2thuDI3ir@m9nGh>FnGhAGaT$b~>
li5iBaoC2thuDI3ir@m9nGh>FnGhAGaT$b~>
li5iBaoC2thuDI3ir@m9nGh>FnGhAGaT$b~>
li5iBaoC2thuDI3ir@m9nGh>FnGhAGaT$b~>
li5iBaoC2thuDI3ir@m9nGh>FnGhAGaT$b~>
li5iBaoC2thuDI3ir@m9nGh>FnGhAGaT$b~>
li5iBaoC2thuDI3ir@m9nGhAGn,M8FaT$b~>
li5iBaoC2thuDI3ir@m9nGhAGn,M8FaT$b~>
li5iBaoC2thuDI3ir@m9nGhAGn,M8FaT$b~>
li5iBaoC2thuDI3ir@m9n,M;Gn,M8FaT$b~>
li5iBaoC2thuDI3ir@m9n,M;Gn,M8FaT$b~>
li5iBaoC2thuDI3ir@m9n,M;Gn,M8FaT$b~>
li5iBaoC2thuDI3ir@m9n,M;Gn,M8FaT$b~>
li5iBaoC2thuDI3ir@m9n,M;Gn,M8FaT$b~>
li5iBaoC2thuDI3ir@m9n,M;Gn,M8FaT$b~>
JcC<$JcEaiJ,~>
JcC<$JcEaiJ,~>
JcC<$JcEaiJ,~>
JcC<$JcEaiJ,~>
JcC<$JcEaiJ,~>
JcC<$JcEaiJ,~>
JcC<$JcEaiJ,~>
JcC<$JcEaiJ,~>
JcC<$JcEaiJ,~>
JcC<$JcEaiJ,~>
JcC<$JcEaiJ,~>
JcC<$JcEaiJ,~>
JcC<$JcEaiJ,~>
JcC<$JcEaiJ,~>
JcC<$JcEaiJ,~>
JcC<$JcEaiJ,~>
JcC<$JcEaiJ,~>
JcC<$JcEaiJ,~>
JcC<$JcEaiJ,~>
JcC<$JcEaiJ,~>
JcC<$JcEaiJ,~>
JcC<$JcEaiJ,~>
JcC<$JcEaiJ,~>
JcC<$JcEaiJ,~>
JcC<$JcEaiJ,~>
JcC<$JcEaiJ,~>
JcC<$JcEaiJ,~>
YlOS!JH5HEaT1Z,kQ'rKaT12tJ,~>
YlOS!JH5HEaT1Z,kQ'rKaT12tJ,~>
YlOS!JH5HEaT1Z,kQ'rKaT12tJ,~>
YlOS!JH5HEaT1Z,kQ'rKaT12tJ,~>
YlOS!JH5HEaT1Z,kQ'rKaT12tJ,~>
YlOS!JH5HEaT1Z,kQ'rKaT12tJ,~>
YlOS!JcPNEaT1Z,klC#KaT12tJ,~>
YlOS!JcPNEaT1Z,klC#KaT12tJ,~>
YlOS!JcPNEaT1Z,klC#KaT12tJ,~>
YlOS!JcPNEaT1W+l2^,LaT12tJ,~>
YlOS!JcPNEaT1W+l2^,LaT12tJ,~>
YlOS!JcPNEaT1W+l2^,LaT12tJ,~>
YlOS!JcPNEaT1W+l2^,LaT12tJ,~>
YlOS!JcPNEaT1W+l2^,LaT12tJ,~>
YlOS!JcPNEaT1W+l2^,LaT12tJ,~>
YlOS!JcPNEaT1W+lN$2LaT12tJ,~>
YlOS!JcPNEaT1W+lN$2LaT12tJ,~>
YlOS!JcPNEaT1W+lN$2LaT12tJ,~>
YlOS!K)kTEaT1T*li?;MaT12tJ,~>
YlOS!K)kTEaT1T*li?;MaT12tJ,~>
YlOS!K)kTEaT1T*li?;MaT12tJ,~>
YlOS!K)kTEaT1T*li?;MaT12tJ,~>
YlOS!K)kTEaT1T*li?;MaT12tJ,~>
YlOS!K)kTEaT1T*li?;MaT12tJ,~>
YlOS!K)kTEaT1T*m/ZAMaT12tJ,~>
YlOS!K)kTEaT1T*m/ZAMaT12tJ,~>
YlOS!K)kTEaT1T*m/ZAMaT12tJ,~>
YlOS!KE1ZEaT1Q)mJuJNaT12tJ,~>
YlOS!KE1ZEaT1Q)mJuJNaT12tJ,~>
YlOS!KE1ZEaT1Q)mJuJNaT12tJ,~>
YlOS!K`L`EaT1Q)mJuJNaT12tJ,~>
YlOS!K`L`EaT1Q)mJuJNaT12tJ,~>
YlOS!K`L`EaT1Q)mJuJNaT12tJ,~>
YlOS!K`L`EaT1Q)mf;PNaT1Z,r;cWmJ,~>
YlOS!K`L`EaT1Q)mf;PNaT1Z,r;cWmJ,~>
YlOS!K`L`EaT1Q)mf;PNaT1Z,r;cWmJ,~>
JcC<$JcF@%p&P!iJ,~>
JcC<$JcF@%p&P!iJ,~>
JcC<$JcF@%p&P!iJ,~>
JcC<$JcFC&quH`rqZ-TpJ,~>
JcC<$JcFC&quH`rqZ-TpJ,~>
JcC<$JcFC&quH`rqZ-TpJ,~>
JcC<$JcFF'rW)`nr;cisJ,~>
JcC<$JcFF'rW)`nr;cisJ,~>
JcC<$JcFF'rW)`nr;cisJ,~>
JcC<$JcFI(rW)WkrW)uuJ,~>
JcC<$JcFI(rW)WkrW)uuJ,~>
JcC<$JcFI(rW)WkrW)uuJ,~>
JcC<$JcFL)rW)uuq#LBnrrE*!J,~>
JcC<$JcFL)rW)uuq#LBnrrE*!J,~>
JcC<$JcFL)rW)uuq#LBnrrE*!J,~>
JcC<$JcFO*rW)rtpAk6nrVuruJ,~>
JcC<$JcFO*rW)rtpAk6nrVuruJ,~>
JcC<$JcFO*rW)rtpAk6nrVuruJ,~>
JcC<$JcFO*rW)rtrrDrrrrE&urW%H~>
JcC<$JcFO*rW)rtrrDrrrrE&urW%H~>
JcC<$JcFO*rW)rtrrDrrrrE&urW%H~>
JcC<$JcFO*rrE#trrDrrrW)rtrr@Q~>
JcC<$JcFO*rrE#trrDrrrW)rtrr@Q~>
JcC<$JcFO*rrE#trrDrrrW)rtrr@Q~>
JcC<$JcFO*rrE#trrDrrrW)rtrr@Q~>
JcC<$JcFO*rrE#trrDrrrW)rtrr@Q~>
JcC<$JcFO*rrE#trrDrrrW)rtrr@Q~>
JcC<$JcFR+rW)osrrE#tr;cfrrr@Q~>
JcC<$JcFR+rW)osrrE#tr;cfrrr@Q~>
JcC<$JcFR+rW)osrrE#tr;cfrrr@Q~>
YlOS!N<&;EaT1E%pAj7RaT2#6rW)ospAk0lrr@Q~>
YlOS!N<&;EaT1E%pAj7RaT2#6rW)ospAk0lrr@Q~>
YlOS!N<&;EaT1E%pAj7RaT2#6rW)ospAk0lrr@Q~>
YlOS!Nr\GEaT1B$p]0@SaT2#6rW)osrrE&urrDoqrr@Q~>
YlOS!Nr\GEaT1B$p]0@SaT2#6rW)osrrE&urrDoqrr@Q~>
YlOS!Nr\GEaT1B$p]0@SaT2#6rW)osrrE&urrDoqrr@Q~>
YlOS!O9"MEaT1B$p]0@SaT1u5rrE#trrE&urW)iqrr@Q~>
YlOS!O9"MEaT1B$p]0@SaT1u5rrE#trrE&urW)iqrr@Q~>
YlOS!O9"MEaT1B$p]0@SaT1u5rrE#trrE&urW)iqrr@Q~>
YlOS!OT=SEaT1B$q#KFSaT1u5rrE#trrE#trW)lrrr@Q~>
YlOS!OT=SEaT1B$q#KFSaT1u5rrE#trrE#trW)lrrr@Q~>
YlOS!OT=SEaT1B$q#KFSaT1u5rrE#trrE#trW)lrrr@Q~>
YlOS!OoXYEaT1?#q>fOTaT1u5rrE#trrDusrrE#trW%H~>
YlOS!OoXYEaT1?#q>fOTaT1u5rrE#trrDusrrE#trW%H~>
YlOS!OoXYEaT1?#q>fOTaT1u5rrE#trrDusrrE#trW%H~>
YlOS!PQ9eEaT1?#q>fOTaT1u5rW)rtrrDusrW)rtrr<'!J,~>
YlOS!PQ9eEaT1?#q>fOTaT1u5rW)rtrrDusrW)rtrr<'!J,~>
YlOS!PQ9eEaT1?#q>fOTaT1u5rW)rtrrDusrW)rtrr<'!J,~>
YlOS!Q2oqEaT1?#qZ,UTaT1r4rW)uurrDrrrVururVuruJ,~>
YlOS!Q2oqEaT1?#qZ,UTaT1r4rW)uurrDrrrVururVuruJ,~>
YlOS!Q2oqEaT1?#qZ,UTaT1r4rW)uurrDrrrVururVuruJ,~>
YlOS!QN6"EaT1<"quG^UaT1o3rW)WkrW)uuJ,~>
YlOS!QN6"EaT1<"quG^UaT1o3rW)WkrW)uuJ,~>
YlOS!QN6"EaT1<"quG^UaT1o3rW)WkrW)uuJ,~>
YlOS!R/l.EaT1<"quG^UaT1o3r;cTlrW)rtJ,~>
YlOS!R/l.EaT1<"quG^UaT1o3r;cTlrW)rtJ,~>
YlOS!R/l.EaT1<"quG^UaT1o3r;cTlrW)rtJ,~>
YlOS!S,h@EaT1<"r;bdUaT1l2r;c]or;cfrJ,~>
YlOS!S,h@EaT1<"r;bdUaT1l2r;c]or;cfrJ,~>
YlOS!S,h@EaT1<"r;bdUaT1l2r;c]or;cfrJ,~>
YlOS!T)dREaT19!rW(mVaT1f0o`4piJ,~>
YlOS!T)dREaT19!rW(mVaT1f0o`4piJ,~>
YlOS!T)dREaT19!rW(mVaT1f0o`4piJ,~>
YlOS!U]ApEaT19!rW(mVaT1`.q#L9kJ,~>
YlOS!U]ApEaT19!rW(mVaT1`.q#L9kJ,~>
YlOS!U]ApEaT19!rW(mVaT1`.q#L9kJ,~>
%%EndData
showpage
%%Trailer
end
%%EOF
