%!PS-Adobe-3.0 EPSF-3.0 
%%BoundingBox: 0 0 755 575
%%Pages: 0
%%Creator: Sun Microsystems, Inc.
%%Title: none
%%CreationDate: none
%%LanguageLevel: 2
%%EndComments
%%BeginProlog
%%BeginResource: SDRes
/b4_inc_state save def
/dict_count countdictstack def
/op_count count 1 sub def
userdict begin
0 setgray 0 setlinecap 1 setlinewidth 0 setlinejoin 10 setmiterlimit[] 0 setdash newpath
/languagelevel where {pop languagelevel 1 ne {false setstrokeadjust false setoverprint} if} if
/bdef {bind def} bind def
/c {setrgbcolor} bdef
/l {neg lineto} bdef
/rl {neg rlineto} bdef
/lc {setlinecap} bdef
/lj {setlinejoin} bdef
/lw {setlinewidth} bdef
/ml {setmiterlimit} bdef
/ld {setdash} bdef
/m {neg moveto} bdef
/ct {6 2 roll neg 6 2 roll neg 6 2 roll neg curveto} bdef
/r {rotate} bdef
/t {neg translate} bdef
/s {scale} bdef
/sw {show} bdef
/gs {gsave} bdef
/gr {grestore} bdef
/f {findfont dup length dict begin
{1 index /FID ne {def} {pop pop} ifelse} forall /Encoding ISOLatin1Encoding def
currentdict end /NFont exch definefont pop /NFont findfont} bdef
/p {closepath} bdef
/sf {scalefont setfont} bdef
/ef {eofill}bdef
/pc {closepath stroke}bdef
/ps {stroke}bdef
/pum {matrix currentmatrix}bdef
/pom {setmatrix}bdef
/bs {/aString exch def /nXOfs exch def /nWidth exch def currentpoint nXOfs 0 rmoveto pum nWidth aString stringwidth pop div 1 scale aString show pom moveto} bdef
%%EndResource
%%EndProlog
%%BeginSetup
%%EndSetup
%%Page: 1 1
%%BeginPageSetup
%%EndPageSetup
pum
0.02834 0.02833 s 
0 -20290 t
/tm matrix currentmatrix def
gs
tm setmatrix
-635 -635 t 
1 1 s 
635 635 m 27274 635 l 27274 20924 l 635 20924 l 635 635 l eoclip newpath
0.140 0.003 0.863 c 11811 15875 m  635 15875 l  635 635 l  22987 635 l  22987 15875 l 
11811 15875 l  p ef
0 lw 1 lj 0.003 0.003 0.003 c 11811 15875 m  635 15875 l  635 635 l  22987 635 l 
22987 15875 l  11811 15875 l  pc
1.000 1.000 1.000 c 11770 8288 m  3279 8288 l  3279 8099 l  20261 8099 l 
20261 8288 l  11770 8288 l  p ef
11770 8288 m  3279 8288 l  3279 8099 l  20261 8099 l  20261 8288 l  11770 8288 l 
pc
gs
pum
3420 7202 t
1526 -1150 m  1490 -1170 l  1490 -1196 1485 -1216 1474 -1231 ct 1463 -1247 1415 -1284 1330 -1343 ct 
1246 -1402 1115 -1432 937 -1432 ct 823 -1432 726 -1420 643 -1397 ct 561 -1373 516 -1319 508 -1234 ct 
508 -1176 529 -1136 571 -1113 ct 613 -1090 734 -1069 932 -1049 ct 1130 -1028 1311 -989 1477 -932 ct 
1642 -874 1724 -735 1724 -515 ct 1724 -325 1645 -187 1487 -100 ct 1328 -13 1146 30 939 30 ct 
828 30 719 19 614 -3 ct 509 -26 426 -53 365 -85 ct 304 -116 265 -137 246 -147 ct 
227 -157 210 -162 195 -162 ct 176 -162 157 -154 137 -137 ct 101 -154 l  284 -568 l 
322 -553 l  322 -458 393 -386 535 -335 ct 678 -284 808 -259 927 -259 ct 1038 -259 1140 -276 1230 -309 ct 
1321 -343 1366 -405 1366 -495 ct 1366 -585 1234 -645 971 -675 ct 708 -706 508 -745 370 -795 ct 
233 -844 165 -973 165 -1183 ct 165 -1373 239 -1510 388 -1595 ct 537 -1679 714 -1722 919 -1722 ct 
1014 -1722 1109 -1710 1206 -1686 ct 1303 -1662 1380 -1637 1440 -1611 ct 1499 -1585 1540 -1567 1562 -1558 ct 
1584 -1548 1606 -1542 1628 -1539 ct 1636 -1539 1646 -1541 1657 -1545 ct 1668 -1549 1679 -1557 1691 -1567 ct 
1727 -1549 l  p ef
2410 -1386 m  2410 -1353 l  2357 -1338 2331 -1308 2331 -1262 ct 2331 -127 l 
2331 -101 2337 -81 2350 -67 ct 2363 -52 2383 -41 2410 -33 ct 2410 0 l  1919 0 l 
1919 -33 l  1972 -46 1998 -77 1998 -127 ct 1998 -1262 l  1998 -1309 1972 -1340 1919 -1353 ct 
1919 -1386 l  p ef
2963 -127 m  2963 -81 2991 -49 3045 -33 ct 3045 0 l  2582 0 l  2582 -33 l 
2635 -46 2661 -77 2661 -127 ct 2661 -1262 l  2661 -1309 2635 -1340 2582 -1353 ct 
2582 -1386 l  3116 -1386 l  3116 -1353 l  3097 -1350 3083 -1345 3074 -1338 ct 
3065 -1331 3060 -1320 3060 -1305 ct 3060 -1292 3062 -1281 3068 -1273 ct 3073 -1266 3084 -1253 3101 -1234 ct 
3845 -497 l  3845 -1262 l  3845 -1309 3819 -1340 3766 -1353 ct 3766 -1386 l 
4228 -1386 l  4228 -1353 l  4174 -1340 4147 -1309 4147 -1262 ct 4147 -127 l 
4147 -81 4174 -49 4228 -33 ct 4228 0 l  3730 0 l  3730 -33 l  3742 -34 3754 -38 3766 -44 ct 
3778 -50 3784 -60 3784 -76 ct 3784 -99 3772 -122 3747 -144 ct 3722 -166 3707 -181 3700 -187 ct 
2963 -914 l  p ef
4825 -254 m  5706 -254 l  5752 -254 5783 -280 5800 -332 ct 5833 -332 l  5833 78 l 
5800 78 l  5787 26 5755 0 5706 0 ct 4413 0 l  4413 -35 l  4466 -49 4492 -79 4492 -127 ct 
4492 -1262 l  4492 -1309 4466 -1340 4413 -1353 ct 4413 -1389 l  5668 -1389 l 
5714 -1389 5745 -1415 5762 -1468 ct 5795 -1468 l  5795 -1056 l  5762 -1056 l 
5745 -1109 5714 -1135 5668 -1135 ct 4825 -1135 l  4825 -833 l  5348 -833 l 
5375 -833 5396 -839 5409 -852 ct 5423 -864 5434 -884 5442 -911 ct 5475 -911 l 
5475 -510 l  5440 -510 l  5426 -564 5396 -591 5348 -591 ct 4825 -591 l  p ef
7156 -129 m  7156 -104 7163 -84 7175 -71 ct 7188 -57 7208 -47 7235 -40 ct 7235 0 l 
6737 0 l  6737 -40 l  6763 -47 6782 -57 6796 -71 ct 6809 -84 6816 -104 6816 -129 ct 
6816 -1564 l  6816 -1590 6809 -1609 6797 -1623 ct 6784 -1636 6764 -1646 6737 -1653 ct 
6737 -1694 l  7314 -1694 l  7314 -1653 l  7297 -1648 7284 -1642 7274 -1634 ct 
7265 -1626 7260 -1614 7260 -1597 ct 7260 -1585 7264 -1574 7271 -1563 ct 7277 -1552 7285 -1541 7293 -1531 ct 
8228 -558 l  8228 -1564 l  8228 -1610 8201 -1640 8147 -1653 ct 8147 -1694 l 
8645 -1694 l  8645 -1653 l  8619 -1646 8600 -1636 8586 -1623 ct 8573 -1609 8566 -1590 8566 -1564 ct 
8566 -129 l  8566 -104 8572 -84 8585 -71 ct 8598 -57 8618 -47 8645 -40 ct 8645 0 l 
8114 0 l  8114 -40 l  8134 -45 8147 -51 8153 -57 ct 8159 -63 8163 -72 8165 -86 ct 
8165 -101 8160 -115 8151 -128 ct 8141 -140 8126 -158 8104 -180 ct 7156 -1160 l 
p ef
9622 30 m  9391 30 9198 -33 9041 -162 ct 8885 -291 8806 -468 8806 -693 ct 8806 -918 8885 -1095 9041 -1224 ct 
9198 -1352 9391 -1417 9622 -1417 ct 9850 -1417 10043 -1352 10200 -1224 ct 10356 -1095 10435 -918 10435 -693 ct 
10435 -469 10356 -293 10198 -163 ct 10041 -34 l  9849 30 l  p
9622 -1155 m  9486 -1155 9374 -1112 9284 -1026 ct 9194 -939 9149 -828 9149 -693 ct 
9149 -557 9194 -447 9284 -360 ct 9374 -274 9486 -231 9622 -231 ct 9756 -231 9868 -274 9958 -361 ct 
10049 -449 10094 -559 10094 -693 ct 10094 -828 10049 -939 9960 -1026 ct 9870 -1112 l 
9757 -1155 l  p ef
10993 -911 m  10993 -127 l  10993 -81 11020 -49 11074 -33 ct 11074 0 l  10612 0 l 
10612 -33 l  10664 -46 10691 -77 10691 -127 ct 10691 -1262 l  10691 -1309 10664 -1340 10612 -1353 ct 
10612 -1386 l  11199 -1386 l  11199 -1353 l  11180 -1347 11166 -1338 11155 -1328 ct 
11145 -1318 11140 -1303 11140 -1285 ct 11140 -1264 11144 -1243 11153 -1221 ct 
11161 -1199 11172 -1179 11183 -1160 ct 11529 -576 l  11877 -1150 l  11894 -1179 11907 -1202 11917 -1220 ct 
11928 -1238 11934 -1257 11935 -1277 ct 11935 -1318 11916 -1343 11877 -1353 ct 
11877 -1386 l  12448 -1386 l  12448 -1353 l  12394 -1340 12367 -1309 12367 -1262 ct 
12367 -127 l  12367 -81 12394 -49 12448 -33 ct 12448 0 l  11956 0 l  11956 -33 l 
11983 -41 12003 -52 12016 -66 ct 12030 -79 12037 -99 12037 -127 ct 12037 -911 l 
11501 -43 l  p ef
13119 -1386 m  13119 -1353 l  13066 -1338 13040 -1308 13040 -1262 ct 13040 -127 l 
13040 -101 13046 -81 13059 -67 ct 13072 -52 13092 -41 13119 -33 ct 13119 0 l 
12628 0 l  12628 -33 l  12681 -46 12707 -77 12707 -127 ct 12707 -1262 l  12707 -1309 12681 -1340 12628 -1353 ct 
12628 -1386 l  p ef
13672 -127 m  13672 -81 13700 -49 13754 -33 ct 13754 0 l  13291 0 l  13291 -33 l 
13344 -46 13370 -77 13370 -127 ct 13370 -1262 l  13370 -1309 13344 -1340 13291 -1353 ct 
13291 -1386 l  13825 -1386 l  13825 -1353 l  13806 -1350 13792 -1345 13783 -1338 ct 
13774 -1331 13769 -1320 13769 -1305 ct 13769 -1292 13771 -1281 13777 -1273 ct 
13782 -1266 13793 -1253 13810 -1234 ct 14554 -497 l  14554 -1262 l  14554 -1309 14528 -1340 14475 -1353 ct 
14475 -1386 l  14937 -1386 l  14937 -1353 l  14883 -1340 14856 -1309 14856 -1262 ct 
14856 -127 l  14856 -81 14883 -49 14937 -33 ct 14937 0 l  14439 0 l  14439 -33 l 
14451 -34 14463 -38 14475 -44 ct 14487 -50 14493 -60 14493 -76 ct 14493 -99 14481 -122 14456 -144 ct 
14431 -166 14416 -181 14409 -187 ct 13672 -914 l  p ef
15534 -254 m  16415 -254 l  16461 -254 16492 -280 16509 -332 ct 16542 -332 l 
16542 78 l  16509 78 l  16496 26 16464 0 16415 0 ct 15122 0 l  15122 -35 l 
15175 -49 15201 -79 15201 -127 ct 15201 -1262 l  15201 -1309 15175 -1340 15122 -1353 ct 
15122 -1389 l  16377 -1389 l  16423 -1389 16454 -1415 16471 -1468 ct 16504 -1468 l 
16504 -1056 l  16471 -1056 l  16454 -1109 16423 -1135 16377 -1135 ct 15534 -1135 l 
15534 -833 l  16057 -833 l  16084 -833 16105 -839 16118 -852 ct 16132 -864 16143 -884 16151 -911 ct 
16184 -911 l  16184 -510 l  16149 -510 l  16135 -564 16105 -591 16057 -591 ct 
15534 -591 l  p ef
pom
gr
gs
pum
3490 10795 t
716 -431 m  601 -193 l  593 -172 587 -157 584 -148 ct 580 -139 579 -128 579 -116 ct 
579 -96 586 -80 600 -68 ct 615 -56 635 -47 660 -40 ct 660 0 l  101 0 l  101 -40 l 
137 -47 163 -60 180 -78 ct 197 -97 215 -127 236 -170 ct 858 -1473 l  866 -1488 874 -1504 880 -1520 ct 
886 -1536 889 -1551 889 -1567 ct 889 -1609 865 -1638 817 -1653 ct 817 -1694 l 
1417 -1694 l  1417 -1653 l  1400 -1648 1383 -1640 1367 -1630 ct 1351 -1620 1343 -1603 1343 -1579 ct 
1343 -1569 1345 -1558 1348 -1546 ct 1352 -1535 1358 -1518 1366 -1498 ct 2014 -193 l 
2037 -143 2059 -107 2078 -85 ct 2098 -62 2127 -47 2166 -40 ct 2166 0 l  1544 0 l 
1544 -40 l  1569 -44 1589 -50 1604 -60 ct 1618 -71 1625 -87 1625 -109 ct 1625 -139 1617 -167 1602 -193 ct 
1485 -431 l  p
1104 -1267 m  825 -662 l  1379 -662 l  p ef
3540 -939 m  3510 -955 l  3510 -1017 3450 -1068 3330 -1107 ct 3209 -1146 3105 -1165 3017 -1165 ct 
2934 -1165 2854 -1154 2777 -1131 ct 2700 -1108 2657 -1065 2649 -1003 ct 2649 -932 2765 -883 2997 -858 ct 
3229 -833 3410 -798 3539 -754 ct 3669 -710 3733 -598 3733 -419 ct 3733 -265 3664 -151 3525 -78 ct 
3386 -5 3232 30 3063 30 ct 2958 30 2856 21 2757 2 ct 2658 -16 2563 -46 2471 -88 ct 
2451 -95 2431 -103 2413 -111 ct 2396 -111 2379 -101 2362 -81 ct 2331 -93 l  2474 -434 l 
2507 -421 l  2507 -352 2571 -301 2701 -269 ct 2831 -237 2946 -220 3048 -220 ct 
3134 -220 3216 -232 3294 -256 ct 3372 -280 3411 -325 3411 -391 ct 3411 -467 3295 -515 3064 -535 ct 
2833 -556 2657 -586 2537 -626 ct 2417 -665 2357 -778 2357 -965 ct 2357 -1119 2422 -1233 2552 -1306 ct 
2683 -1380 2832 -1417 2999 -1417 ct 3099 -1417 3204 -1400 3314 -1366 ct 3418 -1327 3521 -1289 3624 -1252 ct 
3634 -1252 3644 -1254 3652 -1259 ct 3661 -1264 3669 -1270 3678 -1277 ct 3708 -1262 l 
p ef
5118 -939 m  5088 -955 l  5088 -1017 5028 -1068 4908 -1107 ct 4787 -1146 4683 -1165 4595 -1165 ct 
4512 -1165 4432 -1154 4355 -1131 ct 4278 -1108 4235 -1065 4227 -1003 ct 4227 -932 4343 -883 4575 -858 ct 
4807 -833 4988 -798 5117 -754 ct 5247 -710 5311 -598 5311 -419 ct 5311 -265 5242 -151 5103 -78 ct 
4964 -5 4810 30 4641 30 ct 4536 30 4434 21 4335 2 ct 4236 -16 4141 -46 4049 -88 ct 
4029 -95 4009 -103 3991 -111 ct 3974 -111 3957 -101 3940 -81 ct 3909 -93 l  4052 -434 l 
4085 -421 l  4085 -352 4149 -301 4279 -269 ct 4409 -237 4524 -220 4626 -220 ct 
4712 -220 4794 -232 4872 -256 ct 4950 -280 4989 -325 4989 -391 ct 4989 -467 4873 -515 4642 -535 ct 
4411 -556 4235 -586 4115 -626 ct 3995 -665 3935 -778 3935 -965 ct 3935 -1119 4000 -1233 4130 -1306 ct 
4261 -1380 4410 -1417 4577 -1417 ct 4677 -1417 4782 -1400 4892 -1366 ct 4996 -1327 5099 -1289 5202 -1252 ct 
5212 -1252 5222 -1254 5230 -1259 ct 5239 -1264 5247 -1270 5256 -1277 ct 5286 -1262 l 
p ef
6304 30 m  6073 30 5880 -33 5723 -162 ct 5567 -291 5488 -468 5488 -693 ct 5488 -918 5567 -1095 5723 -1224 ct 
5880 -1352 6073 -1417 6304 -1417 ct 6532 -1417 6725 -1352 6882 -1224 ct 7038 -1095 7117 -918 7117 -693 ct 
7117 -469 7038 -293 6880 -163 ct 6723 -34 l  6531 30 l  p
6304 -1155 m  6168 -1155 6056 -1112 5966 -1026 ct 5876 -939 5831 -828 5831 -693 ct 
5831 -557 5876 -447 5966 -360 ct 6056 -274 6168 -231 6304 -231 ct 6438 -231 6550 -274 6640 -361 ct 
6731 -449 6776 -559 6776 -693 ct 6776 -828 6731 -939 6642 -1026 ct 6552 -1112 l 
6439 -1155 l  p ef
8894 -190 m  8866 -170 l  8849 -183 8833 -190 8818 -190 ct 8711 -132 8600 -81 8484 -36 ct 
8368 8 8252 30 8137 30 ct 7900 30 7701 -31 7539 -156 ct 7377 -280 7296 -459 7296 -693 ct 
7296 -923 7377 -1101 7539 -1228 ct 7701 -1354 7900 -1417 8137 -1417 ct 8262 -1417 8381 -1394 8493 -1348 ct 
8599 -1297 8706 -1247 8813 -1196 ct 8831 -1196 8849 -1203 8866 -1216 ct 8894 -1196 l 
8686 -891 l  8658 -911 l  8663 -944 l  8663 -1000 8600 -1049 8475 -1092 ct 
8350 -1134 8241 -1155 8150 -1155 ct 8014 -1155 7895 -1112 7793 -1024 ct 7691 -937 7639 -827 7639 -693 ct 
7639 -559 7690 -449 7792 -361 ct 7893 -274 8013 -231 8150 -231 ct 8284 -231 8390 -251 8470 -292 ct 
8549 -332 8602 -361 8626 -378 ct 8651 -395 8663 -415 8663 -439 ct 8658 -474 l 
8686 -495 l  p ef
9572 -1386 m  9572 -1353 l  9519 -1338 9493 -1308 9493 -1262 ct 9493 -127 l 
9493 -101 9499 -81 9512 -67 ct 9525 -52 9545 -41 9572 -33 ct 9572 0 l  9081 0 l 
9081 -33 l  9134 -46 9160 -77 9160 -127 ct 9160 -1262 l  9160 -1309 9134 -1340 9081 -1353 ct 
9081 -1386 l  p ef
10276 -347 m  10256 -309 10234 -266 10211 -220 ct 10189 -175 10177 -137 10177 -106 ct 
10177 -88 10185 -72 10201 -59 ct 10217 -46 10236 -38 10256 -33 ct 10256 0 l 
9745 0 l  9745 -33 l  9778 -38 9802 -49 9818 -67 ct 9834 -85 9851 -111 9870 -147 ct 
10378 -1173 l  10385 -1187 10391 -1201 10397 -1216 ct 10403 -1231 10406 -1250 10406 -1272 ct 
10406 -1292 10399 -1309 10387 -1322 ct 10374 -1334 10357 -1345 10335 -1353 ct 
10335 -1386 l  10876 -1386 l  10876 -1353 l  10857 -1347 10841 -1336 10827 -1323 ct 
10814 -1309 10807 -1294 10807 -1277 ct 10807 -1257 10809 -1239 10813 -1224 ct 
10818 -1209 10826 -1190 10838 -1168 ct 11363 -172 l  11380 -140 11398 -111 11415 -85 ct 
11433 -58 11464 -41 11508 -33 ct 11508 0 l  10942 0 l  10942 -33 l  10960 -36 10978 -42 10995 -52 ct 
11012 -61 11020 -79 11020 -106 ct 11020 -143 11008 -183 10984 -226 ct 10959 -268 10936 -309 10914 -347 ct 
p
10586 -988 m  10370 -541 l  10812 -541 l  p ef
12559 -127 m  12559 -81 12585 -49 12638 -33 ct 12638 0 l  12148 0 l  12148 -33 l 
12200 -48 12226 -79 12226 -127 ct 12226 -1135 l  11817 -1135 l  11772 -1135 11740 -1109 11723 -1056 ct 
11690 -1056 l  11690 -1468 l  11723 -1468 l  11732 -1441 11743 -1420 11756 -1407 ct 
11770 -1393 11790 -1386 11817 -1386 ct 12968 -1386 l  13015 -1386 13046 -1413 13059 -1468 ct 
13095 -1468 l  13095 -1056 l  13059 -1056 l  13046 -1109 13015 -1135 12968 -1135 ct 
12559 -1135 l  p ef
13681 -254 m  14562 -254 l  14608 -254 14639 -280 14656 -332 ct 14689 -332 l 
14689 78 l  14656 78 l  14643 26 14611 0 14562 0 ct 13269 0 l  13269 -35 l 
13322 -49 13348 -79 13348 -127 ct 13348 -1262 l  13348 -1309 13322 -1340 13269 -1353 ct 
13269 -1389 l  14524 -1389 l  14570 -1389 14601 -1415 14618 -1468 ct 14651 -1468 l 
14651 -1056 l  14618 -1056 l  14601 -1109 14570 -1135 14524 -1135 ct 13681 -1135 l 
13681 -833 l  14204 -833 l  14231 -833 14252 -839 14265 -852 ct 14279 -864 14290 -884 14298 -911 ct 
14331 -911 l  14331 -510 l  14296 -510 l  14282 -564 14252 -591 14204 -591 ct 
13681 -591 l  p ef
16079 -939 m  16049 -955 l  16049 -1017 15989 -1068 15869 -1107 ct 15748 -1146 15644 -1165 15556 -1165 ct 
15473 -1165 15393 -1154 15316 -1131 ct 15239 -1108 15196 -1065 15188 -1003 ct 
15188 -932 15304 -883 15536 -858 ct 15768 -833 15949 -798 16078 -754 ct 16208 -710 16272 -598 16272 -419 ct 
16272 -265 16203 -151 16064 -78 ct 15925 -5 15771 30 15602 30 ct 15497 30 15395 21 15296 2 ct 
15197 -16 15102 -46 15010 -88 ct 14990 -95 14970 -103 14952 -111 ct 14935 -111 14918 -101 14901 -81 ct 
14870 -93 l  15013 -434 l  15046 -421 l  15046 -352 15110 -301 15240 -269 ct 
15370 -237 15485 -220 15587 -220 ct 15673 -220 15755 -232 15833 -256 ct 15911 -280 15950 -325 15950 -391 ct 
15950 -467 15834 -515 15603 -535 ct 15372 -556 15196 -586 15076 -626 ct 14956 -665 14896 -778 14896 -965 ct 
14896 -1119 14961 -1233 15091 -1306 ct 15222 -1380 15371 -1417 15538 -1417 ct 
15638 -1417 15743 -1400 15853 -1366 ct 15957 -1327 16060 -1289 16163 -1252 ct 
16173 -1252 16183 -1254 16191 -1259 ct 16200 -1264 16208 -1270 16217 -1277 ct 
16247 -1262 l  p ef
pom
gr
gr
0 20290 t 
pom
count op_count sub {pop} repeat countdictstack dict_count sub {end} repeat b4_inc_state restore
%%PageTrailer
%%Trailer
%%EOF
