%!PS-Adobe-3.0
%%Title: ksp-dc6.txt
%%For: Anibal Monsalve Salazar
%%Creator: a2ps version 4.13
%%CreationDate: Mon May  8 10:26:18 2006
%%BoundingBox: 24 24 571 818
%%DocumentData: Clean7Bit
%%Orientation: Landscape
%%Pages: 8
%%PageOrder: Ascend
%%DocumentMedia: A4 595 842 0 () ()
%%DocumentNeededResources: font Courier
%%+ font Courier-Bold
%%+ font Courier-BoldOblique
%%+ font Courier-Oblique
%%+ font Helvetica
%%+ font Helvetica-Bold
%%+ font Symbol
%%+ font Times-Bold
%%+ font Times-Roman
%%DocumentProcessColors: Black 
%%DocumentSuppliedResources: procset a2ps-a2ps-hdr
%%+ procset a2ps-black+white-Prolog
%%+ encoding ISO-8859-1Encoding
%%EndComments
/a2psdict 200 dict def
a2psdict begin
%%BeginProlog
%%Copyright: (c) 1988, 89, 90, 91, 92, 93 Miguel Santana
%%Copyright: (c) 1995, 96, 97, 98 Akim Demaille, Miguel Santana
% Check PostScript language level.
/languagelevel where {
  pop /gs_languagelevel languagelevel def
} {
  /gs_languagelevel 1 def
} ifelse

% EPSF import as in the Red Book
/BeginInclude {
  /b4_Inc_state save def    		% Save state for cleanup
  /dict_count countdictstack def	% Count objects on dict stack
  /op_count count 1 sub def		% Count objects on operand stack 
  userdict begin
    0 setgray 0 setlinecap
    1 setlinewidth 0 setlinejoin
    10 setmiterlimit [ ] 0 setdash newpath
    gs_languagelevel 1 ne {
      false setstrokeadjust false setoverprint 
    } if
} bind def

/EndInclude {
  count op_count sub { pos } repeat	% Clean up stacks
  countdictstack dict_count sub { end } repeat
  b4_Inc_state restore
} bind def

/BeginEPSF {
  BeginInclude
  /showpage { } def
} bind def

/EndEPSF {
  EndInclude
} bind def

% Page prefeed
/page_prefeed {         % bool -> -
  statusdict /prefeed known {
    statusdict exch /prefeed exch put
  } {
    pop
  } ifelse
} bind def

/deffont {
  findfont exch scalefont def
} bind def

/reencode_font {
  findfont reencode 2 copy definefont pop def
} bind def

% Function c-show (str => -)
% centers text only according to x axis.
/c-show { 
  dup stringwidth pop
  2 div neg 0 rmoveto
  show
} bind def

% Function l-show (str => -)
% prints texts so that it ends at currentpoint
/l-show {
  dup stringwidth pop neg 
  0 
  rmoveto show
} bind def

% center-fit show (str w => -)
% show centered, and scale currentfont so that the width is less than w
/cfshow {
  exch dup stringwidth pop
  % If the title is too big, try to make it smaller
  3 2 roll 2 copy
  gt
  { % if, i.e. too big
    exch div
    currentfont exch scalefont setfont
  } { % ifelse
    pop pop 
  }
  ifelse
  c-show			% center title
} bind def

% Return the y size of the current font
% - => fontsize
/currentfontsize {
  currentfont /FontType get 0 eq {
    currentfont /FontMatrix get 3 get
  }{
    currentfont /FontMatrix get 3 get 1000 mul
  } ifelse
} bind def

% reencode the font
% <encoding-vector> <fontdict> -> <newfontdict>
/reencode { %def
  dup length 5 add dict begin
    { %forall
      1 index /FID ne 
      { def }{ pop pop } ifelse
    } forall
    /Encoding exch def

    % Use the font's bounding box to determine the ascent, descent,
    % and overall height; don't forget that these values have to be
    % transformed using the font's matrix.
    % We use `load' because sometimes BBox is executable, sometimes not.
    % Since we need 4 numbers an not an array avoid BBox from being executed
    /FontBBox load aload pop
    FontMatrix transform /Ascent exch def pop
    FontMatrix transform /Descent exch def pop
    /FontHeight Ascent Descent sub def

    % Define these in case they're not in the FontInfo (also, here
    % they're easier to get to.
    /UnderlinePosition 1 def
    /UnderlineThickness 1 def
    
    % Get the underline position and thickness if they're defined.
    currentdict /FontInfo known {
      FontInfo
      
      dup /UnderlinePosition known {
	dup /UnderlinePosition get
	0 exch FontMatrix transform exch pop
	/UnderlinePosition exch def
      } if
      
      dup /UnderlineThickness known {
	/UnderlineThickness get
	0 exch FontMatrix transform exch pop
	/UnderlineThickness exch def
      } if
      
    } if
    currentdict 
  end 
} bind def

% composite fonts for ASCII-EUC mixed strings
% Version 1.2 1/31/1990
% Original Ken'ichi HANDA (handa@etl.go.jp)
% Modified Norio Katayama (katayama@rd.nacsis.ac.jp),1998
% Extend & Fix Koji Nakamaru (maru@on.cs.keio.ac.jp), 1999
% Anyone can freely copy, modify, distribute this program.

/copyfont {	% font-dic extra-entry-count  copyfont  font-dic
	1 index maxlength add dict begin
	{	1 index /FID ne 2 index /UniqueID ne and
		{def} {pop pop} ifelse
	} forall
	currentdict
	end
} bind def

/compositefont { % ASCIIFontName EUCFontName RomanScale RomanOffset Rot(T/F) compositefont font
    /RomanRotation exch def
    /RomanOffset exch def
    /RomanScale exch def
    userdict /fixeucfont_dict known not {
	userdict begin
	    /fixeucfont_dict 2 dict begin
		/UpperByteEncoding [
		    16#00 1 16#20 { pop 0 } for
		    16#21 1 16#28 { 16#20 sub } for
		    16#29 1 16#2F { pop 0 } for
		    16#30 1 16#74 { 16#27 sub } for
		    16#75 1 16#FF { pop 0 } for
		] def
	        /LowerByteEncoding [
		    16#00 1 16#A0 { pop /.notdef } for
		    16#A1 1 16#FE { 16#80 sub 16 2 string cvrs
				    (cXX) dup 1 4 -1 roll
				    putinterval cvn } for
		    /.notdef
		] def
		currentdict
	    end def
	end
    } if
    findfont dup /FontType get 0 eq {
	14 dict begin
	    %
	    % 7+8 bit EUC font
	    %
	    12 dict begin
		/EUCFont exch def
		/FontInfo (7+8 bit EUC font) readonly def
		/PaintType 0 def
		/FontType 0 def
		/FontMatrix matrix def
		% /FontName
		/Encoding fixeucfont_dict /UpperByteEncoding get def
		/FMapType 2 def
		EUCFont /WMode known
		{ EUCFont /WMode get /WMode exch def }
		{ /WMode 0 def } ifelse
		/FDepVector [
		    EUCFont /FDepVector get 0 get
		    [ 16#21 1 16#28 {} for 16#30 1 16#74 {} for ]
		    {
			13 dict begin
			    /EUCFont EUCFont def
			    /UpperByte exch 16#80 add def	
			    % /FontName
			    /FontInfo (EUC lower byte font) readonly def
			    /PaintType 0 def
			    /FontType 3 def
			    /FontMatrix matrix def
			    /FontBBox {0 0 0 0} def
			    /Encoding
				fixeucfont_dict /LowerByteEncoding get def
			    % /UniqueID
			    % /WMode
			    /BuildChar {
				gsave
				exch dup /EUCFont get setfont
				/UpperByte get
				2 string
				dup 0 4 -1 roll put
				dup 1 4 -1 roll put
				dup stringwidth setcharwidth
				0 0 moveto show
				grestore
			    } bind def
			    currentdict
			end
			/lowerbytefont exch definefont
		    } forall
		] def
		currentdict
	    end
	    /eucfont exch definefont
	    exch
	    findfont 1 copyfont dup begin
		RomanRotation {
			/FontMatrix FontMatrix
			[ 0 RomanScale neg RomanScale 0 RomanOffset neg 0 ]
			matrix concatmatrix def
		}{
			/FontMatrix FontMatrix
			[ RomanScale 0 0 RomanScale 0 RomanOffset ] matrix concatmatrix
			def
			/CDevProc
			    {pop pop pop pop 0 exch -1000 exch 2 div 880} def
		} ifelse
	    end
	    /asciifont exch definefont
	    exch
	    /FDepVector [ 4 2 roll ] def
	    /FontType 0 def
	    /WMode 0 def
	    /FMapType 4 def
	    /FontMatrix matrix def
	    /Encoding [0 1] def
	    /FontBBox {0 0 0 0} def
%	    /FontHeight 1.0 def % XXXX
	    /FontHeight RomanScale 1.0 ge { RomanScale }{ 1.0 } ifelse def
	    /Descent -0.3 def   % XXXX
	    currentdict
	end
	/tmpfont exch definefont
	pop
	/tmpfont findfont
    }{
	pop findfont 0 copyfont
    } ifelse
} def	

/slantfont {	% FontName slant-degree  slantfont  font'
    exch findfont 1 copyfont begin
    [ 1 0 4 -1 roll 1 0 0 ] FontMatrix exch matrix concatmatrix
    /FontMatrix exch def
    currentdict
    end
} def

% Function print line number (<string> # -)
/# {
  gsave
    sx cw mul neg 2 div 0 rmoveto
    f# setfont
    c-show
  grestore
} bind def

% -------- Some routines to enlight plain b/w printings ---------

% Underline
% width --
/dounderline {
  currentpoint
  gsave
    moveto
    0 currentfont /Descent get currentfontsize mul rmoveto
    0 rlineto
    stroke
  grestore
} bind def

% Underline a string
% string --
/dounderlinestring {
  stringwidth pop
  dounderline
} bind def

/UL {
  /ul exch store
} bind def

% Draw a box of WIDTH wrt current font
% width --
/dobox {
  currentpoint
  gsave
    newpath
    moveto
    0 currentfont /Descent get currentfontsize mul rmoveto
    dup 0 rlineto
    0 currentfont /FontHeight get currentfontsize mul rlineto
    neg 0 rlineto
    closepath
    stroke
  grestore
} bind def

/BX {
  /bx exch store
} bind def

% Box a string
% string --
/doboxstring {
  stringwidth pop
  dobox
} bind def

%
% ------------- Color routines ---------------
%
/FG /setrgbcolor load def

% Draw the background
% width --
/dobackground {
  currentpoint
  gsave
    newpath
    moveto
    0 currentfont /Descent get currentfontsize mul rmoveto
    dup 0 rlineto
    0 currentfont /FontHeight get currentfontsize mul rlineto
    neg 0 rlineto
    closepath
    bgcolor aload pop setrgbcolor
    fill
  grestore
} bind def

% Draw bg for a string
% string --
/dobackgroundstring {
  stringwidth pop
  dobackground
} bind def


/BG {
  dup /bg exch store
  { mark 4 1 roll ] /bgcolor exch store } if
} bind def


/Show {
  bg { dup dobackgroundstring } if
  ul { dup dounderlinestring } if
  bx { dup doboxstring } if
  show
} bind def

% Function T(ab), jumps to the n-th tabulation in the current line
/T {
  cw mul x0 add
  bg { dup currentpoint pop sub dobackground } if
  ul { dup currentpoint pop sub dounderline } if
  bx { dup currentpoint pop sub dobox } if
  y0 moveto
} bind def

% Function n: move to the next line
/n {
  /y0 y0 bfs sub store
  x0 y0 moveto
} bind def

% Function N: show and move to the next line
/N {
  Show
  /y0 y0 bfs sub store
  x0 y0 moveto
} bind def

/S {
  Show
} bind def

%%BeginResource: procset a2ps-a2ps-hdr 2.0 2
%%Copyright: (c) 1988, 89, 90, 91, 92, 93 Miguel Santana
%%Copyright: (c) 1995, 96, 97, 98 Akim Demaille, Miguel Santana
% Function title: prints page header.
% <ct> <rt> <lt> are passed as argument
/title { 
  % 1. Draw the background
  x v get y v get moveto
  gsave
    0 th 2 div neg rmoveto 
    th setlinewidth
    0.95 setgray
    pw 0 rlineto stroke
  grestore
  % 2. Border it
  gsave
    0.7 setlinewidth
    pw 0 rlineto
    0 th neg rlineto
    pw neg 0 rlineto
    closepath stroke
  grestore
  % stk: ct rt lt
  x v get y v get th sub 1 add moveto
%%IncludeResource: font Helvetica
  fHelvetica fnfs 0.8 mul scalefont setfont
  % 3. The left title
  gsave
    dup stringwidth pop fnfs 0.8 mul add exch % leave space took on stack
    fnfs 0.8 mul hm rmoveto
    show			% left title
  grestore
  exch
  % stk: ct ltw rt
  % 4. the right title
  gsave
    dup stringwidth pop fnfs 0.8 mul add exch % leave space took on stack
    dup
    pw exch stringwidth pop fnfs 0.8 mul add sub
    hm
    rmoveto
    show			% right title
  grestore
  % stk: ct ltw rtw
  % 5. the center title
  gsave
    pw 3 1 roll
    % stk: ct pw ltw rtw
    3 copy 
    % Move to the center of the left room
    sub add 2 div hm rmoveto
    % What is the available space in here?
    add sub fnfs 0.8 mul sub fnfs 0.8 mul sub
    % stk: ct space_left
%%IncludeResource: font Helvetica-Bold
  fHelvetica-Bold fnfs scalefont setfont
    cfshow
  grestore
} bind def

% Function border: prints virtual page border
/border { %def
  gsave				% print four sides
    0 setgray
    x v get y v get moveto
    0.7 setlinewidth		% of the square
    pw 0 rlineto
    0 ph neg rlineto
    pw neg 0 rlineto
    closepath stroke
  grestore
} bind def

% Function water: prints a water mark in background
/water { %def
  gsave
    scx scy moveto rotate
%%IncludeResource: font Times-Bold
  fTimes-Bold 100 scalefont setfont
    .97 setgray
    dup stringwidth pop 2 div neg -50 rmoveto
    show
  grestore
} bind def

% Function rhead: prints the right header
/rhead {  %def
  lx ly moveto
  fHelvetica fnfs 0.8 mul scalefont setfont
  l-show
} bind def

% Function footer (cf rf lf -> -)
/footer {
  fHelvetica fnfs 0.8 mul scalefont setfont
  dx dy moveto
  show

  snx sny moveto
  l-show
  
  fnx fny moveto
  c-show
} bind def
%%EndResource
%%BeginResource: procset a2ps-black+white-Prolog 2.0 1

% Function T(ab), jumps to the n-th tabulation in the current line
/T { 
  cw mul x0 add y0 moveto
} bind def

% Function n: move to the next line
/n { %def
  /y0 y0 bfs sub store
  x0 y0 moveto
} bind def

% Function N: show and move to the next line
/N {
  Show
  /y0 y0 bfs sub store
  x0 y0 moveto
}  bind def

/S {
  Show
} bind def

/p {
  false UL
  false BX
  fCourier bfs scalefont setfont
  Show
} bind def

/sy {
  false UL
  false BX
  fSymbol bfs scalefont setfont
  Show
} bind def

/k {
  false UL
  false BX
  fCourier-Oblique bfs scalefont setfont
  Show
} bind def

/K {
  false UL
  false BX
  fCourier-Bold bfs scalefont setfont
  Show
} bind def

/c {
  false UL
  false BX
  fCourier-Oblique bfs scalefont setfont
  Show
} bind def

/C {
  false UL
  false BX
  fCourier-BoldOblique bfs scalefont setfont
  Show 
} bind def

/l {
  false UL
  false BX
  fHelvetica bfs scalefont setfont
  Show
} bind def

/L {
  false UL
  false BX
  fHelvetica-Bold bfs scalefont setfont
  Show 
} bind def

/str{
  false UL
  false BX
  fTimes-Roman bfs scalefont setfont
  Show
} bind def

/e{
  false UL
  true BX
  fHelvetica-Bold bfs scalefont setfont
  Show
} bind def

%%EndResource
%%EndProlog
%%BeginSetup
%%IncludeResource: font Courier
%%IncludeResource: font Courier-Oblique
%%IncludeResource: font Courier-Bold
%%IncludeResource: font Times-Roman
%%IncludeResource: font Symbol
%%IncludeResource: font Courier-BoldOblique
%%BeginResource: encoding ISO-8859-1Encoding
/ISO-8859-1Encoding [
/.notdef /.notdef /.notdef /.notdef /.notdef /.notdef /.notdef /.notdef 
/.notdef /.notdef /.notdef /.notdef /.notdef /.notdef /.notdef /.notdef 
/.notdef /.notdef /.notdef /.notdef /.notdef /.notdef /.notdef /.notdef 
/.notdef /.notdef /.notdef /.notdef /.notdef /.notdef /.notdef /.notdef 
/space /exclam /quotedbl /numbersign /dollar /percent /ampersand /quoteright 
/parenleft /parenright /asterisk /plus /comma /minus /period /slash 
/zero /one /two /three /four /five /six /seven 
/eight /nine /colon /semicolon /less /equal /greater /question 
/at /A /B /C /D /E /F /G 
/H /I /J /K /L /M /N /O 
/P /Q /R /S /T /U /V /W 
/X /Y /Z /bracketleft /backslash /bracketright /asciicircum /underscore 
/quoteleft /a /b /c /d /e /f /g 
/h /i /j /k /l /m /n /o 
/p /q /r /s /t /u /v /w 
/x /y /z /braceleft /bar /braceright /asciitilde /.notdef 
/.notdef /.notdef /.notdef /.notdef /.notdef /.notdef /.notdef /.notdef 
/.notdef /.notdef /.notdef /.notdef /.notdef /.notdef /.notdef /.notdef 
/.notdef /.notdef /.notdef /.notdef /.notdef /.notdef /.notdef /.notdef 
/.notdef /.notdef /.notdef /.notdef /.notdef /.notdef /.notdef /.notdef 
/space /exclamdown /cent /sterling /currency /yen /brokenbar /section 
/dieresis /copyright /ordfeminine /guillemotleft /logicalnot /hyphen /registered /macron 
/degree /plusminus /twosuperior /threesuperior /acute /mu /paragraph /bullet 
/cedilla /onesuperior /ordmasculine /guillemotright /onequarter /onehalf /threequarters /questiondown 
/Agrave /Aacute /Acircumflex /Atilde /Adieresis /Aring /AE /Ccedilla 
/Egrave /Eacute /Ecircumflex /Edieresis /Igrave /Iacute /Icircumflex /Idieresis 
/Eth /Ntilde /Ograve /Oacute /Ocircumflex /Otilde /Odieresis /multiply 
/Oslash /Ugrave /Uacute /Ucircumflex /Udieresis /Yacute /Thorn /germandbls 
/agrave /aacute /acircumflex /atilde /adieresis /aring /ae /ccedilla 
/egrave /eacute /ecircumflex /edieresis /igrave /iacute /icircumflex /idieresis 
/eth /ntilde /ograve /oacute /ocircumflex /otilde /odieresis /divide 
/oslash /ugrave /uacute /ucircumflex /udieresis /yacute /thorn /ydieresis 
] def
%%EndResource
% Initialize page description variables.
/sh 595 def
/sw 842 def
/llx 24 def
/urx 818 def
/ury 571 def
/lly 24 def
/#copies 1 def
/th 15.000000 def
/fnfs 11 def
/bfs 7.000000 def
/cw 4.200000 def

% Dictionary for ISO-8859-1 support
/iso1dict 8 dict begin
  /fCourier ISO-8859-1Encoding /Courier reencode_font
  /fCourier-Bold ISO-8859-1Encoding /Courier-Bold reencode_font
  /fCourier-BoldOblique ISO-8859-1Encoding /Courier-BoldOblique reencode_font
  /fCourier-Oblique ISO-8859-1Encoding /Courier-Oblique reencode_font
  /fHelvetica ISO-8859-1Encoding /Helvetica reencode_font
  /fHelvetica-Bold ISO-8859-1Encoding /Helvetica-Bold reencode_font
  /fTimes-Bold ISO-8859-1Encoding /Times-Bold reencode_font
  /fTimes-Roman ISO-8859-1Encoding /Times-Roman reencode_font
currentdict end def
/bgcolor [ 0 0 0 ] def
/bg false def
/ul false def
/bx false def
% The font for line numbering
/f# /Helvetica findfont bfs .6 mul scalefont def
/fSymbol /Symbol findfont def
/hm fnfs 0.25 mul def
/pw
   cw 92.400000 mul
def
/ph
   501.900000 th add
def
/pmw urx llx sub pw 2 mul sub 1 div def
/pmh 0 def
/v 0 def
/x [
  0
  dup pmw add pw add
] def
/y [
  pmh ph add 0 mul ph add
  dup
] def
/scx sw 2 div def
/scy sh 2 div def
/snx urx def
/sny lly 2 add def
/dx llx def
/dy sny def
/fnx scx def
/fny dy def
/lx snx def
/ly ury fnfs 0.8 mul sub def
/sx 0 def
/tab 8 def
/x0 0 def
/y0 0 def
%%EndSetup

%%Page: (1-2) 1
%%BeginPageSetup
/pagesave save def
sh 0 translate 90 rotate
%%EndPageSetup
iso1dict begin
gsave
llx lly 12 add translate
/v 0 store
/x0 x v get 2.940000 add sx cw mul add store
/y0 y v get bfs th add sub store
x0 y0 moveto
(Mon, 08 May 2006 09:25:02 +1000      Anibal Monsalve Salazar <anibal@debian.org>) p n
() N
(             D E B C O N F 6    K E Y S I G N I N G P A R T Y) N
() N
(                     List of Participants  \(v 1.0\)) N
() N
() N
(Here's what you have to do with this file:) N
(\(1\) Print this file to paper.) N
(\(2\) Compute this file's MD5 checksum and optionally also its SHA1 checksum.) N
(   gpg --print-md md5 ksp-dc6.txt   \(or use md5sum\)) N
(   gpg --print-md sha1 ksp-dc6.txt  \(or use sha1sum\)) N
(\(3\) fill in the hash values on the printout.) N
(\(4\) Bring the printout, a pen, and proof of identity to the keysigningparty.) N
() N
(MD5 Checksum:  __ __ __ __ __ __ __ __    __ __ __ __ __ __ __ __           [ ]) N
() N
(SHA1 Checksum: ____ ____ ____ ____ ____    ____ ____ ____ ____ ____         [ ]) N
() N
() N
() N
(001a  [ ] Fingerprint OK        [ ] ID OK) N
(pub   1024D/1880283C 2002-09-15) N
(      Key fingerprint = FFB0 87FF AA67 B0BC B97D  6204 8A90 6779 1880 283C) N
(uid                  Anibal Monsalve Salazar <anibal@debian.org>) N
(uid                  Anibal Monsalve Salazar <anibal@v7w.com>) N
(uid                  Anibal Monsalve Salazar <anibal@computer.org>) N
(uid                  Anibal Monsalve Salazar <A.Monsalve.Salazar@IEEE.org>) N
(uid                  Anibal Monsalve Salazar <A.Monsalve.Salazar@its.monash.edu.au>) N
() N
(001b  [ ] Fingerprint OK        [ ] ID OK) N
(pub   1024D/C3F159CA 2006-04-17) N
(      Key fingerprint = 3EFF EF3A B1E0 3462 2929  D8AC 88A1 787F C3F1 59CA) N
(uid                  Anibal Monsalve Salazar <anibal@debian.org>) N
(uid                  Anibal Monsalve Salazar <anibal@v7w.com>) N
() N
(001c  [ ] Fingerprint OK        [ ] ID OK) N
(pub   1024R/ADD1A4B5 1994-08-15) N
(      Key fingerprint = 41 B6 E8 A6 33 BF 30 E2  48 20 09 15 50 1F C4 CB) N
(uid                  Anibal Monsalve Salazar <a.monsalve.salazar@ieee.org>) N
() N
(002a  [ ] Fingerprint OK        [ ] ID OK) N
(pub   1024D/808D0FD0 2001-01-13) N
(      Key fingerprint = 45AD 1B8A 9474 319A 4F7F  6498 81C0 8922 808D 0FD0) N
(uid                  Don Armstrong <don@donarmstrong.com>) N
(uid                  Don Armstrong <don@debian.org>) N
(uid                  Don Armstrong <don@5045kensington.com>) N
(uid                  Don Armstrong <armstd02@student.ucr.edu>) N
() N
(003a  [ ] Fingerprint OK        [ ] ID OK) N
(pub   1024D/16D970C6 2000-10-29) N
(      Key fingerprint = 097C 4861 9934 27A0 8E1C  2B0A 61E9 8ECF 16D9 70C6) N
(uid                  Eric Dorland <eric@debian.org>) N
(uid                  Eric Dorland <dorland@lords.com>) N
(uid                  Eric Dorland <eric@kuroneko.ca>) N
(uid                  Eric Dorland <edorla@cs.mcgill.ca>) N
(uid                  Eric Dorland <eric.dorland@mail.mcgill.ca>) N
() N
(004a  [ ] Fingerprint OK        [ ] ID OK) N
(pub   1024D/005C3B82 2005-03-16 [expires: 2006-12-24]) N
(      Key fingerprint = 7C10 81B5 3C56 6C78 AC7D  3A2D 5160 2C8D 005C 3B82) N
(uid                  Jose Parrella <joseparrella@cantv.net>) N
(uid                  Jose Parrella <joseparrella@gmail.com>) N
(uid                  Jose Parrella <jparrella@sapi.gob.ve>) N
(uid                  Jose Parrella <bureado@debianvenezuela.org>) N
(uid                  Jose Parrella \(g33k.com.ve\) <bureado@g33k.com.ve>) N
(uid                  Jose Parrella \(anorak.com.ve\) <bureado@anorak.com.ve>) N
() N
(005a  [ ] Fingerprint OK        [ ] ID OK) N
(pub   2048R/7F75635F 2001-11-20) N
(      Key fingerprint = A0A7 AE54 665D 6446 F2D9  81FF 8B94 031D 7F75 635F) N
(ksp-dc6.txt) (Page 1/15) (May 08, 06 9:25) title
border
/v 1 store
/x0 x v get 2.940000 add sx cw mul add store
/y0 y v get bfs th add sub store
x0 y0 moveto
(uid                  Graham Wilson <graham@mknod.org>) p n
(uid                  Graham Wilson <bob@decoy.wox.org>) N
(uid                  Graham Wilson <graham@debian.org>) N
() N
(006a  [ ] Fingerprint OK        [ ] ID OK) N
(pub   1024D/6FECCDE0 2003-08-19) N
(      Key fingerprint = 3821 4FB5 774A 611D 31E4  B268 414B 8423 6FEC CDE0) N
(uid                  Santiago Ruano Rinc\363n <santiago@unicauca.edu.co>) N
(uid                  Santiago Ruano Rinc\363n <santiago@debian.org>) N
(uid                  Santiago Ruano Rinc\363n <santiago@avatar.com.co>) N
(uid                  Santiago Ruano Rincon <santiago@unicauca.edu.co>) N
(uid                  Santiago Ruano Rinc\363n <santiago@debiancolombia.org>) N
(uid                  santiago jos\351 ruano rinc\363n <santiago@unicauca.edu.co>) N
() N
(007a  [ ] Fingerprint OK        [ ] ID OK) N
(pub   1024D/C0143D2D 2003-11-26) N
(      Key fingerprint = F972 A168 A270 3B34 CC23  E09F D4E5 EDAC C014 3D2D) N
(uid                  Christian Perrier <bubulle@kheops.homeunix.org>) N
(uid                  Christian Perrier <bubulle@kheops.frmug.org>) N
(uid                  Christian Perrier <bubulle@debian.org>) N
(uid                  Christian Perrier <christian.perrier@onera.fr>) N
() N
(008a  [ ] Fingerprint OK        [ ] ID OK) N
(pub   1024D/4B2B2B9E 2004-06-20) N
(      Key fingerprint = 709F 54E4 ECF3 1956 2332  6AE3 F82E 5CC0 4B2B 2B9E) N
(uid                  Daniel Baumann <daniel.baumann@panthera-systems.net>) N
() N
(009a  [ ] Fingerprint OK        [ ] ID OK) N
(pub   1024D/29982E5A 2000-11-09) N
(      Key fingerprint = DEA2 7BAA 479C CA58 76E5  DE56 28DE AE7F 2998 2E5A) N
(uid                  Steve Langasek <vorlon@dodds.net>) N
(uid                  Steve Langasek <steve.langasek@stuntcomputing.com>) N
(uid                  Steve Langasek <vorlon@debian.org>) N
() N
(010a  [ ] Fingerprint OK        [ ] ID OK) N
(pub   1024D/7244970B 2002-04-02) N
(      Key fingerprint = 71D7 2EF4 798F 8E3A 8B5A  B114 41DC 1C90 7244 970B) N
(uid                  Kurt Roeckx <kurt@roeckx.be>) N
(uid                  Kurt Roeckx <Q@ping.be>) N
() N
(011a  [ ] Fingerprint OK        [ ] ID OK) N
(pub   1024D/9B7C328D 2004-02-19) N
(      Key fingerprint = D5AF 25FB 316B 53BB 08E7  F999 E544 DE07 9B7C 328D) N
(uid                  Luk Claes <luk@debian.org>) N
(uid                  Luk Claes <luk@zeus.ugent.be>) N
(uid                  Luk Claes <luk.claes@ugent.be>) N
(uid                  Luk Claes <luk@lugwv.be>) N
() N
(012a  [ ] Fingerprint OK        [ ] ID OK) N
(pub   1024D/248AEB73 2001-10-23) N
(      Key fingerprint = 41FA F208 28D4 7CA5 19BB  7AD9 F859 90B0 248A EB73) N
(uid                  Rene Engelhard <rene@debian.org>) N
(uid                  Rene Engelhard <rene@openoffice.org>) N
(uid                  Rene Engelhard <mail@rene-engelhard.de>) N
(uid                  Rene Engelhard <rene@rene-engelhard.de>) N
() N
(013a  [ ] Fingerprint OK        [ ] ID OK) N
(pub   1024D/1E880A84 2003-03-10) N
(      Key fingerprint = ED6F 9504 FD4E 539A 8279  616B 826F CAC2 1E88 0A84) N
(uid                  Frans Pop \(Debian\) <aragorn@tiscali.nl>) N
(uid                  Frans Pop <fjp@debian.org>) N
(uid                  Frans Pop \(Debian\) <elendil@planet.nl>) N
() N
(014a  [ ] Fingerprint OK        [ ] ID OK) N
(pub   1024D/E8C43461 2004-12-06) N
(      Key fingerprint = 17A2 BDBA A421 4072 7A15  3606 9F78 F83C E8C4 3461) N
(uid                  Ana Beatriz Guerrero L\363pez <ana@ekaia.org>) N
(uid                  Ana Beatriz Guerrero Lopez <anja_isbilia@yahoo.es>) N
(uid                  Ana Beatriz Guerrero L\363pez <ana.guerrero@gmail.com>) N
() N
(015a  [ ] Fingerprint OK        [ ] ID OK) N
(ksp-dc6.txt) (Page 2/15) (May 08, 06 9:25) title
border
grestore
(Printed by Anibal Monsalve Salazar) rhead
(ksp-dc6.txt) (1/8) (Monday May 08, 2006) footer
end % of iso1dict
pagesave restore
showpage
%%Page: (3-4) 2
%%BeginPageSetup
/pagesave save def
sh 0 translate 90 rotate
%%EndPageSetup
iso1dict begin
gsave
llx lly 12 add translate
/v 0 store
/x0 x v get 2.940000 add sx cw mul add store
/y0 y v get bfs th add sub store
x0 y0 moveto
(pub   1024D/5706A4B4 2002-02-26) p n
(      Key fingerprint = 040E B5F7 84F1 4FBC CEAD  ADC6 18A0 CC8D 5706 A4B4) N
(uid                  Simon Richter <Simon.Richter@hogyros.de>) N
(uid                  Simon RICHTER) N
(uid                  Simon Richter <sjr@debian.org>) N
(uid                  Simon Richter <Simon.Richter@eyepy.de>) N
(uid                  Simon Richter <Simon.Richter@fs.tum.de>) N
(uid                  Simon Richter <Simon.Richter@in.tum.de>) N
(uid                  Simon Richter <Simon@riseofdarkness.de>) N
(uid                  Simon Richter <simon@earplugs-recommended.de>) N
(uid                  Simon Richter <Simon.Richter@picotux.com>) N
() N
(016a  [ ] Fingerprint OK        [ ] ID OK) N
(pub   1024D/12066207 2003-08-16) N
(      Key fingerprint = 3FA5 45F1 0304 9F9A AE90  2F84 EFD6 4D09 1206 6207) N
(uid                  Ben Hutchings <benh@debian.org>) N
(uid                  Ben Hutchings <ben@decadentplace.org.uk>) N
() N
(017a  [ ] Fingerprint OK        [ ] ID OK) N
(pub   1024D/4B729625 1999-09-09 [expires: 2009-09-06]) N
(      Key fingerprint = 7EE2 90B2 1E01 D6B3 A752  0B1B D759 5D37 4B72 9625) N
(uid                  Peter Van Eynde <pvaneynd@debian.org>) N
(uid                  Peter Van Eynde \(Lisper\) <pvaneynd@debian.org>) N
(uid                  Peter Van Eynde \(Private email\) <gpg@pvaneynd.mailworks.org>) N
(uid                  Peter Van Eynde <pvaneynd@mailworks.org>) N
(uid                  Peter Van Eynde \(Cl debian id\) <cl-debian@pvaneynd.mailworks.org>) N
() N
(017b  [ ] Fingerprint OK        [ ] ID OK) N
(pub   1633R/B9DD5409 1995-08-22) N
(      Key fingerprint = A3 46 59 3A 52 3D 11 71  3A 5A 63 35 4F F4 BD CB) N
(uid                  Peter Van Eynde \(Old key\) <pvaneynd@inthan.be>) N
(uid                  Peter Van Eynde <pvaneynd@debian.org>) N
(uid                  Peter Van Eynde <03/454.07.03>) N
() N
(018a  [ ] Fingerprint OK        [ ] ID OK) N
(pub   1024D/149CDDB2 2001-05-20) N
(      Key fingerprint = 453C BE8C 8DF8 B5E2 7B38  2D4F 2578 F87E 149C DDB2) N
(uid                  Jacobo Tarrio <jtarrio@trasno.net>) N
(uid                  Jacobo Tarrio Barreiro) N
(uid                  Jacobo Tarrio <jtarrio@gpul.org>) N
(uid                  Jacobo Tarrio <jtarrio@debian.org>) N
(uid                  Jacobo Tarrio <jacobo@tarrio.org>) N
() N
(019a  [ ] Fingerprint OK        [ ] ID OK) N
(pub   1024D/0ED704EA 2004-10-30) N
(      Key fingerprint = E751 A687 D8EE 4EC3 0922  C4A5 394D C591 0ED7 04EA) N
(uid                  Mohammed Adn\350ne Trojette \(adn\) <adnene@trojette.com>) N
(uid                  Mohammed Adn\350ne Trojette \(adn\) <adn@via.ecp.fr>) N
(uid                  Mohammed Adn\350ne Trojette \(adn\) <adn+deb@diwi.org>) N
() N
(020a  [ ] Fingerprint OK        [ ] ID OK) N
(pub   1024D/8F068012 2001-02-16) N
(      Key fingerprint = CCA3 77BD 7749 4424 B0DB  674F 8C90 347F 8F06 8012) N
(uid                  Andrew McMillan \(Andrew @ Work\) <andrew@catalyst.net.nz>) N
(uid                  Andrew McMillan <debian@mcmillan.net.nz>) N
(uid                  Andrew McMillan \(Debian e-mail address\) <awm@debian.org>) N
() N
(021a  [ ] Fingerprint OK        [ ] ID OK) N
(pub   1024D/6E8169D2 1999-08-15) N
(      Key fingerprint = 7D2E 678D C54F 79E8 C02D  DE9A BCF6 C60F 6E81 69D2) N
(uid                  Raphael Hertzog <raphael@ouaza.com>) N
(uid                  Raphael Hertzog <hertzog@debian.org>) N
(uid                  Raphael Hertzog <raphael@freexian.com>) N
() N
(022a  [ ] Fingerprint OK        [ ] ID OK) N
(pub   1024D/72D03CB1 1999-09-21) N
(      Key fingerprint = 360B B879 6957 5D6F EED3  D986 40A5 BEED 72D0 3CB1) N
(uid                  Kenshi Muto <kmuto@debian.org>) N
(uid                  Kenshi Muto <kmuto@topstudio.co.jp>) N
(uid                  Kenshi Muto <kmuto@debian.or.jp>) N
(uid                  Kenshi Muto <kmuto@linux.or.jp>) N
(ksp-dc6.txt) (Page 3/15) (May 08, 06 9:25) title
border
/v 1 store
/x0 x v get 2.940000 add sx cw mul add store
/y0 y v get bfs th add sub store
x0 y0 moveto
(uid                  Kenshi Muto <kmuto@kmuto.jp>) p n
(uid                  Kenshi Muto <kmuto@opensource.jp>) N
() N
(023a  [ ] Fingerprint OK        [ ] ID OK) N
(pub   1024R/6D8ABE71 1998-07-25) N
(      Key fingerprint = 09 9D 09 8F 89 52 24 12  FE C2 31 9D FE F8 5C 03) N
(uid                  Christoph Berg <myon@debian.org>) N
(uid                  Christoph Berg <cb@df7cb.de>) N
(uid                  Christoph Berg <cb@cs.uni-sb.de>) N
() N
(023b  [ ] Fingerprint OK        [ ] ID OK) N
(pub   1024D/58510B5A 2004-04-17) N
(      Key fingerprint = D224 C8B0 7E63 A694 6DA3  2E07 C5AF 774A 5851 0B5A) N
(uid                  Christoph Berg <cb@df7cb.de>) N
(uid                  Christoph Berg <myon@debian.org>) N
() N
(024a  [ ] Fingerprint OK        [ ] ID OK) N
(pub   1024D/3433BD21 2002-10-07 [expires: 2010-05-15]) N
(      Key fingerprint = 0D12 8537 607E 2DF5 4EFB  35A7 550F 1A00 3433 BD21) N
(uid                  Rudy Godoy \(sTone_heAd at KP\) <rudy@kernel-panik.org>) N
(uid                  Rudy Godoy \(Rudy at APESOL\) <rudy@apesol.org.pe>) N
(uid                  Rudy Godoy Guill\351n <rudy@stone-head.org>) N
(uid                  Rudy Godoy <rudy@debian.org>) N
() N
(025a  [ ] Fingerprint OK        [ ] ID OK) N
(pub   1024D/E65D1B15 2004-11-02) N
(      Key fingerprint = 9141 ACF2 8C29 303C 1536  A147 3E48 5695 E65D 1B15) N
(uid                  David Alexander Contreras Castillo \(Colombia\) <dacoc@dacoc.org>) N
(uid                  David Alexander Contreras Castillo \(Yo apoyo el Software Libre y el C\363) N
(digo Abierto\) <dacoc@debiancolombia.org>) N
() N
(026a  [ ] Fingerprint OK        [ ] ID OK) N
(pub   1024D/C671257D 2004-12-27 [expires: 2014-12-25]) N
(      Key fingerprint = 6EF6 C284 C95D 78F6 0B78  FFD3 981C 5FD7 C671 257D) N
(uid                  David Moreno Garza \(1984-08-08\) <damog@damog.net>) N
(uid                  David Moreno Garza \(Universidad Iberoamericana, AC.\) <dmoreno@alumno.u) N
(ia.mx>) N
(uid                  David Moreno Garza \(Debian Developer\) <damog@debian.org>) N
(uid                  David Moreno Garza \(Cerdita's mobile mail system\) <damog@cerdita.damog) N
(.net>) N
() N
(027a  [ ] Fingerprint OK        [ ] ID OK) N
(pub   1024D/AC583520 2004-05-18 [expires: 2007-05-18]) N
(      Key fingerprint = 480E 51BA FB08 CB41 75CC  91B1 5072 D036 AC58 3520) N
(uid                  Holger Levsen <holger@layer-acht.org>) N
(uid                  Holger Levsen <holger@layer-acht.de>) N
(uid                  Holger Levsen <debian@layer-acht.org>) N
(uid                  Holger Levsen <debian@layer-acht.de>) N
() N
(028a  [ ] Fingerprint OK        [ ] ID OK) N
(pub   1024D/A965818F 2001-03-16) N
(      Key fingerprint = 918E 4ACF 6AA5 A7DC 02DC  CC89 C416 22BC A965 818F) N
(uid                  Matej Vela <vela@debian.org>) N
(uid                  Matej Vela <mvela@public.srce.hr>) N
() N
(029a  [ ] Fingerprint OK        [ ] ID OK) N
(pub   1024D/B345BDD3 2004-03-31) N
(      Key fingerprint = 48FF DD79 CB6F 6282 6317  D1CC F7B2 C1C1 B345 BDD3) N
(uid                  Neil McGovern <maulkin@halon.org.uk>) N
(uid                  Neil McGovern \(OpenVas\) <neilm@openvas.org>) N
(uid                  Neil McGovern <neilm@debian.org>) N
() N
(030a  [ ] Fingerprint OK        [ ] ID OK) N
(pub   1024D/2BE16D01 2002-03-19) N
(      Key fingerprint = 5863 7710 0EB1 1C2D AD7E  1B3E E74D 29B8 2BE1 6D01) N
(uid                  Moray Allan <moray@sermisy.org>) N
(uid                  Moray Allan <mma29@srcf.ucam.org>) N
(uid                  Moray Allan <moray@tardis.ed.ac.uk>) N
(uid                  Moray Allan <moray@debian.org>) N
() N
(030b  [ ] Fingerprint OK        [ ] ID OK) N
(ksp-dc6.txt) (Page 4/15) (May 08, 06 9:25) title
border
grestore
(Printed by Anibal Monsalve Salazar) rhead
(ksp-dc6.txt) (2/8) (Monday May 08, 2006) footer
end % of iso1dict
pagesave restore
showpage
%%Page: (5-6) 3
%%BeginPageSetup
/pagesave save def
sh 0 translate 90 rotate
%%EndPageSetup
iso1dict begin
gsave
llx lly 12 add translate
/v 0 store
/x0 x v get 2.940000 add sx cw mul add store
/y0 y v get bfs th add sub store
x0 y0 moveto
(pub   1024D/56191A6D 2004-05-19) p n
(      Key fingerprint = 91C7 9B1D 93D5 30A2 89FE  E77C 4BB3 A3A3 5619 1A6D) N
(uid                  Moray Allan \(key signing key\) <moray@sermisy.org>) N
() N
(031a  [ ] Fingerprint OK        [ ] ID OK) N
(pub   1024D/20C4A1F7 2005-11-29) N
(      Key fingerprint = 446E F1A7 FE85 3851 863E  D18A 046B C6DA 20C4 A1F7) N
(uid                  C\351sar G\363mez Mart\355n <cesar.gomez@juntaextremadura.net>) N
(uid                  C\351sar G\363mez Mart\355n <cesar@unex.es>) N
(uid                  C\351sar G\363mez Mart\355n <cesar.gomez@gmail.com>) N
() N
(032a  [ ] Fingerprint OK        [ ] ID OK) N
(pub   1024D/6B79D401 2001-11-25) N
(      Key fingerprint = 22D5 2C90 6D66 77F1 59F1  0030 001C DE6A 6B79 D401) N
(uid                  Giunchedi Filippo <filippo@esaurito.net>) N
(uid                  Giunchedi Filippo <filogiunchedi@libero.it>) N
(uid                  Giunchedi Filippo <filippo@debian.org>) N
(uid                  Giunchedi Filippo \(University of Bologna\) <giunched@cs.unibo.it>) N
(uid                  Filippo Giunchedi <filippo@debian.org>) N
() N
(033a  [ ] Fingerprint OK        [ ] ID OK) N
(pub   1024D/144843F5 2000-11-09) N
(      Key fingerprint = F556 6852 EB92 BD77 9CF1  3719 0EA7 56B5 1448 43F5) N
(uid                  Roland Mas <lolando@debian.org>) N
(uid                  Roland Mas <99.roland.mas@aist.enst.fr>) N
() N
(034a  [ ] Fingerprint OK        [ ] ID OK) N
(pub   1024D/F2C423BC 2000-03-06) N
(      Key fingerprint = 8156 FBF9 3EC1 D872 722D  3632 D5CA 9B04 F2C4 23BC) N
(uid                  Stefano Zacchiroli <zack@bononia.it>) N
(uid                  Stefano Zacchiroli <zack@debian.org>) N
(uid                  Stefano Zacchiroli \(Zack\) <zack@cs.unibo.it>) N
(uid                  Stefano Zacchiroli \(Zack\) <zacchiro@cs.unibo.it>) N
() N
(034b  [ ] Fingerprint OK        [ ] ID OK) N
(pub   1024D/73146BD4 2006-04-18) N
(      Key fingerprint = 5807 91C4 6171 0ED5 ACB7  7822 64DE 637A 7314 6BD4) N
(uid                  Stefano Zacchiroli <zack@bononia.it>) N
(uid                  Stefano Zacchiroli <zack@debian.org>) N
(uid                  Stefano Zacchiroli <zack@cs.unibo.it>) N
(uid                  Stefano Zacchiroli <zacchiro@cs.unibo.it>) N
() N
(035a  [ ] Fingerprint OK        [ ] ID OK) N
(pub   1024D/306CDFF3 2004-09-26) N
(      Key fingerprint = 12DA D001 50FD B751 A32C  ED19 A1BC BB2F 306C DFF3) N
(uid                  Alejandro Rios P. <alerios@debiancolombia.org>) N
(uid                  Alejandro Rios P. <alejandro.rios@avatar.com.co>) N
(uid                  Alejandro Rios P. <alerios@unicauca.edu.co>) N
() N
(036a  [ ] Fingerprint OK        [ ] ID OK) N
(pub   1024D/C97E7015 2005-08-15) N
(      Key fingerprint = 66CB 6BF4 7C7C EC0E DA60  06C8 87E8 9061 C97E 7015) N
(uid                  Ernesto Nadir Crespo Avila \(seraph\) <ecrespo@ujap.edu.ve>) N
(uid                  Ernesto Crespo \(seraph1\) <ecrespoa@yahoo.es>) N
(uid                  Ernesto Nadir Crespo Avila \(seraph1\) <ecrespo@uc.edu.ve>) N
(uid                  Ernesto Nadir Crespo Avila \(seraph1\) <ecrespo@debianvenezuela.org>) N
(uid                  Ernesto Nadir Crespo Avila \(seraph1\) <ecrespo@cantv.net>) N
(uid                  Ernesto Nadir Crespo Avila \(seraph1\) <ecrespo@gmail.com>) N
() N
(037a  [ ] Fingerprint OK        [ ] ID OK) N
(pub   1024D/8BB527AF 2001-10-23) N
(      Key fingerprint = 0C79 D2D1 2C4E 9CE4 5973  F800 D80E F35A 8BB5 27AF) N
(uid                  Gunnar Wolf <gwolf@gwolf.org>) N
(uid                  Gunnar Wolf <gwolf@debian.org>) N
(uid                  Gunnar Wolf <gwolf@seguridad.unam.mx>) N
() N
(038a  [ ] Fingerprint OK        [ ] ID OK) N
(pub   1024D/00D8CD16 2002-09-28) N
(      Key fingerprint = 46CD D292 0692 D5A2 8F81  2E48 0717 74E0 00D8 CD16) N
(uid                  Alexander Schmehl \(university\) <schmehl@cs.uni-frankfurt.de>) N
(uid                  Alexander Schmehl \(privat\) <alexander@schmehl.info>) N
(ksp-dc6.txt) (Page 5/15) (May 08, 06 9:25) title
border
/v 1 store
/x0 x v get 2.940000 add sx cw mul add store
/y0 y v get bfs th add sub store
x0 y0 moveto
(uid                  Alexander Schmehl \(university\) <schmehl@informatik.uni-frankfurt.de>) p n
(uid                  Alexander Schmehl <tolimar@debian.org>) N
(uid                  Alexander Schmehl <aschmehl@opensourcefactory.com>) N
() N
(039a  [ ] Fingerprint OK        [ ] ID OK) N
(pub   1024D/ADC9BC28 2002-02-26) N
(      Key fingerprint = 7C81 E60C 442E 8FBC D975  2F49 0199 8318 ADC9 BC28) N
(uid                  Luis Rodrigo Gallardo Cruz <rodrigo@nul-unu.com>) N
(uid                  Luis Rodrigo Gallardo Cruz <lrgallardo@interservice.net>) N
(uid                  Luis Rodrigo Gallardo Cruz <rodrigo.gallardo@gmail.com>) N
() N
(040a  [ ] Fingerprint OK        [ ] ID OK) N
(pub   1024D/BD76E77F 2005-08-12 [expires: 2007-08-12]) N
(      Key fingerprint = F899 5A87 C648 3F38 5107  79F1 B97B 7C4D BD76 E77F) N
(uid                  Ralph Amissah <ralph.amissah@gmail.com>) N
(uid                  Ralph Amissah <ralph@amissah.com>) N
() N
(041a  [ ] Fingerprint OK        [ ] ID OK) N
(pub   1024D/D626ABB6 2004-08-02 [expires: 2007-08-02]) N
(      Key fingerprint = D02D 8C0C ADBB A69B BF0F  6EAD B2B0 5F45 D626 ABB6) N
(uid                  Marcela Tiznado <mtiznado@linux.org.ar>) N
() N
(042a  [ ] Fingerprint OK        [ ] ID OK) N
(pub   1024D/3F3E6426 1999-09-27) N
(      Key fingerprint = FBDF 66F8 4CAC 5E58 8EC4  77E4 9FCF 2CCD 3F3E 6426) N
(uid                  Guido Guenther <agx@sigxcpu.org>) N
(uid                  Guido Guenther <agx@debian.org>) N
() N
(043a  [ ] Fingerprint OK        [ ] ID OK) N
(pub   1024D/D75F8533 2001-10-23) N
(      Key fingerprint = 8C62 F78F 7304 1328 C670  C347 AD29 5AE1 D75F 8533) N
(uid                  Josselin Mouette <joss@malsain.org>) N
(uid                  Josselin Mouette <joss@debian.org>) N
(uid                  Josselin Mouette <josselin.mouette@ens-lyon.org>) N
() N
(044a  [ ] Fingerprint OK        [ ] ID OK) N
(pub   1024D/6D742669 2003-11-09) N
(      Key fingerprint = 10CD 0397 6DBE 1E36 DEA3  72CC 540A 7B5E 6D74 2669) N
(uid                  Luca Capello <luca@pca.it>) N
(uid                  Luca Capello <gismo@member.fsf.org>) N
(uid                  Luca Capello <luca.capello@gmail.com>) N
(uid                  Luca Capello <luca.capello@vodafone.it>) N
(uid                  Luca Capello <luca.capello@zoo.unige.ch>) N
(uid                  Luca Capello <lucacapello@users.sourceforge.net>) N
(uid                  Luca Capello <luca.capello@frontiers-in-genetics.org>) N
(uid                  Luca Capello <gismo@innerloop.it>) N
(uid                  Luca Capello <lcapello@common-lisp.net>) N
() N
(045a  [ ] Fingerprint OK        [ ] ID OK) N
(pub   1024D/6A372DF6 2005-03-01) N
(      Key fingerprint = DB71 A7A1 3DB2 9A5A 3A40  63DF 75DC A23C 6A37 2DF6) N
(uid                  V\355ctor P\351rez Pereira <vperez@debianvenezuela.org>) N
() N
(046a  [ ] Fingerprint OK        [ ] ID OK) N
(pub   1024D/5FA99A33 2004-04-11) N
(      Key fingerprint = 368E E49F E9F7 F7B8 94C6  BD9E 724F BDA3 5FA9 9A33) N
(uid                  Orlando Fiol <fiolorlando@gmail.com>) N
(uid                  Orlando Fiol \(overflow\) <fiolorlando@cantv.net>) N
(uid                  Orlando Fiol <ofiol@ikirux.com.ve>) N
() N
(047a  [ ] Fingerprint OK        [ ] ID OK) N
(pub   1024D/0E60DFAD 2005-11-11) N
(      Key fingerprint = D26B B5F1 2531 23B2 2846  65B5 5A66 27B6 0E60 DFAD) N
(uid                  Manuel Garcia Fernandez \(mannyto\) <mannyto@gmail.com>) N
() N
(048a  [ ] Fingerprint OK        [ ] ID OK) N
(pub   1024D/174FEE35 2000-11-02) N
(      Key fingerprint = 6554 26C9 FA10 C1D1 D3D1  99C2 2167 2570 174F EE35) N
(uid                  Wookey <wookey@wookware.org>) N
(uid                  Wookey <wookey@survex.com>) N
(uid                  Wookey <wookey@aleph1.co.uk>) N
(ksp-dc6.txt) (Page 6/15) (May 08, 06 9:25) title
border
grestore
(Printed by Anibal Monsalve Salazar) rhead
(ksp-dc6.txt) (3/8) (Monday May 08, 2006) footer
end % of iso1dict
pagesave restore
showpage
%%Page: (7-8) 4
%%BeginPageSetup
/pagesave save def
sh 0 translate 90 rotate
%%EndPageSetup
iso1dict begin
gsave
llx lly 12 add translate
/v 0 store
/x0 x v get 2.940000 add sx cw mul add store
/y0 y v get bfs th add sub store
x0 y0 moveto
(uid                  Wookey <wookey@debian.org>) p n
() N
(049a  [ ] Fingerprint OK        [ ] ID OK) N
(pub   1024D/3E8DCCC0 2000-05-15) N
(      Key fingerprint = 30DC 1D28 1D79 32F5 5E67  3ABB 28EE B35A 3E8D CCC0) N
(uid                  Martin Wuertele <martin@wuertele.net>) N
(uid                  Martin Wuertele <maxx@debian.org>) N
(uid                  Martin W\374rtele <maxx@debian.org>) N
(uid                  Martin W\374rtele <martin@wuertele.net>) N
() N
(050a  [ ] Fingerprint OK        [ ] ID OK) N
(pub   1024D/6E76D81D 2002-07-07) N
(      Key fingerprint = F6FB 2231 48A9 B50C 68D7  18EC CA78 CB3E 6E76 D81D) N
(uid                  Sean Finney <seanius@seanius.net>) N
(uid                  Sean Finney \(debian\) <seanius@debian.org>) N
(uid                  Sean Finney \(gradient solutions\) <sean@gradientsolutions.net>) N
(uid                  Sean Finney \(stickybit\) <sean@stickybit.se>) N
() N
(051a  [ ] Fingerprint OK        [ ] ID OK) N
(pub   1024D/DC47CA16 2002-04-07) N
(      Key fingerprint = 7ACE 0FB0 7A74 F994 9B36  E1D1 D14E 8526 DC47 CA16) N
(uid                  David Weinehall <tao@acc.umu.se>) N
(uid                  David Weinehall <tao@kernel.org>) N
(uid                  David Weinehall <tao@linux.nu>) N
(uid                  David Weinehall <tao@linux.se>) N
(uid                  David Weinehall <tao@debian.org>) N
(uid                  David Weinehall \(Tao of TRIAD\) <tao@triad.se>) N
() N
(052a  [ ] Fingerprint OK        [ ] ID OK) N
(pub   1024D/AB963370 1999-09-16) N
(      Key fingerprint = 9953 1408 5A0E C967 941D  CE9D E66D 2EEB AB96 3370) N
(uid                  Clint Adams \(Debian\) <schizo@debian.org>) N
() N
(052b  [ ] Fingerprint OK        [ ] ID OK) N
(pub   1024R/3E30A739 1994-06-04) N
(      Key fingerprint = 75 4D 5F 7C F3 96 B4 18  5F B7 ED 50 80 30 35 9A) N
(uid                  Clint Adams <schizo@debian.org>) N
(uid                  Clint Adams <schizo@simons-rock.edu>) N
() N
(053a  [ ] Fingerprint OK        [ ] ID OK) N
(pub   1024D/99E81DA0 2004-07-02) N
(      Key fingerprint = C644 D0B3 92F4 8FE4 4662  B541 1558 9445 99E8 1DA0) N
(uid                  Lior Kaplan <kaplanlior@gmail.com>) N
(uid                  Lior Kaplan \(Israel\) <webmaster@guides.co.il>) N
(uid                  Lior Kaplan <kaplan@debian.org>) N
() N
(054a  [ ] Fingerprint OK        [ ] ID OK) N
(pub   1024D/68AC5746 2002-04-16) N
(      Key fingerprint = D5D0 98AF B143 6373 4F41  7861 8351 C3C2 68AC 5746) N
(uid                  Robert Alan Larson \(Blars\) <blarson@blars.org>) N
() N
(055a  [ ] Fingerprint OK        [ ] ID OK) N
(pub   1024D/10731977 2001-01-19) N
(      Key fingerprint = 7023 2C99 12BB AE1D 46FC  F524 0432 36EB 1073 1977) N
(uid                  Danny Cautaert \(DaCa\) <danny@limehouse.org>) N
(uid                  Danny Cautaert \(ydctrt\) <daniel.cautaert@agf.be>) N
() N
(056a  [ ] Fingerprint OK        [ ] ID OK) N
(pub   1024D/D54F0847 2004-02-18) N
(      Key fingerprint = 70E4 66E4 1AF7 052F 7F2C  3B27 5D3C E77F D54F 0847) N
(uid                  Mark Shuttleworth <mark.shuttleworth@ubuntu.com>) N
(uid                  Mark Shuttleworth <mark@hbd.com>) N
(uid                  Mark Shuttleworth <mark@canonical.com>) N
(uid                  Mark Shuttleworth <mark@ubuntu.com>) N
(uid                  Mark Shuttleworth <mark.shuttleworth@canonical.com>) N
() N
(057a  [ ] Fingerprint OK        [ ] ID OK) N
(pub   1024D/F2CF01A8 1999-07-18) N
(      Key fingerprint = A18E EFA7 E2E3 B02A 4168  875D 64A7 C0A7 F2CF 01A8) N
(uid                  Bdale Garbee <bdale@gag.com>) N
(uid                  Bdale Garbee <bdale@hp.com>) N
(ksp-dc6.txt) (Page 7/15) (May 08, 06 9:25) title
border
/v 1 store
/x0 x v get 2.940000 add sx cw mul add store
/y0 y v get bfs th add sub store
x0 y0 moveto
() p n
(058a  [ ] Fingerprint OK        [ ] ID OK) N
(pub   1024D/797EBFAB 2000-12-05) N
(      Key fingerprint = 66B4 DFB6 8CB2 4EBB D865  0BC4 F4B4 B0CC 797E BFAB) N
(uid                  Enrico Zini <enrico@enricozini.com>) N
(uid                  Enrico Zini <enrico@enricozini.org>) N
(uid                  Enrico Zini <enrico@debian.org>) N
(uid                  Enrico Zini \(Unibo\) <zinie@cs.unibo.it>) N
(uid                  Enrico Zini <zinie@cs.unibo.it>) N
() N
(059a  [ ] Fingerprint OK        [ ] ID OK) N
(pub   1024D/38015E7E 2003-09-18) N
(      Key fingerprint = 26C5 36DC A9AB 1F3F 640E  E030 8771 3483 3801 5E7E) N
(uid                  Thaddeus H. Black <thb@debian.org>) N
(uid                  Thaddeus H. Black <t@b-tk.org>) N
() N
(060a  [ ] Fingerprint OK        [ ] ID OK) N
(pub   1024D/84E22DA2 2005-11-07) N
(      Key fingerprint = 78F9 18B3 EF58 56F5 FC85  C5CA 53E7 887F 84E2 2DA2) N
(uid                  Matt Zagrabelny <mzagrabe@d.umn.edu>) N
() N
(061a  [ ] Fingerprint OK        [ ] ID OK) N
(pub   1024D/08419E50 2006-04-24) N
(      Key fingerprint = AFCE 86BC F3ED C0C1 4591  8589 AF60 06BC 0841 9E50) N
(uid                  Raul Odria \(A_Senna\) <rodria1@gmail.com>) N
() N
(062a  [ ] Fingerprint OK        [ ] ID OK) N
(pub   1024D/88F88F8F 2005-02-14) N
(      Key fingerprint = 41F3 CA36 E8BB F572 E99C  DE25 260C 3548 88F8 8F8F) N
(uid                  Sam Hocevar <sam@hocevar.net>) N
(uid                  Sam Hocevar <sam@zoy.org>) N
(uid                  Sam Hocevar <sam@via.ecp.fr>) N
(uid                  Sam Hocevar <sam@videolan.org>) N
(uid                  Samuel Hocevar <sho@debian.org>) N
(uid                  Samuel Hocevar <samuel@hocevar.net>) N
(uid                  Sam Hocevar \(RPM packages\) <sam+rpm@zoy.org>) N
(uid                  Sam Hocevar \(Debian packages\) <sam+deb@zoy.org>) N
() N
(062b  [ ] Fingerprint OK        [ ] ID OK) N
(pub   1024D/29499F61 1999-04-22) N
(      Key fingerprint = 1155 4B19 A50F 1136 6E60  A499 7CF3 F5AF 2949 9F61) N
(uid                  Sam Hocevar <sam@zoy.org>) N
(uid                  Sam Hocevar <sam@via.ecp.fr>) N
(uid                  Samuel Hocevar <sam@zoy.org>) N
(uid                  Samuel Hocevar <sho@debian.org>) N
(uid                  Samuel Hocevar <samuel@hocevar.net>) N
(uid                  Sam Hocevar \(RPM packages\) <sam+rpm@zoy.org>) N
(uid                  Sam Hocevar \(Debian packages\) <sam+deb@zoy.org>) N
() N
(063a  [ ] Fingerprint OK        [ ] ID OK) N
(pub   1024D/964199E2 2002-02-13) N
(      Key fingerprint = A74A 703C 8FC9 198E B12D  D83D EFA5 5436 9641 99E2) N
(uid                  Fabian Fagerholm <fabbe@paniq.net>) N
(uid                  Fabian Fagerholm <fabian.fagerholm@linux-aktivaattori.fi>) N
(uid                  Fabian Fagerholm <fabbe@nma.fi>) N
(uid                  Fabian Fagerholm <fabbe@debian.org>) N
() N
(064a  [ ] Fingerprint OK        [ ] ID OK) N
(pub   1024D/5A35FD42 2001-10-08) N
(      Key fingerprint = 7520 B443 610E C440 38F9  4A22 9BA0 936B 5A35 FD42) N
(uid                  Christoph Ulrich Scholler \(FNB\) <scholler@fnb.tu-darmstadt.de>) N
() N
(064b  [ ] Fingerprint OK        [ ] ID OK) N
(pub   1024D/1EEF26F4 2005-06-18) N
(      Key fingerprint = 5C1A 0C02 EC5B 2C1C AB3D  4389 3148 BBEF 1EEF 26F4) N
(uid                  Christoph Ulrich Scholler <scholler@fnb.tu-darmstadt.de>) N
(uid                  Christoph Ulrich Scholler <uli@scholler.net>) N
() N
(065a  [ ] Fingerprint OK        [ ] ID OK) N
(pub   1024D/E81E55C1 2005-05-22) N
(      Key fingerprint = 183A 70FC 4732 1B87 57A5  CE82 D837 7D4E E81E 55C1) N
(ksp-dc6.txt) (Page 8/15) (May 08, 06 9:25) title
border
grestore
(Printed by Anibal Monsalve Salazar) rhead
(ksp-dc6.txt) (4/8) (Monday May 08, 2006) footer
end % of iso1dict
pagesave restore
showpage
%%Page: (9-10) 5
%%BeginPageSetup
/pagesave save def
sh 0 translate 90 rotate
%%EndPageSetup
iso1dict begin
gsave
llx lly 12 add translate
/v 0 store
/x0 x v get 2.940000 add sx cw mul add store
/y0 y v get bfs th add sub store
x0 y0 moveto
(uid                  Junichi Uekawa <dancer@netfort.gr.jp>) p n
(uid                  Junichi Uekawa <dancer@debian.org>) N
() N
(066a  [ ] Fingerprint OK        [ ] ID OK) N
(pub   1024D/ED430BBA 2001-08-27) N
(      Key fingerprint = DB64 AF5C 4374 1E43 FA87  37AB 6692 F138 ED43 0BBA) N
(uid                  Yukiharu Yabuki <yabuki@netfort.gr.jp>) N
() N
(067a  [ ] Fingerprint OK        [ ] ID OK) N
(pub   1024D/3170EBE9 2003-09-29) N
(      Key fingerprint = 353A C650 BB7A 6F72 3650  9461 4121 C743 3170 EBE9) N
(uid                  Nobuhiro Iwamatsu <hemamu@t-base.ne.jp>) N
(uid                  Nobuhiro Iwamatsu <iwamatsu@nigauri.org>) N
(uid                  Nobuhiro Iwamatsu \(t-base version\) <hemamu@t-base.ne.jp>) N
() N
(068a  [ ] Fingerprint OK        [ ] ID OK) N
(pub   1024D/294260F6 2005-06-29) N
(      Key fingerprint = 2A66 C00A C1EA FE2E 4493  B7E0 7BC8 83A0 2942 60F6) N
(uid                  Jonna R\344m\366 <jonna@paniq.net>) N
() N
(069a  [ ] Fingerprint OK        [ ] ID OK) N
(pub   1024D/307D56ED 2001-05-17) N
(      Key fingerprint = B79B 0A23 EB24 809B BAEE  5DB6 F7F0 E70F 307D 56ED) N
(uid                  No\350l K\366the <noel@debian.org>) N
(uid                  No\350l K\366the <noel@hostsharing.net>) N
(uid                  No\350l K\366the <noel.koethe@credativ.de>) N
(uid                  No\350l K\366the <noel@koethe.net>) N
(uid                  Noel Koethe <noel@koethe.net>) N
(uid                  Noel Koethe <noel@hostsharing.net>) N
(uid                  Noel Koethe <noel.koethe@credativ.de>) N
(uid                  Noel Koethe <noel@debian.org>) N
(uid                  No\350l K\366the <noel@guug.de>) N
(uid                  No\350l K\366the <noel.koethe@linux.de>) N
(uid                  Noel Koethe <noel@kernelnotes.de>) N
(uid                  Noel Koethe <noel.koethe@linux.de>) N
(uid                  Noel Koethe \(German Unix User Group\) <noel@guug.de>) N
() N
(069b  [ ] Fingerprint OK        [ ] ID OK) N
(pub   2048R/1C2A301D 1999-03-23) N
(      Key fingerprint = 99 59 EF 36 61 CD 53 87  30 01 7F 47 49 8B E2 2D) N
(uid                  noel koethe <noel@koethe.net>) N
() N
(070a  [ ] Fingerprint OK        [ ] ID OK) N
(pub   1024D/287111EE 2005-08-13) N
(      Key fingerprint = 3119 5A09 CE9E 4928 B968  A637 9787 4067 2871 11EE) N
(uid                  Mario Oyorzabal Salgado \(tuxsoul\) <tuxsoul@tuxsoul.com>) N
(uid                  Mario Oyorzabal Salgado \(tuxsoul\) <tuxsoul@gruslic.org.mx>) N
(uid                  Mario Oyorzabal Salgado \(tuxsoul\) <tuxsoul@deblix.com>) N
(uid                  Mario Oyorzabal Salgado \(tuxsoul\) <tuxsoul@cicol.org.mx>) N
(uid                  Mario Oyorzabal Salgado \(tuxsoul\) <tuxsoul@ofrenda.com.mx>) N
() N
(071a  [ ] Fingerprint OK        [ ] ID OK) N
(pub   1024D/1BF8DE0F 2002-04-12) N
(      Key fingerprint = 9328 CDA7 3EF5 3AC1 CDF9  3A8B 71A1 FF60 1BF8 DE0F) N
(uid                  Roland Stigge <stigge@antcom.de>) N
(uid                  Roland Stigge <mail@rolandstigge.de>) N
(uid                  Roland Stigge <roland@stigge.org>) N
(uid                  Roland Stigge <stigge@debian.org>) N
() N
(072a  [ ] Fingerprint OK        [ ] ID OK) N
(pub   1024D/71473F66 2001-05-07) N
(      Key fingerprint = 31B8 BF83 4898 E26D 1935  4C5D E2ED E843 7147 3F66) N
(uid                  Todd Troxell <ttroxell@debian.org>) N
(uid                  Todd Troxell <xtat@rapidpacket.com>) N
() N
(073a  [ ] Fingerprint OK        [ ] ID OK) N
(pub   1024D/F1BCDB73 2001-03-03) N
(      Key fingerprint = 4B7D 2188 17B6 F67C 582D  CFB0 C376 A8DA F1BC DB73) N
(uid                  Aurelien Jarno <aurelien@aurel32.net>) N
(uid                  Aurelien Jarno <aurel32@debian.org>) N
(uid                  Aurelien Jarno <aurelien@jarno.name>) N
(ksp-dc6.txt) (Page 9/15) (May 08, 06 9:25) title
border
/v 1 store
/x0 x v get 2.940000 add sx cw mul add store
/y0 y v get bfs th add sub store
x0 y0 moveto
() p n
(074a  [ ] Fingerprint OK        [ ] ID OK) N
(pub   1024D/3F382AFA 2006-03-31) N
(      Key fingerprint = 997A 416F 8229 8DB2 6BFC  C1D6 A65F D7AF 3F38 2AFA) N
(uid                  Ivan Alfredo Zenteno Aguilar \(Creada el 31 de Marzo del 2006 a las 2:0) N
(4pm\) <k001.operator@gmail.com>) N
() N
(075a  [ ] Fingerprint OK        [ ] ID OK) N
(pub   1024D/BD1E5AFD 2006-03-31) N
(      Key fingerprint = A57B F2C0 BD75 0529 A35C  5F88 7617 42D3 BD1E 5AFD) N
(uid                  Osvaldo Jair Gaxiola Mercado \(Activista Gruslic\) <jyr@gruslic.org.mx>) N
() N
(076a  [ ] Fingerprint OK        [ ] ID OK) N
(pub   1024D/BF24424C 1999-01-24) N
(      Key fingerprint = 4966 F272 D093 B493 410B  924B 21BA DABB BF24 424C) N
(uid                  Manoj Srivastava <srivasta@computer.org>) N
(uid                  Manoj Srivastava <srivasta@golden-gryphon.com>) N
(uid                  Manoj Srivastava <srivasta@acm.org>) N
(uid                  Manoj Srivastava <srivasta@debian.org>) N
(uid                  Manoj Srivastava <srivasta@ieee.org>) N
() N
(076b  [ ] Fingerprint OK        [ ] ID OK) N
(pub   1024R/C7261095 1996-07-31) N
(      Key fingerprint = CB D9 F4 12 68 07 E4 05  CC 2D 27 12 1D F5 E8 6E) N
(uid                  Manoj Srivastava <srivasta@ieee.org>) N
(uid                  Manoj Srivastava <srivasta@acm.org>) N
(uid                  Manoj Srivastava <srivasta@debian.org>) N
(uid                  Manoj Srivastava <srivasta@computer.org>) N
() N
(077a  [ ] Fingerprint OK        [ ] ID OK) N
(pub   1024D/1B5B58F8 1999-07-08) N
(      Key fingerprint = 192D 26F1 8C0D 28E4 3B63  E846 E8B3 75C0 1B5B 58F8) N
(uid                  Thomas Bliesener <nospam@melix.com.mx>) N
(uid                  Thomas Bliesener <bli@melix.com.mx>) N
() N
(078a  [ ] Fingerprint OK        [ ] ID OK) N
(pub   1024D/C5E95333 2004-07-07) N
(      Key fingerprint = B52D A49A 0140 9672 AD0A  9722 56DC B977 C5E9 5333) N
(uid                  Faidon Liambotis <paravoid@debian.org>) N
(uid                  Faidon Liambotis <faidon@cube.gr>) N
() N
(079a  [ ] Fingerprint OK        [ ] ID OK) N
(pub   1024D/E1797BD2 2005-10-07 [expires: 2010-10-06]) N
(      Key fingerprint = 228B 0F96 8653 DF52 9740  B75E FB32 9C30 E179 7BD2) N
(uid                  Gerardo Curiel <gcuriel@debianvenezuela.org>) N
(uid                  Gerardo Curiel \(JavaManiac\) <gcuriel@gmail.com>) N
() N
(080a  [ ] Fingerprint OK        [ ] ID OK) N
(pub   1024D/DC814B09 2000-08-31) N
(      Key fingerprint = 86AA DB04 D2F5 CC55 3A4D  940F B1A9 DD82 DC81 4B09) N
(uid                  Javier Fern\341ndez-Sanguino Pe\361a <jfs@debian.org>) N
(uid                  Javier Fern\341ndez-Sanguino Pe\361a <jfs@gsi.dit.upm.es>) N
(uid                  Javier Fern\341ndez-Sanguino Pe\361a <jfs@computer.org>) N
(uid                  Javier Fern\341ndez-Sanguino Pe\361a <jfs@dat.etsit.upm.es>) N
() N
(080b  [ ] Fingerprint OK        [ ] ID OK) N
(pub   1024R/A436AD25 1997-11-17) N
(      Key fingerprint = D6 91 BB 89 88 7A F7 A0  BA E4 27 FD 7A 6A FE DA) N
(uid                  Javier Fernandez-Sanguino Pen~a <jfs@computer.org>) N
(uid                  Javier Fernandez-Sanguino Pen~a <jfs@ieeesb.etsit.upm.es>) N
(uid                  Javier Fernandez-Sanguino Pen~a <jfs@dat.etsit.upm.es>) N
(uid                  Javier Fernandez-Sanguino Pen~a <jfs@debian.org>) N
() N
(081a  [ ] Fingerprint OK        [ ] ID OK) N
(pub   1024D/7E7B8AC9 2002-05-11) N
(      Key fingerprint = DF7D EB2F DB28 FD2B A9FB  FA6D 715E D6A0 7E7B 8AC9) N
(uid                  Joerg Jaspert <joerg@debian.org>) N
(uid                  Joerg Jaspert <joerg@goliathbbs.dnsalias.net>) N
(uid                  Joerg Jaspert <joerg@german.ath.cx>) N
(uid                  Joerg Jaspert <joerg@ganneff.de>) N
() N
(ksp-dc6.txt) (Page 10/15) (May 08, 06 9:25) title
border
grestore
(Printed by Anibal Monsalve Salazar) rhead
(ksp-dc6.txt) (5/8) (Monday May 08, 2006) footer
end % of iso1dict
pagesave restore
showpage
%%Page: (11-12) 6
%%BeginPageSetup
/pagesave save def
sh 0 translate 90 rotate
%%EndPageSetup
iso1dict begin
gsave
llx lly 12 add translate
/v 0 store
/x0 x v get 2.940000 add sx cw mul add store
/y0 y v get bfs th add sub store
x0 y0 moveto
(082a  [ ] Fingerprint OK        [ ] ID OK) p n
(pub   1024D/F2833C93 2004-01-18) N
(      Key fingerprint = CEC8 6BB4 A0BA 9D0F 9039  7CAE F835 8FA2 F283 3C93) N
(uid                  Eric Evans <eevans@debian.org>) N
(uid                  Eric Evans <eevans@opennms.org>) N
(uid                  Eric Evans <eevans@sym-link.com>) N
() N
(083a  [ ] Fingerprint OK        [ ] ID OK) N
(pub   1024D/92DC02A9 2003-10-13) N
(      Key fingerprint = 16A2 86B6 CA6F C9FA 6280  C9D5 BD09 9FA2 92DC 02A9) N
(uid                  Peter Rockai <me@mornfall.net>) N
(uid                  Peter Rockai \(mornfall\) <me@mornfall.net>) N
(uid                  Peter Rockai \(mornfall\) <mornfall@danill.sk>) N
() N
(084a  [ ] Fingerprint OK        [ ] ID OK) N
(pub   1024D/0F7A8D01 1999-11-24) N
(      Key fingerprint = 4A6B 2543 679D 43B0 2B63  5439 AFF4 670B 0F7A 8D01) N
(uid                  Norbert Tretkowski <norbert@tretkowski.de>) N
(uid                  Norbert Tretkowski <nobse@debian.org>) N
() N
(085a  [ ] Fingerprint OK        [ ] ID OK) N
(pub   1024D/1CF2D62A 2000-05-07) N
(      Key fingerprint = 892B E46A 7E96 280B 4D93  73F4 F67E 2A5D 1CF2 D62A) N
(uid                  Micah Anderson <micah@debian.org>) N
(uid                  Micah Johan Anderson <micah@riseup.net>) N
(uid                  Micah Anderson \(no comment\) <micah@indymedia.org>) N
(uid                  Micah Anderson <micah@riseup.net>) N
(uid                  Micah Anderson <micah@indymedia.org>) N
() N
(086a  [ ] Fingerprint OK        [ ] ID OK) N
(pub   1024D/EA59038E 2002-09-26) N
(      Key fingerprint = F343 8FD5 0F2E AAF9 2155  02DE 4982 0C1C EA59 038E) N
(uid                  Stephen Gran <sgran@debian.org>) N
(uid                  Stephen Gran <steve@lobefin.net>) N
() N
(087a  [ ] Fingerprint OK        [ ] ID OK) N
(pub   1024D/54E672DE 2001-10-27) N
(      Key fingerprint = ED6F E2EF E079 3C8C FB0D  0638 4044 F618 54E6 72DE) N
(uid                  Isaac Clerencia <isaac@debian.org>) N
(uid                  Isaac Clerencia <isaac@warp.es>) N
(uid                  Isaac Clerencia <isaac@sindominio.net>) N
(uid                  Isaac Clerencia <isaac.clerencia@hispalinux.es>) N
() N
(088a  [ ] Fingerprint OK        [ ] ID OK) N
(pub   1024D/3FCC2A90 1999-11-28) N
(      Key fingerprint = 395D E808 BEAD D721 5E82  2051 3450 ED51 3FCC 2A90) N
(uid                  Amaya Rodrigo Sastre <amaya@debian.org>) N
(uid                  Amaya Rodrigo Sastre <amaya.rodrigo@hispalinux.es>) N
(uid                  Amaya Rodrigo Sastre <amaya@amayita.com>) N
() N
(089a  [ ] Fingerprint OK        [ ] ID OK) N
(pub   1024D/67209BDE 2003-11-27 [expires: 2011-11-25]) N
(      Key fingerprint = 0E97 81D6 9B88 16F2 86F5  72CE 3330 A215 6720 9BDE) N
(uid                  Aigars Mahinovs <aigarius@debian.org>) N
(uid                  Aigars Mahinovs <aigarius@koyanet.lv>) N
(uid                  Aigars Mahinovs <aigarius@one.lv>) N
(uid                  Aigars Mahinovs <aigarius@laka.lv>) N
(uid                  Aigars Mahinovs <aigarius@gmail.com>) N
() N
(090a  [ ] Fingerprint OK        [ ] ID OK) N
(pub   1024D/4E2ECA5A 2004-09-08) N
(      Key fingerprint = CA4F D469 C047 165A 1A55  CCD7 5E6D EF1C 4E2E CA5A) N
(uid                  Moritz Muehlenhoff <jmm@debian.org>) N
(uid                  Moritz Muehlenhoff <jmm@inutil.org>) N
() N
(091a  [ ] Fingerprint OK        [ ] ID OK) N
(pub   1024D/2C0FCD1A 2001-01-10) N
(      Key fingerprint = 0CA2 4B97 1443 7CBD 3628  A341 FE87 DFAD 2C0F CD1A) N
(uid                  Daniel Glassey <wdg@debian.org>) N
(uid                  Daniel Glassey <danglassey@ntlworld.com>) N
(uid                  Daniel Glassey \(Crosswire\) <dglassey@crosswire.org>) N
(ksp-dc6.txt) (Page 11/15) (May 08, 06 9:25) title
border
/v 1 store
/x0 x v get 2.940000 add sx cw mul add store
/y0 y v get bfs th add sub store
x0 y0 moveto
(uid                  Daniel Glassey <wdg1000@cantab.net>) p n
() N
(091b  [ ] Fingerprint OK        [ ] ID OK) N
(pub   1024D/45082D14 2004-10-15) N
(      Key fingerprint = BAF8 6608 F04E 6859 5860  1AD4 A4FD 5E5E 4508 2D14) N
(uid                  Daniel Glassey <daniel_glassey@sil.org>) N
(uid                  Daniel Glassey <wdg@debian.org>) N
() N
(092a  [ ] Fingerprint OK        [ ] ID OK) N
(pub   1024D/D0EC0723 2004-04-29) N
(      Key fingerprint = A982 F04E ABCD 834C AED9  DFFD 3485 BA08 D0EC 0723) N
(uid                  Mark Hymers \(Debian key\) <mark.hymers@ncl.ac.uk>) N
(uid                  Mark Hymers <mark.hymers@ynic.york.ac.uk>) N
(uid                  Mark Hymers <mark@hymers.org.uk>) N
() N
(093a  [ ] Fingerprint OK        [ ] ID OK) N
(pub   1024D/A504FECA 2006-03-19) N
(      Key fingerprint = C426 23B7 60FA 5999 693F  0782 690D 6214 A504 FECA) N
(uid                  Tiago Bortoletto Vaz <tiagovaz@gmail.com>) N
(uid                  Tiago Bortoletto Vaz <tiago@debian-ba.org>) N
() N
(094a  [ ] Fingerprint OK        [ ] ID OK) N
(pub   1024D/4BA401C3 2001-01-16) N
(      Key fingerprint = 9782 04E7 2B75 405C F5E9  0C81 C514 AF8E 4BA4 01C3) N
(uid                  Alberto Gonzalez Iniesta <agi@inittab.org>) N
(uid                  Alberto Gonzalez Iniesta <agi@debian.org>) N
(uid                  Alberto Gonzalez Iniesta <agi@agi.as>) N
() N
(095a  [ ] Fingerprint OK        [ ] ID OK) N
(pub   1024D/FA90587C 2003-09-02) N
(      Key fingerprint = B557 6185 4E38 59FB F58D  D083 23A2 6FFD FA90 587C) N
(uid                  Alejandro G S\341nchez Mart\355nez \(Lurkan\) <asanchezm@e-compugraf.com>) N
() N
(096a  [ ] Fingerprint OK        [ ] ID OK) N
(pub   1024D/05F7C9D9 2005-12-11) N
(      Key fingerprint = F804 BF28 8022 77FC 2839  13A6 62DF B58B 05F7 C9D9) N
(uid                  Leonel Duran Fuentes \(Ajatollah\) <ldfxjp@yahoo.co.jp>) N
() N
(096b  [ ] Fingerprint OK        [ ] ID OK) N
(pub   1024D/2F41E1B5 2006-05-05) N
(      Key fingerprint = A3C0 FB2E 3965 81EE A415  7417 5590 959F 2F41 E1B5) N
(uid                  Leonel Duran Fuentes \(Ajatollah\) <lduran@elementia.org>) N
() N
(096c  [ ] Fingerprint OK        [ ] ID OK) N
(pub   1024D/203E37B1 2006-05-05) N
(      Key fingerprint = F8B0 87CF F40D AD6C 7436  0A4E D80D 5095 203E 37B1) N
(uid                  Leonel Duran Fuentes \(Ajatollah\) <lnduran@elementia.org>) N
() N
(097a  [ ] Fingerprint OK        [ ] ID OK) N
(pub   1024D/DD9B9910 1999-08-20) N
(      Key fingerprint = 8DF8 CE53 24F3 177C 2417  6C65 6203 8A4B DD9B 9910) N
(uid                  Philip Hands <phil@hands.com>) N
() N
(098a  [ ] Fingerprint OK        [ ] ID OK) N
(pub   1024D/1D1D1702 2005-07-11) N
(      Key fingerprint = 271F 84DF D041 734D 7E99  BC03 C40A D37B 1D1D 1702) N
(uid                  Tassia Camoes Araujo <tassia@debian-ba.org>) N
() N
(099a  [ ] Fingerprint OK        [ ] ID OK) N
(pub   1024D/7B8357E5 2000-10-30) N
(      Key fingerprint = ADEE 5683 1C99 3257 F41D  A3F2 F20F AC0B 7B83 57E5) N
(uid                  Andreas Schuldei \(debian developer\) <andreas@debian.org>) N
(uid                  Andreas Schuldei \(permanent\) <andreas@schuldei.org>) N
() N
(100a  [ ] Fingerprint OK        [ ] ID OK) N
(pub   1024D/CAEAAF03 1999-06-15) N
(      Key fingerprint = ECF3 ADB2 B82A 839E 1404  D804 89B3 EF32 CAEA AF03) N
(uid                  Riku Voipio <Riku.Voipio@iki.fi>) N
(uid                  Riku Voipio <riku.voipio@movial.fi>) N
() N
(101a  [ ] Fingerprint OK        [ ] ID OK) N
(ksp-dc6.txt) (Page 12/15) (May 08, 06 9:25) title
border
grestore
(Printed by Anibal Monsalve Salazar) rhead
(ksp-dc6.txt) (6/8) (Monday May 08, 2006) footer
end % of iso1dict
pagesave restore
showpage
%%Page: (13-14) 7
%%BeginPageSetup
/pagesave save def
sh 0 translate 90 rotate
%%EndPageSetup
iso1dict begin
gsave
llx lly 12 add translate
/v 0 store
/x0 x v get 2.940000 add sx cw mul add store
/y0 y v get bfs th add sub store
x0 y0 moveto
(pub   1024D/83B64656 2003-04-28) p n
(      Key fingerprint = C143 4AD8 B017 53FA B742  D6AA CEEA F9F3 83B6 4656) N
(uid                  Anibal Avelar \(Fixxxer\) <avelar@gmail.com>) N
(uid                  Anibal Avelar \(Fixxxer\) <aavelar@cofradia.org>) N
() N
(102a  [ ] Fingerprint OK        [ ] ID OK) N
(pub   4096R/143E4666 2006-03-20) N
(      Key fingerprint = 48ED 28F7 053C 5D05 D959  41F2 4985 3A83 143E 4666) N
(uid                  Ted Walther <ted@dnull.com>) N
(uid                  Ted Walther <krooger@debian.org>) N
(uid                  Ted Walther <ted@enumera.com>) N
(uid                  Ted Walther <ted@reactor-core.org>) N
() N
(103a  [ ] Fingerprint OK        [ ] ID OK) N
(pub   1024D/0813569F 2003-09-14) N
(      Key fingerprint = D9E4 5378 D0F9 E4B2 0622  D299 976B 884B 0813 569F) N
(uid                  Jeroen van Wolffelaar <jeroen@wolffelaar.nl>) N
(uid                  Jeroen van Wolffelaar <jeroen@php.net>) N
(uid                  Jeroen van Wolffelaar <jeroen@debian.org>) N
(uid                  Jeroen van Wolffelaar <jjawolff@cs.uu.nl>) N
(uid                  Jeroen van Wolffelaar <jeroen@A-Eskwadraat.nl>) N
(uid                  Jeroen van Wolffelaar <jeroenvw@users.sourceforge.net>) N
() N
(104a  [ ] Fingerprint OK        [ ] ID OK) N
(pub   1024D/330C4A75 2001-06-20 [expires: 2006-06-20]) N
(      Key fingerprint = ACF4 9D3E 1E1D 5EE2 B203  5E53 220B C883 330C 4A75) N
(uid                  Martin F. Krafft <mail@martin-krafft.net>) N
(uid                  Martin F. Krafft <madduck@madduck.net>) N
(uid                  Martin F. Krafft \(AERAsec GmbH\) <mkrafft@aerasec.de>) N
(uid                  Martin F. Krafft \(MB! Sudetia\) <mkrafft@sudetia.de>) N
(uid                  Martin F. Krafft \(Debian\) <madduck@debian.org>) N
(uid                  Martin F. Krafft \(Uni Zuerich\) <krafft@ifi.unizh.ch>) N
(uid                  Martin F. Krafft \(AILab\) <krafft@ailab.ch>) N
(uid                  Martin F. Krafft \(ACM\) <madduck@acm.org>) N
(uid                  Martin F. Krafft \(IEEE\) <madduck@ieee.org>) N
() N
(105a  [ ] Fingerprint OK        [ ] ID OK) N
(pub   1024D/DA6AE621 2003-10-07) N
(      Key fingerprint = 7F9A D2AD CD37 37FD 60FD  0A11 4F1A 998E DA6A E621) N
(uid                  Adeodato Sim\363 <dato@net.com.org.es>) N
(uid                  Adeodato Sim\363 <asp16@alu.ua.es>) N
(uid                  Adeodato Sim\363 <adeodato.simo@hispalinux.es>) N
(uid                  Adeodato Sim\363 <adeodato@debian.org>) N
() N
(106a  [ ] Fingerprint OK        [ ] ID OK) N
(pub   1024D/EA7CF5AD 2005-04-09) N
(      Key fingerprint = 96F7 A8CC A87F 0EB8 3497  01B2 5A0A 399A EA7C F5AD) N
(uid                  Nicolas FRANCOIS \(Nekral\) <nicolas.francois@centraliens.net>) N
() N
(107a  [ ] Fingerprint OK        [ ] ID OK) N
(pub   1024D/7796A60B 2001-07-03 [expires: 2008-04-14]) N
(      Key fingerprint = 1F97 58A6 50D0 1FD2 60AB  4995 2E2C F67B 7796 A60B) N
(uid                  Simon Law <sfllaw@debian.org>) N
(uid                  Simon Law <sfllaw@nit.ca>) N
(uid                  Simon Law <sfllaw@law.yi.org>) N
(uid                  Simon Law <sfllaw@uwaterloo.ca>) N
(uid                  Simon Law <sfllaw@engmail.uwaterloo.ca>) N
() N
(108a  [ ] Fingerprint OK        [ ] ID OK) N
(pub   1024D/DDC0B70D 2004-02-28) N
(      Key fingerprint = 348D E846 F478 9BC1 7FBD  D2B0 7989 7DE7 DDC0 B70D) N
(uid                  Kari Pahula <kaol@iki.fi>) N
(uid                  Kari Pahula <kari@sammakko.yok.utu.fi>) N
(uid                  Kari Pahula <kaol@debian.org>) N
() N
(109a  [ ] Fingerprint OK        [ ] ID OK) N
(pub   1024D/90E5CA46 2004-06-04) N
(      Key fingerprint = C2E3 EBF1 F6E8 092F 5526  9A97 0A30 0ED0 90E5 CA46) N
(uid                  Felipe Augusto van de Wiel \(faw\) <felipe@cathedrallabs.org>) N
() N
(110a  [ ] Fingerprint OK        [ ] ID OK) N
(ksp-dc6.txt) (Page 13/15) (May 08, 06 9:25) title
border
/v 1 store
/x0 x v get 2.940000 add sx cw mul add store
/y0 y v get bfs th add sub store
x0 y0 moveto
(pub   1024D/19A42D19 2001-03-29) p n
(      Key fingerprint = AAA1 D9EA 42E0 99A3 39B3  6D76 86E0 0D0C 19A4 2D19) N
(uid                  dann frazier <dannf@fc.hp.com>) N
(uid                  Dann Frazier <dannf@dannf.org>) N
(uid                  dann frazier <dannf@debian.org>) N
(uid                  Dann Frazier <dannf@ldl.fc.hp.com>) N
() N
(111a  [ ] Fingerprint OK        [ ] ID OK) N
(pub   1024D/C33486C0 2004-02-02) N
(      Key fingerprint = 8C29 D187 7318 A862 11A9  D0C3 2C49 81C4 C334 86C0) N
(uid                  Patrick Ohnewein \(Free Software Foundation Europe\) <patrick.ohnewein@f) N
(sfeurope.org>) N
(uid                  Patrick Ohnewein <ohnewein@fsfeurope.org>) N
(uid                  Patrick Ohnewein <patrick.ohnewein@lugbz.org>) N
() N
(112a  [ ] Fingerprint OK        [ ] ID OK) N
(pub   1024D/258D8781 2000-06-15) N
(      Key fingerprint = 3CAB 9397 E835 E2E9 5289  A0C0 F85E BF46 258D 8781) N
(uid                  Michael Bramer <michael@debsupport.de>) N
(uid                  Michael Bramer <grisu@debian.org>) N
() N
(113a  [ ] Fingerprint OK        [ ] ID OK) N
(pub   1024D/F3E857E7 2006-02-15) N
(      Key fingerprint = B6F9 6F37 3A15 7D95 EA32  2E09 8DCC A2F1 F3E8 57E7) N
(uid                  Patricia de Vasconcelos Felix \(chave para DebConf\) <patyfelix02@yahoo.) N
(com>) N
() N
(114a  [ ] Fingerprint OK        [ ] ID OK) N
(pub   1024D/DAEBF9D6 2006-05-05) N
(      Key fingerprint = C30E 9AFC 1A6D 8463 B272  3ECE 0F15 A1C1 DAEB F9D6) N
(uid                  C\351sar Alberto Barrera Balderrama \(kab\) <abarrera@uach.mx>) N
(uid                  C\351sar Alberto Barrera Balderrama \(kab\) <abarrera@gmail.com>) N
() N
(115a  [ ] Fingerprint OK        [ ] ID OK) N
(pub   1024D/0D0F6AA4 2005-10-11) N
(      Key fingerprint = D029 DC2C 0AA7 B743 20B5  8CAB E794 A35F 0D0F 6AA4) N
(uid                  Sergio Cu\351llar Vald\351s <herrsergio@gmail.com>) N
() N
(116a  [ ] Fingerprint OK        [ ] ID OK) N
(pub   1024D/7D33D13F 2006-05-04) N
(      Key fingerprint = E481 02CC 2065 6CD2 DCFF  2D8F A0F5 A0E8 7D33 D13F) N
(uid                  Ana Isabel Delgado Dom\355nguez <anubis@debianvenezuela.org>) N
() N
(117a  [ ] Fingerprint OK        [ ] ID OK) N
(pub   1024D/EAA8922A 2005-12-02) N
(      Key fingerprint = 4096 27DA CF2A A05E 87E8  1179 9C75 8538 EAA8 922A) N
(uid                  Guntupalli Karunakar \(karunakar\) <karunakar@indlinux.org>) N
() N
(118a  [ ] Fingerprint OK        [ ] ID OK) N
(pub   1024D/F0D7D44A 2001-12-09) N
(      Key fingerprint = 0D4C 40C1 84AF A56A F548  DE1C EAE3 DC35 F0D7 D44A) N
(uid                  Jimmy Kaplowitz <jimmy@kaplowitz.org>) N
(uid                  Jimmy Kaplowitz <jim@bway.net>) N
(uid                  Jim Kaplowitz <jim@bway.net>) N
(uid                  Jimmy Kaplowitz <jimmy@debian.org>) N
(uid                  Jimmy Kaplowitz <jimmy@techhouse.org>) N
(uid                  Jimmy Kaplowitz <jkaplowi@cs.brown.edu>) N
(uid                  Jimmy Kaplowitz <Jimmy_Kaplowitz@brown.edu>) N
(uid                  Jimmy Kaplowitz <jimmy@techhouse.brown.edu>) N
() N
(119a  [ ] Fingerprint OK        [ ] ID OK) N
(pub   1024D/80B2D10A 2005-03-22) N
(      Key fingerprint = 7296 E8CA 8EF5 DAB5 916A  56F3 1EE2 9C0C 80B2 D10A) N
(uid                  Barry Hawkins <barry@alltc.com>) N
(uid                  Barry Hawkins <barry@yepthatsme.com>) N
(uid                  Barry Hawkins <barry@allthingscomputed.com>) N
(uid                  Barry Hawkins <barry@codecelt.org>) N
(uid                  Barry Hawkins <barry@codecelt.com>) N
(uid                  Barry Hawkins <barry@bytemason.org>) N
(uid                  Barry Hawkins <barryh-guest@users.alioth.debian.org>) N
() N
(ksp-dc6.txt) (Page 14/15) (May 08, 06 9:25) title
border
grestore
(Printed by Anibal Monsalve Salazar) rhead
(ksp-dc6.txt) (7/8) (Monday May 08, 2006) footer
end % of iso1dict
pagesave restore
showpage
%%Page: (15) 8
%%BeginPageSetup
/pagesave save def
sh 0 translate 90 rotate
%%EndPageSetup
iso1dict begin
gsave
llx lly 12 add translate
/v 0 store
/x0 x v get 2.940000 add sx cw mul add store
/y0 y v get bfs th add sub store
x0 y0 moveto
(120a  [ ] Fingerprint OK        [ ] ID OK) p n
(pub   1024D/5B026945 2006-05-05) N
(      Key fingerprint = 433B 4E51 6160 AE9A 9C29  149E 1CCD C53E 5B02 6945) N
(uid                  Ana Carolina Comandulli \(Caroll\) <carol@funlabs.org>) N
() N
(121a  [ ] Fingerprint OK        [ ] ID OK) N
(pub   1024D/9741C03A 2004-11-19) N
(      Key fingerprint = 1764 3C6F B433 B2DD 9029  98B1 8E6B 58D3 9741 C03A) N
(uid                  Erick Ivaan Lopez Carreon \(www.fsl.org.mx\) <erick@fsl.org.mx>) N
() N
(122a  [ ] Fingerprint OK        [ ] ID OK) N
(pub   1024D/13D0461D 2000-05-14) N
(      Key fingerprint = 640F ED14 88F4 1A5E D571  8358 5E4E EC21 13D0 461D) N
(uid                  Peter Samuelson <peter@p12n.org>) N
(uid                  Peter Samuelson <peter@samba-tng.org>) N
(uid                  Peter Samuelson <peter@angua.rince.de>) N
() N
(122b  [ ] Fingerprint OK        [ ] ID OK) N
(pub   1536R/AF9A6DB4 2004-06-08) N
(      Key fingerprint = 6564 497E 273E 5352 6190  E636 EFD1 7DE9 AF9A 6DB4) N
(uid                  Peter Samuelson \(Master key\) <peter@p12n.org>) N
() N
(123a  [ ] Fingerprint OK        [ ] ID OK) N
(pub   1024D/DAD018B4 2001-09-21) N
(      Key fingerprint = 34B6 2592 2D5C C4C5 1556  4824 B6D2 DCFC DAD0 18B4) N
(uid                  Jim Gettys \(X.org Foundation\) <jg@x.org>) N
(uid                  James Gettys \(Jim\) <jg@handhelds.org>) N
(uid                  Jim Gettys \(One Laptop Per Child, V.P. Software Engineering\) <jg@lapto) N
(p.org>) N
() N
(ksp-dc6.txt) (Page 15/15) (May 08, 06 9:25) title
border
grestore
(Printed by Anibal Monsalve Salazar) rhead
(ksp-dc6.txt) (8/8) (Monday May 08, 2006) footer
end % of iso1dict
pagesave restore
showpage

%%Trailer
end
%%EOF
