%!PS-Adobe-2.0 EPSF-1.2
%%Title: logoja.FH10
%%Creator: FreeHand 10.0
%%CreationDate: Thu Feb 10 11:01:02 2005 
%%BoundingBox: 0 0 314 234
%%FHPathName:C:\DOCUME~1\ADMINI~1\Desktop\LOGOJA~1\logoja.FH10
%ALDOriginalFile:C:\DOCUME~1\ADMINI~1\Desktop\LOGOJA~1\logoja.FH10
%ALDBoundingBox: -158 -68 683 527
%%FHPageNum:1
%%DocumentSuppliedResources: procset Altsys_header 4 0
%%ColorUsage: Color
%%DocumentProcessColors: Cyan Magenta Yellow Black
%%CMYKProcessColor: 0 0 0 0.1 (0c 0m 0y 10k)
%%+ 0.3 0.3 0.3 0.3 (30c 30m 30y 30k)
%%+ 0.09 0.4 0.68 0.11 (9c 40m 68y 11k)
%%+ 0 0.15 1 0 (0c 15m 100y 0k)
%%+ 0 0.13 0.6 0 (0c 13m 60y 0k)
%%+ 0 0.16 0.6 0 (0c 16m 60y 0k)
%%+ 1 0 0 0 (100c 0m 0y 0k)
%%+ 0.72 0.43 0 0 (PANTONE 2718 CV)
%%+ 0 0.91 0.87 0 (0c 91m 87y 0k)
%%+ 0 1 1 0 (0c 100m 100y 0k)
%%+ 1 0.6 0 0.18 (100c 60m 0y 18k)
%%EndComments
%%BeginResource: procset Altsys_header 4 0
userdict begin /AltsysDict 300 dict def end
AltsysDict begin
/bdf{bind def}bind def
/xdf{exch def}bdf
/defed{where{pop true}{false}ifelse}bdf
/ndf{1 index where{pop pop pop}{dup xcheck{bind}if def}ifelse}bdf
/d{setdash}bdf
/h{closepath}bdf
/H{}bdf
/J{setlinecap}bdf
/j{setlinejoin}bdf
/M{setmiterlimit}bdf
/n{newpath}bdf
/N{newpath}bdf
/q{gsave}bdf
/Q{grestore}bdf
/w{setlinewidth}bdf
/Xic{matrix invertmatrix concat}bdf
/Xq{matrix currentmatrix mark}bdf
/XQ{cleartomark setmatrix}bdf
/sepdef{
dup where not
{
AltsysSepDict
}
if	
3 1 roll exch put
}bdf
/st{settransfer}bdf
/colorimage defed /_rci xdf
/cntr 0 def
/readbinarystring{
/cntr 0 def
2 copy readstring
{
{
dup
(\034) search
{
length exch pop exch
dup length 0 ne
{
dup dup 0 get  32 sub 0 exch put
/cntr cntr 1 add def
}
{
pop 1 string dup
0 6 index read pop 32 sub put
}ifelse
3 copy
putinterval pop
1 add
1 index length 1 sub
1 index sub
dup 0 le {pop pop exit}if
getinterval
}
{
pop exit
} ifelse
} loop
}if
cntr 0 gt
{
pop 2 copy
dup length cntr sub cntr getinterval
readbinarystring
} if
pop exch pop
} bdf
/_NXLevel2 defed {			
_NXLevel2 not {			
/colorimage where {
userdict eq {
/_rci false def		
} if
} if
} if
} if
/md defed{	
md type /dicttype eq {		
/colorimage where {		
md eq {				
/_rci false def	
}if
}if
/settransfer where {
md eq {
/st systemdict /settransfer get def
}if
}if
}if
}if
/setstrokeadjust defed
{
true setstrokeadjust
/C{curveto}bdf
/L{lineto}bdf
/m{moveto}bdf
}
{
/dr{transform .25 sub round .25 add
exch .25 sub round .25 add exch itransform}bdf
/C{dr curveto}bdf
/L{dr lineto}bdf
/m{dr moveto}bdf
/setstrokeadjust{pop}bdf	
}ifelse
/privrectpath {	
4 -2 roll m
dtransform round exch round exch idtransform	
2 copy 0 lt exch 0 lt xor
{dup 0 exch rlineto exch 0 rlineto neg 0 exch rlineto}
{exch dup 0 rlineto exch 0 exch rlineto neg 0 rlineto}
ifelse
closepath
}bdf
/rectclip{newpath privrectpath clip newpath}def
/rectfill{gsave newpath privrectpath fill grestore}def
/rectstroke{gsave newpath privrectpath stroke grestore}def
/_fonthacksave false def
/currentpacking defed
{
/_bfh {/_fonthacksave currentpacking def false setpacking} bdf
/_efh {_fonthacksave setpacking} bdf
}
{
/_bfh {} bdf
/_efh {} bdf
}ifelse
/packedarray{array astore readonly}ndf
/`	
{
false setoverprint		
/-save0- save def
5 index concat
pop
storerect left bottom width height rectclip
pop
/MMdict_count countdictstack def
/MMop_count count 1 sub def
userdict begin
/showpage {} def
0 setgray 0 setlinecap 1 setlinewidth
0 setlinejoin 10 setmiterlimit [] 0 setdash newpath
} bdf
/currentpacking defed{true setpacking}if
/min{2 copy gt{exch}if pop}bdf
/max{2 copy lt{exch}if pop}bdf
/xformfont { currentfont exch makefont setfont } bdf
/fhnumcolors 1
statusdict begin
/processcolors defed
{
pop processcolors
}
{
/deviceinfo defed {
deviceinfo /Colors known {
pop deviceinfo /Colors get
} if
} if
} ifelse
end 
def
%	pix = x^2 + y^2
/printerRes
gsave
matrix defaultmatrix setmatrix
72 72 dtransform
abs exch abs
max
grestore
def
/graycalcs
[
{Angle Frequency}			
{GrayAngle GrayFrequency}	
{0 Width Height matrix defaultmatrix idtransform
dup mul exch dup mul add sqrt 72 exch div}	
{0 GrayWidth GrayHeight matrix defaultmatrix idtransform
dup mul exch dup mul add sqrt 72 exch div}	
] def
/calcgraysteps {
forcemaxsteps
{
maxsteps
}
{
/currenthalftone defed
{currenthalftone /dicttype eq}{false}ifelse
{
currenthalftone begin
HalftoneType 4 le
{graycalcs HalftoneType 1 sub get exec}
{
HalftoneType 5 eq
{
Default begin
{graycalcs HalftoneType 1 sub get exec}
end
}
{0 60}	
ifelse
}
ifelse
end
}
{
currentscreen pop exch			
}
ifelse
printerRes 300 max exch div exch	
2 copy								
sin mul round dup mul				
3 1 roll							
cos mul round dup mul				
add 1 add							
dup maxsteps gt {pop maxsteps} if	
dup minsteps lt {pop minsteps} if	
}
ifelse
} bdf
/nextrelease defed {						
/languagelevel defed not {				
/framebuffer defed {				
0 40 string framebuffer 9 1 roll 8 {pop} repeat
dup 516 eq exch 520 eq or
{
/fhnumcolors 3 def
/currentscreen {60 0 {pop pop 1}}bdf
/calcgraysteps {maxsteps} bdf
}if
}if
}if
}if
fhnumcolors 1 ne {
/calcgraysteps {maxsteps} bdf
} if
/currentpagedevice defed {
currentpagedevice /PreRenderingEnhance known
{
currentpagedevice /PreRenderingEnhance get
{
/calcgraysteps
{
forcemaxsteps
{maxsteps}
{256 maxsteps min}
ifelse
} def
} if
} if
} if
/gradfrequency 144 def
printerRes 1000 lt {
/gradfrequency 72 def
} if
/adjnumsteps {
dup dtransform abs exch abs max  
printerRes div 					 
gradfrequency mul 				 
round 						 
5 max						 
min							 
}bdf
/goodsep {
spots exch get 4 get dup sepname eq exch (_vc_Registration) eq or
}bdf
/BeginGradation defed
{/bb{BeginGradation}bdf}
{/bb{}bdf}
ifelse
/EndGradation defed
{/eb{EndGradation}bdf}
{/eb{}bdf}
ifelse
/bottom -0 def			
/delta -0 def			
/frac -0 def			
/height -0 def			
/left -0 def			
/numsteps1 -0 def		
/radius -0 def			
/right -0 def			
/top -0 def				
/width -0 def			
/xt -0 def				
/yt -0 def				
/df currentflat def		
/tempstr 1 string def	
/clipflatness currentflat def	
/inverted?				
0 currenttransfer exec .5 ge def
/tc1 [0 0 0 1] def		
/tc2 [0 0 0 1] def		
/storerect{/top xdf /right xdf /bottom xdf /left xdf
/width right left sub def /height top bottom sub def}bdf
/concatprocs{
systemdict /packedarray known
{dup type /packedarraytype eq 2 index type /packedarraytype eq or}{false}ifelse
{	
/proc2 exch cvlit def	/proc1 exch cvlit def
proc1 aload pop proc2 aload pop
proc1 length proc2 length add packedarray cvx
}
{	
/proc2 exch cvlit def	/proc1 exch cvlit def
/newproc proc1 length proc2 length add array def
newproc 0 proc1 putinterval newproc proc1 length proc2 putinterval
newproc cvx
}ifelse
}bdf
/i{dup 0 eq
{pop df dup}	
{dup} ifelse
/clipflatness xdf setflat
}bdf
version cvr 38.0 le
{/setrgbcolor{
currenttransfer exec 3 1 roll
currenttransfer exec 3 1 roll
currenttransfer exec 3 1 roll
setrgbcolor}bdf}if
/vms {/vmsv save def} bdf
/vmr {vmsv restore} bdf
/vmrs{vmsv restore /vmsv save def}bdf
/eomode{
{/filler /eofill load def /clipper /eoclip load def}
{/filler /fill load def /clipper /clip load def}
ifelse
}bdf
/normtaper{}bdf
/logtaper{9 mul 1 add log}bdf
/CD{
/NF exch def	
{				
exch dup	
/FID ne 1 index/UniqueID ne and
{exch NF 3 1 roll put}
{pop pop}
ifelse
}forall
NF
}bdf
/MN{
1 index length 		
/Len exch def
dup length Len add 	
string dup 			
Len 				
4 -1 roll 			
putinterval 		
dup 				
0 					
4 -1 roll			
putinterval			
}bdf
/RC{4 -1 roll /ourvec xdf 256 string cvs(|______)anchorsearch
{1 index MN cvn/NewN exch def cvn
findfont dup maxlength dict CD dup/FontName NewN put dup
/Encoding ourvec put NewN exch definefont pop}{pop}ifelse}bdf
/RF{						
dup 					
FontDirectory exch 		
known					
{pop 3 -1 roll pop}		
{RC}
ifelse
}bdf
/FF{dup 256 string cvs(|______)exch MN cvn dup FontDirectory exch known
{exch pop findfont 3 -1 roll pop}
{pop dup findfont dup maxlength dict CD dup dup
/Encoding exch /Encoding get 256 array copy 7 -1 roll
{3 -1 roll dup 4 -2 roll put}forall put definefont}
ifelse}bdf
/RCJ{4 -1 roll 			
/ourvec xdf  		
256 string cvs 		
(|______) anchorsearch
{pop				
cvn				
dup FDFJ		
exch	 		
1 index 		
eq				
{
_bfh findfont _efh		
dup 					
maxlength dict			
CD						
dup						
/FontName 		
3 index			
put						
dup						
/Encoding ourvec put	
1 index					
exch 					
definefont				
pop						
}
{exch pop}		
ifelse
}
{pop}				
ifelse
}bdf
/RFJ{						
dup 					
FontDirectory exch 		
known					
{pop 3 -1 roll pop}		
{RCJ}
ifelse
}bdf
/hasfont
{
/resourcestatus where	
{
pop			
/Font resourcestatus
{			
pop pop true
}
{			
false
}
ifelse
}
{
dup FontDirectory exch known
{pop true}
{
256 string
cvs
(fonts/) exch MN
status
{pop pop pop pop true}
{false}
ifelse
}
ifelse
}
ifelse
}bdf
/FDFJ
{
dup			
hasfont		
not			
{			
pop
/Ryumin-Light-83pv-RKSJ-H
hasfont			
{
/Ryumin-Light-83pv-RKSJ-H
}
{
/Courier
}
ifelse			
}
if
}bdf
/FFJ{
_bfh
dup					
256 string cvs		
(|______)exch MN	
cvn					
dup					
FontDirectory
exch known			
{					
exch				
pop					
findfont			
3 -1 roll			
pop					
}
{					
pop					
FDFJ				
dup findfont		
dup maxlength dict	
CD 					
dup dup				
/Encoding exch		
/Encoding get		
256 array copy		
7 -1 roll 			
{					
3 -1 roll		
dup				
4 -2 roll		
put				
}forall
put 				
definefont			
}
ifelse
_efh
}bdf
/GS {
dup
hasfont
{
findfont
exch makesetfont
exch
pop
ts
}
{
pop pop pop
ts
} ifelse
} bdf
/RCK{4 -1 roll 			
/ourvec xdf  		
256 string cvs 		
(|______) anchorsearch
{pop				
cvn				
dup FDFK		
exch	 		
1 index 		
eq				
{
_bfh findfont _efh		
dup 					
maxlength dict			
CD						
dup						
/FontName 		
3 index			
put						
dup						
/Encoding ourvec put	
1 index					
exch 					
definefont				
pop						
}
{exch pop}		
ifelse
}
{pop}				
ifelse
}bdf
/RFK{						
dup 					
FontDirectory exch 		
known					
{pop 3 -1 roll pop}		
{RCK}
ifelse
}bdf
/hasfont
{
/resourcestatus where	
{
pop			
/Font resourcestatus
{			
pop pop true
}
{			
false
}
ifelse
}
{
dup FontDirectory exch known
{pop true}
{
256 string
cvs
(fonts/) exch MN
status
{pop pop pop pop true}
{false}
ifelse
}
ifelse
}
ifelse
}bdf
/FDFK
{
dup			
hasfont		
not			
{			
pop
/JCsm
hasfont			
{
/JCsm
}
{
/Courier
}
ifelse			
}
if
}bdf
/FFK{
_bfh
dup					
256 string cvs		
(|______)exch MN	
cvn					
dup					
FontDirectory
exch known			
{					
exch				
pop					
findfont			
3 -1 roll			
pop					
}
{					
pop					
FDFK				
dup findfont		
dup maxlength dict	
CD 					
dup dup				
/Encoding exch		
/Encoding get		
256 array copy		
7 -1 roll 			
{					
3 -1 roll		
dup				
4 -2 roll		
put				
}forall
put 				
definefont			
}
ifelse
_efh
}bdf
/RCTC{4 -1 roll 			
/ourvec xdf  		
256 string cvs 		
(|______) anchorsearch
{pop				
cvn				
dup FDFTC		
exch	 		
1 index 		
eq				
{
_bfh findfont _efh		
dup 					
maxlength dict			
CD						
dup						
/FontName 		
3 index			
put						
dup						
/Encoding ourvec put	
1 index					
exch 					
definefont				
pop						
}
{exch pop}		
ifelse
}
{pop}				
ifelse
}bdf
/RFTC{						
dup 					
FontDirectory exch 		
known					
{pop 3 -1 roll pop}		
{RCTC}
ifelse
}bdf
/FDFTC
{
dup			
hasfont		
not			
{			
pop
/DFMing-Lt-HK-BF
hasfont			
{
/DFMing-Lt-HK-BF
}
{
/Courier
}
ifelse			
}
if
}bdf
/FFTC{
_bfh
dup					
256 string cvs		
(|______)exch MN	
cvn					
dup					
FontDirectory
exch known			
{					
exch				
pop					
findfont			
3 -1 roll			
pop					
}
{					
pop					
FDFTC				
dup findfont		
dup maxlength dict	
CD 					
dup dup				
/Encoding exch		
/Encoding get		
256 array copy		
7 -1 roll 			
{					
3 -1 roll		
dup				
4 -2 roll		
put				
}forall
put 				
definefont			
}
ifelse
_efh
}bdf
/fps{
currentflat 		
exch 				
dup 0 le{pop 1}if	
{
dup setflat 3 index stopped
{1.3 mul dup 3 index gt{pop setflat pop pop stop}if}	
{exit}			
ifelse
}loop
pop setflat pop pop
}bdf
/fp{100 currentflat fps}bdf
/clipper{clip}bdf		
/W{/clipper load 100 clipflatness dup setflat fps}bdf
/AVec 256 array def
AVec 0 /Helvetica findfont
/Encoding get 0 256 getinterval putinterval
/ANSIPatch[
16#0/grave 16#1/acute 16#2/circumflex 16#3/tilde 16#4/macron 16#5/breve
16#6/dotaccent 16#7/dieresis 16#8/ring 16#9/cedilla 16#A/hungarumlaut
16#B/ogonek 16#C/caron 16#D/dotlessi 16#27/quotesingle 16#60/grave
16#7C/bar 16#82/quotesinglbase 16#83/florin 16#84/quotedblbase 16#85
/ellipsis 16#86/dagger 16#87/daggerdbl 16#89/perthousand 16#8A/Scaron
16#8B/guilsinglleft 16#8C/OE 16#91/quoteleft 16#92/quoteright 16#93
/quotedblleft 16#94/quotedblright 16#95/bullet 16#96/endash 16#97/emdash
16#99/trademark 16#9A/scaron 16#9B/guilsinglright 16#9C/oe
16#9F/Ydieresis 16#A0/space 16#A4/currency 16#A6/brokenbar
16#A7/section 16#A8/dieresis 16#A9/copyright 16#AA/ordfeminine 16#AB/guillemotleft
16#AC/logicalnot 16#AD/hyphen 16#AE/registered 16#AF/macron 16#B0/degree
16#B1/plusminus 16#B2/twosuperior 16#B3/threesuperior 16#B4/acute 16#B5/mu
16#B6/paragraph 16#B7/periodcentered 16#B8/cedilla 16#B9/onesuperior
16#BA/ordmasculine 16#BB/guillemotright 16#BC/onequarter 16#BD/onehalf
16#BE/threequarters 16#BF/questiondown 16#C0/Agrave 16#C1/Aacute 16#C2/Acircumflex
16#C3/Atilde 16#C4/Adieresis 16#C5/Aring 16#C6/AE 16#C7/Ccedilla 16#C8/Egrave
16#C9/Eacute 16#CA/Ecircumflex 16#CB/Edieresis 16#CC/Igrave 16#CD/Iacute
16#CE/Icircumflex 16#CF/Idieresis 16#D0/Eth 16#D1/Ntilde 16#D2/Ograve
16#D3/Oacute 16#D4/Ocircumflex 16#D5/Otilde 16#D6/Odieresis 16#D7/multiply
16#D8/Oslash 16#D9/Ugrave 16#DA/Uacute 16#DB/Ucircumflex 16#DC/Udieresis
16#DD/Yacute 16#DE/Thorn 16#DF/germandbls 16#E0/agrave 16#E1/aacute
16#E2/acircumflex 16#E3/atilde 16#E4/adieresis 16#E5/aring 16#E6/ae
16#E7/ccedilla 16#E8/egrave 16#E9/eacute 16#EA/ecircumflex 16#EB/edieresis
16#EC/igrave 16#ED/iacute 16#EE/icircumflex 16#EF/idieresis 16#F0/eth
16#F1/ntilde 16#F2/ograve 16#F3/oacute 16#F4/ocircumflex 16#F5/otilde
16#F6/odieresis 16#F7/divide 16#F8/oslash 16#F9/ugrave 16#FA/uacute
16#FB/ucircumflex 16#FC/udieresis 16#FD/yacute 16#FE/thorn 16#FF/ydieresis
] def
127 1 159 { AVec exch/bullet put } for
ANSIPatch aload pop ANSIPatch length 2 idiv{AVec 3 1 roll put}repeat
/DoPatch { dup /CharStrings known
{ setfont
0 1 255 { dup
currentfont
/Encoding get
exch get
currentfont /CharStrings get
exch known
{pop} {currentfont /Encoding get exch /bullet put} ifelse
} for
} {pop} ifelse
} def
/findheaderfont {
AVec 256 array copy
/FHT /|______Helvetica dup RF findfont def
FHT DoPatch
FHT
}	def
end		%. AltsysDict
%%EndResource
%%EndProlog
%%BeginSetup
AltsysDict begin
_bfh	
_efh	
end %. AltsysDict
%%EndSetup
AltsysDict begin	
/onlyk4{false}ndf
/ccmyk{dup 5 -1 roll sub 0 max exch}ndf
/cmyk2gray{
4 -1 roll 0.3 mul 4 -1 roll 0.59 mul 4 -1 roll 0.11 mul
add add add 1 min neg 1 add
}bdf
/setcmykcolor{1 exch sub ccmyk ccmyk ccmyk pop setrgbcolor}ndf
/maxcolor {    
max max max		
} ndf
/maxspot {
pop
} ndf
/setcmykcoloroverprint{4{dup -1 eq{pop 0}if 4 1 roll}repeat setcmykcolor}ndf
/findcmykcustomcolor{5 packedarray}ndf
/setcustomcolor{exch aload pop pop 4{4 index mul 4 1 roll}repeat setcmykcolor pop}ndf
/setseparationgray{setgray}ndf
/setoverprint{pop}ndf		
/currentoverprint false ndf
/cmykbufs2gray{
0 1 2 index length 1 sub
{
4 index 1 index get	0.3 mul		
4 index 2 index get	0.59 mul	
4 index 3 index get	0.11 mul	
4 index 4 index get				
add add add cvi 255 min
255 exch sub
2 index 3 1 roll put
}for
4 1 roll pop pop pop
}bdf
/colorimage{
pop pop
[
5 -1 roll/exec cvx
6 -1 roll/exec cvx
7 -1 roll/exec cvx
8 -1 roll/exec cvx
/cmykbufs2gray cvx
]cvx
image
}
%. version 47.1 on Linotronic of Postscript defines colorimage incorrectly (rgb model only)
version cvr 47.1 le
statusdict /product get (Lino) anchorsearch{pop pop true}{pop false}ifelse
and{userdict begin bdf end}{ndf}ifelse
fhnumcolors 1 ne {/yt save def} if
/customcolorimage{
aload pop
(_vc_Registration) eq
{
pop pop pop pop separationimage
}
{
/ik xdf /iy xdf /im xdf /ic xdf
ic im iy ik cmyk2gray /xt xdf
currenttransfer
{dup 1.0 exch sub xt mul add}concatprocs
st
image
}
ifelse
}ndf
fhnumcolors 1 ne {yt restore} if
fhnumcolors 3 ne {/yt save def} if
/customcolorimage{
aload pop
(_vc_Registration) eq
{
pop pop pop pop separationimage
}
{
/ik xdf /iy xdf /im xdf /ic xdf
1.0 dup ic ik add min sub	
1.0 dup im ik add min sub	
1.0 dup iy ik add min sub	
/ic xdf /iy xdf /im xdf
currentcolortransfer
4 1 roll	
{dup 1.0 exch sub ic mul add}concatprocs 4 1 roll	
{dup 1.0 exch sub iy mul add}concatprocs 4 1 roll	
{dup 1.0 exch sub im mul add}concatprocs 4 1 roll	
setcolortransfer
{/dummy xdf dummy}concatprocs{dummy}{dummy}true 3 colorimage
}
ifelse
}ndf
fhnumcolors 3 ne {yt restore} if
fhnumcolors 4 ne {/yt save def} if
/customcolorimage{
aload pop
(_vc_Registration) eq
{
pop pop pop pop separationimage
}
{
/ik xdf /iy xdf /im xdf /ic xdf
currentcolortransfer
{1.0 exch sub ik mul ik sub 1 add}concatprocs 4 1 roll
{1.0 exch sub iy mul iy sub 1 add}concatprocs 4 1 roll
{1.0 exch sub im mul im sub 1 add}concatprocs 4 1 roll
{1.0 exch sub ic mul ic sub 1 add}concatprocs 4 1 roll
setcolortransfer
{/dummy xdf dummy}concatprocs{dummy}{dummy}{dummy}
true 4 colorimage
}
ifelse
}ndf
fhnumcolors 4 ne {yt restore} if
/separationimage{image}ndf
/spotascmyk false ndf
/newcmykcustomcolor{6 packedarray}ndf
/inkoverprint false ndf
/setinkoverprint{pop}ndf		
/setspotcolor {		
spots exch get
dup 4 get (_vc_Registration) eq
{pop 1 exch sub setseparationgray}
{0 5 getinterval exch setcustomcolor}
ifelse
}ndf
/currentcolortransfer{currenttransfer dup dup dup}ndf
/setcolortransfer{st pop pop pop}ndf
/fas{}ndf
/sas{}ndf
/fhsetspreadsize{pop}ndf
/filler{fill}bdf			
/F{gsave {filler}fp grestore}bdf
/f{closepath F}bdf
/S{gsave {stroke}fp grestore}bdf
/s{closepath S}bdf
userdict /islevel2
systemdict /languagelevel known dup
{
pop systemdict /languagelevel get 2 ge
} if
put
islevel2 not
{
/currentcmykcolor
{
0 0 0 1 currentgray sub
} ndf
} if
/tc
{
gsave
setcmykcolor currentcmykcolor
grestore
} bind def
/testCMYKColorThrough
{
tc add add add 0 ne
} bind def
/fhiscomposite where not {
userdict /fhiscomposite
islevel2
{
gsave 1 1 1 1 setcmykcolor currentcmykcolor grestore
add add add 4 eq
}
{
1 0 0 0 testCMYKColorThrough
0 1 0 0 testCMYKColorThrough
0 0 1 0 testCMYKColorThrough
0 0 0 1 testCMYKColorThrough
and and and
} ifelse
put
}
{ pop }
ifelse
/bc4 [0 0 0 0] def	
/_lfp4 {
1 pop	
/yt xdf							
/xt xdf							
/ang xdf						
storerect
/taperfcn xdf
/k2 xdf /y2 xdf /m2 xdf /c2 xdf
/k1 xdf /y1 xdf /m1 xdf /c1 xdf
c1 c2 sub abs
m1 m2 sub abs
y1 y2 sub abs
k1 k2 sub abs
maxcolor						
calcgraysteps mul abs round		
height abs adjnumsteps			
dup 1 lt {pop 1} if				
1 sub /numsteps1 xdf
currentflat mark				
currentflat clipflatness		
/delta top bottom sub numsteps1 1 add div def	
/right right left sub def		
/botsv top delta sub def		
{
{
W
xt yt translate
ang rotate
xt neg yt neg translate
dup setflat				
/bottom botsv def
0 1 numsteps1			
{
numsteps1 dup 0 eq {pop pop 0.5} {div} ifelse 
taperfcn /frac xdf
bc4 0 c2 c1 sub frac mul c1 add put
bc4 1 m2 m1 sub frac mul m1 add put
bc4 2 y2 y1 sub frac mul y1 add put
bc4 3 k2 k1 sub frac mul k1 add put
bc4 vc
1 index setflat		
{
mark {newpath left bottom right delta rectfill}stopped
{cleartomark exch 1.3 mul dup setflat exch 2 copy gt{stop}if}
{cleartomark exit}ifelse
}loop
/bottom bottom delta sub def
}for
}
gsave stopped grestore
{exch pop 2 index exch 1.3 mul dup 100 gt{cleartomark setflat stop}if}
{exit}ifelse
}loop
cleartomark setflat
}bdf
/bcs [0 0] def	
/_lfs4 {
/yt xdf							
/xt xdf							
/ang xdf						
storerect
/taperfcn xdf
/tint2 xdf						
/tint1 xdf						
bcs exch 1 exch put				
tint1 tint2 sub abs				
bcs 1 get maxspot				
calcgraysteps mul abs round		
height abs adjnumsteps			
dup 2 lt {pop 2} if				
1 sub /numsteps1 xdf
currentflat mark				
currentflat clipflatness		
/delta top bottom sub numsteps1 1 add div def	
/right right left sub def		
/botsv top delta sub def		
{
{
W
xt yt translate
ang rotate
xt neg yt neg translate
dup setflat				
/bottom botsv def
0 1 numsteps1			
{
numsteps1 div taperfcn /frac xdf
bcs 0
1.0 tint2 tint1 sub frac mul tint1 add sub
put bcs vc
1 index setflat		
{
mark {newpath left bottom right delta rectfill}stopped
{cleartomark exch 1.3 mul dup setflat exch 2 copy gt{stop}if}
{cleartomark exit}ifelse
}loop
/bottom bottom delta sub def
}for
}
gsave stopped grestore
{exch pop 2 index exch 1.3 mul dup 100 gt{cleartomark setflat stop}if}
{exit}ifelse
}loop
cleartomark setflat
}bdf
/_rfs6 {
/tint2 xdf						
/tint1 xdf						
bcs exch 1 exch put				
/inrad xdf						
/radius xdf						
/yt xdf							
/xt xdf							
tint1 tint2 sub abs				
bcs 1 get maxspot				
calcgraysteps mul abs round		
radius inrad sub abs			
adjnumsteps						
dup 1 lt {pop 1} if				
1 sub /numsteps1 xdf
radius inrad sub numsteps1 dup 0 eq {pop} {div} ifelse	
2 div /halfstep xdf				
currentflat mark				
currentflat clipflatness		
{
{
dup setflat				
W 						
0 1 numsteps1			
{
dup /radindex xdf
numsteps1 dup 0 eq {pop pop 0.5} {div} ifelse 
/frac xdf
bcs 0
tint2 tint1 sub frac mul tint1 add
put bcs vc
1 index setflat		
{
newpath mark	
xt yt radius inrad sub 1 frac sub mul halfstep add inrad add 0 360
{	arc
radindex numsteps1 ne
inrad 0 gt or		
{
xt yt			
numsteps1 0 eq
{ inrad }	
{			
radindex 1 add numsteps1 div 1 exch sub
radius inrad sub mul halfstep add inrad add
}ifelse
dup xt add yt moveto
360 0 arcn
} if
fill
}stopped
{cleartomark exch 1.3 mul dup setflat exch 2 copy gt{stop}if}
{cleartomark exit}ifelse
}loop
}for
}
gsave stopped grestore
{exch pop 2 index exch 1.3 mul dup 100 gt{cleartomark setflat stop}if}
{exit}ifelse
}loop
cleartomark setflat
}bdf
/_rfp6 {
1 pop	
/k2 xdf /y2 xdf /m2 xdf /c2 xdf
/k1 xdf /y1 xdf /m1 xdf /c1 xdf
/inrad xdf						
/radius xdf						
/yt xdf							
/xt xdf							
c1 c2 sub abs
m1 m2 sub abs
y1 y2 sub abs
k1 k2 sub abs
maxcolor					
calcgraysteps mul abs round	
radius inrad sub abs		
adjnumsteps					
dup 1 lt {pop 1} if			
1 sub /numsteps1 xdf
radius inrad sub numsteps1 dup 0 eq {pop} {div} ifelse	
2 div /halfstep xdf			
currentflat mark			
currentflat clipflatness	
{
{
dup setflat			
W 					
0 1 numsteps1		
{
dup /radindex xdf
numsteps1 dup 0 eq {pop pop 0.5} {div} ifelse 
/frac xdf
bc4 0 c2 c1 sub frac mul c1 add put
bc4 1 m2 m1 sub frac mul m1 add put
bc4 2 y2 y1 sub frac mul y1 add put
bc4 3 k2 k1 sub frac mul k1 add put
bc4 vc
1 index setflat		
{
newpath mark	
xt yt radius inrad sub 1 frac sub mul halfstep add inrad add 0 360
{	arc
radindex numsteps1 ne
inrad 0 gt or		
{
xt yt			
numsteps1 0 eq
{ inrad }	
{			
radindex 1 add numsteps1 div 1 exch sub
radius inrad sub mul halfstep add inrad add
}ifelse
dup xt add yt moveto
360 0 arcn
} if
fill
}stopped
{cleartomark exch 1.3 mul dup setflat exch 2 copy gt{stop}if}
{cleartomark exit}ifelse
}loop
}for
}
gsave stopped grestore
{exch pop 2 index exch 1.3 mul dup 100 gt{cleartomark setflat stop}if}
{exit}ifelse
}loop
cleartomark setflat
}bdf
/lfp4{_lfp4}ndf
/lfs4{_lfs4}ndf
/rfs6{_rfs6}ndf
/rfp6{_rfp6}ndf
/cvc [0 0 0 1] def	
/vc{
AltsysDict /cvc 2 index put	
aload length dup 4 eq
{pop dup -1 eq{pop setrgbcolor}{setcmykcolor}ifelse}
{6 eq {sethexcolor} {setspotcolor}	ifelse }
ifelse
}bdf	
0 setseparationgray
/imgr {1692 1584 2533.89 2179.28 } def			
/bleed 0 def			
/clpr {1692 1584 2533.89 2179.28 } def			
/xs 1 def				
/ys 1 def				
/botx 0 def			
/overlap 0 def			
/wdist 18 def			
0 2 mul fhsetspreadsize	
0 0 ne {/df 0 def /clipflatness 0 def} if	
/maxsteps 256 def		
/forcemaxsteps false def	
/minsteps 0 def		
userdict begin /AGDOrigMtx matrix currentmatrix def end
vms
-1850 -1652 translate
/currentpacking defed{false setpacking}if 	
/spots[
1 0 0 0 (Process Cyan) false newcmykcustomcolor
0 1 0 0 (Process Magenta) false newcmykcustomcolor
0 0 1 0 (Process Yellow) false newcmykcustomcolor
0 0 0 1 (Process Black) false newcmykcustomcolor
]def
/cvtr {1 exch sub 3 1 roll} def
/vr {
[ 3 index 3 index 3 index cvtr cvtr cvtr 0 ]
fhiscomposite not {vc pop pop pop}{pop setrgbcolor}ifelse
} def
/vc {AltsysDict /cvc 2 index put aload length dup 4 eq
{pop dup -0.2 ge {setcmykcolor} {pop vr} ifelse}
{6 eq {sethexcolor} {setspotcolor} ifelse} ifelse
} bdf
n
[] 0 d
3.863708 M
1 w
0 j
0 J
false setoverprint
0 i
false eomode
[0 0 0 1]vc
vms
1957.5879 1885.9234 m
1867.6214 1885.9234 L
1858.0393 1885.9234 1850.2709 1877.8421 1850.2709 1867.8754 C
1850.2709 1736.4838 L
1850.2709 1726.5169 1858.0393 1718.4369 1867.6214 1718.4369 C
1953.8867 1718.4369 L
1958.9614 1731.8446 L
1928.3634 1739.0086 1905.4334 1768.5546 1905.4334 1803.9143 C
1905.4334 1836.9343 1925.4296 1864.8842 1952.993 1874.2728 C
1957.5879 1885.9234 L
[0 0.2214 0.433 -1]vc
f	
n
1995.0671 1730.4678 m
2032.5744 1730.4678 2062.9824 1762.7125 2062.9824 1802.4859 C
2062.9824 1842.2602 2032.5744 1874.5053 1995.0671 1874.5053 C
1993.6682 1874.5053 1992.2803 1874.46 1990.9027 1874.3712 C
1994.6047 1885.9234 L
2102.2107 1885.9234 L
2111.7928 1885.9234 2119.5618 1877.8421 2119.5618 1867.8754 C
2119.5618 1736.4838 L
2119.5618 1726.5169 2111.7928 1718.4369 2102.2107 1718.4369 C
1990.9027 1718.4369 L
1995.0671 1730.4678 L
f	
n
2033.9523 1835.3882 m
2004.585 1835.3882 L
1962.9276 1718.4063 L
1980.9731 1718.4063 L
1998.7246 1768.2581 L
2016.7735 1768.2581 L
2020.7644 1768.2581 2025.7966 1769.4529 2027.8789 1775.4078 C
2029.9614 1781.3645 2041.2394 1812.587 2044.3627 1821.9727 C
2047.4867 1831.3581 2040.0257 1835.3882 2033.9523 1835.3882 C
h
2011.184 1777.7858 m
2002.1174 1777.7858 L
2019.1461 1825.6046 L
2028.2126 1825.6046 L
2011.184 1777.7858 L
f	
n
1988.5428 1820.4669 m
1970.7669 1770.6105 L
1952.8808 1770.6105 L
1972.4399 1825.4677 L
1963.2291 1825.4677 L
1943.6701 1770.6105 L
1925.625 1770.6105 L
1966.718 1885.8636 L
1984.7634 1885.8636 L
1966.6661 1835.106 L
1978.8207 1835.106 L
1987.579 1835.106 1991.1651 1828.2453 1988.5428 1820.4669 C
f	
n
1971.1056 1672.6334 m
1965.2765 1672.6334 L
1960.8943 1661.9351 L
1956.3791 1672.6334 L
1950.5496 1672.6334 L
1958.7489 1653.208 L
1963.151 1653.208 L
1971.1056 1672.6334 L
[0 0 0 1]vc
f	
n
1914.7987 1673.5151 m
1912.1441 1673.5151 1910.5682 1672.0571 1909.6831 1670.6665 C
1909.6831 1672.635 L
1903.8531 1672.635 L
1903.8531 1653.2096 L
1909.6831 1653.2096 L
1909.6831 1666.6873 L
1910.2066 1667.8696 1911.3161 1668.5983 1912.9782 1668.5983 C
1915.3453 1668.5983 1916.2722 1667.1411 1916.2722 1665.3497 C
1916.2722 1653.2096 L
1922.1018 1653.2096 L
1922.1018 1665.3497 L
1922.1018 1669.4172 1919.628 1673.5151 1914.7987 1673.5151 C
f	
n
2059.36 1673.5151 m
2056.7045 1673.5151 2055.129 1672.0571 2054.2433 1670.6665 C
2054.2433 1672.635 L
2048.4142 1672.635 L
2048.4142 1653.2096 L
2054.2433 1653.2096 L
2054.2433 1666.6873 L
2054.7671 1667.8696 2055.8758 1668.5983 2057.5377 1668.5983 C
2059.9071 1668.5983 2060.8324 1667.1411 2060.8324 1665.3497 C
2060.8324 1653.2096 L
2066.6622 1653.2096 L
2066.6622 1665.3497 L
2066.6622 1669.4172 2064.1888 1673.5151 2059.36 1673.5151 C
f	
n
1865.9039 1672.6334 m
1871.7338 1672.6334 L
1871.7338 1653.208 L
1865.9039 1653.208 L
1865.9039 1672.6334 L
f	
n
1868.8078 1677.3495 m
1870.7733 1677.3495 1872.3682 1678.943 1872.3682 1680.908 C
1872.3682 1682.8739 1870.7733 1684.4674 1868.8078 1684.4674 C
1866.8412 1684.4674 1865.246 1682.8739 1865.246 1680.908 C
1865.246 1678.943 1866.8412 1677.3495 1868.8078 1677.3495 C
f	
n
2107.2717 1672.635 m
2103.629 1672.635 L
2103.629 1679.4186 L
2097.7985 1679.4186 L
2097.7985 1672.635 L
2095.8554 1672.635 L
2095.8554 1668.0204 L
2097.7985 1668.0204 L
2097.7985 1653.2096 L
2103.629 1653.2096 L
2103.629 1668.0204 L
2107.2717 1668.0204 L
2107.2717 1672.635 L
f	
n
2007.9643 1656.682 m
2005.7962 1656.682 2004.0067 1658.9692 2003.6871 1661.9517 C
2017.6698 1661.9517 L
2017.6892 1662.2066 2017.7083 1662.4644 2017.7083 1662.7247 C
2017.7083 1668.5564 2013.2525 1673.2829 2007.759 1673.2829 C
2002.2632 1673.2829 1997.8068 1668.5564 1997.8068 1662.7247 C
1997.8068 1656.8946 2002.2632 1652.1647 2007.759 1652.1647 C
2011.9639 1652.1647 2015.5535 1654.9399 2017.0088 1658.8555 C
2011.2443 1658.8555 L
2010.452 1657.5274 2009.278 1656.682 2007.9643 1656.682 C
h
2007.9643 1669.1044 m
2009.7557 1669.1044 2011.2917 1667.5438 2011.951 1665.3192 C
2003.9765 1665.3192 L
2004.636 1667.5438 2006.1711 1669.1044 2007.9643 1669.1044 C
f	
n
2137.4188 1871.7643 m
2137.4188 1878.4928 2142.4738 1883.5581 2148.9758 1883.5581 C
2155.3648 1883.5581 2160.442 1878.4928 2160.442 1871.7643 C
2160.442 1864.945 2155.3648 1859.9379 2148.9758 1859.9379 C
2142.4738 1859.9379 2137.4188 1864.945 2137.4188 1871.7643 C
h
2148.9758 1857.5586 m
2156.6803 1857.5586 2163.2852 1863.5651 2163.2852 1871.7643 C
2163.2852 1879.9245 2156.6803 1885.9247 2148.9758 1885.9247 C
2141.1617 1885.9247 2134.5567 1879.9245 2134.5567 1871.7643 C
2134.5567 1863.5651 2141.1617 1857.5586 2148.9758 1857.5586 C
h
2145.9518 1870.6553 m
2148.8016 1870.6553 L
2153.1113 1863.5651 L
2155.9193 1863.5651 L
2151.2513 1870.7712 L
2153.6597 1871.0616 2155.4647 1872.3478 2155.4647 1875.2753 C
2155.4647 1878.4928 2153.5662 1879.9245 2149.7139 1879.9245 C
2143.486 1879.9245 L
2143.486 1863.5651 L
2145.9518 1863.5651 L
2145.9518 1870.6553 L
h
2145.9518 1872.7638 m
2145.9518 1877.8222 L
2149.3399 1877.8222 L
2151.0742 1877.8222 2152.9148 1877.442 2152.9148 1875.4139 C
2152.9148 1872.9086 2151.0131 1872.7638 2148.927 1872.7638 C
2145.9518 1872.7638 L
f	
n
vmr
vmr
end
%%Trailer
