%!PS-Adobe-3.0
%%Title: ksp-dc6-additional.txt
%%For: Anibal Monsalve Salazar
%%Creator: a2ps version 4.13
%%CreationDate: Fri May 19 23:08:21 2006
%%BoundingBox: 24 24 571 818
%%DocumentData: Clean7Bit
%%Orientation: Landscape
%%Pages: 1
%%PageOrder: Ascend
%%DocumentMedia: A4 595 842 0 () ()
%%DocumentNeededResources: font Courier
%%+ font Courier-Bold
%%+ font Courier-BoldOblique
%%+ font Courier-Oblique
%%+ font Helvetica
%%+ font Helvetica-Bold
%%+ font Symbol
%%+ font Times-Bold
%%+ font Times-Roman
%%DocumentProcessColors: Black 
%%DocumentSuppliedResources: procset a2ps-a2ps-hdr
%%+ procset a2ps-black+white-Prolog
%%+ encoding ISO-8859-1Encoding
%%EndComments
/a2psdict 200 dict def
a2psdict begin
%%BeginProlog
%%Copyright: (c) 1988, 89, 90, 91, 92, 93 Miguel Santana
%%Copyright: (c) 1995, 96, 97, 98 Akim Demaille, Miguel Santana
% Check PostScript language level.
/languagelevel where {
  pop /gs_languagelevel languagelevel def
} {
  /gs_languagelevel 1 def
} ifelse

% EPSF import as in the Red Book
/BeginInclude {
  /b4_Inc_state save def    		% Save state for cleanup
  /dict_count countdictstack def	% Count objects on dict stack
  /op_count count 1 sub def		% Count objects on operand stack 
  userdict begin
    0 setgray 0 setlinecap
    1 setlinewidth 0 setlinejoin
    10 setmiterlimit [ ] 0 setdash newpath
    gs_languagelevel 1 ne {
      false setstrokeadjust false setoverprint 
    } if
} bind def

/EndInclude {
  count op_count sub { pos } repeat	% Clean up stacks
  countdictstack dict_count sub { end } repeat
  b4_Inc_state restore
} bind def

/BeginEPSF {
  BeginInclude
  /showpage { } def
} bind def

/EndEPSF {
  EndInclude
} bind def

% Page prefeed
/page_prefeed {         % bool -> -
  statusdict /prefeed known {
    statusdict exch /prefeed exch put
  } {
    pop
  } ifelse
} bind def

/deffont {
  findfont exch scalefont def
} bind def

/reencode_font {
  findfont reencode 2 copy definefont pop def
} bind def

% Function c-show (str => -)
% centers text only according to x axis.
/c-show { 
  dup stringwidth pop
  2 div neg 0 rmoveto
  show
} bind def

% Function l-show (str => -)
% prints texts so that it ends at currentpoint
/l-show {
  dup stringwidth pop neg 
  0 
  rmoveto show
} bind def

% center-fit show (str w => -)
% show centered, and scale currentfont so that the width is less than w
/cfshow {
  exch dup stringwidth pop
  % If the title is too big, try to make it smaller
  3 2 roll 2 copy
  gt
  { % if, i.e. too big
    exch div
    currentfont exch scalefont setfont
  } { % ifelse
    pop pop 
  }
  ifelse
  c-show			% center title
} bind def

% Return the y size of the current font
% - => fontsize
/currentfontsize {
  currentfont /FontType get 0 eq {
    currentfont /FontMatrix get 3 get
  }{
    currentfont /FontMatrix get 3 get 1000 mul
  } ifelse
} bind def

% reencode the font
% <encoding-vector> <fontdict> -> <newfontdict>
/reencode { %def
  dup length 5 add dict begin
    { %forall
      1 index /FID ne 
      { def }{ pop pop } ifelse
    } forall
    /Encoding exch def

    % Use the font's bounding box to determine the ascent, descent,
    % and overall height; don't forget that these values have to be
    % transformed using the font's matrix.
    % We use `load' because sometimes BBox is executable, sometimes not.
    % Since we need 4 numbers an not an array avoid BBox from being executed
    /FontBBox load aload pop
    FontMatrix transform /Ascent exch def pop
    FontMatrix transform /Descent exch def pop
    /FontHeight Ascent Descent sub def

    % Define these in case they're not in the FontInfo (also, here
    % they're easier to get to.
    /UnderlinePosition 1 def
    /UnderlineThickness 1 def
    
    % Get the underline position and thickness if they're defined.
    currentdict /FontInfo known {
      FontInfo
      
      dup /UnderlinePosition known {
	dup /UnderlinePosition get
	0 exch FontMatrix transform exch pop
	/UnderlinePosition exch def
      } if
      
      dup /UnderlineThickness known {
	/UnderlineThickness get
	0 exch FontMatrix transform exch pop
	/UnderlineThickness exch def
      } if
      
    } if
    currentdict 
  end 
} bind def

% composite fonts for ASCII-EUC mixed strings
% Version 1.2 1/31/1990
% Original Ken'ichi HANDA (handa@etl.go.jp)
% Modified Norio Katayama (katayama@rd.nacsis.ac.jp),1998
% Extend & Fix Koji Nakamaru (maru@on.cs.keio.ac.jp), 1999
% Anyone can freely copy, modify, distribute this program.

/copyfont {	% font-dic extra-entry-count  copyfont  font-dic
	1 index maxlength add dict begin
	{	1 index /FID ne 2 index /UniqueID ne and
		{def} {pop pop} ifelse
	} forall
	currentdict
	end
} bind def

/compositefont { % ASCIIFontName EUCFontName RomanScale RomanOffset Rot(T/F) compositefont font
    /RomanRotation exch def
    /RomanOffset exch def
    /RomanScale exch def
    userdict /fixeucfont_dict known not {
	userdict begin
	    /fixeucfont_dict 2 dict begin
		/UpperByteEncoding [
		    16#00 1 16#20 { pop 0 } for
		    16#21 1 16#28 { 16#20 sub } for
		    16#29 1 16#2F { pop 0 } for
		    16#30 1 16#74 { 16#27 sub } for
		    16#75 1 16#FF { pop 0 } for
		] def
	        /LowerByteEncoding [
		    16#00 1 16#A0 { pop /.notdef } for
		    16#A1 1 16#FE { 16#80 sub 16 2 string cvrs
				    (cXX) dup 1 4 -1 roll
				    putinterval cvn } for
		    /.notdef
		] def
		currentdict
	    end def
	end
    } if
    findfont dup /FontType get 0 eq {
	14 dict begin
	    %
	    % 7+8 bit EUC font
	    %
	    12 dict begin
		/EUCFont exch def
		/FontInfo (7+8 bit EUC font) readonly def
		/PaintType 0 def
		/FontType 0 def
		/FontMatrix matrix def
		% /FontName
		/Encoding fixeucfont_dict /UpperByteEncoding get def
		/FMapType 2 def
		EUCFont /WMode known
		{ EUCFont /WMode get /WMode exch def }
		{ /WMode 0 def } ifelse
		/FDepVector [
		    EUCFont /FDepVector get 0 get
		    [ 16#21 1 16#28 {} for 16#30 1 16#74 {} for ]
		    {
			13 dict begin
			    /EUCFont EUCFont def
			    /UpperByte exch 16#80 add def	
			    % /FontName
			    /FontInfo (EUC lower byte font) readonly def
			    /PaintType 0 def
			    /FontType 3 def
			    /FontMatrix matrix def
			    /FontBBox {0 0 0 0} def
			    /Encoding
				fixeucfont_dict /LowerByteEncoding get def
			    % /UniqueID
			    % /WMode
			    /BuildChar {
				gsave
				exch dup /EUCFont get setfont
				/UpperByte get
				2 string
				dup 0 4 -1 roll put
				dup 1 4 -1 roll put
				dup stringwidth setcharwidth
				0 0 moveto show
				grestore
			    } bind def
			    currentdict
			end
			/lowerbytefont exch definefont
		    } forall
		] def
		currentdict
	    end
	    /eucfont exch definefont
	    exch
	    findfont 1 copyfont dup begin
		RomanRotation {
			/FontMatrix FontMatrix
			[ 0 RomanScale neg RomanScale 0 RomanOffset neg 0 ]
			matrix concatmatrix def
		}{
			/FontMatrix FontMatrix
			[ RomanScale 0 0 RomanScale 0 RomanOffset ] matrix concatmatrix
			def
			/CDevProc
			    {pop pop pop pop 0 exch -1000 exch 2 div 880} def
		} ifelse
	    end
	    /asciifont exch definefont
	    exch
	    /FDepVector [ 4 2 roll ] def
	    /FontType 0 def
	    /WMode 0 def
	    /FMapType 4 def
	    /FontMatrix matrix def
	    /Encoding [0 1] def
	    /FontBBox {0 0 0 0} def
%	    /FontHeight 1.0 def % XXXX
	    /FontHeight RomanScale 1.0 ge { RomanScale }{ 1.0 } ifelse def
	    /Descent -0.3 def   % XXXX
	    currentdict
	end
	/tmpfont exch definefont
	pop
	/tmpfont findfont
    }{
	pop findfont 0 copyfont
    } ifelse
} def	

/slantfont {	% FontName slant-degree  slantfont  font'
    exch findfont 1 copyfont begin
    [ 1 0 4 -1 roll 1 0 0 ] FontMatrix exch matrix concatmatrix
    /FontMatrix exch def
    currentdict
    end
} def

% Function print line number (<string> # -)
/# {
  gsave
    sx cw mul neg 2 div 0 rmoveto
    f# setfont
    c-show
  grestore
} bind def

% -------- Some routines to enlight plain b/w printings ---------

% Underline
% width --
/dounderline {
  currentpoint
  gsave
    moveto
    0 currentfont /Descent get currentfontsize mul rmoveto
    0 rlineto
    stroke
  grestore
} bind def

% Underline a string
% string --
/dounderlinestring {
  stringwidth pop
  dounderline
} bind def

/UL {
  /ul exch store
} bind def

% Draw a box of WIDTH wrt current font
% width --
/dobox {
  currentpoint
  gsave
    newpath
    moveto
    0 currentfont /Descent get currentfontsize mul rmoveto
    dup 0 rlineto
    0 currentfont /FontHeight get currentfontsize mul rlineto
    neg 0 rlineto
    closepath
    stroke
  grestore
} bind def

/BX {
  /bx exch store
} bind def

% Box a string
% string --
/doboxstring {
  stringwidth pop
  dobox
} bind def

%
% ------------- Color routines ---------------
%
/FG /setrgbcolor load def

% Draw the background
% width --
/dobackground {
  currentpoint
  gsave
    newpath
    moveto
    0 currentfont /Descent get currentfontsize mul rmoveto
    dup 0 rlineto
    0 currentfont /FontHeight get currentfontsize mul rlineto
    neg 0 rlineto
    closepath
    bgcolor aload pop setrgbcolor
    fill
  grestore
} bind def

% Draw bg for a string
% string --
/dobackgroundstring {
  stringwidth pop
  dobackground
} bind def


/BG {
  dup /bg exch store
  { mark 4 1 roll ] /bgcolor exch store } if
} bind def


/Show {
  bg { dup dobackgroundstring } if
  ul { dup dounderlinestring } if
  bx { dup doboxstring } if
  show
} bind def

% Function T(ab), jumps to the n-th tabulation in the current line
/T {
  cw mul x0 add
  bg { dup currentpoint pop sub dobackground } if
  ul { dup currentpoint pop sub dounderline } if
  bx { dup currentpoint pop sub dobox } if
  y0 moveto
} bind def

% Function n: move to the next line
/n {
  /y0 y0 bfs sub store
  x0 y0 moveto
} bind def

% Function N: show and move to the next line
/N {
  Show
  /y0 y0 bfs sub store
  x0 y0 moveto
} bind def

/S {
  Show
} bind def

%%BeginResource: procset a2ps-a2ps-hdr 2.0 2
%%Copyright: (c) 1988, 89, 90, 91, 92, 93 Miguel Santana
%%Copyright: (c) 1995, 96, 97, 98 Akim Demaille, Miguel Santana
% Function title: prints page header.
% <ct> <rt> <lt> are passed as argument
/title { 
  % 1. Draw the background
  x v get y v get moveto
  gsave
    0 th 2 div neg rmoveto 
    th setlinewidth
    0.95 setgray
    pw 0 rlineto stroke
  grestore
  % 2. Border it
  gsave
    0.7 setlinewidth
    pw 0 rlineto
    0 th neg rlineto
    pw neg 0 rlineto
    closepath stroke
  grestore
  % stk: ct rt lt
  x v get y v get th sub 1 add moveto
%%IncludeResource: font Helvetica
  fHelvetica fnfs 0.8 mul scalefont setfont
  % 3. The left title
  gsave
    dup stringwidth pop fnfs 0.8 mul add exch % leave space took on stack
    fnfs 0.8 mul hm rmoveto
    show			% left title
  grestore
  exch
  % stk: ct ltw rt
  % 4. the right title
  gsave
    dup stringwidth pop fnfs 0.8 mul add exch % leave space took on stack
    dup
    pw exch stringwidth pop fnfs 0.8 mul add sub
    hm
    rmoveto
    show			% right title
  grestore
  % stk: ct ltw rtw
  % 5. the center title
  gsave
    pw 3 1 roll
    % stk: ct pw ltw rtw
    3 copy 
    % Move to the center of the left room
    sub add 2 div hm rmoveto
    % What is the available space in here?
    add sub fnfs 0.8 mul sub fnfs 0.8 mul sub
    % stk: ct space_left
%%IncludeResource: font Helvetica-Bold
  fHelvetica-Bold fnfs scalefont setfont
    cfshow
  grestore
} bind def

% Function border: prints virtual page border
/border { %def
  gsave				% print four sides
    0 setgray
    x v get y v get moveto
    0.7 setlinewidth		% of the square
    pw 0 rlineto
    0 ph neg rlineto
    pw neg 0 rlineto
    closepath stroke
  grestore
} bind def

% Function water: prints a water mark in background
/water { %def
  gsave
    scx scy moveto rotate
%%IncludeResource: font Times-Bold
  fTimes-Bold 100 scalefont setfont
    .97 setgray
    dup stringwidth pop 2 div neg -50 rmoveto
    show
  grestore
} bind def

% Function rhead: prints the right header
/rhead {  %def
  lx ly moveto
  fHelvetica fnfs 0.8 mul scalefont setfont
  l-show
} bind def

% Function footer (cf rf lf -> -)
/footer {
  fHelvetica fnfs 0.8 mul scalefont setfont
  dx dy moveto
  show

  snx sny moveto
  l-show
  
  fnx fny moveto
  c-show
} bind def
%%EndResource
%%BeginResource: procset a2ps-black+white-Prolog 2.0 1

% Function T(ab), jumps to the n-th tabulation in the current line
/T { 
  cw mul x0 add y0 moveto
} bind def

% Function n: move to the next line
/n { %def
  /y0 y0 bfs sub store
  x0 y0 moveto
} bind def

% Function N: show and move to the next line
/N {
  Show
  /y0 y0 bfs sub store
  x0 y0 moveto
}  bind def

/S {
  Show
} bind def

/p {
  false UL
  false BX
  fCourier bfs scalefont setfont
  Show
} bind def

/sy {
  false UL
  false BX
  fSymbol bfs scalefont setfont
  Show
} bind def

/k {
  false UL
  false BX
  fCourier-Oblique bfs scalefont setfont
  Show
} bind def

/K {
  false UL
  false BX
  fCourier-Bold bfs scalefont setfont
  Show
} bind def

/c {
  false UL
  false BX
  fCourier-Oblique bfs scalefont setfont
  Show
} bind def

/C {
  false UL
  false BX
  fCourier-BoldOblique bfs scalefont setfont
  Show 
} bind def

/l {
  false UL
  false BX
  fHelvetica bfs scalefont setfont
  Show
} bind def

/L {
  false UL
  false BX
  fHelvetica-Bold bfs scalefont setfont
  Show 
} bind def

/str{
  false UL
  false BX
  fTimes-Roman bfs scalefont setfont
  Show
} bind def

/e{
  false UL
  true BX
  fHelvetica-Bold bfs scalefont setfont
  Show
} bind def

%%EndResource
%%EndProlog
%%BeginSetup
%%IncludeResource: font Courier
%%IncludeResource: font Courier-Oblique
%%IncludeResource: font Courier-Bold
%%IncludeResource: font Times-Roman
%%IncludeResource: font Symbol
%%IncludeResource: font Courier-BoldOblique
%%BeginResource: encoding ISO-8859-1Encoding
/ISO-8859-1Encoding [
/.notdef /.notdef /.notdef /.notdef /.notdef /.notdef /.notdef /.notdef 
/.notdef /.notdef /.notdef /.notdef /.notdef /.notdef /.notdef /.notdef 
/.notdef /.notdef /.notdef /.notdef /.notdef /.notdef /.notdef /.notdef 
/.notdef /.notdef /.notdef /.notdef /.notdef /.notdef /.notdef /.notdef 
/space /exclam /quotedbl /numbersign /dollar /percent /ampersand /quoteright 
/parenleft /parenright /asterisk /plus /comma /minus /period /slash 
/zero /one /two /three /four /five /six /seven 
/eight /nine /colon /semicolon /less /equal /greater /question 
/at /A /B /C /D /E /F /G 
/H /I /J /K /L /M /N /O 
/P /Q /R /S /T /U /V /W 
/X /Y /Z /bracketleft /backslash /bracketright /asciicircum /underscore 
/quoteleft /a /b /c /d /e /f /g 
/h /i /j /k /l /m /n /o 
/p /q /r /s /t /u /v /w 
/x /y /z /braceleft /bar /braceright /asciitilde /.notdef 
/.notdef /.notdef /.notdef /.notdef /.notdef /.notdef /.notdef /.notdef 
/.notdef /.notdef /.notdef /.notdef /.notdef /.notdef /.notdef /.notdef 
/.notdef /.notdef /.notdef /.notdef /.notdef /.notdef /.notdef /.notdef 
/.notdef /.notdef /.notdef /.notdef /.notdef /.notdef /.notdef /.notdef 
/space /exclamdown /cent /sterling /currency /yen /brokenbar /section 
/dieresis /copyright /ordfeminine /guillemotleft /logicalnot /hyphen /registered /macron 
/degree /plusminus /twosuperior /threesuperior /acute /mu /paragraph /bullet 
/cedilla /onesuperior /ordmasculine /guillemotright /onequarter /onehalf /threequarters /questiondown 
/Agrave /Aacute /Acircumflex /Atilde /Adieresis /Aring /AE /Ccedilla 
/Egrave /Eacute /Ecircumflex /Edieresis /Igrave /Iacute /Icircumflex /Idieresis 
/Eth /Ntilde /Ograve /Oacute /Ocircumflex /Otilde /Odieresis /multiply 
/Oslash /Ugrave /Uacute /Ucircumflex /Udieresis /Yacute /Thorn /germandbls 
/agrave /aacute /acircumflex /atilde /adieresis /aring /ae /ccedilla 
/egrave /eacute /ecircumflex /edieresis /igrave /iacute /icircumflex /idieresis 
/eth /ntilde /ograve /oacute /ocircumflex /otilde /odieresis /divide 
/oslash /ugrave /uacute /ucircumflex /udieresis /yacute /thorn /ydieresis 
] def
%%EndResource
% Initialize page description variables.
/sh 595 def
/sw 842 def
/llx 24 def
/urx 818 def
/ury 571 def
/lly 24 def
/#copies 1 def
/th 15.000000 def
/fnfs 11 def
/bfs 7.000000 def
/cw 4.200000 def

% Dictionary for ISO-8859-1 support
/iso1dict 8 dict begin
  /fCourier ISO-8859-1Encoding /Courier reencode_font
  /fCourier-Bold ISO-8859-1Encoding /Courier-Bold reencode_font
  /fCourier-BoldOblique ISO-8859-1Encoding /Courier-BoldOblique reencode_font
  /fCourier-Oblique ISO-8859-1Encoding /Courier-Oblique reencode_font
  /fHelvetica ISO-8859-1Encoding /Helvetica reencode_font
  /fHelvetica-Bold ISO-8859-1Encoding /Helvetica-Bold reencode_font
  /fTimes-Bold ISO-8859-1Encoding /Times-Bold reencode_font
  /fTimes-Roman ISO-8859-1Encoding /Times-Roman reencode_font
currentdict end def
/bgcolor [ 0 0 0 ] def
/bg false def
/ul false def
/bx false def
% The font for line numbering
/f# /Helvetica findfont bfs .6 mul scalefont def
/fSymbol /Symbol findfont def
/hm fnfs 0.25 mul def
/pw
   cw 92.400000 mul
def
/ph
   501.900000 th add
def
/pmw urx llx sub pw 2 mul sub 1 div def
/pmh 0 def
/v 0 def
/x [
  0
  dup pmw add pw add
] def
/y [
  pmh ph add 0 mul ph add
  dup
] def
/scx sw 2 div def
/scy sh 2 div def
/snx urx def
/sny lly 2 add def
/dx llx def
/dy sny def
/fnx scx def
/fny dy def
/lx snx def
/ly ury fnfs 0.8 mul sub def
/sx 0 def
/tab 8 def
/x0 0 def
/y0 0 def
%%EndSetup

%%Page: (1-2) 1
%%BeginPageSetup
/pagesave save def
sh 0 translate 90 rotate
%%EndPageSetup
iso1dict begin
gsave
llx lly 12 add translate
/v 0 store
/x0 x v get 2.940000 add sx cw mul add store
/y0 y v get bfs th add sub store
x0 y0 moveto
(Fri, 19 May 2006 22:22:30 +1000      Anibal Monsalve Salazar <anibal@debian.org>) p n
() N
(             D E B C O N F 6    K E Y S I G N I N G P A R T Y) N
() N
(                 Additional List of Participants  \(v 1.0\)) N
() N
() N
(Here's what you have to do with this file:) N
(\(1\) Print this file to paper.) N
(\(2\) Compute this file's MD5 checksum and optionally also its SHA1 checksum.) N
(   gpg --print-md md5 ksp-dc6-additional.txt   \(or use md5sum\)) N
(   gpg --print-md sha1 ksp-dc6-additional.txt  \(or use sha1sum\)) N
(\(3\) fill in the hash values on the printout.) N
(\(4\) Bring the printout, a pen, and proof of identity to the keysigningparty.) N
() N
(MD5 Checksum:  __ __ __ __ __ __ __ __    __ __ __ __ __ __ __ __           [ ]) N
() N
(SHA1 Checksum: ____ ____ ____ ____ ____    ____ ____ ____ ____ ____         [ ]) N
() N
() N
() N
(121b  [ ] Fingerprint OK        [ ] ID OK) N
(pub   1024D/FD0DF1AC 2006-05-06) N
(      Key fingerprint = 9E71 69E0 8F6C 2F6C DC16  7F41 A028 3278 FD0D F1AC) N
(uid                  Erick Ivaan Lopez Carreon \(Cibercalli\) <erick@cibercalli.com>) N
() N
(124a  [ ] Fingerprint OK        [ ] ID OK) N
(pub   1024D/575D0A76 2004-10-28) N
(      Key fingerprint = D32A 5C3A 81B8 5406 ED96  EF81 6964 36BF 575D 0A76) N
(uid                  Mart\355n Ferrari <martin.ferrari@gmail.com>) N
() N
(125a  [ ] Fingerprint OK        [ ] ID OK) N
(pub   1024D/F69D4834 2004-08-13 [expires: 2010-08-01]) N
(      Key fingerprint = 8E35 D684 3E1E AB1A 2AD2  7191 90CC 0C4A F69D 4834) N
(uid                  Juan A. Diaz \(CaFeLug - Argentina\) <juan@cafelug.org.ar>) N
(uid                  Juan A. Diaz \(Laboratorio de Intenet - Facultad Regional Buenos Aires ) N
(- Universidad Tecnol\363gica Nacional\) <juan@labint.frba.utn.edu.ar>) N
() N
(126a  [ ] Fingerprint OK        [ ] ID OK) N
(pub   1024D/72151E76 2006-05-14) N
(      Key fingerprint = 1DEE 7D3D AE22 CAD3 CC9E  A8FB E535 A2DB 7215 1E76) N
(uid                  Carlos Juan Martin Perez <k@ues.edu.sv>) N
() N
(127a  [ ] Fingerprint OK        [ ] ID OK) N
(pub   1024D/ADB60EC5 2006-05-14) N
(      Key fingerprint = 1374 3BB7 51FA 67CE DBC6  33A4 0961 F9F2 ADB6 0EC5) N
(uid                  Roger Julian Orellana Munoz <rjorellana@gmail.com>) N
() N
(128a  [ ] Fingerprint OK        [ ] ID OK) N
(pub   1024D/29086E58 2006-05-14) N
(      Key fingerprint = 7125 67EE C114 269A 51CC  3952 7387 F2E0 2908 6E58) N
(uid                  Gustavo Alexander Rauda Perez <tavorauda@gmail.com>) N
() N
(129a  [ ] Fingerprint OK        [ ] ID OK) N
(pub   1024D/3CF31473 2006-05-13) N
(      Key fingerprint = 4489 411A 7D37 38F7 292A  624C C4F3 0429 3CF3 1473) N
(uid                  Michael Dorrington \(Quark\) <mike@zen.co.uk>) N
() N
(130a  [ ] Fingerprint OK        [ ] ID OK) N
(pub   1024D/4F89B572 2006-05-14) N
(      Key fingerprint = 3B01 B3CA 4FFD 341D D887  3FFD 0087 A54D 4F89 B572) N
(uid                  Daniel Ernesto Tutila Hernandez <daniel.tutila@gmail.com>) N
() N
(131a  [ ] Fingerprint OK        [ ] ID OK) N
(pub   1024D/07F11177 2006-05-14) N
(      Key fingerprint = 1BEF 2F3F E031 4369 A66C  2792 7E55 969D 07F1 1177) N
(uid                  Manuel de Jesus Flores Villatoro <neozeroes@gmail.com>) N
() N
(132a  [ ] Fingerprint OK        [ ] ID OK) N
(pub   1024D/E0A64565 2006-05-14) N
(      Key fingerprint = 065D CE41 FCC2 286C 593E  F533 2B0F 809F E0A6 4565) N
(ksp-dc6-additional.txt) (Page 1/2) (May 19, 06 23:07) title
border
/v 1 store
/x0 x v get 2.940000 add sx cw mul add store
/y0 y v get bfs th add sub store
x0 y0 moveto
(uid                  Jos\351 David Calder\363n Serrano <gato@linux.ues.edu.sv>) p n
() N
(133a  [ ] Fingerprint OK        [ ] ID OK) N
(pub   1024D/894BB479 2003-07-15) N
(      Key fingerprint = 53D7 3210 9C90 AAB2 11D8  0503 4164 D1B3 894B B479) N
(uid                  Luciano Bello \(Linux Argentina\) <luciano@linux.org.ar>) N
(uid                  Luciano Bello \(ArCERT\) <lbello@arcert.gov.ar>) N
(uid                  Luciano Bello \(Capital Federal Linux Users Group\) <luciano@cafelug.org) N
(.ar>) N
(uid                  Luciano Bello \(Laboratorio de Internet FRBA-UTN\) <lbello@labint.frba.u) N
(tn.edu.ar>) N
(uid                  Luciano Bello \(Laboratorio de Sistemas - FRBA-UTN\) <lbello@sistemas.fr) N
(ba.utn.edu.ar>) N
(uid                  Luciano Bello \(ArCERT - Coordinaci\363n de Emergencias en Redes Teleinfor) N
(m\341ticas\) \(Coordinaci\363n de Emergencias en Redes Teleinform\341ticas\) <lbello@arcert.gov.ar>) N
() N
(134a  [ ] Fingerprint OK        [ ] ID OK) N
(pub   1024D/C71A016D 2006-05-16) N
(      Key fingerprint = B219 8BAB DD30 2153 7340  ABCA 2EF6 3491 C71A 016D) N
(uid                  Patricio Paez <pp@pp.com.mx>) N
() N
(135a  [ ] Fingerprint OK        [ ] ID OK) N
(pub   1024D/FD6645AB 1998-07-12) N
(      Key fingerprint = 70BC 7F9D 8C60 D226 5B70  76A2 3760 DBCF FD66 45AB) N
(uid                  Ryan Murray <rmurray@cyberhqz.com>) N
(uid                  Ryan Murray <rmurray@debian.org>) N
() N
(136a  [ ] Fingerprint OK        [ ] ID OK) N
(pub   1024D/096C4DD3 2001-08-07) N
(      Key fingerprint = 3B31 C0AD 093B 6CCD 3C63  81CE 429F 015B 096C 4DD3) N
(uid                  Keith Packard <keithp@keithp.com>) N
(uid                  Keith Packard <keithp@freedesktop.org>) N
(uid                  Keith Packard <keithp@debian.org>) N
(uid                  Keith Packard <keith.packard@intel.com>) N
() N
(137a  [ ] Fingerprint OK        [ ] ID OK) N
(pub   1024D/51C19066 2006-05-17 [expires: 2014-05-15]) N
(      Key fingerprint = 5BF2 AD5C D262 6EA5 DA0E  9518 0E31 CDE4 51C1 9066) N
(uid                  Alvaro Fuentes \(gpg\) <linux@linux-gnu.com>) N
() N
(138a  [ ] Fingerprint OK        [ ] ID OK) N
(pub   1024D/C1E45D08 2006-02-04) N
(      Key fingerprint = 8191 7C20 8A8C 29AC D5C2  7840 C8AC 7982 C1E4 5D08) N
(uid                  Hanna Ollila <hamaolli@cc.jyu.fi>) N
() N
(139a  [ ] Fingerprint OK        [ ] ID OK) N
(pub   1024D/B1FADA7B 2006-03-28) N
(      Key fingerprint = 167A FCBE 90EB A9CF 3406  0ED4 7052 79A0 B1FA DA7B) N
(uid                  Tuukka Hastrup <Tuukka.Hastrup@iki.fi>) N
() N
(140a  [ ] Fingerprint OK        [ ] ID OK) N
(pub   1024D/0AE35AEF 2006-05-05) N
(      Key fingerprint = 05CA 949B 9F93 306B A1DD  9C81 DD14 99B4 0AE3 5AEF) N
(uid                  Edgar Becerra \(Key for Debconf keysigning! Happy birthday '06 Palmis!\)) N
( <edgar@linux.ajusco.upn.mx>) N
(ksp-dc6-additional.txt) (Page 2/2) (May 19, 06 23:07) title
border
grestore
(Printed by Anibal Monsalve Salazar) rhead
(ksp-dc6-additional.txt) (1/1) (Friday May 19, 2006) footer
end % of iso1dict
pagesave restore
showpage

%%Trailer
end
%%EOF
