%!PS-Adobe-2.0 EPSF-2.0
%%Title: /var/home/p2/dc6-paper/HTsystem
%%Creator: Dia v0.94
%%CreationDate: Tue Apr  4 21:25:01 2006
%%For: p2
%%Orientation: Portrait
%%Magnification: 1.0000
%%BoundingBox: 0 0 981 405
%%BeginSetup
%%EndSetup
%%EndComments
%%BeginProlog
[ /.notdef /.notdef /.notdef /.notdef /.notdef /.notdef /.notdef /.notdef /.notdef /.notdef
/.notdef /.notdef /.notdef /.notdef /.notdef /.notdef /.notdef /.notdef /.notdef /.notdef
/.notdef /.notdef /.notdef /.notdef /.notdef /.notdef /.notdef /.notdef /.notdef /.notdef
/.notdef /.notdef /space /exclam /quotedbl /numbersign /dollar /percent /ampersand /quoteright
/parenleft /parenright /asterisk /plus /comma /hyphen /period /slash /zero /one
/two /three /four /five /six /seven /eight /nine /colon /semicolon
/less /equal /greater /question /at /A /B /C /D /E
/F /G /H /I /J /K /L /M /N /O
/P /Q /R /S /T /U /V /W /X /Y
/Z /bracketleft /backslash /bracketright /asciicircum /underscore /quoteleft /a /b /c
/d /e /f /g /h /i /j /k /l /m
/n /o /p /q /r /s /t /u /v /w
/x /y /z /braceleft /bar /braceright /asciitilde /.notdef /.notdef /.notdef
/.notdef /.notdef /.notdef /.notdef /.notdef /.notdef /.notdef /.notdef /.notdef /.notdef
/.notdef /.notdef /.notdef /.notdef /.notdef /.notdef /.notdef /.notdef /.notdef /.notdef
/.notdef /.notdef /.notdef /.notdef /.notdef /.notdef /.notdef /.notdef /.notdef /.notdef
/space /exclamdown /cent /sterling /currency /yen /brokenbar /section /dieresis /copyright
/ordfeminine /guillemotleft /logicalnot /hyphen /registered /macron /degree /plusminus /twosuperior /threesuperior
/acute /mu /paragraph /periodcentered /cedilla /onesuperior /ordmasculine /guillemotright /onequarter /onehalf
/threequarters /questiondown /Agrave /Aacute /Acircumflex /Atilde /Adieresis /Aring /AE /Ccedilla
/Egrave /Eacute /Ecircumflex /Edieresis /Igrave /Iacute /Icircumflex /Idieresis /Eth /Ntilde
/Ograve /Oacute /Ocircumflex /Otilde /Odieresis /multiply /Oslash /Ugrave /Uacute /Ucircumflex
/Udieresis /Yacute /Thorn /germandbls /agrave /aacute /acircumflex /atilde /adieresis /aring
/ae /ccedilla /egrave /eacute /ecircumflex /edieresis /igrave /iacute /icircumflex /idieresis
/eth /ntilde /ograve /oacute /ocircumflex /otilde /odieresis /divide /oslash /ugrave
/uacute /ucircumflex /udieresis /yacute /thorn /ydieresis] /isolatin1encoding exch def
/cp {closepath} bind def
/c {curveto} bind def
/f {fill} bind def
/a {arc} bind def
/ef {eofill} bind def
/ex {exch} bind def
/gr {grestore} bind def
/gs {gsave} bind def
/sa {save} bind def
/rs {restore} bind def
/l {lineto} bind def
/m {moveto} bind def
/rm {rmoveto} bind def
/n {newpath} bind def
/s {stroke} bind def
/sh {show} bind def
/slc {setlinecap} bind def
/slj {setlinejoin} bind def
/slw {setlinewidth} bind def
/srgb {setrgbcolor} bind def
/rot {rotate} bind def
/sc {scale} bind def
/sd {setdash} bind def
/ff {findfont} bind def
/sf {setfont} bind def
/scf {scalefont} bind def
/sw {stringwidth pop} bind def
/tr {translate} bind def

/ellipsedict 8 dict def
ellipsedict /mtrx matrix put
/ellipse
{ ellipsedict begin
   /endangle exch def
   /startangle exch def
   /yrad exch def
   /xrad exch def
   /y exch def
   /x exch def   /savematrix mtrx currentmatrix def
   x y tr xrad yrad sc
   0 0 1 startangle endangle arc
   savematrix setmatrix
   end
} def

/mergeprocs {
dup length
3 -1 roll
dup
length
dup
5 1 roll
3 -1 roll
add
array cvx
dup
3 -1 roll
0 exch
putinterval
dup
4 2 roll
putinterval
} bind def
/Times-Roman-latin1
    /Times-Roman findfont
    dup length dict begin
	{1 index /FID ne {def} {pop pop} ifelse} forall
	/Encoding isolatin1encoding def
    currentdict end
definefont pop
/Times-Italic-latin1
    /Times-Italic findfont
    dup length dict begin
	{1 index /FID ne {def} {pop pop} ifelse} forall
	/Encoding isolatin1encoding def
    currentdict end
definefont pop
/Times-Bold-latin1
    /Times-Bold findfont
    dup length dict begin
	{1 index /FID ne {def} {pop pop} ifelse} forall
	/Encoding isolatin1encoding def
    currentdict end
definefont pop
/Times-BoldItalic-latin1
    /Times-BoldItalic findfont
    dup length dict begin
	{1 index /FID ne {def} {pop pop} ifelse} forall
	/Encoding isolatin1encoding def
    currentdict end
definefont pop
/AvantGarde-Book-latin1
    /AvantGarde-Book findfont
    dup length dict begin
	{1 index /FID ne {def} {pop pop} ifelse} forall
	/Encoding isolatin1encoding def
    currentdict end
definefont pop
/AvantGarde-BookOblique-latin1
    /AvantGarde-BookOblique findfont
    dup length dict begin
	{1 index /FID ne {def} {pop pop} ifelse} forall
	/Encoding isolatin1encoding def
    currentdict end
definefont pop
/AvantGarde-Demi-latin1
    /AvantGarde-Demi findfont
    dup length dict begin
	{1 index /FID ne {def} {pop pop} ifelse} forall
	/Encoding isolatin1encoding def
    currentdict end
definefont pop
/AvantGarde-DemiOblique-latin1
    /AvantGarde-DemiOblique findfont
    dup length dict begin
	{1 index /FID ne {def} {pop pop} ifelse} forall
	/Encoding isolatin1encoding def
    currentdict end
definefont pop
/Bookman-Light-latin1
    /Bookman-Light findfont
    dup length dict begin
	{1 index /FID ne {def} {pop pop} ifelse} forall
	/Encoding isolatin1encoding def
    currentdict end
definefont pop
/Bookman-LightItalic-latin1
    /Bookman-LightItalic findfont
    dup length dict begin
	{1 index /FID ne {def} {pop pop} ifelse} forall
	/Encoding isolatin1encoding def
    currentdict end
definefont pop
/Bookman-Demi-latin1
    /Bookman-Demi findfont
    dup length dict begin
	{1 index /FID ne {def} {pop pop} ifelse} forall
	/Encoding isolatin1encoding def
    currentdict end
definefont pop
/Bookman-DemiItalic-latin1
    /Bookman-DemiItalic findfont
    dup length dict begin
	{1 index /FID ne {def} {pop pop} ifelse} forall
	/Encoding isolatin1encoding def
    currentdict end
definefont pop
/Courier-latin1
    /Courier findfont
    dup length dict begin
	{1 index /FID ne {def} {pop pop} ifelse} forall
	/Encoding isolatin1encoding def
    currentdict end
definefont pop
/Courier-Oblique-latin1
    /Courier-Oblique findfont
    dup length dict begin
	{1 index /FID ne {def} {pop pop} ifelse} forall
	/Encoding isolatin1encoding def
    currentdict end
definefont pop
/Courier-Bold-latin1
    /Courier-Bold findfont
    dup length dict begin
	{1 index /FID ne {def} {pop pop} ifelse} forall
	/Encoding isolatin1encoding def
    currentdict end
definefont pop
/Courier-BoldOblique-latin1
    /Courier-BoldOblique findfont
    dup length dict begin
	{1 index /FID ne {def} {pop pop} ifelse} forall
	/Encoding isolatin1encoding def
    currentdict end
definefont pop
/Helvetica-latin1
    /Helvetica findfont
    dup length dict begin
	{1 index /FID ne {def} {pop pop} ifelse} forall
	/Encoding isolatin1encoding def
    currentdict end
definefont pop
/Helvetica-Oblique-latin1
    /Helvetica-Oblique findfont
    dup length dict begin
	{1 index /FID ne {def} {pop pop} ifelse} forall
	/Encoding isolatin1encoding def
    currentdict end
definefont pop
/Helvetica-Bold-latin1
    /Helvetica-Bold findfont
    dup length dict begin
	{1 index /FID ne {def} {pop pop} ifelse} forall
	/Encoding isolatin1encoding def
    currentdict end
definefont pop
/Helvetica-BoldOblique-latin1
    /Helvetica-BoldOblique findfont
    dup length dict begin
	{1 index /FID ne {def} {pop pop} ifelse} forall
	/Encoding isolatin1encoding def
    currentdict end
definefont pop
/Helvetica-Narrow-latin1
    /Helvetica-Narrow findfont
    dup length dict begin
	{1 index /FID ne {def} {pop pop} ifelse} forall
	/Encoding isolatin1encoding def
    currentdict end
definefont pop
/Helvetica-Narrow-Oblique-latin1
    /Helvetica-Narrow-Oblique findfont
    dup length dict begin
	{1 index /FID ne {def} {pop pop} ifelse} forall
	/Encoding isolatin1encoding def
    currentdict end
definefont pop
/Helvetica-Narrow-Bold-latin1
    /Helvetica-Narrow-Bold findfont
    dup length dict begin
	{1 index /FID ne {def} {pop pop} ifelse} forall
	/Encoding isolatin1encoding def
    currentdict end
definefont pop
/Helvetica-Narrow-BoldOblique-latin1
    /Helvetica-Narrow-BoldOblique findfont
    dup length dict begin
	{1 index /FID ne {def} {pop pop} ifelse} forall
	/Encoding isolatin1encoding def
    currentdict end
definefont pop
/NewCenturySchoolbook-Roman-latin1
    /NewCenturySchoolbook-Roman findfont
    dup length dict begin
	{1 index /FID ne {def} {pop pop} ifelse} forall
	/Encoding isolatin1encoding def
    currentdict end
definefont pop
/NewCenturySchoolbook-Italic-latin1
    /NewCenturySchoolbook-Italic findfont
    dup length dict begin
	{1 index /FID ne {def} {pop pop} ifelse} forall
	/Encoding isolatin1encoding def
    currentdict end
definefont pop
/NewCenturySchoolbook-Bold-latin1
    /NewCenturySchoolbook-Bold findfont
    dup length dict begin
	{1 index /FID ne {def} {pop pop} ifelse} forall
	/Encoding isolatin1encoding def
    currentdict end
definefont pop
/NewCenturySchoolbook-BoldItalic-latin1
    /NewCenturySchoolbook-BoldItalic findfont
    dup length dict begin
	{1 index /FID ne {def} {pop pop} ifelse} forall
	/Encoding isolatin1encoding def
    currentdict end
definefont pop
/Palatino-Roman-latin1
    /Palatino-Roman findfont
    dup length dict begin
	{1 index /FID ne {def} {pop pop} ifelse} forall
	/Encoding isolatin1encoding def
    currentdict end
definefont pop
/Palatino-Italic-latin1
    /Palatino-Italic findfont
    dup length dict begin
	{1 index /FID ne {def} {pop pop} ifelse} forall
	/Encoding isolatin1encoding def
    currentdict end
definefont pop
/Palatino-Bold-latin1
    /Palatino-Bold findfont
    dup length dict begin
	{1 index /FID ne {def} {pop pop} ifelse} forall
	/Encoding isolatin1encoding def
    currentdict end
definefont pop
/Palatino-BoldItalic-latin1
    /Palatino-BoldItalic findfont
    dup length dict begin
	{1 index /FID ne {def} {pop pop} ifelse} forall
	/Encoding isolatin1encoding def
    currentdict end
definefont pop
/Symbol-latin1
    /Symbol findfont
definefont pop
/ZapfChancery-MediumItalic-latin1
    /ZapfChancery-MediumItalic findfont
    dup length dict begin
	{1 index /FID ne {def} {pop pop} ifelse} forall
	/Encoding isolatin1encoding def
    currentdict end
definefont pop
/ZapfDingbats-latin1
    /ZapfDingbats findfont
    dup length dict begin
	{1 index /FID ne {def} {pop pop} ifelse} forall
	/Encoding isolatin1encoding def
    currentdict end
definefont pop
28.346000 -28.346000 scale
-7.015100 -15.280000 translate
%%EndProlog


1.000000 1.000000 1.000000 srgb
n 15.450000 1.100000 m 15.450000 4.100000 l 19.450000 4.100000 l 19.450000 1.100000 l f
0.100000 slw
[] 0 sd
[] 0 sd
0 slj
0.000000 0.000000 0.000000 srgb
n 15.450000 1.100000 m 15.450000 4.100000 l 19.450000 4.100000 l 19.450000 1.100000 l cp s
/Courier-latin1 ff 0.560000 scf sf
(CPU) dup sw 2 div 17.450000 ex sub 2.850000 m gs 1 -1 sc sh gr
1.000000 1.000000 1.000000 srgb
n 29.215000 1.060000 m 29.215000 4.060000 l 33.215000 4.060000 l 33.215000 1.060000 l f
0.100000 slw
[] 0 sd
[] 0 sd
0 slj
0.000000 0.000000 0.000000 srgb
n 29.215000 1.060000 m 29.215000 4.060000 l 33.215000 4.060000 l 33.215000 1.060000 l cp s
/Courier-latin1 ff 0.560000 scf sf
(CPU) dup sw 2 div 31.215000 ex sub 2.810000 m gs 1 -1 sc sh gr
0.100000 slw
[] 0 sd
[] 0 sd
0 slc
n 17.450000 4.100000 m 17.490100 6.000000 l s
1.000000 1.000000 1.000000 srgb
n 15.565100 6.000000 m 15.565100 9.000000 l 19.415100 9.000000 l 19.415100 6.000000 l f
0.100000 slw
[] 0 sd
[] 0 sd
0 slj
0.000000 0.000000 0.000000 srgb
n 15.565100 6.000000 m 15.565100 9.000000 l 19.415100 9.000000 l 19.415100 6.000000 l cp s
/Courier-latin1 ff 0.560000 scf sf
(HT PCIe) dup sw 2 div 17.465100 ex sub 7.300000 m gs 1 -1 sc sh gr
(bridge) dup sw 2 div 17.465100 ex sub 8.100000 m gs 1 -1 sc sh gr
0.100000 slw
[] 0 sd
[] 0 sd
0 slc
n 33.215000 2.560000 m 35.715100 2.600000 l s
1.000000 1.000000 1.000000 srgb
n 35.715100 1.150000 m 35.715100 4.050000 l 41.565100 4.050000 l 41.565100 1.150000 l f
0.100000 slw
[] 0 sd
[] 0 sd
0 slj
0.000000 0.000000 0.000000 srgb
n 35.715100 1.150000 m 35.715100 4.050000 l 41.565100 4.050000 l 41.565100 1.150000 l cp s
/Courier-latin1 ff 0.560000 scf sf
(Memory) dup sw 2 div 38.565100 ex sub 2.400000 m gs 1 -1 sc sh gr
(subsystem) dup sw 2 div 38.565100 ex sub 3.200000 m gs 1 -1 sc sh gr
1.000000 1.000000 1.000000 srgb
n 11.415100 11.900000 m 11.415100 15.050000 l 14.065100 15.050000 l 14.065100 11.900000 l f
0.100000 slw
[] 0 sd
[] 0 sd
0 slj
0.000000 0.000000 0.000000 srgb
n 11.415100 11.900000 m 11.415100 15.050000 l 14.065100 15.050000 l 14.065100 11.900000 l cp s
/Courier-latin1 ff 0.560000 scf sf
(Device) dup sw 2 div 12.615100 ex sub 13.750000 m gs 1 -1 sc sh gr
1.000000 1.000000 1.000000 srgb
n 20.775100 11.935000 m 20.775100 15.085000 l 23.425100 15.085000 l 23.425100 11.935000 l f
0.100000 slw
[] 0 sd
[] 0 sd
0 slj
0.000000 0.000000 0.000000 srgb
n 20.775100 11.935000 m 20.775100 15.085000 l 23.425100 15.085000 l 23.425100 11.935000 l cp s
/Courier-latin1 ff 0.560000 scf sf
(Device) dup sw 2 div 21.975100 ex sub 13.785000 m gs 1 -1 sc sh gr
1.000000 1.000000 1.000000 srgb
n 16.225100 11.985000 m 16.225100 15.135000 l 18.875100 15.135000 l 18.875100 11.985000 l f
0.100000 slw
[] 0 sd
[] 0 sd
0 slj
0.000000 0.000000 0.000000 srgb
n 16.225100 11.985000 m 16.225100 15.135000 l 18.875100 15.135000 l 18.875100 11.985000 l cp s
/Courier-latin1 ff 0.560000 scf sf
(Device) dup sw 2 div 17.375100 ex sub 13.835000 m gs 1 -1 sc sh gr
1.000000 1.000000 1.000000 srgb
n 7.065100 1.145000 m 7.065100 4.045000 l 12.915100 4.045000 l 12.915100 1.145000 l f
0.100000 slw
[] 0 sd
[] 0 sd
0 slj
0.000000 0.000000 0.000000 srgb
n 7.065100 1.145000 m 7.065100 4.045000 l 12.915100 4.045000 l 12.915100 1.145000 l cp s
/Courier-latin1 ff 0.560000 scf sf
(Memory) dup sw 2 div 9.915100 ex sub 2.395000 m gs 1 -1 sc sh gr
(subsystem) dup sw 2 div 9.915100 ex sub 3.195000 m gs 1 -1 sc sh gr
0.100000 slw
[] 0 sd
[] 0 sd
0 slc
n 12.915100 2.595000 m 15.450000 2.600000 l s
0.100000 slw
[] 0 sd
[] 0 sd
0 slc
n 12.740100 11.900000 m 16.615100 9.010000 l s
0.100000 slw
[] 0 sd
[] 0 sd
0 slc
n 17.490100 9.000000 m 17.550100 11.985000 l s
0.100000 slw
[] 0 sd
[] 0 sd
0 slc
n 19.450000 2.600000 m 29.215000 2.560000 l s
0.100000 slw
[] 0 sd
[] 0 sd
0 slc
n 22.100100 11.935000 m 18.265100 8.960000 l s
1.000000 1.000000 1.000000 srgb
n 29.215100 6.095000 m 29.215100 9.095000 l 33.065100 9.095000 l 33.065100 6.095000 l f
0.100000 slw
[] 0 sd
[] 0 sd
0 slj
0.000000 0.000000 0.000000 srgb
n 29.215100 6.095000 m 29.215100 9.095000 l 33.065100 9.095000 l 33.065100 6.095000 l cp s
/Courier-latin1 ff 0.560000 scf sf
(HT PCIe) dup sw 2 div 31.115100 ex sub 7.395000 m gs 1 -1 sc sh gr
(bridge) dup sw 2 div 31.115100 ex sub 8.195000 m gs 1 -1 sc sh gr
1.000000 1.000000 1.000000 srgb
n 25.065100 11.995000 m 25.065100 15.145000 l 27.715100 15.145000 l 27.715100 11.995000 l f
0.100000 slw
[] 0 sd
[] 0 sd
0 slj
0.000000 0.000000 0.000000 srgb
n 25.065100 11.995000 m 25.065100 15.145000 l 27.715100 15.145000 l 27.715100 11.995000 l cp s
/Courier-latin1 ff 0.560000 scf sf
(Device) dup sw 2 div 26.265100 ex sub 13.845000 m gs 1 -1 sc sh gr
1.000000 1.000000 1.000000 srgb
n 34.425100 12.030000 m 34.425100 15.180000 l 37.075100 15.180000 l 37.075100 12.030000 l f
0.100000 slw
[] 0 sd
[] 0 sd
0 slj
0.000000 0.000000 0.000000 srgb
n 34.425100 12.030000 m 34.425100 15.180000 l 37.075100 15.180000 l 37.075100 12.030000 l cp s
/Courier-latin1 ff 0.560000 scf sf
(Device) dup sw 2 div 35.625100 ex sub 13.880000 m gs 1 -1 sc sh gr
1.000000 1.000000 1.000000 srgb
n 29.875100 12.080000 m 29.875100 15.230000 l 32.525100 15.230000 l 32.525100 12.080000 l f
0.100000 slw
[] 0 sd
[] 0 sd
0 slj
0.000000 0.000000 0.000000 srgb
n 29.875100 12.080000 m 29.875100 15.230000 l 32.525100 15.230000 l 32.525100 12.080000 l cp s
/Courier-latin1 ff 0.560000 scf sf
(Device) dup sw 2 div 31.025100 ex sub 13.930000 m gs 1 -1 sc sh gr
0.100000 slw
[] 0 sd
[] 0 sd
0 slc
n 26.390100 11.995000 m 30.265100 9.105000 l s
0.100000 slw
[] 0 sd
[] 0 sd
0 slc
n 31.140100 9.095000 m 31.200100 12.080000 l s
0.100000 slw
[] 0 sd
[] 0 sd
0 slc
n 35.750100 12.030000 m 31.915100 9.055000 l s
0.100000 slw
[] 0 sd
[] 0 sd
0 slc
n 31.215000 4.060000 m 31.140100 6.095000 l s
showpage
