<?xml version="1.0" encoding="UTF-8"?>
<svg id="svg176" width="170mm" height="170mm" version="1.1" viewBox="0 0 170 170" xmlns="http://www.w3.org/2000/svg">
 <defs id="defs170">
  <clipPath id="clipPath1525">
   <path id="path1527" d="m594.96 30.321c-0.97204 0-1.76 0.78799-1.76 1.76v8.8234c0 0.68067-0.80491 1.041-1.3123 0.58725l-11.925-10.66c-0.74727-0.66794-1.877-0.66794-2.6243 0l-37.83 33.817c-0.8349 0.74628-1.3122 1.813-1.3123 2.9328v53.117c0 0.97202 0.78799 1.76 1.76 1.76h77.389c0.97204 0 1.76-0.788 1.76-1.76v-53.117c-9e-5 -1.1198-0.47738-2.1865-1.3123-2.9328l-4.8905-4.3717c-0.83487-0.7464-1.3121-1.8132-1.312-2.9331v-25.262c0-0.97205-0.788-1.76-1.76-1.76zm-12.997 25.575c-0.67571 0.15381-1.6036 0.04777-2.2407 0.28188l-0.38128-0.05416c0.86562-0.1115 1.7413-0.15428 2.622-0.22802zm-3.8455 0.40419-2e-3 0.0016v0.0066h-0.0133c-0.44691 0.24872-0.88905 0.44557-1.308 0.73964 1.7184-0.40977 1.6365 0.16656 3.3929-0.06559-0.61606 0.08983-1.3654 0.33372-1.2458 0.42739 1.9634 0.22734 2.2645-0.60693 4.081 0l-0.11514-0.53654c2.5234 0.9111 3.0508 0.75724 5.7926 2.2115 0.96362 0.04711 1.0603-0.59378 2.5152 0 0.25585 0.44935-0.059 0.53208 1.7268 1.5953 0.19928-0.07905-0.35603-0.58359-0.79549-0.98572 3.5908 1.9198 7.4952 6.0108 8.6853 10.389-1.114-2.0541-0.11552 1.0484-0.49816 0.88746 0.49652 1.3395 0.90397 2.7227 1.1556 4.152-0.32975-1.1723-1.0492-4.0012-2.3095-5.8272-0.10287 1.1786-1.6234-0.81283-0.79209 1.7807 0.63397 0.91857 0.12783-0.93264 0.90896 0.69982 0.0121 0.7759 0.30919 1.5475 0.48098 2.5587-0.26745-0.04398-0.59689-1.117-0.79351-0.81815 0.27112 1.2719 0.71762 1.934 0.88746 2.0316-0.0872 0.21295-0.31243-0.19797-0.32771 0.66717 0.10399 1.9917 0.5583 1.151 0.77231 1.2458-0.21702 0.97978-1.0945 2.1324-0.66144 3.8186-0.12418-0.51061-0.36758-1.0246-0.55203-1.5085-0.17102 1.4395 0.31979 1.7208-0.34489 3.4656 0.47914-1.5728 0.42634-2.9917-0.0264-2.308 0.19946 2.2354-1.7693 3.9517-1.5564 5.3652l-0.5712-0.78949c-1.5502 2.2475-0.0373 1.2378-1.0926 2.9405 0.38693-0.669-0.20288-0.27565 0.30078-1.0333-0.33451 0.02279-1.4918 1.4231-2.5513 2.2485-4.1654 3.3389-9.137 3.7763-13.951 1.978-4e-3 0-4e-3 0.0038-6e-3 0.0063-4e-3 0.01442-9e-3 0.02808-0.0144 0.04211-4e-3 0.23141 0.93835 0.95652 1.6486 1.322 1.8339 0.67793 3.9079 0.70458 5.5399 0.64424-3.5271 1.4753-10.264-1.4991-12.467-5.4442 0.4985 0.10865 2.2067 2.7739 3.4848 3.207-0.75561-0.60554-1.3408-1.377-1.8824-2.1697 1.0208 1.1733 2.2636 2.1309 3.6192 2.7658-0.0369-0.13988 0.023-0.23219 0.057-0.32513 0-0.01647 4e-3 -0.03067 0.0144-0.04211 0.0282-0.11383-0.0102-0.23885-0.33947-0.46063-4.0802-3.1272-6.4917-5.785-5.6545-11.938 0.62229-0.4697 0.7878-3.036 2.2158-3.9352 0.87035-1.923 3.4769-3.6957 6.2644-3.7398 2.8457-0.15656 5.2477 1.5194 6.454 3.0995-2.1962-2.0467-5.7902-2.6699-8.856-1.1522-3.1346 1.4097-4.9942 4.8627-4.7232 8.3003 0.11649-0.17128 0.22008-0.06664 0.27615-0.49101-0.0959 6.6812 7.1999 11.578 12.452 9.1073l0.0633 0.1395c2.1295-0.58088 1.8526-1.0601 3.245-2.0164-0.10865 0.22437-0.93703 0.79565-0.44259 0.80669 0.67727-0.17955 2.7933-2.1478 3.8334-3.0726 0.47712-1.0291-0.25401-0.55756 0.41223-1.8514l0.81469-0.40678c0.45242-1.3086 0.95491-2.0477 0.89893-3.571l-0.47725 1.0023c0.69935-2.1175 0.29627-4.4219 0.39475-6.4153l-0.19536-0.05185c-0.17098-5.0145-4.5051-10.344-8.363-12.147-3.325-1.5361-8.4443-1.801-10.809-0.64397 0.3258-0.2882 1.6233-0.40852 1.2327-0.63051-3.7028 0.36793-2.8757 1.2916-5.7141 2.0167-0.77855 0.75179 2.2724-0.60293 0.63051 0.37183-1.5226 0.41998-2.2312-0.26647-4.4872 2.0683 0.20078 0.32494 1.4315-0.9603 0.40448 0.33-2.1202-0.2633-6.6975 4.8503-7.6695 6.5457l0.5079 0.08823c-0.83464 2.0908-1.932 3.4246-2.0814 4.6771-0.21545 3.08-1.2905 8.6952 0.20311 10.422l-0.14553 1.4415c0.20509 0.40901 0.36043 0.82598 0.61532 1.2097l-0.33373 0.02895c1.5712 4.9558 1.6881 0.09138 3.7627 5.2386-0.30089-0.10137-0.60444-0.21136-1.0427-0.80296-0.0517 0.45133 0.63752 1.8069 1.4589 2.8638l-0.3469 0.39646c0.45704 0.83047 0.87892 1.0118 1.196 1.3017-1.7069-0.93156 1.5831 3.0728 1.8803 3.5828l0.26269-0.46809c-0.0376 0.67162 0.4815 1.5384 1.4567 2.7415l0.81096-0.0295c0.33469 0.66118 1.5582 1.855 2.3 1.911l-0.49414 0.64426c1.8622 0.58985 0.90421 0.7808 3.1932 1.5908l-0.46179-0.81444c1.1671 1.0129 1.5283 1.898 3.176 2.6738 2.2842 0.79641 2.5873 0.48142 4.9323 1.1519-1.9875-0.0579-4.3234-0.0366-5.8946-0.59785-10.72-2.9034-20.528-15.479-19.811-28.431-0.16458-2.6223 0.26237-5.899-0.17416-6.5517 0.61275-1.9954 1.3205-4.427 2.7486-7.3226-0.10299-0.19398 0.23625 0.56637 0.96222-0.67089 0.44038-0.96728 0.80006-2.0332 1.3553-2.9732l0.28387-0.06502c0.28558-1.6587 3.8709-4.2036 4.9378-5.4843l0.0748 0.48899c2.3282-2.1831 6.4778-3.6469 8.8139-4.6891-0.61151 0.67688 1.3592-0.06273 2.7904-0.15354 5e-3 -0.0039 9e-3 -5e-3 0.0149-0.0075zm1.4189 0.32829c1.6792 0.04777 1.5544 0.15906 1.0043 0.2796l-0.0264 0.04414-0.33173 0.02923 0.35608-0.07305c0.0816-0.12016-0.50125-0.1895-1.0041-0.27958zm-22.176 11.44c-0.0121 0.56302 0.94564-0.55598 0.25896 0.99116-1.2813 0.89598-0.11218 0.36779-0.25896-0.99116zm-1.0448 4.315c-0.11275 0.52432-0.16704 1.0684-0.46207 1.9743 0.086-0.70936-0.35371-0.9315 0.46207-1.9743zm33.572 6.2988c0.11644 0 0.20068 0.28664 0.14381 1.1347-0.16988 0.6831-0.30947-0.42029-0.48497-0.51163 0.0748-0.32381 0.22479-0.6202 0.34116-0.62306zm10.303 2.858c-0.25156 1.9335-0.8527 3.8427-1.7806 5.5875 0.83991-1.6535 1.387-3.4382 1.6409-5.2406zm-10.911 0.64282c-0.14525 0.87411-0.55461 1.7187-1.1141 2.4911 0.068-0.66581-1.5637 0.28813 0.33001-2.0952-0.16464 0.67158-1.7611 2.4391 0 1.3303 0.3182-0.56723 0.65709-1.1042 0.78406-1.7262zm-3.8415 3.6318c-0.27492 0.26075-0.58219 0.53003-0.92183 0.79523-1.2299-0.18912-2.3512-0.66162-1.4091-0.67462 0.78525 0.0717 1.5649 0.06643 2.331-0.1206zm-11.889 0.1229c0.217 0.4347 0.41223 0.87034 0.73992 1.2326l0.28905 0.85451c-0.39592-0.66741-0.82161-1.3233-1.0293-2.0872zm-0.7236 1.2899c0.77753 1.501 1.2003 1.9605 1.7692 3.0709-0.79074-0.65745-1.2828-1.5688-1.9018-2.4097z" fill="#ce0056"/>
  </clipPath>
 </defs>
 <rect id="rect22" x="37.042" y="44.979" width="92.604" height="108.48" fill="#fff" stroke-width=".2164"/>
 <g id="layer1" transform="translate(117.35 329.39)">
  <g id="g1523" transform="matrix(1.8169 0 0 1.8169 -1083.7 -383.18)" clip-path="url(#clipPath1525)" stroke-width="1.1351">
   <path id="rect1333" d="m626.34 30.321v9.2137h-110.73v-9.2137z" fill="#e50202"/>
   <path id="rect1333-7" d="m626.34 57.962v9.2137h-110.73v-9.2137z" fill="#008026"/>
   <path id="rect1333-6" d="m626.34 67.176v9.2137h-110.73v-9.2137z" fill="#004dff"/>
   <path id="rect1333-5" d="m626.34 76.39v9.2137h-110.73v-9.2137z" fill="#91399f"/>
   <path id="rect1333-5-6" d="m626.34 39.535v9.2137h-110.73v-9.2137z" fill="#ff8c00"/>
   <path id="rect1333-5-9" d="m626.34 48.749v9.2137h-110.73v-9.2137z" fill="#ffd42a"/>
   <path id="rect1333-7-6" d="m626.34 94.817v9.2137h-110.73v-9.2137z" fill="#74d7ee"/>
   <path id="rect1333-6-1" d="m626.34 104.03v9.2137h-110.73v-9.2137z" fill="#603914"/>
   <path id="rect1333-5-5" d="m626.34 113.24v9.2137h-110.73v-9.2137z" fill="#010101"/>
   <path id="rect1333-5-9-9" d="m626.34 85.603v9.2137h-110.73v-9.2137z" fill="#fab0c8"/>
  </g>
 </g>
</svg>
