<?xml version="1.0" encoding="UTF-8"?>
<svg id="svg50" width="1017.5" height="310.97" version="1.1" viewBox="0 0 1017.5 310.97" xml:space="preserve" xmlns="http://www.w3.org/2000/svg">
<style id="style2" type="text/css">
	.st0{fill:#FAFAFA;}
	.st1{fill:#F0F0F0;}
	.st2{fill:#FFFFFF;}
	.st3{fill:#E24329;}
	.st4{fill:#FCA326;}
	.st5{fill:#FC6D26;}
	.st6{fill:#8C929D;}
	.st7{fill:#2E2E2E;}
	.st8{fill:none;stroke:#FCA326;stroke-width:16;stroke-linecap:round;stroke-linejoin:round;stroke-miterlimit:10;}
	.st9{fill:none;stroke:#FC6D26;stroke-width:16;stroke-linecap:round;stroke-linejoin:round;stroke-miterlimit:10;}
	.st10{fill:none;stroke:#E24329;stroke-width:16;stroke-linecap:round;stroke-linejoin:round;stroke-miterlimit:10;}
	.st11{fill:none;stroke:#F0F0F0;stroke-miterlimit:10;}
	.st12{fill:#231F20;}
	.st13{fill:none;stroke:#231F20;stroke-width:16;stroke-linecap:round;stroke-linejoin:round;stroke-miterlimit:10;}
	.st14{display:none;}
	.st15{display:inline;opacity:0.1;fill:#E828E3;}
	.st16{display:inline;}
	.st17{opacity:0.1;fill:#E828E3;}
	.st18{font-family:'SourceSansPro-Semibold';}
	.st19{font-size:24px;}
	.st20{display:inline;fill:#DB3B21;}
	.st21{display:inline;fill:#FC6D26;}
	.st22{display:inline;fill:#2E2E2E;}
	.st23{display:inline;fill:#6E49CB;}
	.st24{display:inline;fill:#380D75;}
	.st25{display:inline;fill:#FCA121;}
	.st26{opacity:0.6;fill:none;stroke:#231F20;stroke-width:2;stroke-miterlimit:10;stroke-dasharray:12,6;}
	.st27{fill:none;stroke:#444444;stroke-width:1.5339;stroke-miterlimit:10;}
</style>
<g id="logo_art" transform="translate(-123.98 -123.92)">
	<g id="g28">
		<g id="g15">
			<path id="path14_3_" class="st6" d="m839.7 198.19h-21.8l0.1 162.5h88.3v-20.1h-66.5z" fill="#8c929d"/>
			<g id="g24_3_" transform="translate(977.33 143.28)">
				<path id="path26_3_" class="st6" d="m13 188.89c-5.5 5.7-14.6 11.4-27 11.4-16.6 0-23.3-8.2-23.3-18.9 0-16.1 11.2-23.8 35-23.8 4.5 0 11.7 0.5 15.4 1.2v30.1zm-22.6-98.5c-17.6 0-33.8 6.2-46.4 16.7l7.7 13.4c8.9-5.2 19.8-10.4 35.5-10.4 17.9 0 25.8 9.2 25.8 24.6v7.9c-3.5-0.7-10.7-1.2-15.1-1.2-38.2 0-57.6 13.4-57.6 41.4 0 25.1 15.4 37.7 38.7 37.7 15.7 0 30.8-7.2 36-18.9l4 15.9h15.4v-83.2c-0.1-26.3-11.5-43.9-44-43.9z" fill="#8c929d"/>
			</g>
			<g id="g28_3_" transform="translate(1099.8 143.13)">
				<path id="path30_3_" class="st6" d="m-17.7 201.19c-8.2 0-15.4-1-20.8-3.5v-75.1c7.4-6.2 16.6-10.7 28.3-10.7 21.1 0 29.2 14.9 29.2 39 0 34.2-13.1 50.3-36.7 50.3m9.2-110.6c-19.5 0-30 13.3-30 13.3v-21l-0.1-27.8h-21.3l0.1 158.5c10.7 4.5 25.3 6.9 41.2 6.9 40.7 0 60.3-26 60.3-70.9-0.1-35.5-18.2-59-50.2-59" fill="#8c929d"/>
			</g>
			<g id="g32_5_" transform="translate(584.04 143.63)">
				<path id="path34_5_" class="st6" d="m18.3 72.192c19.3 0 31.8 6.4 39.9 12.9l9.4-16.3c-12.7-11.2-29.9-17.2-48.3-17.2-46.4 0-78.9 28.3-78.9 85.4 0 59.8 35.1 83.1 75.2 83.1 20.1 0 37.2-4.7 48.4-9.4l-0.5-63.9v-20.1h-59.5v20.1h38l0.5 48.5c-5 2.5-13.6 4.5-25.3 4.5-32.2 0-53.8-20.3-53.8-63-0.1-43.5 22.2-64.6 54.9-64.6" fill="#8c929d"/>
			</g>
			<g id="g36_4_" transform="translate(793.57 142.58)">
				<path id="path38_4_" class="st6" d="m-37.7 55.592h-21.3l0.1 27.3v94.3c0 26.3 11.4 43.9 43.9 43.9 4.5 0 8.9-0.4 13.1-1.2v-19.1c-3.1 0.5-6.4 0.7-9.9 0.7-17.9 0-25.8-9.2-25.8-24.6v-65h35.7v-17.8h-35.7z" fill="#8c929d"/>
			</g>
			<path id="path40_33_" class="st6" d="m680.4 360.69h21.3v-124h-21.3z" fill="#8c929d"/>
			<path id="path42_3_" class="st6" d="m680.4 219.59h21.3v-21.3h-21.3z" fill="#8c929d"/>
		</g>
		<g id="g26">
			<path id="path50_5_" class="st3" d="m292.78 434.89 62.199-191.32h-124.31z" fill="#e24329"/>
			<path id="path66_12_" class="st4" d="m143.55 243.57-18.941 58.126c-1.714 5.278 0.137 11.104 4.661 14.394l163.51 118.8z" fill="#fca326"/>
			<path id="path74_5_" class="st3" d="m143.55 243.57h87.12l-37.494-115.22c-1.919-5.895-10.282-5.895-12.27 0z" fill="#e24329"/>
			<path id="path82_12_" class="st4" d="m442.1 243.57 18.873 58.126c1.714 5.278-0.137 11.104-4.661 14.394l-163.53 118.8z" fill="#fca326"/>
			<path id="path86_5_" class="st3" d="m442.1 243.57h-87.12l37.425-115.22c1.919-5.895 10.282-5.895 12.27 0z" fill="#e24329"/>
			<polygon id="polygon22" class="st5" points="442.1 243.57 292.78 434.89 354.98 243.57" fill="#fc6d26"/>
			<polygon id="polygon24" class="st5" points="230.67 243.57 292.78 434.89 143.55 243.57" fill="#fc6d26"/>
		</g>
	</g>
</g>
<g id="spacing_guides" class="st14" transform="translate(-123.98 -123.92)" display="none">
	<path id="path40_32_" class="st15" d="m-1 0v124h1268v-124z" display="inline" fill="#e828e3" opacity=".1"/>
	<path id="path40_31_" class="st15" d="m-1 435v124h1268v-124z" display="inline" fill="#e828e3" opacity=".1"/>
	<path id="path40_30_" class="st15" d="m261.69 434.55h62v-310h-62z" display="inline" fill="#e828e3" opacity=".1"/>
	<path id="path40_29_" class="st15" d="m462.2 560h62v-561h-62z" display="inline" fill="#e828e3" opacity=".1"/>
	<text id="text35" class="st16 st18 st19" transform="translate(256.25 195)" display="inline" font-family="SourceSansPro-Semibold" font-size="24px">H: 2.5 x</text>

	<text id="text37" class="st16 st18 st19" transform="translate(468.47 282.83)" display="inline" font-family="SourceSansPro-Semibold" font-size="24px">1/2 x</text>

	<text id="text39" class="st16 st18 st19" transform="translate(621.29 500.5)" display="inline" font-family="SourceSansPro-Semibold" font-size="24px">1x</text>

	<text id="text41" class="st16 st18 st19" transform="translate(621.29 65.499)" display="inline" font-family="SourceSansPro-Semibold" font-size="24px">1x</text>

	<path id="path40_27_" class="st15" d="m0 560h124v-561h-124z" display="inline" fill="#e828e3" opacity=".1"/>
	<text id="text44" class="st16 st18 st19" transform="translate(51.288 282.83)" display="inline" font-family="SourceSansPro-Semibold" font-size="24px">1x</text>

	<path id="path40_3_" class="st15" d="m1142 560h124v-561h-124z" display="inline" fill="#e828e3" opacity=".1"/>
	<text id="text47" class="st16 st18 st19" transform="translate(1191.3 282.83)" display="inline" font-family="SourceSansPro-Semibold" font-size="24px">1x</text>

</g>
</svg>
