<?xml version="1.0" encoding="UTF-8"?>
<svg id="svg208" width="283.46pt" height="101.07pt" version="1.2" viewBox="0 0 283.46 101.07" xmlns="http://www.w3.org/2000/svg" xmlns:xlink="http://www.w3.org/1999/xlink">
 <defs id="defs91">
  <g id="g77">
   <symbol id="glyph0-1" overflow="visible">
    <path id="path5" d="m14.703-0.17188c-1.0156 0.4375-2.0312 0.65625-3.0781 0.65625-1.6406 0-3.1094-0.3125-4.3906-0.875-1.3125-0.5625-2.4219-1.3438-3.3125-2.3281-0.90625-0.98438-1.5938-2.1875-2.0625-3.5312-0.48438-1.3438-0.71875-2.7812-0.71875-4.3281 0-1.5938 0.23438-3.0781 0.71875-4.4531 0.46875-1.3438 1.1562-2.5469 2.0625-3.5625 0.89062-1.0156 2-1.8281 3.3125-2.3906 1.2812-0.5625 2.75-0.85938 4.3906-0.85938 1.1094 0 2.1562 0.14062 3.2031 0.46875 1.0156 0.32812 1.9375 0.84375 2.7812 1.4688 0.79688 0.625 1.4844 1.4375 2.0312 2.3594 0.53125 0.92188 0.85938 2 0.98438 3.2344h-4.4844c-0.26562-1.2031-0.8125-2.0938-1.6094-2.6875-0.8125-0.60938-1.7656-0.90625-2.9062-0.90625-1.0469 0-1.9375 0.21875-2.6875 0.59375-0.75 0.42188-1.3438 0.96875-1.7969 1.6562-0.4375 0.6875-0.78125 1.4844-0.98438 2.3594-0.20312 0.85938-0.32812 1.7812-0.32812 2.7188 0 0.89062 0.125 1.7656 0.32812 2.5938 0.20312 0.875 0.54688 1.625 0.98438 2.3125 0.45312 0.6875 1.0469 1.2188 1.7969 1.6094 0.75 0.42188 1.6406 0.625 2.6875 0.625 1.5625 0 2.75-0.39062 3.625-1.2031 0.82812-0.76562 1.3125-1.9062 1.4531-3.4062h-4.7188v-3.4844h8.9688v11.531h-2.9844l-0.48438-2.4219c-0.82812 1.0781-1.7656 1.8281-2.7812 2.25z"/>
   </symbol>
   <symbol id="glyph0-2" overflow="visible">
    <path id="path8" d="m12.969-8.25-2.6875-7.8281h-0.0625l-2.7812 7.8281zm-0.26562-13.094 7.9844 21.344h-4.875l-1.6094-4.75h-7.9844l-1.6719 4.75h-4.7188l8.0625-21.344z"/>
   </symbol>
   <symbol id="glyph0-3" overflow="visible">
    <path id="path11" d="m10.969-11.844c-0.5-0.5625-1.2812-0.82812-2.3281-0.82812-0.6875 0-1.2344 0.125-1.6719 0.32812-0.45312 0.23438-0.8125 0.53125-1.0781 0.85938s-0.48438 0.6875-0.5625 1.0781c-0.125 0.39062-0.1875 0.71875-0.21875 1.0156h6.9062c-0.20312-1.0781-0.53125-1.875-1.0469-2.4531zm-4.8125 8.1406c0.625 0.625 1.5625 0.92188 2.75 0.92188 0.875 0 1.5781-0.20312 2.2188-0.65625 0.625-0.42188 0.98438-0.85938 1.125-1.3438h3.7344c-0.59375 1.8594-1.5156 3.1719-2.75 3.9688-1.2188 0.8125-2.7188 1.2031-4.4688 1.2031-1.2344 0-2.3125-0.21875-3.2969-0.59375-0.98438-0.39062-1.7969-0.9375-2.4844-1.6562s-1.1875-1.5781-1.5469-2.5625c-0.39062-0.98438-0.57812-2.0938-0.57812-3.2969 0-1.1562 0.1875-2.2344 0.57812-3.2188s0.92188-1.8594 1.6094-2.6094c0.6875-0.70312 1.5312-1.2812 2.5156-1.7031 0.95312-0.40625 2.0312-0.625 3.2031-0.625 1.3125 0 2.4375 0.25 3.4375 0.75 0.98438 0.51562 1.7812 1.2031 2.4062 2.0625 0.64062 0.85938 1.0781 1.8281 1.3594 2.9219 0.26562 1.1094 0.375 2.25 0.29688 3.4375h-11.156c0.0625 1.375 0.42188 2.375 1.0469 3z"/>
   </symbol>
   <symbol id="glyph0-4" overflow="visible">
    <path id="path14" d="m9-12.672c-0.6875 0-1.2656 0.14062-1.7031 0.45312-0.45312 0.32812-0.84375 0.70312-1.1094 1.1875-0.29688 0.51562-0.51562 1.0469-0.625 1.6094-0.125 0.60938-0.1875 1.2031-0.1875 1.7656 0 0.57812 0.0625 1.1406 0.1875 1.7031 0.10938 0.57812 0.32812 1.1094 0.59375 1.5625 0.26562 0.46875 0.625 0.85938 1.0781 1.1562 0.45312 0.3125 1.0156 0.45312 1.6719 0.45312 1.0156 0 1.7969-0.29688 2.3594-0.85938 0.54688-0.57812 0.875-1.3281 1.0156-2.2812h4.0938c-0.26562 2.0625-1.0781 3.625-2.3906 4.7031-1.3125 1.0625-2.9844 1.6094-5.0469 1.6094-1.1719 0-2.2188-0.21875-3.1719-0.59375-0.98438-0.39062-1.7969-0.9375-2.4844-1.625s-1.1875-1.5156-1.5781-2.5c-0.39062-0.96875-0.5625-2.0156-0.5625-3.1719 0-1.2031 0.17188-2.2969 0.53125-3.3438 0.32812-1.0156 0.84375-1.9219 1.5312-2.6719 0.6875-0.73438 1.4844-1.3125 2.4688-1.7344 1-0.40625 2.0938-0.625 3.3594-0.625 0.92188 0 1.7969 0.125 2.6562 0.35938 0.84375 0.23438 1.5781 0.59375 2.2656 1.0781 0.65625 0.51562 1.2031 1.1094 1.625 1.8281 0.40625 0.75 0.65625 1.6094 0.71875 2.5938h-4.1562c-0.28125-1.7656-1.3125-2.6562-3.1406-2.6562z"/>
   </symbol>
   <symbol id="glyph0-5" overflow="visible">
    <path id="path17" d="m2.1875-13.188c0.4375-0.65625 0.98438-1.1875 1.6719-1.5781s1.4375-0.6875 2.2969-0.85938c0.84375-0.15625 1.6719-0.25 2.5469-0.25 0.76562 0 1.5469 0.0625 2.3594 0.15625 0.79688 0.10938 1.5156 0.32812 2.1719 0.65625 0.67188 0.32812 1.2031 0.75 1.625 1.3125s0.625 1.3438 0.625 2.2656v8.0469c0 0.6875 0.03125 1.375 0.125 2 0.078125 0.625 0.20312 1.1094 0.40625 1.4375h-4.2969c-0.09375-0.23438-0.15625-0.48438-0.1875-0.75-0.046875-0.23438-0.078125-0.46875-0.10938-0.75-0.6875 0.6875-1.4688 1.2031-2.3906 1.4688-0.9375 0.26562-1.8594 0.42188-2.8125 0.42188-0.75 0-1.4375-0.09375-2.0625-0.26562-0.625-0.1875-1.2031-0.45312-1.6719-0.84375-0.48438-0.39062-0.84375-0.85938-1.1094-1.4375-0.26562-0.5625-0.42188-1.25-0.42188-2.0625 0-0.85938 0.15625-1.6094 0.48438-2.1719 0.29688-0.57812 0.6875-1.0156 1.1875-1.3438 0.48438-0.34375 1.0469-0.60938 1.6719-0.78125 0.64062-0.15625 1.2656-0.29688 1.8906-0.39062s1.25-0.1875 1.8906-0.23438c0.625-0.0625 1.1562-0.15625 1.6406-0.28125 0.46875-0.10938 0.85938-0.29688 1.125-0.53125 0.28125-0.20312 0.42188-0.53125 0.39062-0.98438 0-0.45312-0.0625-0.84375-0.20312-1.1094-0.15625-0.26562-0.35938-0.48438-0.59375-0.625-0.28125-0.15625-0.54688-0.23438-0.875-0.29688-0.32812-0.03125-0.6875-0.0625-1.0781-0.0625-0.82812 0-1.4844 0.17188-1.9688 0.53125s-0.75 0.96875-0.84375 1.7969h-4.2344c0.0625-0.98438 0.29688-1.8281 0.75-2.4844zm8.3906 5.9844c-0.26562 0.09375-0.5625 0.17188-0.85938 0.23438-0.32812 0.0625-0.65625 0.125-0.98438 0.15625s-0.6875 0.09375-1.0156 0.14062c-0.32812 0.0625-0.64062 0.15625-0.9375 0.25-0.32812 0.078125-0.59375 0.23438-0.79688 0.39062-0.25 0.17188-0.42188 0.375-0.57812 0.65625-0.14062 0.26562-0.20312 0.59375-0.20312 0.98438s0.0625 0.6875 0.20312 0.95312c0.15625 0.26562 0.32812 0.45312 0.57812 0.59375 0.23438 0.15625 0.5 0.26562 0.82812 0.32812s0.65625 0.09375 0.98438 0.09375c0.84375 0 1.5-0.15625 1.9531-0.42188 0.4375-0.26562 0.79688-0.625 1.0156-1.0156 0.20312-0.39062 0.35938-0.78125 0.40625-1.1562 0.03125-0.39062 0.0625-0.71875 0.0625-0.96875v-1.5781c-0.17188 0.15625-0.39062 0.26562-0.65625 0.35938z"/>
   </symbol>
   <symbol id="glyph0-6" overflow="visible">
    <path id="path20" d="m17.062-21.344v3.9531h-10.312v4.9219h8.9375v3.6562h-8.9375v8.8125h-4.6875v-21.344z"/>
   </symbol>
   <symbol id="glyph0-7" overflow="visible">
    <path id="path23" d="m5.6562-15.453v2.875h0.046875c0.21875-0.48438 0.48438-0.9375 0.8125-1.3438 0.32812-0.39062 0.71875-0.75 1.1719-1.0469 0.4375-0.28125 0.89062-0.51562 1.4062-0.65625 0.5-0.15625 1.0156-0.25 1.5469-0.25 0.26562 0 0.59375 0.0625 0.92188 0.15625v3.9375c-0.20312-0.03125-0.4375-0.078125-0.71875-0.10938-0.26562-0.03125-0.53125-0.03125-0.79688-0.03125-0.78125 0-1.4375 0.10938-1.9688 0.39062-0.54688 0.26562-0.96875 0.59375-1.2969 1.0469-0.32812 0.4375-0.5625 0.98438-0.71875 1.5781-0.14062 0.59375-0.20312 1.25-0.20312 1.9375v6.9688h-4.25v-15.453z"/>
   </symbol>
   <symbol id="glyph0-8" overflow="visible">
    <path id="path26" d="m10.109-15.453v2.8438h-3.1094v7.6406c0 0.71875 0.10938 1.2031 0.35938 1.4375 0.23438 0.25 0.71875 0.35938 1.4219 0.35938 0.25 0 0.48438 0 0.6875-0.03125 0.21875-0.03125 0.42188-0.0625 0.64062-0.078125v3.2812c-0.35938 0.0625-0.75 0.09375-1.2031 0.125s-0.85938 0.03125-1.2812 0.03125c-0.65625 0-1.2812-0.0625-1.8594-0.15625-0.59375-0.09375-1.1094-0.23438-1.5469-0.51562-0.45312-0.26562-0.8125-0.625-1.0781-1.0938-0.26562-0.48438-0.39062-1.1094-0.39062-1.8906v-9.1094h-2.5781v-2.8438h2.5781v-4.6406h4.25v4.6406z"/>
   </symbol>
   <symbol id="glyph0-9" overflow="visible">
    <path id="path29" d="m5.6562-15.453v2.1562h0.078125c0.54688-0.90625 1.2344-1.5625 2.0938-1.9844 0.875-0.375 1.7344-0.59375 2.6406-0.59375 1.125 0 2.0625 0.15625 2.7969 0.45312 0.71875 0.32812 1.2969 0.75 1.7031 1.2812 0.42188 0.57812 0.71875 1.2344 0.90625 2 0.14062 0.8125 0.23438 1.6719 0.23438 2.6406v9.5h-4.25v-8.7344c0-1.2812-0.20312-2.2344-0.59375-2.8594s-1.1094-0.9375-2.125-0.9375c-1.1562 0-2 0.32812-2.5 1.0156-0.51562 0.6875-0.78125 1.8281-0.78125 3.4219v8.0938h-4.25v-15.453z"/>
   </symbol>
   <symbol id="glyph0-10" overflow="visible">
    <path id="path32" d="m6.75-21.344v21.344h-4.6875v-21.344z"/>
   </symbol>
   <symbol id="glyph1-1" overflow="visible">
    <path id="path38" d="m5.125-9.9688v1.0312h-2.0312v6.7188c0 0.40625 0.046875 0.71875 0.17188 0.92188 0.09375 0.23438 0.35938 0.375 0.8125 0.39062 0.34375 0 0.6875-0.015625 1.0469-0.0625v1.0312c-0.1875 0-0.375 0-0.54688 0.015625s-0.375 0.015625-0.54688 0.015625c-0.8125 0-1.3594-0.15625-1.6875-0.48438-0.32812-0.29688-0.48438-0.89062-0.46875-1.7344v-6.8125h-1.7344v-1.0312h1.7344v-2.9844h1.2188v2.9844z"/>
   </symbol>
   <symbol id="glyph1-2" overflow="visible">
    <path id="path41" d="m2.3594-13.781v5.5312h0.03125c0.23438-0.59375 0.64062-1.0938 1.2344-1.4688 0.60938-0.35938 1.2344-0.53125 1.9531-0.53125 0.70312 0 1.2812 0.09375 1.7656 0.26562 0.45312 0.17188 0.82812 0.42188 1.1094 0.75 0.29688 0.32812 0.48438 0.73438 0.60938 1.2188 0.10938 0.48438 0.17188 1 0.17188 1.6094v6.4062h-1.2188v-6.2188c0-0.42188-0.046875-0.82812-0.10938-1.2031-0.078125-0.35938-0.21875-0.67188-0.40625-0.9375-0.20312-0.26562-0.45312-0.48438-0.78125-0.64062s-0.75-0.23438-1.2344-0.23438-0.92188 0.078125-1.2969 0.25c-0.39062 0.17188-0.71875 0.42188-0.96875 0.71875-0.26562 0.3125-0.46875 0.67188-0.60938 1.0781-0.15625 0.42188-0.23438 0.89062-0.25 1.375v5.8125h-1.2188v-13.781z"/>
   </symbol>
   <symbol id="glyph1-3" overflow="visible">
    <path id="path44" d="m8.0938-7.0156c-0.15625-0.42188-0.375-0.8125-0.64062-1.1406s-0.59375-0.57812-0.98438-0.78125-0.82812-0.29688-1.3125-0.29688c-0.5 0-0.95312 0.09375-1.3281 0.29688-0.39062 0.20312-0.71875 0.45312-0.98438 0.78125-0.28125 0.32812-0.48438 0.71875-0.64062 1.1406-0.17188 0.45312-0.26562 0.89062-0.32812 1.3438h6.4531c-0.03125-0.46875-0.09375-0.90625-0.23438-1.3438zm-6.0312 3.7188c0.125 0.48438 0.3125 0.90625 0.57812 1.2656 0.28125 0.375 0.625 0.67188 1.0312 0.9375 0.40625 0.25 0.90625 0.35938 1.4844 0.35938 0.89062 0 1.5781-0.23438 2.0781-0.6875 0.51562-0.46875 0.85938-1.0938 1.0469-1.8594h1.2188c-0.25 1.1406-0.73438 2-1.4062 2.625-0.70312 0.625-1.6875 0.92188-2.9375 0.92188-0.79688 0-1.4688-0.125-2.0312-0.42188-0.57812-0.26562-1.0469-0.65625-1.4062-1.1406s-0.625-1.0469-0.79688-1.6719c-0.17188-0.64062-0.26562-1.2969-0.26562-2.0156 0-0.65625 0.09375-1.2969 0.26562-1.9219 0.17188-0.64062 0.4375-1.2031 0.79688-1.7031 0.35938-0.48438 0.82812-0.89062 1.4062-1.2031 0.5625-0.28125 1.2344-0.4375 2.0312-0.4375s1.4844 0.15625 2.0469 0.48438 1.0312 0.73438 1.3906 1.25c0.34375 0.51562 0.59375 1.125 0.75 1.7969s0.21875 1.375 0.20312 2.0625h-7.6719c0 0.45312 0.0625 0.89062 0.1875 1.3594z"/>
   </symbol>
   <symbol id="glyph1-4" overflow="visible"></symbol>
   <symbol id="glyph1-5" overflow="visible">
    <path id="path50" d="m3.0312-8.9375v8.9375h-1.2188v-8.9375h-1.7031v-1.0312h1.7031v-0.90625c0-0.42188 0.046875-0.8125 0.09375-1.1719 0.0625-0.375 0.20312-0.6875 0.375-0.9375s0.42188-0.45312 0.75-0.59375c0.3125-0.14062 0.71875-0.20312 1.2031-0.20312 0.17188 0 0.34375 0 0.5 0.015625s0.32812 0.03125 0.51562 0.046875v1.0469c-0.17188-0.015625-0.32812-0.0625-0.45312-0.078125-0.14062-0.015625-0.29688-0.015625-0.4375-0.015625-0.32812 0-0.59375 0.0625-0.76562 0.15625s-0.3125 0.23438-0.39062 0.40625c-0.09375 0.17188-0.125 0.39062-0.15625 0.60938-0.015625 0.23438-0.015625 0.48438-0.015625 0.76562v0.85938h1.9688v1.0312z"/>
   </symbol>
   <symbol id="glyph1-6" overflow="visible">
    <path id="path53" d="m1.4062-8.4219c0.21875-0.42188 0.48438-0.76562 0.85938-1.0469 0.34375-0.26562 0.75-0.45312 1.2344-0.59375s1-0.1875 1.5781-0.1875c0.4375 0 0.875 0.03125 1.3125 0.10938 0.45312 0.09375 0.82812 0.25 1.1875 0.48438 0.34375 0.23438 0.625 0.5625 0.84375 0.96875 0.20312 0.42188 0.32812 0.96875 0.32812 1.6406v5.2969c0 0.46875 0.23438 0.71875 0.71875 0.71875 0.125 0 0.26562-0.015625 0.375-0.0625v1.0156c-0.125 0.015625-0.26562 0.046875-0.35938 0.0625-0.125 0.015625-0.25 0.015625-0.42188 0.015625-0.3125 0-0.5625-0.03125-0.73438-0.14062-0.20312-0.078125-0.35938-0.1875-0.45312-0.34375s-0.17188-0.34375-0.1875-0.5625c-0.046875-0.20312-0.0625-0.4375-0.0625-0.6875h-0.03125c-0.21875 0.32812-0.45312 0.59375-0.65625 0.84375-0.23438 0.25-0.48438 0.46875-0.75 0.64062-0.29688 0.17188-0.60938 0.28125-0.95312 0.39062-0.375 0.09375-0.79688 0.125-1.2812 0.125-0.45312 0-0.875-0.046875-1.2812-0.17188-0.40625-0.09375-0.78125-0.26562-1.0625-0.51562-0.3125-0.23438-0.54688-0.54688-0.71875-0.90625-0.17188-0.375-0.26562-0.79688-0.26562-1.2969 0-0.70312 0.14062-1.2344 0.45312-1.6406 0.3125-0.39062 0.71875-0.67188 1.2344-0.89062 0.5-0.21875 1.0938-0.34375 1.7188-0.4375 0.64062-0.078125 1.2812-0.15625 1.9375-0.23438 0.25-0.03125 0.48438-0.0625 0.67188-0.09375 0.20312-0.046875 0.34375-0.125 0.48438-0.21875s0.23438-0.21875 0.3125-0.39062c0.0625-0.17188 0.09375-0.375 0.09375-0.65625 0-0.40625-0.0625-0.75-0.1875-1.0156-0.14062-0.25-0.32812-0.46875-0.5625-0.625-0.25-0.15625-0.53125-0.26562-0.82812-0.32812-0.32812-0.0625-0.65625-0.078125-1.0312-0.078125-0.76562 0-1.4062 0.17188-1.8906 0.54688-0.48438 0.35938-0.75 0.96875-0.76562 1.7812h-1.2188c0.03125-0.59375 0.15625-1.0938 0.35938-1.5156zm6.0938 2.9688c-0.078125 0.14062-0.23438 0.26562-0.45312 0.3125-0.20312 0.0625-0.40625 0.125-0.57812 0.14062-0.51562 0.09375-1.0469 0.17188-1.5781 0.23438-0.5625 0.078125-1.0625 0.1875-1.5156 0.32812-0.4375 0.125-0.8125 0.34375-1.0938 0.59375-0.29688 0.26562-0.45312 0.65625-0.45312 1.1406 0 0.3125 0.0625 0.57812 0.20312 0.8125 0.10938 0.25 0.26562 0.4375 0.48438 0.60938 0.20312 0.1875 0.4375 0.3125 0.70312 0.40625 0.28125 0.10938 0.54688 0.14062 0.84375 0.14062 0.45312 0 0.90625-0.078125 1.3281-0.21875 0.42188-0.125 0.79688-0.34375 1.125-0.60938 0.29688-0.26562 0.54688-0.59375 0.75-0.98438 0.17188-0.39062 0.26562-0.82812 0.26562-1.3125v-1.5938z"/>
   </symbol>
   <symbol id="glyph1-7" overflow="visible">
    <path id="path56" d="m7.2656-8.5938c-0.45312-0.42188-1.0781-0.64062-1.8906-0.64062-0.57812 0-1.0938 0.125-1.5312 0.375s-0.79688 0.5625-1.0781 0.95312c-0.29688 0.40625-0.53125 0.85938-0.65625 1.3594-0.15625 0.51562-0.23438 1.0469-0.23438 1.5625s0.078125 1.0469 0.23438 1.5469c0.125 0.51562 0.35938 0.96875 0.65625 1.375 0.28125 0.40625 0.64062 0.70312 1.0781 0.96875 0.4375 0.25 0.95312 0.35938 1.5312 0.35938 0.35938 0 0.73438-0.078125 1.0625-0.21875 0.32812-0.125 0.625-0.34375 0.875-0.59375 0.26562-0.25 0.46875-0.53125 0.64062-0.89062 0.17188-0.34375 0.28125-0.73438 0.3125-1.1406h1.2188c-0.17188 1.2188-0.625 2.1562-1.3281 2.8281-0.71875 0.67188-1.6406 1.0156-2.7812 1.0156-0.76562 0-1.4375-0.125-2.0156-0.42188-0.59375-0.26562-1.0781-0.64062-1.4844-1.125-0.40625-0.46875-0.70312-1.0312-0.90625-1.6719-0.21875-0.64062-0.3125-1.3125-0.3125-2.0312s0.09375-1.4062 0.3125-2.0469c0.20312-0.64062 0.5-1.1719 0.90625-1.6562s0.89062-0.85938 1.4844-1.1406c0.57812-0.29688 1.25-0.42188 2.0156-0.42188 1.0625 0 1.9688 0.28125 2.7188 0.84375 0.73438 0.5625 1.1719 1.4375 1.3125 2.5625h-1.2188c-0.17188-0.75-0.48438-1.3281-0.92188-1.75z"/>
   </symbol>
   <symbol id="glyph1-8" overflow="visible">
    <path id="path59" d="m3.8438-8.8594c-0.4375 0.25-0.79688 0.5625-1.0781 0.95312-0.29688 0.40625-0.53125 0.85938-0.65625 1.3594-0.15625 0.51562-0.23438 1.0469-0.23438 1.5625s0.078125 1.0469 0.23438 1.5469c0.125 0.51562 0.35938 0.96875 0.65625 1.375 0.28125 0.40625 0.64062 0.70312 1.0781 0.96875 0.4375 0.25 0.95312 0.35938 1.5312 0.35938s1.0781-0.10938 1.5156-0.35938c0.45312-0.26562 0.8125-0.5625 1.1094-0.96875 0.28125-0.40625 0.5-0.85938 0.65625-1.375 0.125-0.5 0.20312-1.0312 0.20312-1.5469s-0.078125-1.0469-0.20312-1.5625c-0.15625-0.5-0.375-0.95312-0.65625-1.3594-0.29688-0.39062-0.65625-0.70312-1.1094-0.95312-0.4375-0.25-0.9375-0.375-1.5156-0.375s-1.0938 0.125-1.5312 0.375zm3.5469-0.96875c0.57812 0.28125 1.0625 0.65625 1.4688 1.1406s0.70312 1.0156 0.90625 1.6562c0.21875 0.64062 0.3125 1.3281 0.3125 2.0469s-0.09375 1.3906-0.3125 2.0312c-0.20312 0.64062-0.5 1.2031-0.90625 1.6719-0.40625 0.48438-0.89062 0.85938-1.4688 1.125-0.59375 0.29688-1.2656 0.42188-2.0156 0.42188-0.76562 0-1.4375-0.125-2.0156-0.42188-0.59375-0.26562-1.0781-0.64062-1.4844-1.125-0.40625-0.46875-0.70312-1.0312-0.90625-1.6719-0.21875-0.64062-0.3125-1.3125-0.3125-2.0312s0.09375-1.4062 0.3125-2.0469c0.20312-0.64062 0.5-1.1719 0.90625-1.6562s0.89062-0.85938 1.4844-1.1406c0.57812-0.29688 1.25-0.42188 2.0156-0.42188 0.75 0 1.4219 0.125 2.0156 0.42188z"/>
   </symbol>
   <symbol id="glyph1-9" overflow="visible">
    <path id="path62" d="m2.3906-13.781v1.9375h-1.2188v-1.9375zm0 3.8125v9.9688h-1.2188v-9.9688z"/>
   </symbol>
   <symbol id="glyph1-10" overflow="visible">
    <path id="path65" d="m2.3594-9.9688v1.7188h0.03125c0.23438-0.59375 0.64062-1.0938 1.2344-1.4688 0.60938-0.35938 1.2344-0.53125 1.9531-0.53125 0.70312 0 1.2812 0.09375 1.7656 0.26562 0.45312 0.17188 0.82812 0.42188 1.1094 0.75 0.29688 0.32812 0.48438 0.73438 0.60938 1.2188 0.10938 0.48438 0.17188 1 0.17188 1.6094v6.4062h-1.2188v-6.2188c0-0.42188-0.046875-0.82812-0.10938-1.2031-0.078125-0.35938-0.21875-0.67188-0.40625-0.9375-0.20312-0.26562-0.45312-0.48438-0.78125-0.64062s-0.75-0.23438-1.2344-0.23438-0.92188 0.078125-1.2969 0.25c-0.39062 0.17188-0.71875 0.42188-0.96875 0.71875-0.26562 0.3125-0.46875 0.67188-0.60938 1.0781-0.15625 0.42188-0.23438 0.89062-0.25 1.375v5.8125h-1.2188v-9.9688z"/>
   </symbol>
   <symbol id="glyph1-11" overflow="visible">
    <path id="path68" d="m2.2812-9.9688v2.3438h0.03125c0.3125-0.8125 0.79688-1.4375 1.4531-1.875 0.64062-0.45312 1.4062-0.64062 2.3125-0.59375v1.2031c-0.5625-0.015625-1.0625 0.046875-1.5 0.21875s-0.82812 0.42188-1.1562 0.75-0.60938 0.70312-0.78125 1.1406c-0.17188 0.45312-0.26562 0.95312-0.26562 1.4688v5.3125h-1.2188v-9.9688z"/>
   </symbol>
   <symbol id="glyph1-12" overflow="visible">
    <path id="path71" d="m2.2812-9.9688v1.6875h0.0625c0.32812-0.625 0.75-1.1094 1.2656-1.4531 0.53125-0.34375 1.1875-0.51562 1.9844-0.51562 0.65625 0 1.2656 0.15625 1.7969 0.48438s0.89062 0.79688 1.0625 1.4688c0.29688-0.67188 0.73438-1.1406 1.3125-1.4688s1.2031-0.48438 1.8594-0.48438c2.2031 0 3.2969 1.1562 3.2969 3.4844v6.7656h-1.2031v-6.7031c0-0.82812-0.1875-1.4531-0.53125-1.8906-0.34375-0.42188-0.96875-0.64062-1.8281-0.64062-0.53125 0-0.96875 0.09375-1.3125 0.29688-0.35938 0.20312-0.625 0.48438-0.82812 0.8125-0.21875 0.32812-0.35938 0.70312-0.4375 1.1406-0.09375 0.4375-0.125 0.875-0.125 1.3438v5.6406h-1.2188v-6.7656c0-0.32812-0.046875-0.65625-0.09375-0.95312-0.078125-0.29688-0.20312-0.5625-0.35938-0.79688-0.17188-0.21875-0.375-0.39062-0.65625-0.51562-0.26562-0.14062-0.59375-0.20312-0.98438-0.20312-0.51562 0-0.95312 0.09375-1.3281 0.26562-0.39062 0.20312-0.6875 0.45312-0.92188 0.78125-0.25 0.32812-0.42188 0.71875-0.54688 1.1562-0.10938 0.45312-0.17188 0.95312-0.17188 1.4688v5.5625h-1.2188v-9.9688z"/>
   </symbol>
   <symbol id="glyph1-13" overflow="visible">
    <path id="path74" d="m6.8906-8.0312c-0.125-0.26562-0.32812-0.5-0.5625-0.67188-0.25-0.1875-0.51562-0.3125-0.82812-0.40625-0.3125-0.078125-0.64062-0.125-0.98438-0.125-0.26562 0-0.53125 0.015625-0.8125 0.078125s-0.53125 0.15625-0.76562 0.29688c-0.23438 0.125-0.42188 0.32812-0.5625 0.53125-0.14062 0.21875-0.21875 0.48438-0.21875 0.8125 0 0.28125 0.078125 0.5 0.21875 0.67188 0.14062 0.20312 0.29688 0.35938 0.5 0.48438 0.21875 0.14062 0.42188 0.23438 0.67188 0.3125 0.25 0.09375 0.46875 0.15625 0.6875 0.21875l1.625 0.35938c0.34375 0.0625 0.6875 0.14062 1.0312 0.28125 0.32812 0.125 0.64062 0.32812 0.90625 0.53125 0.25 0.21875 0.46875 0.48438 0.64062 0.8125s0.25 0.70312 0.25 1.1406c0 0.54688-0.10938 1-0.35938 1.375s-0.5625 0.6875-0.9375 0.92188c-0.375 0.25-0.8125 0.42188-1.2812 0.51562-0.48438 0.10938-0.95312 0.15625-1.4219 0.15625-1.1719 0-2.125-0.26562-2.8281-0.82812-0.73438-0.5625-1.1719-1.4531-1.2656-2.6562h1.2188c0.0625 0.82812 0.34375 1.4375 0.90625 1.8438 0.54688 0.42188 1.2188 0.64062 2.0312 0.64062 0.29688 0 0.59375-0.03125 0.92188-0.09375 0.3125-0.0625 0.60938-0.17188 0.875-0.32812s0.5-0.34375 0.67188-0.59375c0.17188-0.23438 0.25-0.53125 0.25-0.875 0-0.29688-0.046875-0.54688-0.17188-0.75s-0.28125-0.375-0.5-0.5c-0.21875-0.14062-0.4375-0.23438-0.6875-0.32812-0.28125-0.10938-0.54688-0.1875-0.8125-0.23438l-1.5625-0.35938c-0.40625-0.09375-0.78125-0.21875-1.1094-0.35938s-0.60938-0.29688-0.875-0.5c-0.25-0.20312-0.45312-0.45312-0.59375-0.73438-0.125-0.29688-0.20312-0.64062-0.20312-1.0625 0-0.5 0.10938-0.92188 0.34375-1.2969 0.20312-0.35938 0.5-0.65625 0.85938-0.875 0.375-0.20312 0.78125-0.375 1.2188-0.46875 0.45312-0.10938 0.875-0.15625 1.3125-0.15625 0.5 0 0.96875 0.046875 1.4219 0.1875 0.42188 0.14062 0.79688 0.32812 1.125 0.59375 0.34375 0.28125 0.59375 0.60938 0.78125 1.0156s0.3125 0.85938 0.32812 1.4062h-1.2188c-0.015625-0.375-0.09375-0.70312-0.23438-0.98438z"/>
   </symbol>
  </g>
  <clipPath id="clip1">
   <path id="path79" d="m16 87h72v14.07h-72z"/>
  </clipPath>
  <clipPath id="clip2">
   <path id="path82" d="m87 87h87v14.07h-87z"/>
  </clipPath>
  <clipPath id="clip3">
   <path id="path85" d="m174 90h9v11.07h-9z"/>
  </clipPath>
  <clipPath id="clip4">
   <path id="path88" d="m226 23h57.461v78h-57.461z"/>
  </clipPath>
 </defs>
 <g id="surface384">
  <g id="g95" fill="#36383a">
   <use id="use93" x="161.785" y="77.42" xlink:href="#glyph0-1"/>
  </g>
  <g id="g99" fill="#36383a">
   <use id="use97" x="141.307697" y="77.42" xlink:href="#glyph0-2"/>
  </g>
  <g id="g103" fill="#36383a">
   <use id="use101" x="115.838861" y="77.42" xlink:href="#glyph0-3"/>
  </g>
  <g id="g107" fill="#36383a">
   <use id="use105" x="98.67998" y="77.42" xlink:href="#glyph0-4"/>
  </g>
  <g id="g111" fill="#36383a">
   <use id="use109" x="81.521697" y="77.42" xlink:href="#glyph0-5"/>
  </g>
  <g id="g115" fill="#36383a">
   <use id="use113" x="63.795148" y="77.42" xlink:href="#glyph0-6"/>
  </g>
  <g id="g119" fill="#36383a">
   <use id="use117" x="52.16701" y="77.42" xlink:href="#glyph0-7"/>
  </g>
  <g id="g123" fill="#36383a">
   <use id="use121" x="35.00804" y="77.42" xlink:href="#glyph0-3"/>
  </g>
  <g id="g127" fill="#36383a">
   <use id="use125" x="24.485763" y="77.42" xlink:href="#glyph0-8"/>
  </g>
  <g id="g131" fill="#36383a">
   <use id="use129" x="6.759214" y="77.42" xlink:href="#glyph0-9"/>
  </g>
  <g id="g135" fill="#36383a">
   <use id="use133" x="-2.06227" y="77.42" xlink:href="#glyph0-10"/>
  </g>
  <g id="g141" fill="#36383a">
   <use id="use137" x="-0.059" y="100.7989" xlink:href="#glyph1-1"/>
   <use id="use139" x="5.65824" y="100.7989" xlink:href="#glyph1-2"/>
  </g>
  <g id="g163" clip-path="url(#clip1)">
   <g id="g161" fill="#36383a">
    <use id="use143" x="16.029841" y="100.7989" xlink:href="#glyph1-3"/>
    <use id="use145" x="26.054326" y="100.7989" xlink:href="#glyph1-4"/>
    <use id="use147" x="31.423896" y="100.7989" xlink:href="#glyph1-5"/>
    <use id="use149" x="36.426481" y="100.7989" xlink:href="#glyph1-6"/>
    <use id="use151" x="46.450966" y="100.7989" xlink:href="#glyph1-7"/>
    <use id="use153" x="56.475451" y="100.7989" xlink:href="#glyph1-3"/>
    <use id="use155" x="66.499936" y="100.7989" xlink:href="#glyph1-4"/>
    <use id="use157" x="71.869506" y="100.7989" xlink:href="#glyph1-8"/>
    <use id="use159" x="82.608646" y="100.7989" xlink:href="#glyph1-5"/>
   </g>
  </g>
  <g id="g189" clip-path="url(#clip2)">
   <g id="g187" fill="#36383a">
    <use id="use165" x="87.610602" y="100.7989" xlink:href="#glyph1-4"/>
    <use id="use167" x="92.980172" y="100.7989" xlink:href="#glyph1-9"/>
    <use id="use169" x="96.553447" y="100.7989" xlink:href="#glyph1-10"/>
    <use id="use171" x="106.925602" y="100.7989" xlink:href="#glyph1-5"/>
    <use id="use173" x="111.928187" y="100.7989" xlink:href="#glyph1-8"/>
    <use id="use175" x="122.667327" y="100.7989" xlink:href="#glyph1-11"/>
    <use id="use177" x="128.751552" y="100.7989" xlink:href="#glyph1-12"/>
    <use id="use179" x="144.840947" y="100.7989" xlink:href="#glyph1-6"/>
    <use id="use181" x="154.865432" y="100.7989" xlink:href="#glyph1-1"/>
    <use id="use183" x="160.582672" y="100.7989" xlink:href="#glyph1-9"/>
    <use id="use185" x="164.155947" y="100.7989" xlink:href="#glyph1-7"/>
   </g>
  </g>
  <g id="g195" clip-path="url(#clip3)">
   <g id="g193" fill="#36383a">
    <use id="use191" x="174.163089" y="100.7989" xlink:href="#glyph1-13"/>
   </g>
  </g>
  <path id="path197" d="m198.17 100.79h22.25v-77.27h-22.25v77.27" fill="#f4711f"/>
  <path id="path199" d="m198.17 15.645h22.25v-15.637h-22.25v15.637" fill="#f4711f"/>
  <g id="g203" clip-path="url(#clip4)">
   <path id="path201" d="m226.88 23.512h56.582v14.223h-34.332v18.496h31.84v14.227h-31.84v30.328h-21.41c-0.52344-0.23047 0.046875-0.53125 0.046875-0.53125 3.2266-0.73047 6.0547-5.7773 3.375-9.2812-2.6758-3.5039 0.22266-6.3438 0.22266-6.3438 1.6133-1.0625 1.6133-2.1914 1.6133-2.1914 0.23047-1.5195-0.58594-2.4375-1.207-2.8477-0.62109-0.39062 0-0.55859 0-0.55859 0.88672-0.14062 1.4844-1.3438 1.4844-1.3438 0.51953-1.3477 0.29688-4.6641 0.29688-4.6641-0.074219-2.6172 1.8555-3.1094 1.8555-3.1094 1.8555-0.35156 3.7891-1.2734 3.7891-1.2734 6.0156-3.3906 0.88672-9.1172 0.88672-9.1172s-3.5977-4.7383-7.6445-9.8242c-4.293-5.3984-3.043-9.1133-3.043-9.1133 2.3516-6.4297-1.6289-15.191-2.2305-15.762-0.59766-0.57031-0.6875-0.90625-0.28516-1.3125" fill="#f4711f"/>
  </g>
  <path id="path205" d="m0 83.543h182.85v-1.418h-182.85v1.418" fill="#f4711f"/>
 </g>
</svg>
