<?xml version="1.0" encoding="UTF-8"?>
<svg id="Layer_2" data-name="Layer 2" xmlns="http://www.w3.org/2000/svg" xmlns:xlink="http://www.w3.org/1999/xlink" viewBox="0 0 758.53 106.1">
  <defs>
    <style>
      .cls-1 {
        fill: url(#linear-gradient);
      }

      .cls-1, .cls-2, .cls-3, .cls-4 {
        stroke-width: 0px;
      }

      .cls-2 {
        fill: #d70010;
      }

      .cls-3 {
        fill: #004287;
      }

      .cls-4 {
        fill: #727171;
      }
    </style>
    <linearGradient id="linear-gradient" x1="106.16" y1="51.1" x2="196.56" y2="59.26" gradientUnits="userSpaceOnUse">
      <stop offset=".15" stop-color="#004287"/>
      <stop offset=".52" stop-color="#0075c2"/>
      <stop offset=".87" stop-color="#004287"/>
    </linearGradient>
  </defs>
  <g id="_레이어_1" data-name="레이어 1">
    <g>
      <path class="cls-3" d="m25.11,36.26h.2c5.15-6.16,10.54-8.25,17.6-8.25,13.71,0,17.8,8.64,15.82,21.16l-4.99,31.49h-18.08l3.93-24.83c.77-4.87,2.92-13.41-6.02-13.41-7.35,0-10.3,5.46-11.31,11.82l-4.18,26.42H0L8.07,29.7h18.08l-1.04,6.56Z"/>
      <path class="cls-2" d="m96.01,10.13c-.88,5.56-6.17,10.13-11.74,10.13s-9.41-4.57-8.53-10.13c.88-5.56,6.18-10.13,11.74-10.13s9.41,4.57,8.53,10.13Z"/>
      <path class="cls-3" d="m83.85,80.67h-18.08l8.07-50.96h18.08l-8.07,50.96Z"/>
      <path class="cls-3" d="m109.12,106.1h-18.08l12.05-76.4h18.08l-12.06,76.4Z"/>
      <path class="cls-3" d="m198.06,80.67h-18.08l8.07-50.96h18.08l-8.07,50.96Z"/>
      <path class="cls-1" d="m174.26,27.9c-7.49,0-14.8,3.09-20.53,8.05,0,0-8.63,6.78-10.89,18.58-.04.2-.08.39-.11.59-.03.2-.05.4-.08.6-1.26,5.95-6.98,10.74-13.01,10.74s-10.52-5.11-9.54-11.34c.99-6.22,6.91-11.33,13.13-11.33,3.26,0,5.99,1.41,7.71,3.65,2.78-7.72,8.17-12.55,10.15-14.13-4-3.39-9.29-5.4-15.35-5.4-14.94,0-29.16,12.28-31.53,27.22-2.37,14.94,7.96,27.22,22.91,27.22,7.49,0,14.8-3.09,20.53-8.05,8.94-7,10.91-18.7,10.91-18.7.03-.15.06-.31.09-.47.03-.15.04-.3.06-.46,1.2-6.01,6.96-10.87,13.03-10.87s10.52,5.11,9.54,11.33c-.98,6.22-6.91,11.34-13.13,11.34-3.26,0-5.98-1.41-7.7-3.64-.99,2.85-3.81,9.3-10.14,14.13,4,3.38,9.28,5.39,15.32,5.39,14.94,0,29.16-12.28,31.53-27.22,2.37-14.94-7.97-27.22-22.91-27.22Z"/>
    </g>
    <g>
      <path class="cls-4" d="m254.84,50.09c-1.4-1.13-2.48-2.47-3.25-4-2.08,2.38-4.89,4.3-8.44,5.76-2.94,1.17-5.79,1.82-8.56,1.94l1.04-6.55c4.32-.49,7.63-1.82,9.92-4,1.86-1.78,3.12-4.24,3.78-7.4h-11.53l.98-6.21h30.72l-.98,6.21h-11.61c-.33,3.07.17,5.52,1.5,7.33,1.63,2.18,4.5,3.52,8.62,4l-.82,5.16c3.89.64,6.94,2.34,9.17,5.09,2.48,2.95,3.39,6.49,2.73,10.61-.73,4.65-3.12,8.49-7.15,11.52-3.8,2.83-7.96,4.24-12.48,4.24s-8.19-1.42-11.01-4.24c-3.03-3.03-4.18-6.87-3.44-11.52.61-3.88,2.43-7.25,5.43-10.12,2.82-2.67,6.13-4.45,9.94-5.33-1.75-.65-3.27-1.48-4.56-2.49Zm.69,11.29c-2.3,1.82-3.66,4.03-4.06,6.61-.41,2.55.25,4.73,1.98,6.55,1.65,1.78,3.72,2.67,6.22,2.67s4.91-.89,7.12-2.67c2.3-1.82,3.65-4,4.05-6.55.41-2.59-.25-4.79-1.97-6.61-1.66-1.7-3.76-2.55-6.29-2.55s-4.84.85-7.04,2.55Zm22.43-23.3l1.34-8.44h7.04l-3.85,24.31h-7.04l1.53-9.65h-8.37l.98-6.21h8.37Z"/>
      <path class="cls-4" d="m340.37,52.4c-.26,1.66-.82,2.85-1.66,3.59-.75.65-1.85.97-3.31.97h-14.75l-2.36,14.91h22.21l-1,6.33h-51.33l1-6.33h22.21l2.36-14.91h-14.88c-1.41,0-2.39-.33-2.93-.97-.57-.73-.72-1.93-.46-3.59l3.61-22.79h7.04l-1.14,7.22h30.82l1.15-7.22h7.04l-3.61,22.79Zm-37.6-1.65h30.82l1.24-7.83h-30.82l-1.24,7.83Z"/>
      <path class="cls-4" d="m380.61,51.1l-.35,2.18h22.2l-.95,6.01h-12.98c1.18,1.25,2.03,2.65,2.55,4.19.59,1.66.73,3.44.43,5.33-.7,4.45-3.05,8.13-7.02,11.04-3.75,2.79-7.91,4.19-12.47,4.19s-8.21-1.4-11.08-4.19c-3.05-2.91-4.22-6.59-3.52-11.04.29-1.86.98-3.63,2.05-5.33.96-1.5,2.23-2.89,3.8-4.19h-13.02l.95-6.01h22.13l.35-2.18h-16.19c-1.42,0-2.39-.34-2.93-1.03-.61-.77-.77-2-.51-3.7l2.64-16.69h47.64l-.94,5.95h-40.47l-.3,1.88h40.47l-.91,5.77h-40.47l-.31,1.94h40.51l-.93,5.89h-20.39Zm-12.04,11.02c-2.32,1.86-3.69,4.09-4.1,6.67-.41,2.55.26,4.75,1.99,6.61,1.7,1.78,3.87,2.67,6.5,2.67s4.96-.89,7.23-2.67c2.36-1.86,3.74-4.07,4.15-6.61.41-2.59-.27-4.81-2.04-6.67-1.71-1.74-3.84-2.61-6.4-2.61s-5.08.87-7.34,2.61Z"/>
      <path class="cls-4" d="m434.61,29.63c-.92,5.83-.77,10.34.47,13.53,1.51,3.72,4.58,5.89,9.22,6.49l-1.07,6.73c-3.37-.2-6.31-1.07-8.81-2.61-2.83-1.78-4.85-4.31-6.06-7.58-2.33,3.28-5.32,5.83-8.96,7.64-3.08,1.54-6.16,2.39-9.26,2.55l1.06-6.67c4.92-.69,8.66-2.87,11.23-6.55,2.15-3.07,3.69-7.58,4.63-13.53h7.55Zm-21.76,33.32h7.04l-1.81,11.41h38.71l-.99,6.21h-41.54c-1.41,0-2.39-.35-2.97-1.03-.61-.72-.78-1.89-.53-3.49l2.07-13.1Zm43.52-33.32h7.05l-5.49,34.65h-7.05l5.49-34.65Z"/>
      <path class="cls-4" d="m493.63,29.63c-.92,5.83-.77,10.34.47,13.53,1.51,3.72,4.58,5.89,9.22,6.49l-1.07,6.73c-3.37-.2-6.3-1.07-8.81-2.61-2.83-1.78-4.85-4.31-6.06-7.58-2.33,3.28-5.32,5.83-8.96,7.64-3.08,1.54-6.17,2.39-9.26,2.55l1.06-6.67c4.92-.69,8.66-2.87,11.23-6.55,2.14-3.07,3.69-7.58,4.63-13.53h7.54Zm-21.75,33.32h7.04l-1.81,11.41h38.71l-.99,6.21h-41.54c-1.41,0-2.4-.35-2.97-1.03-.61-.72-.78-1.89-.53-3.49l2.08-13.1Zm47.82-16.05l-2.76,17.41h-7.04l5.49-34.67h7.04l-1.73,10.92h7.16l-1.01,6.34h-7.16Z"/>
      <path class="cls-4" d="m531.6,58.51h6.92l-.78,4.92h31.45l.78-4.92h7.05l-2.8,17.62c-.26,1.66-.84,2.84-1.71,3.53-.76.69-1.85,1.03-3.26,1.03h-36.91c-1.42,0-2.42-.35-2.99-1.03-.61-.73-.79-1.91-.53-3.53l2.79-17.62Zm20.17-6.8c-3,1.85-6.15,2.77-9.46,2.77-3.92,0-7.14-1.23-9.65-3.7-2.66-2.59-3.68-5.88-3.04-9.88.64-4.04,2.7-7.35,6.18-9.94,3.29-2.38,6.89-3.58,10.81-3.58,3.39,0,6.29.93,8.71,2.79,2.51,1.98,3.88,4.61,4.08,7.89h13.69l1.34-8.43h7.17l-3.83,24.17h-7.17l1.51-9.53h-13.76c-1.25,3.06-3.44,5.53-6.57,7.42Zm16.5,17.56h-31.45l-.83,5.22h31.44l.83-5.22Zm-28.25-33.47c-1.84,1.37-2.91,3.07-3.24,5.09-.32,2.02.22,3.73,1.61,5.14,1.33,1.33,2.98,2,4.96,2s3.91-.67,5.66-2c1.88-1.41,2.98-3.13,3.3-5.14.32-2.02-.24-3.71-1.68-5.09-1.33-1.29-3.01-1.94-5.03-1.94s-3.84.65-5.58,1.94Z"/>
      <path class="cls-4" d="m589.92,62.95h7.05l-1.81,11.41h38.71l-.98,6.21h-41.54c-1.4,0-2.39-.35-2.97-1.03-.61-.72-.78-1.89-.53-3.49l2.07-13.1Zm32.84-27.11h-11.77c-.62,4.2-.31,7.44.95,9.71,1.48,2.62,4.39,4.2,8.72,4.73l-1.09,6.86c-2.35,0-4.88-.64-7.58-1.94-3.38-1.66-5.63-3.82-6.74-6.49-2.08,2.67-5.07,4.81-8.97,6.43-3.08,1.29-5.79,1.96-8.15,2l1.09-6.86c4.53-.53,7.93-2.11,10.21-4.73,1.88-2.19,3.21-5.42,3.97-9.71h-11.52l.98-6.21h30.88l-.98,6.21Zm10.68-6.21h7.05l-5.49,34.65h-7.05l5.49-34.65Z"/>
      <path class="cls-4" d="m645.73,56.71l.98-6.21h13.53c-.77-1.02-1.28-2.12-1.54-3.3-.29-1.22-.33-2.5-.12-3.84.2-1.3.62-2.54,1.26-3.72.62-1.1,1.41-2.16,2.39-3.18h-11.41l.9-5.71h19.93l.77-4.86h7.67l-.77,4.86h20.11l-.9,5.71h-12.02c.75.94,1.27,1.95,1.58,3.05.33,1.22.39,2.5.18,3.85-.22,1.38-.73,2.69-1.53,3.91-.71,1.18-1.65,2.26-2.81,3.23h14.13l-.98,6.21h-12.79c1.39,1.37,2.38,2.94,2.97,4.7.65,1.93.79,4.01.44,6.21-.76,4.79-3.27,8.75-7.53,11.89-3.99,2.93-8.35,4.4-13.08,4.4s-8.95-1.47-12.05-4.4c-3.31-3.14-4.58-7.1-3.82-11.89.34-2.17,1.14-4.2,2.38-6.09,1.19-1.77,2.73-3.38,4.63-4.83h-12.5Zm17.39,3.28c-2.59,2.06-4.11,4.51-4.56,7.34-.45,2.84.3,5.26,2.24,7.28,1.87,1.98,4.24,2.97,7.11,2.97s5.53-.99,7.99-2.97c2.58-2.02,4.1-4.45,4.55-7.28.44-2.83-.3-5.28-2.23-7.34-1.83-1.94-4.19-2.92-7.06-2.92s-5.55.97-8.04,2.92Zm5.59-21.44c-1.67,1.3-2.65,2.91-2.96,4.85-.3,1.9.17,3.52,1.42,4.86,1.28,1.37,3.02,2.06,5.21,2.06s4.03-.69,5.75-2.06c1.68-1.37,2.67-2.99,2.96-4.86.31-1.94-.16-3.56-1.42-4.85-1.26-1.25-2.97-1.88-5.12-1.88s-4.18.63-5.84,1.88Z"/>
      <path class="cls-4" d="m721.79,55.1h-16.69l.98-6.21h7.1c-1.2-1.09-2.08-2.35-2.62-3.77-.53-1.54-.65-3.2-.37-4.98.61-3.89,2.65-7.06,6.11-9.53,3.23-2.31,6.84-3.46,10.84-3.46,3.79,0,6.9,1.15,9.33,3.46,2.62,2.51,3.63,5.69,3.03,9.53-.29,1.78-.95,3.44-1.99,4.98-.99,1.42-2.23,2.67-3.73,3.77h8.22l-.98,6.21h-12.19l-1.89,11.95h-7.05l1.9-11.95Zm-13.53,6.03h6.92l-2.1,13.23h38.83l-.98,6.21h-41.54c-1.41,0-2.39-.35-2.97-1.03-.61-.72-.78-1.91-.51-3.56l2.35-14.85Zm11.8-26.21c-1.72,1.46-2.74,3.18-3.05,5.16-.3,1.9.17,3.6,1.43,5.1,1.33,1.5,3.07,2.25,5.2,2.25s3.96-.75,5.74-2.25c1.76-1.49,2.8-3.19,3.1-5.1.31-1.98-.18-3.7-1.48-5.16-1.3-1.46-2.98-2.18-5.04-2.18s-4.1.73-5.9,2.18Zm26.73,24.4l4.7-29.67h7.04l-6.36,40.13h-7.04l.69-4.37h-12.08l.96-6.09h12.08Z"/>
    </g>
  </g>
</svg>