%!PS-Adobe-3.0 EPSF-3.0
%%Creator: inkscape 0.44.1
%%Pages: 1
%%Orientation: Portrait
%%BoundingBox: 189 538 387 747
%%HiResBoundingBox: 189.42101 538.04497 386.57896 746.52643
%%DocumentMedia: plain 596 842 0 () ()
%%EndComments
%%Page: 1 1
0 842 translate
0.8 -0.8 scale
gsave [1 0 0 1 0 0] concat
gsave
0 0 0 setrgbcolor
newpath
416.08765 149.46362 moveto
415.19107 149.46362 415.01458 150.39556 415.1484 154.90348 curveto
415.23734 157.89913 415.43573 160.60133 415.57888 160.89123 curveto
415.72205 161.18113 416.15441 161.43915 416.51815 161.43914 curveto
416.88186 161.43912 417.18345 158.73694 417.18345 155.45136 curveto
417.18345 150.53857 416.97853 149.46365 416.08765 149.46362 curveto
closepath
444.93062 160.69555 moveto
444.07166 160.69555 443.87392 161.88166 443.87393 167.03553 curveto
443.87396 172.18932 444.0716 173.3755 444.93062 173.37549 curveto
445.7896 173.3755 445.94815 172.18931 445.94814 167.03553 curveto
445.94812 161.88169 445.78954 160.69555 444.93062 160.69555 curveto
closepath
387.83173 160.81296 moveto
387.07283 160.86869 386.9316 161.9547 386.9316 166.64417 curveto
386.9316 172.24072 387.04764 172.67103 388.37963 172.67106 curveto
389.72359 172.67104 389.8233 172.30569 389.63196 166.87898 curveto
389.46065 162.01953 389.21615 161.04935 388.18396 160.8521 curveto
388.0472 160.82597 387.94015 160.805 387.83173 160.81296 curveto
closepath
416.1268 162.848 moveto
415.31733 162.848 413.40989 164.08048 411.90014 165.62665 curveto
409.12151 168.44441 lineto
416.1268 168.44441 lineto
423.09293 168.44441 lineto
420.3143 165.62665 lineto
418.80455 164.08047 416.93623 162.84803 416.1268 162.848 curveto
closepath
405.20794 169.85328 moveto
405.20794 173.25808 lineto
405.20794 175.7706 405.57967 176.97659 406.61683 177.91523 curveto
407.89351 179.07056 408.02575 180.0747 408.02572 188.91234 curveto
408.02572 198.65711 lineto
416.43988 198.65711 lineto
424.89317 198.65711 lineto
424.89317 188.83407 lineto
424.89316 179.73896 424.99946 178.96455 426.30205 178.26744 curveto
427.44439 177.65608 427.71095 176.80991 427.71093 173.68858 curveto
427.71093 169.85328 lineto
424.89317 169.85328 lineto
422.36311 169.85329 422.11454 170.03311 422.11454 171.61439 curveto
422.11455 172.70763 421.67471 173.3755 421.01875 173.37549 curveto
420.43307 173.3755 419.96205 172.74748 419.96208 171.96662 curveto
419.96207 170.75099 419.51626 170.55774 416.51815 170.55774 curveto
413.66878 170.55771 412.93212 170.81127 412.56544 171.96662 curveto
411.92061 173.99832 410.13905 173.73823 410.13904 171.61439 curveto
410.13905 170.07495 409.82877 169.85328 407.67349 169.85328 curveto
405.20794 169.85328 lineto
closepath
444.61752 174.07994 moveto
443.53161 174.07996 437.53398 179.54488 437.53398 180.53732 curveto
437.53398 180.84339 440.9073 181.12437 445.04801 181.12435 curveto
452.6012 181.12435 lineto
449.15726 177.60215 lineto
447.25362 175.6695 445.19723 174.07991 444.61752 174.07994 curveto
closepath
388.37963 174.15821 moveto
387.07072 174.10914 385.74904 174.99067 383.99645 176.70202 curveto
382.53062 178.13336 381.33521 179.52478 381.33522 179.83288 curveto
381.33522 180.14093 384.47511 180.38079 388.3405 180.38078 curveto
392.20587 180.38078 395.3458 180.27494 395.34578 180.14595 curveto
395.34578 180.01701 394.13219 178.62555 392.64542 177.01511 curveto
390.946 175.17432 389.68852 174.20728 388.37963 174.15821 curveto
closepath
379.49584 181.78965 moveto
377.52247 181.78965 377.09743 182.08191 377.03031 183.39422 curveto
376.87011 186.52427 377.24828 187.7676 378.94795 189.34282 curveto
380.46112 190.74524 380.64754 191.35689 380.23942 194.07824 curveto
379.98317 195.78713 380.01527 197.52666 380.27857 197.95267 curveto
380.59476 198.46426 383.50905 198.63104 388.92754 198.50056 curveto
397.14601 198.30489 lineto
397.34169 194.35218 lineto
397.49167 191.50134 397.91918 190.04122 398.90712 189.14715 curveto
399.86781 188.27772 400.27685 186.97908 400.27686 184.84223 curveto
400.27686 181.78965 lineto
397.5765 181.78965 lineto
395.43836 181.78965 394.73366 182.09735 394.44566 183.19854 curveto
394.24351 183.9716 393.7305 184.60741 393.27159 184.60741 curveto
392.81267 184.60741 392.29971 183.97161 392.09751 183.19854 curveto
391.7948 182.04093 391.09945 181.78969 388.3405 181.78965 curveto
385.58152 181.78965 384.92533 182.04093 384.62262 183.19854 curveto
384.42043 183.9716 383.90747 184.60741 383.44855 184.60741 curveto
382.98963 184.60741 382.43751 183.97161 382.23534 183.19854 curveto
381.95914 182.14231 381.2826 181.78969 379.49584 181.78965 curveto
closepath
416.51815 182.18101 moveto
417.43982 181.89927 417.83909 184.13709 417.84876 189.34282 curveto
417.85726 193.92758 417.63199 195.13492 416.83122 195.13489 curveto
416.27423 195.13488 415.648 194.87382 415.42234 194.50872 curveto
414.61157 193.19687 414.92619 183.87655 415.8137 182.80717 curveto
416.0846 182.48077 416.30547 182.24604 416.51815 182.18101 curveto
closepath
436.12509 182.53324 moveto
434.57896 182.53324 433.31186 182.75207 433.26819 183.04199 curveto
432.75399 186.45541 433.01799 188.4177 434.20744 189.92986 curveto
435.70029 191.82772 436.00414 192.91155 436.08596 196.38725 curveto
436.12509 198.65711 lineto
444.57839 198.65711 lineto
453.03168 198.65711 lineto
453.03168 195.09577 lineto
453.03167 192.40149 453.35934 191.23922 454.40143 190.36036 curveto
455.91113 189.08707 456.64167 186.22336 456.04512 183.9421 curveto
455.75658 182.83876 455.07705 182.53325 453.26651 182.53324 curveto
451.62142 182.53324 450.87921 182.82141 450.87922 183.55076 curveto
450.87922 184.13642 450.25122 184.60741 449.47034 184.60741 curveto
448.68945 184.60741 448.10061 184.13642 448.10059 183.55076 curveto
448.10061 182.75733 447.24481 182.53325 444.65666 182.53324 curveto
442.24829 182.53324 441.0655 182.81245 440.78224 183.55076 curveto
440.55974 184.13057 440.08509 184.60741 439.68645 184.60741 curveto
439.28775 184.60741 438.94289 184.13057 438.94286 183.55076 curveto
438.94286 182.7894 438.15539 182.53325 436.12509 182.53324 curveto
closepath
423.05379 200.066 moveto
421.53313 200.12594 421.37098 200.48767 421.37096 202.17932 curveto
421.37095 203.5849 421.01708 204.29263 420.3143 204.29264 curveto
419.60669 204.29266 419.25761 203.58536 419.25764 202.14018 curveto
419.25763 200.13461 419.11552 200.01741 416.98778 200.22252 curveto
415.08456 200.40605 414.66838 200.7646 414.48309 202.37499 curveto
414.36079 203.43797 413.83746 204.29263 413.30903 204.29264 curveto
412.78057 204.29266 412.21815 203.43798 412.09582 202.37499 curveto
411.91052 200.76458 411.53347 200.40606 409.63027 200.22252 curveto
407.5025 200.01738 407.32126 200.13462 407.32128 202.14018 curveto
407.32128 204.90375 405.40495 205.10764 405.09055 202.37499 curveto
404.90306 200.74552 404.52004 200.41822 402.74242 200.41822 curveto
400.62909 200.41822 lineto
400.4334 215.60282 lineto
400.27292 228.49045 400.42764 230.93573 401.33352 231.68756 curveto
402.20095 232.40749 402.42935 234.54171 402.42932 243.03689 curveto
402.42932 248.24194 lineto
404.01977 248.01031 405.65422 247.81061 407.32128 247.65492 curveto
407.32128 240.88443 lineto
407.32128 228.28276 lineto
411.58706 222.96033 lineto
413.93764 220.03837 416.07879 217.6379 416.36161 217.63789 curveto
417.18245 217.63789 420.2845 221.16109 423.40602 225.66069 curveto
426.30205 229.8482 lineto
426.30205 241.66716 lineto
426.30205 247.61578 lineto
427.74392 247.74414 429.14239 247.86093 430.5287 248.04626 curveto
430.68524 243.27172 lineto
430.9721 234.82148 431.20454 232.90405 432.17239 232.19633 curveto
433.21278 231.43558 433.31967 229.66488 433.15079 215.91591 curveto
432.99425 200.41822 lineto
430.88093 200.41822 lineto
429.09233 200.41819 428.72483 200.73924 428.53278 202.41413 curveto
428.25153 204.86682 426.76369 204.52183 426.45859 201.9445 curveto
426.26585 200.31627 425.88896 200.066 423.79738 200.066 curveto
423.52079 200.066 423.27103 200.05742 423.05379 200.066 curveto
closepath
380.27857 200.41822 moveto
380.23942 214.50703 lineto
380.2223 222.23775 380.45691 229.11434 380.78732 229.80906 curveto
381.31938 230.9276 382.15143 231.04463 387.87087 230.74833 curveto
391.42297 230.56432 395.05542 230.34534 395.93281 230.31782 curveto
397.49825 230.2787 lineto
397.34169 215.36801 lineto
397.14601 200.41822 lineto
388.69271 200.41822 lineto
380.27857 200.41822 lineto
closepath
436.47731 200.41822 moveto
436.28163 215.72024 lineto
436.12509 230.98312 lineto
444.57839 230.98312 lineto
453.03168 230.98312 lineto
452.83601 215.72024 lineto
452.64033 200.41822 lineto
444.57839 200.41822 lineto
436.47731 200.41822 lineto
closepath
388.84927 208.67583 moveto
389.06609 208.64807 389.27637 208.99491 389.67111 209.73248 curveto
390.10598 210.54501 390.45384 213.61764 390.45382 216.54209 curveto
390.45381 221.74521 390.41199 221.86451 388.69271 221.86454 curveto
386.97786 221.86452 386.94646 221.74994 386.97075 216.7769 curveto
386.98489 213.87996 387.41389 210.93341 387.94914 209.96731 curveto
388.41915 209.11892 388.63243 208.70362 388.84927 208.67583 curveto
closepath
444.30444 209.96731 moveto
445.34145 209.60861 446.18557 214.05346 445.59592 218.77281 curveto
445.27804 221.31728 444.79862 222.56896 444.14789 222.56898 curveto
443.40627 222.56898 443.16949 221.33682 443.16951 217.36393 curveto
443.16951 214.49652 443.36535 211.63541 443.6 211.02396 curveto
443.84938 210.37408 444.06512 210.05008 444.30444 209.96731 curveto
closepath
385.28793 232.90079 moveto
381.94619 232.9471 379.59508 233.14221 379.30017 233.44867 curveto
378.58319 234.19378 378.30257 239.17851 378.43919 248.04626 curveto
378.51746 256.18952 lineto
383.76162 253.48612 lineto
388.14835 251.40637 393.59788 249.72608 399.80723 248.6333 curveto
399.85803 246.98489 399.90962 246.17272 399.96377 243.78048 curveto
400.21073 232.87006 400.40057 233.0947 388.8884 232.90079 curveto
387.58462 232.87879 386.40185 232.88533 385.28793 232.90079 curveto
closepath
439.33422 233.21387 moveto
433.31503 233.35797 433.34649 235.06094 433.34646 244.25012 curveto
433.34646 245.81846 433.38047 247.21988 433.42473 248.5159 curveto
439.94994 249.60426 442.01456 249.89923 448.56535 252.16757 curveto
453.9005 254.01496 454.97714 254.92429 454.97714 254.92429 curveto
455.10587 244.44579 lineto
455.10586 236.99149 454.94008 235.1989 454.01007 234.42707 curveto
453.25025 233.79647 450.1431 233.44952 444.53925 233.29214 curveto
442.43174 233.23294 440.72327 233.18061 439.33422 233.21387 curveto
closepath
fill
grestore
gsave
0.76862746 0 0.22352941 setrgbcolor
newpath
313.80288 119.20414 moveto
311.33154 119.41141 308.83786 119.5172 306.40624 119.8303 curveto
307.50205 119.98685 lineto
309.28936 119.33272 311.90672 119.63484 313.80288 119.20414 curveto
closepath
fill
grestore
gsave
0.76862746 0 0.22352941 setrgbcolor
newpath
302.96231 120.33906 moveto
298.94342 120.58306 293.37493 122.67317 295.09604 120.76956 curveto
288.54111 123.69186 276.89522 127.75903 270.36234 133.88 curveto
270.16667 132.54937 lineto
267.17311 136.14053 257.11437 143.27869 256.31265 147.92967 curveto
255.49081 148.08623 lineto
253.93297 150.72191 252.96946 153.71002 251.73378 156.4221 curveto
250.20574 159.02396 249.27353 158.50885 249.03342 158.30062 curveto
249.03972 158.31206 249.02506 158.32405 249.03342 158.33975 curveto
245.02631 166.4584 243.04336 173.25212 241.32371 178.84683 curveto
242.54908 180.67693 241.32996 189.88777 241.79334 197.24057 curveto
240.42904 221.86065 252.66569 245.93868 270.04925 261.46214 curveto
271.84238 263.92976 273.66609 266.21357 275.60651 267.72382 curveto
298.60915 288.74363 343.13169 293.08858 372.70198 271.91133 curveto
373.05731 271.71572 373.43519 271.49258 373.7978 271.28516 curveto
373.8012 271.29518 373.79439 271.31426 373.7978 271.32431 curveto
373.90229 271.24639 374.00632 271.16691 374.11087 271.08949 curveto
374.39407 270.92492 374.65218 270.75229 374.93273 270.58074 curveto
374.92164 270.54706 374.94368 270.5362 374.93273 270.50245 curveto
379.75489 267.00084 384.52588 264.16842 387.84748 264.67126 curveto
391.09572 262.16656 lineto
392.37229 262.04026 393.56122 261.78486 394.85275 261.81435 curveto
394.42227 260.95337 lineto
408.52404 257.25659 397.19315 264.83877 412.50293 262.04916 curveto
411.81198 261.48698 411.04064 260.91065 408.98071 260.75769 curveto
409.97201 259.95721 414.24531 259.57043 417.98191 259.93585 curveto
418.4124 258.56609 lineto
421.06724 258.40572 422.10257 259.10904 423.26521 259.42708 curveto
418.49825 256.77372 432.92074 258.58597 434.57542 258.52695 curveto
433.87096 259.85756 lineto
435.40743 258.76125 438.24554 258.64249 442.55908 259.15312 curveto
443.69402 261.18818 lineto
445.76359 260.99046 450.43147 262.09638 451.67768 263.77113 curveto
452.42125 261.61867 lineto
456.61066 265.15214 455.68133 262.56789 461.03109 266.78459 curveto
458.409 266.94113 lineto
462.55788 268.19273 465.17529 267.71722 469.48438 270.46333 curveto
474.79646 274.68641 474.47556 275.88587 479.58138 280.4429 curveto
476.46541 275.81509 473.05439 270.21744 469.36698 267.33247 curveto
456.45798 255.47616 436.7521 248.91523 416.69043 249.17354 curveto
401.08696 249.37449 385.27106 253.71701 372.31064 262.94929 curveto
372.22361 262.9969 372.12402 263.01828 372.03669 263.06668 curveto
372.01311 263.0327 371.982 263.02298 371.95842 262.98842 curveto
371.66769 263.2106 371.34992 263.39573 371.05829 263.61459 curveto
369.98806 264.23366 368.94734 264.92544 367.88831 265.61051 curveto
367.98126 265.651 368.07043 265.68581 368.16226 265.7279 curveto
364.01812 268.57844 360.04757 270.6574 357.16514 270.22851 curveto
353.9169 272.73319 lineto
352.64068 272.86273 351.45149 273.11164 350.15987 273.08541 curveto
350.59036 273.90725 lineto
336.498 277.6397 347.81236 270.06138 332.5097 272.88973 curveto
333.20205 273.45016 333.97161 273.99432 336.03191 274.14206 curveto
335.04263 274.94505 330.76824 275.39815 327.03071 275.04219 curveto
326.63936 276.41194 lineto
323.98493 276.57901 322.87172 275.86605 321.70828 275.55096 curveto
326.48198 278.19229 312.09171 276.38785 310.43722 276.45107 curveto
311.14166 275.1596 lineto
309.60797 276.25978 306.72924 276.32463 302.41441 275.8249 curveto
301.31862 273.829 lineto
300.15807 273.94279 298.16652 273.65765 296.42666 273.08541 curveto
294.52693 271.49338 293.35619 269.76466 291.18248 267.88038 curveto
292.47396 270.15024 lineto
286.05141 267.88058 288.73703 267.34249 283.5119 265.68878 curveto
284.9208 263.88854 lineto
282.83928 263.72978 279.36279 260.4212 278.42427 258.56609 curveto
276.15441 258.60524 lineto
273.41828 255.23165 271.9784 252.81914 272.0843 250.93465 curveto
271.34072 252.26527 lineto
270.50664 250.83502 261.26771 239.59527 266.05742 242.2074 curveto
265.16743 241.39453 264.01363 240.85858 262.73089 238.52866 curveto
263.67014 237.47199 lineto
261.36503 234.50849 259.45293 230.6757 259.60005 229.41004 curveto
260.82983 231.06964 261.65171 231.39622 262.49608 231.67992 curveto
256.67518 217.24772 256.37732 230.86058 251.9686 216.96492 curveto
252.86872 216.88667 lineto
252.15379 215.81064 251.76107 214.66758 251.18589 213.52099 curveto
251.5381 209.49003 lineto
247.35005 204.6553 250.42473 188.89181 251.02934 180.25573 curveto
251.44859 176.74396 254.47952 173.00753 256.82142 167.14527 curveto
255.45167 166.91046 lineto
258.17896 162.15658 270.98825 147.77879 276.93712 148.51671 curveto
279.81888 144.89912 276.36561 148.52798 275.80219 147.6166 curveto
282.13209 141.07083 284.13197 143.00196 288.40385 141.82453 curveto
293.01116 139.09183 284.45827 142.87581 286.64276 140.76786 curveto
294.60697 138.73487 292.2984 136.16425 302.68836 135.13233 curveto
303.78428 135.7556 300.11881 136.08495 299.20529 136.89344 curveto
305.84117 133.64918 320.20755 134.38667 329.5354 138.69367 curveto
340.36224 143.7489 352.53721 158.68138 353.01678 172.74167 curveto
353.52555 172.89822 lineto
353.25045 178.48703 354.43124 184.96338 352.46888 190.9006 curveto
353.79948 188.08283 lineto
353.9569 192.35456 352.52664 194.39336 351.25567 198.06242 curveto
348.98581 199.23649 lineto
347.11757 202.86437 349.15184 201.51684 347.81173 204.40239 curveto
344.89318 206.99544 338.98769 212.5457 337.08858 213.05137 curveto
335.69847 213.02049 337.99727 211.41063 338.30179 210.78149 curveto
334.39473 213.4627 335.15856 214.78832 329.18318 216.41704 curveto
329.02663 216.06481 lineto
314.2883 222.99278 293.80932 209.24256 294.07852 190.50925 curveto
293.92112 191.69844 293.62238 191.39833 293.29582 191.87898 curveto
292.53531 182.24039 297.76746 172.54605 306.56278 168.59329 curveto
315.16692 164.33775 325.21113 166.10279 331.37476 171.84154 curveto
327.9899 167.41105 321.27891 162.71392 313.29412 163.15344 curveto
305.4726 163.27691 298.16415 168.24993 295.72221 173.64178 curveto
291.71513 176.16281 291.24578 183.36094 289.49966 184.67805 curveto
287.14892 201.9311 293.89902 209.37061 305.34959 218.139 curveto
306.34557 218.81062 306.40265 219.16788 306.28884 219.50874 curveto
306.2957 219.46795 306.29506 219.45739 306.32797 219.43047 curveto
319.83361 224.47247 333.77767 223.23545 345.4636 213.87321 curveto
348.43805 211.55947 351.68688 207.62678 352.62542 207.57238 curveto
351.38845 209.43097 352.54121 208.80839 352.11665 209.88138 curveto
354.29795 206.00828 350.72057 208.20416 354.85615 202.21079 curveto
356.4607 204.40239 lineto
355.86347 200.43789 361.40582 195.64228 360.8439 189.37431 curveto
362.11192 187.45748 362.22756 191.42178 360.88302 195.83169 curveto
362.74833 190.93962 361.42246 190.1626 361.90056 186.12607 curveto
362.41837 187.48285 363.07821 188.92096 363.42686 190.3527 curveto
362.2103 185.62528 364.65574 182.41606 365.26622 179.66868 curveto
364.66458 179.4026 363.40356 181.73089 363.11377 176.14647 curveto
363.15497 173.72103 363.77115 174.9039 364.01388 174.3071 curveto
363.53727 174.03369 362.30887 172.15945 361.54833 168.59329 curveto
362.09853 167.75542 362.99118 170.77884 363.73994 170.9023 curveto
363.25889 168.06671 362.44463 165.87691 362.40932 163.70134 curveto
360.21748 159.12382 361.60485 164.31995 359.82637 161.74457 curveto
357.49478 154.47262 361.80791 160.07881 362.09625 156.77432 curveto
365.63409 161.89426 367.62687 169.80704 368.55361 173.0939 curveto
367.84606 169.08677 366.70138 165.22639 365.30536 161.47062 curveto
366.38214 161.92189 363.58681 153.20658 366.71424 158.96594 curveto
363.37352 146.68873 352.40937 135.23207 342.33274 129.84903 curveto
343.56403 130.97648 345.16161 132.36656 344.60261 132.58851 curveto
339.59226 129.60742 340.42852 129.42596 339.71065 128.16619 curveto
335.63 126.50658 335.37001 128.29702 332.66624 128.16619 curveto
324.9727 124.08849 323.50507 124.4593 316.42496 121.90448 curveto
316.77719 123.46991 lineto
311.68005 121.77359 310.77889 124.10787 305.27132 123.46991 curveto
304.9359 123.20827 307.06357 122.50807 308.79351 122.25671 curveto
303.86551 122.90644 304.10564 121.26373 299.28355 122.41325 curveto
300.47219 121.57976 301.69428 121.04758 302.96231 120.33906 curveto
closepath
fill
grestore
gsave
0.76862746 0 0.22352941 setrgbcolor
newpath
308.79351 122.25671 moveto
309.73278 122.13931 lineto
309.77191 122.06104 lineto
308.79351 122.25671 lineto
closepath
fill
grestore
gsave
0.76862746 0 0.22352941 setrgbcolor
newpath
309.77191 122.06104 moveto
311.31503 121.72294 311.66735 121.41209 306.95413 121.27833 curveto
308.36488 121.53117 310.00433 121.7244 309.77191 122.06104 curveto
closepath
fill
grestore
gsave
0.76862746 0 0.22352941 setrgbcolor
newpath
306.28884 219.50874 moveto
306.19691 219.78409 305.98406 220.07398 306.09315 220.48713 curveto
302.28906 218.707 298.82115 215.98894 295.95705 212.69914 curveto
297.4766 214.92026 299.12057 217.06883 301.24035 218.76517 curveto
297.65396 217.55097 292.85539 210.10739 291.45644 209.80311 curveto
297.63922 220.86614 316.54357 229.2025 326.44369 225.066 curveto
321.86289 225.23507 316.05253 225.16643 310.90685 223.26576 curveto
308.87957 222.22529 306.18574 220.12076 306.28884 219.50874 curveto
closepath
fill
grestore
gsave
0.76862746 0 0.22352941 setrgbcolor
newpath
244.76765 153.5652 moveto
245.02433 157.20072 241.95176 158.56887 245.47208 156.10901 curveto
247.2787 152.04228 245.03191 154.53849 244.76765 153.5652 curveto
closepath
fill
grestore
gsave
0.76862746 0 0.22352941 setrgbcolor
newpath
434.77705 147.54974 moveto
432.46806 149.97616 lineto
430.1199 152.36343 lineto
431.6462 154.47675 lineto
432.46656 155.62889 433.09422 156.74783 433.09422 156.98143 curveto
433.09422 157.21506 431.4448 157.22915 429.41547 157.02058 curveto
427.38614 156.81204 424.14719 156.92545 422.21451 157.25538 curveto
418.03335 157.96922 417.56942 157.83375 417.94874 155.80736 curveto
418.10789 154.95718 418.27225 153.07648 418.30095 151.65899 curveto
418.35192 149.14291 418.43703 149.07546 421.90143 148.33247 curveto
423.85315 147.91393 427.55065 147.54974 430.1199 147.54974 curveto
434.77705 147.54974 lineto
closepath
fill
grestore
gsave
0.76862746 0 0.22352941 setrgbcolor
newpath
405.37262 158.34107 moveto
407.81237 158.44739 407.54183 159.21813 404.98128 161.04145 curveto
402.41513 162.86873 402.38798 163.83036 404.6682 165.97254 curveto
405.63301 166.87897 406.26884 167.7767 406.07708 167.96846 curveto
405.88529 168.16024 403.71836 168.28981 401.30253 168.24241 curveto
398.88669 168.19499 395.48878 168.43 393.74935 168.75117 curveto
392.00993 169.07234 390.51948 169.36809 390.42283 169.41647 curveto
390.32617 169.46489 390.22715 167.46078 390.22715 164.99415 curveto
390.22715 160.53268 lineto
393.59281 159.6717 lineto
395.42886 159.20568 399.24368 158.6348 402.04611 158.41936 curveto
403.46738 158.3101 404.55939 158.30564 405.37262 158.34107 curveto
closepath
fill
grestore
gsave
0.76862746 0 0.22352941 setrgbcolor
newpath
462.97894 157.98487 moveto
465.52318 158.07352 465.19231 158.92106 462.27448 160.72436 curveto
459.34167 162.53697 459.25685 163.2002 461.60918 165.65545 curveto
463.40942 167.53397 lineto
457.57822 167.92532 lineto
448.66796 168.57598 447.36435 168.97329 446.93333 171.13443 curveto
446.78515 166.5742 446.92603 164.89832 447.40295 161.23313 curveto
447.67525 162.27509 447.72522 162.28268 447.79431 161.3114 curveto
447.89449 159.90266 452.11251 158.76221 459.45672 158.14141 curveto
460.94981 158.01524 462.13085 157.9553 462.97894 157.98487 curveto
closepath
fill
grestore
gsave
0.76862746 0 0.22352941 setrgbcolor
newpath
241.83247 165.46245 moveto
239.54354 168.38621 240.78225 168.95255 240.541 170.94144 curveto
241.3692 168.40132 241.51618 166.93241 241.83247 165.46245 curveto
closepath
fill
grestore
gsave
0.76862746 0 0.22352941 setrgbcolor
newpath
336.03191 183.11261 moveto
335.70479 183.12087 335.26462 183.92687 335.05352 184.83457 curveto
335.54634 185.09037 335.94665 188.19797 336.42326 186.2826 curveto
336.58361 183.90418 336.35903 183.10435 336.03191 183.11261 curveto
closepath
fill
grestore
gsave
0.76862746 0 0.22352941 setrgbcolor
newpath
364.91401 191.09629 moveto
364.52265 192.07467 lineto
364.11379 194.97665 363.4721 197.85068 362.52673 200.64539 curveto
363.65069 197.53923 364.48929 194.35027 364.91401 191.09629 curveto
closepath
fill
grestore
gsave
0.76862746 0 0.22352941 setrgbcolor
newpath
334.30995 192.85738 moveto
333.9569 194.60959 333.01714 196.15295 332.11835 197.74934 curveto
327.1786 200.85835 331.65644 195.91447 332.11835 194.03144 curveto
326.8079 200.7154 331.37032 198.03493 331.17909 199.9018 curveto
332.75459 197.73065 333.90689 195.31517 334.30995 192.85738 curveto
closepath
fill
grestore
gsave
0.76862746 0 0.22352941 setrgbcolor
newpath
323.54766 203.07179 moveto
321.39847 203.59656 319.21562 203.62538 317.012 203.424 curveto
314.36854 203.46076 317.47451 204.81098 320.92556 205.34165 curveto
321.88027 204.59637 322.77684 203.80384 323.54766 203.07179 curveto
closepath
fill
grestore
gsave
0.76862746 0 0.22352941 setrgbcolor
newpath
290.16496 203.424 moveto
290.74751 205.56577 291.95038 207.42308 293.061 209.29434 curveto
292.23915 206.90707 lineto
291.31974 205.88986 290.77398 204.64114 290.16496 203.424 curveto
closepath
fill
grestore
gsave
0.76862746 0 0.22352941 setrgbcolor
newpath
288.12991 207.06361 moveto
287.77768 208.90299 lineto
289.51501 211.25937 290.8818 213.8301 293.10013 215.67344 curveto
291.50407 212.56149 290.31147 211.27214 288.12991 207.06361 curveto
closepath
fill
grestore
gsave
0.76862746 0 0.22352941 setrgbcolor
newpath
416.45561 220.48713 moveto
415.29888 220.64036 414.09122 222.53815 411.6028 226.35748 curveto
408.74589 230.74067 lineto
408.74589 242.12913 lineto
408.74589 247.52985 lineto
411.43821 247.31667 414.20226 247.17762 417.04264 247.17762 curveto
419.73587 247.17765 422.3477 247.29858 424.90891 247.49072 curveto
424.90891 242.05086 lineto
424.86978 230.62326 lineto
420.95621 225.14427 lineto
418.69366 221.95415 417.61238 220.33394 416.45561 220.48713 curveto
closepath
fill
grestore
gsave
0 0 0 setrgbcolor
newpath
324.65338 344.33539 moveto
332.02838 344.33539 lineto
332.02838 345.66351 lineto
326.23151 345.66351 lineto
326.23151 349.11664 lineto
331.78619 349.11664 lineto
331.78619 350.44476 lineto
326.23151 350.44476 lineto
326.23151 354.67133 lineto
332.16901 354.67133 lineto
332.16901 355.99945 lineto
324.65338 355.99945 lineto
324.65338 344.33539 lineto
340.47369 348.57758 moveto
340.47369 343.8432 lineto
341.91119 343.8432 lineto
341.91119 355.99945 lineto
340.47369 355.99945 lineto
340.47369 354.68695 lineto
340.1716 355.20778 339.78879 355.59581 339.32526 355.85101 curveto
338.86692 356.10101 338.31483 356.22601 337.66901 356.22601 curveto
336.61171 356.22601 335.74973 355.80414 335.08307 354.96039 curveto
334.42161 354.11664 334.09088 353.00727 334.09088 351.63226 curveto
334.09088 350.25727 334.42161 349.1479 335.08307 348.30414 curveto
335.74973 347.4604 336.61171 347.03852 337.66901 347.03851 curveto
338.31483 347.03852 338.86692 347.16613 339.32526 347.42133 curveto
339.78879 347.67133 340.1716 348.05675 340.47369 348.57758 curveto
335.57526 351.63226 moveto
335.57525 352.68956 335.7914 353.52029 336.22369 354.12445 curveto
336.66119 354.72341 337.26015 355.02289 338.02057 355.02289 curveto
338.78098 355.02289 339.37994 354.72341 339.81744 354.12445 curveto
340.25494 353.52029 340.47369 352.68956 340.47369 351.63226 curveto
340.47369 350.57498 340.25494 349.74685 339.81744 349.14789 curveto
339.37994 348.54373 338.78098 348.24165 338.02057 348.24164 curveto
337.26015 348.24165 336.66119 348.54373 336.22369 349.14789 curveto
335.7914 349.74685 335.57525 350.57498 335.57526 351.63226 curveto
344.87213 347.24945 moveto
346.30963 347.24945 lineto
346.30963 355.99945 lineto
344.87213 355.99945 lineto
344.87213 347.24945 lineto
344.87213 343.8432 moveto
346.30963 343.8432 lineto
346.30963 345.66351 lineto
344.87213 345.66351 lineto
344.87213 343.8432 lineto
356.58307 350.7182 moveto
356.58307 355.99945 lineto
355.14557 355.99945 lineto
355.14557 350.76508 lineto
355.14556 349.93696 354.9841 349.31717 354.66119 348.9057 curveto
354.33827 348.49425 353.8539 348.28852 353.20807 348.28851 curveto
352.43202 348.28852 351.82004 348.53592 351.37213 349.0307 curveto
350.92421 349.5255 350.70025 350.19998 350.70026 351.05414 curveto
350.70026 355.99945 lineto
349.25494 355.99945 lineto
349.25494 347.24945 lineto
350.70026 347.24945 lineto
350.70026 348.60883 lineto
351.044 348.08279 351.44765 347.68956 351.91119 347.42914 curveto
352.37994 347.16873 352.919 347.03852 353.52838 347.03851 curveto
354.53358 347.03852 355.294 347.35102 355.80963 347.97601 curveto
356.32525 348.59581 356.58306 349.50987 356.58307 350.7182 curveto
365.74713 351.63226 moveto
365.74712 350.57498 365.52837 349.74685 365.09088 349.14789 curveto
364.65858 348.54373 364.06223 348.24165 363.30182 348.24164 curveto
362.5414 348.24165 361.94244 348.54373 361.50494 349.14789 curveto
361.07265 349.74685 360.8565 350.57498 360.85651 351.63226 curveto
360.8565 352.68956 361.07265 353.52029 361.50494 354.12445 curveto
361.94244 354.72341 362.5414 355.02289 363.30182 355.02289 curveto
364.06223 355.02289 364.65858 354.72341 365.09088 354.12445 curveto
365.52837 353.52029 365.74712 352.68956 365.74713 351.63226 curveto
360.85651 348.57758 moveto
361.15859 348.05675 361.53879 347.67133 361.99713 347.42133 curveto
362.46067 347.16613 363.01275 347.03852 363.65338 347.03851 curveto
364.71587 347.03852 365.57785 347.4604 366.23932 348.30414 curveto
366.90598 349.1479 367.23931 350.25727 367.23932 351.63226 curveto
367.23931 353.00727 366.90598 354.11664 366.23932 354.96039 curveto
365.57785 355.80414 364.71587 356.22601 363.65338 356.22601 curveto
363.01275 356.22601 362.46067 356.10101 361.99713 355.85101 curveto
361.53879 355.59581 361.15859 355.20778 360.85651 354.68695 curveto
360.85651 355.99945 lineto
359.41119 355.99945 lineto
359.41119 343.8432 lineto
360.85651 343.8432 lineto
360.85651 348.57758 lineto
369.47369 352.54633 moveto
369.47369 347.24945 lineto
370.91119 347.24945 lineto
370.91119 352.49164 lineto
370.91119 353.31977 371.07265 353.94216 371.39557 354.35883 curveto
371.71848 354.77029 372.20286 354.97601 372.84869 354.97601 curveto
373.62473 354.97601 374.23671 354.72862 374.68463 354.23383 curveto
375.13775 353.73904 375.36431 353.06456 375.36432 352.21039 curveto
375.36432 347.24945 lineto
376.80182 347.24945 lineto
376.80182 355.99945 lineto
375.36432 355.99945 lineto
375.36432 354.6557 lineto
375.01535 355.18695 374.6091 355.58278 374.14557 355.8432 curveto
373.68723 356.09841 373.15338 356.22601 372.54401 356.22601 curveto
371.53879 356.22601 370.77577 355.91351 370.25494 355.28851 curveto
369.73411 354.66351 369.47369 353.74945 369.47369 352.54633 curveto
384.84869 348.5932 moveto
384.68723 348.49946 384.51015 348.43175 384.31744 348.39008 curveto
384.12994 348.34321 383.9216 348.31977 383.69244 348.31976 curveto
382.87994 348.31977 382.25494 348.5854 381.81744 349.11664 curveto
381.38515 349.64269 381.169 350.4005 381.16901 351.39008 curveto
381.16901 355.99945 lineto
379.72369 355.99945 lineto
379.72369 347.24945 lineto
381.16901 347.24945 lineto
381.16901 348.60883 lineto
381.47109 348.07758 381.86432 347.68435 382.34869 347.42914 curveto
382.83306 347.16873 383.42161 347.03852 384.11432 347.03851 curveto
384.21327 347.03852 384.32265 347.04633 384.44244 347.06195 curveto
384.56223 347.07238 384.69504 347.09061 384.84088 347.11664 curveto
384.84869 348.5932 lineto
391.84869 351.52289 moveto
391.84869 350.48123 391.63254 349.67394 391.20026 349.10101 curveto
390.77317 348.5281 390.1716 348.24165 389.39557 348.24164 curveto
388.62473 348.24165 388.02317 348.5281 387.59088 349.10101 curveto
387.1638 349.67394 386.95025 350.48123 386.95026 351.52289 curveto
386.95025 352.55935 387.1638 353.36404 387.59088 353.93695 curveto
388.02317 354.50987 388.62473 354.79633 389.39557 354.79633 curveto
390.1716 354.79633 390.77317 354.50987 391.20026 353.93695 curveto
391.63254 353.36404 391.84869 352.55935 391.84869 351.52289 curveto
393.28619 354.91351 moveto
393.28619 356.4031 392.95546 357.50987 392.29401 358.23383 curveto
391.63254 358.96299 390.61952 359.32757 389.25494 359.32758 curveto
388.74973 359.32757 388.27317 359.28851 387.82526 359.21039 curveto
387.37734 359.13747 386.94244 359.02289 386.52057 358.86664 curveto
386.52057 357.4682 lineto
386.94244 357.69737 387.35911 357.86664 387.77057 357.97601 curveto
388.18202 358.08539 388.60129 358.14007 389.02838 358.14008 curveto
389.97108 358.14007 390.67681 357.89268 391.14557 357.39789 curveto
391.61431 356.9083 391.84869 356.16612 391.84869 355.17133 curveto
391.84869 354.46039 lineto
391.55181 354.97601 391.1716 355.36143 390.70807 355.61664 curveto
390.24452 355.87185 389.68983 355.99945 389.04401 355.99945 curveto
387.97109 355.99945 387.1065 355.5906 386.45026 354.77289 curveto
385.79401 353.95518 385.46588 352.87185 385.46588 351.52289 curveto
385.46588 350.16873 385.79401 349.08279 386.45026 348.26508 curveto
387.1065 347.44738 387.97109 347.03852 389.04401 347.03851 curveto
389.68983 347.03852 390.24452 347.16613 390.70807 347.42133 curveto
391.1716 347.67654 391.55181 348.06196 391.84869 348.57758 curveto
391.84869 347.24945 lineto
393.28619 347.24945 lineto
393.28619 354.91351 lineto
403.52057 350.7182 moveto
403.52057 355.99945 lineto
402.08307 355.99945 lineto
402.08307 350.76508 lineto
402.08306 349.93696 401.9216 349.31717 401.59869 348.9057 curveto
401.27577 348.49425 400.7914 348.28852 400.14557 348.28851 curveto
399.36952 348.28852 398.75754 348.53592 398.30963 349.0307 curveto
397.86171 349.5255 397.63775 350.19998 397.63776 351.05414 curveto
397.63776 355.99945 lineto
396.19244 355.99945 lineto
396.19244 343.8432 lineto
397.63776 343.8432 lineto
397.63776 348.60883 lineto
397.9815 348.08279 398.38515 347.68956 398.84869 347.42914 curveto
399.31744 347.16873 399.8565 347.03852 400.46588 347.03851 curveto
401.47108 347.03852 402.2315 347.35102 402.74713 347.97601 curveto
403.26275 348.59581 403.52056 349.50987 403.52057 350.7182 curveto
406.77057 354.01508 moveto
408.41901 354.01508 lineto
408.41901 355.35883 lineto
407.13776 357.85883 lineto
406.12994 357.85883 lineto
406.77057 355.35883 lineto
406.77057 354.01508 lineto
423.64557 344.7182 moveto
423.64557 346.25726 lineto
423.0466 345.97081 422.4815 345.75727 421.95026 345.61664 curveto
421.419 345.47602 420.90598 345.40571 420.41119 345.4057 curveto
419.55181 345.40571 418.88775 345.57238 418.41901 345.9057 curveto
417.95546 346.23904 417.72369 346.713 417.72369 347.32758 curveto
417.72369 347.84321 417.87734 348.23383 418.18463 348.49945 curveto
418.49713 348.75987 419.08567 348.97081 419.95026 349.13226 curveto
420.90338 349.32758 lineto
422.08046 349.55154 422.94764 349.94737 423.50494 350.51508 curveto
424.06743 351.07758 424.34868 351.83279 424.34869 352.7807 curveto
424.34868 353.91091 423.96848 354.76768 423.20807 355.35101 curveto
422.45285 355.93435 421.34348 356.22601 419.87994 356.22601 curveto
419.32786 356.22601 418.73932 356.16351 418.11432 356.03851 curveto
417.49452 355.91351 416.8513 355.72862 416.18463 355.48383 curveto
416.18463 353.85883 lineto
416.82525 354.2182 417.45286 354.48904 418.06744 354.67133 curveto
418.68202 354.85362 419.28619 354.94476 419.87994 354.94476 curveto
420.78098 354.94476 421.47629 354.76768 421.96588 354.41351 curveto
422.45546 354.05935 422.70025 353.55414 422.70026 352.89789 curveto
422.70025 352.32498 422.52317 351.87706 422.16901 351.55414 curveto
421.82004 351.23123 421.24452 350.98904 420.44244 350.82758 curveto
419.48151 350.64008 lineto
418.30442 350.40571 417.45286 350.03852 416.92682 349.53851 curveto
416.40078 349.03852 416.13776 348.34321 416.13776 347.45258 curveto
416.13776 346.42134 416.49973 345.60884 417.22369 345.01508 curveto
417.95286 344.42134 418.95546 344.12446 420.23151 344.12445 curveto
420.77838 344.12446 421.33567 344.17394 421.90338 344.27289 curveto
422.47108 344.37186 423.05181 344.5203 423.64557 344.7182 curveto
433.04401 347.58539 moveto
433.04401 348.92914 lineto
432.63775 348.70519 432.2289 348.53852 431.81744 348.42914 curveto
431.41119 348.31456 430.99973 348.25727 430.58307 348.25726 curveto
429.65077 348.25727 428.92682 348.55415 428.41119 349.14789 curveto
427.89557 349.73644 427.63775 350.56456 427.63776 351.63226 curveto
427.63775 352.69997 427.89557 353.5307 428.41119 354.12445 curveto
428.92682 354.71299 429.65077 355.00726 430.58307 355.00726 curveto
430.99973 355.00726 431.41119 354.95258 431.81744 354.8432 curveto
432.2289 354.72862 432.63775 354.55935 433.04401 354.33539 curveto
433.04401 355.66351 lineto
432.64296 355.85101 432.22629 355.99164 431.79401 356.08539 curveto
431.36692 356.17914 430.91119 356.22601 430.42682 356.22601 curveto
429.10911 356.22601 428.06223 355.81195 427.28619 354.98383 curveto
426.51015 354.1557 426.12213 353.03852 426.12213 351.63226 curveto
426.12213 350.20519 426.51276 349.08279 427.29401 348.26508 curveto
428.08046 347.44738 429.15598 347.03852 430.52057 347.03851 curveto
430.96327 347.03852 431.39556 347.0854 431.81744 347.17914 curveto
432.23931 347.26769 432.64817 347.40311 433.04401 347.58539 curveto
438.95026 348.25726 moveto
438.17942 348.25727 437.57004 348.55935 437.12213 349.16351 curveto
436.67421 349.76248 436.45025 350.58539 436.45026 351.63226 curveto
436.45025 352.67914 436.67161 353.50466 437.11432 354.10883 curveto
437.56223 354.70779 438.17421 355.00726 438.95026 355.00726 curveto
439.71588 355.00726 440.32265 354.70518 440.77057 354.10101 curveto
441.21848 353.49685 441.44244 352.67393 441.44244 351.63226 curveto
441.44244 350.59581 441.21848 349.7755 440.77057 349.17133 curveto
440.32265 348.56196 439.71588 348.25727 438.95026 348.25726 curveto
438.95026 347.03851 moveto
440.20025 347.03852 441.18202 347.44477 441.89557 348.25726 curveto
442.6091 349.06977 442.96587 350.19477 442.96588 351.63226 curveto
442.96587 353.06456 442.6091 354.18956 441.89557 355.00726 curveto
441.18202 355.81976 440.20025 356.22601 438.95026 356.22601 curveto
437.69504 356.22601 436.71067 355.81976 435.99713 355.00726 curveto
435.2888 354.18956 434.93463 353.06456 434.93463 351.63226 curveto
434.93463 350.19477 435.2888 349.06977 435.99713 348.25726 curveto
436.71067 347.44477 437.69504 347.03852 438.95026 347.03851 curveto
446.76276 344.76508 moveto
446.76276 347.24945 lineto
449.72369 347.24945 lineto
449.72369 348.36664 lineto
446.76276 348.36664 lineto
446.76276 353.11664 lineto
446.76275 353.83018 446.85911 354.28851 447.05182 354.49164 curveto
447.24973 354.69476 447.64817 354.79633 448.24713 354.79633 curveto
449.72369 354.79633 lineto
449.72369 355.99945 lineto
448.24713 355.99945 lineto
447.13775 355.99945 446.37213 355.79372 445.95026 355.38226 curveto
445.52838 354.9656 445.31744 354.21039 445.31744 353.11664 curveto
445.31744 348.36664 lineto
444.26276 348.36664 lineto
444.26276 347.24945 lineto
445.31744 347.24945 lineto
445.31744 344.76508 lineto
446.76276 344.76508 lineto
451.62213 343.8432 moveto
453.05963 343.8432 lineto
453.05963 355.99945 lineto
451.62213 355.99945 lineto
451.62213 343.8432 lineto
460.03619 351.60101 moveto
458.87473 351.60102 458.07004 351.73383 457.62213 351.99945 curveto
457.17421 352.26508 456.95025 352.7182 456.95026 353.35883 curveto
456.95025 353.86924 457.11692 354.27549 457.45026 354.57758 curveto
457.78879 354.87445 458.24713 355.02289 458.82526 355.02289 curveto
459.62213 355.02289 460.26015 354.74164 460.73932 354.17914 curveto
461.22369 353.61143 461.46587 352.85883 461.46588 351.92133 curveto
461.46588 351.60101 lineto
460.03619 351.60101 lineto
462.90338 351.00726 moveto
462.90338 355.99945 lineto
461.46588 355.99945 lineto
461.46588 354.67133 lineto
461.13775 355.20258 460.7289 355.59581 460.23932 355.85101 curveto
459.74973 356.10101 459.15077 356.22601 458.44244 356.22601 curveto
457.54661 356.22601 456.83307 355.97601 456.30182 355.47601 curveto
455.77578 354.97081 455.51276 354.29633 455.51276 353.45258 curveto
455.51276 352.4682 455.84088 351.72602 456.49713 351.22601 curveto
457.15859 350.72602 458.14296 350.47602 459.45026 350.47601 curveto
461.46588 350.47601 lineto
461.46588 350.33539 lineto
461.46587 349.67394 461.24712 349.16352 460.80963 348.80414 curveto
460.37733 348.43956 459.76796 348.25727 458.98151 348.25726 curveto
458.4815 348.25727 457.99452 348.31717 457.52057 348.43695 curveto
457.04661 348.55675 456.59088 348.73644 456.15338 348.97601 curveto
456.15338 347.64789 lineto
456.67942 347.44477 457.18984 347.29373 457.68463 347.19476 curveto
458.17942 347.09061 458.66119 347.03852 459.12994 347.03851 curveto
460.39556 347.03852 461.34087 347.36665 461.96588 348.02289 curveto
462.59087 348.67915 462.90337 349.67394 462.90338 351.00726 curveto
473.14557 350.7182 moveto
473.14557 355.99945 lineto
471.70807 355.99945 lineto
471.70807 350.76508 lineto
471.70806 349.93696 471.5466 349.31717 471.22369 348.9057 curveto
470.90077 348.49425 470.4164 348.28852 469.77057 348.28851 curveto
468.99452 348.28852 468.38254 348.53592 467.93463 349.0307 curveto
467.48671 349.5255 467.26275 350.19998 467.26276 351.05414 curveto
467.26276 355.99945 lineto
465.81744 355.99945 lineto
465.81744 347.24945 lineto
467.26276 347.24945 lineto
467.26276 348.60883 lineto
467.6065 348.08279 468.01015 347.68956 468.47369 347.42914 curveto
468.94244 347.16873 469.4815 347.03852 470.09088 347.03851 curveto
471.09608 347.03852 471.8565 347.35102 472.37213 347.97601 curveto
472.88775 348.59581 473.14556 349.50987 473.14557 350.7182 curveto
481.78619 348.57758 moveto
481.78619 343.8432 lineto
483.22369 343.8432 lineto
483.22369 355.99945 lineto
481.78619 355.99945 lineto
481.78619 354.68695 lineto
481.4841 355.20778 481.10129 355.59581 480.63776 355.85101 curveto
480.17942 356.10101 479.62733 356.22601 478.98151 356.22601 curveto
477.92421 356.22601 477.06223 355.80414 476.39557 354.96039 curveto
475.73411 354.11664 475.40338 353.00727 475.40338 351.63226 curveto
475.40338 350.25727 475.73411 349.1479 476.39557 348.30414 curveto
477.06223 347.4604 477.92421 347.03852 478.98151 347.03851 curveto
479.62733 347.03852 480.17942 347.16613 480.63776 347.42133 curveto
481.10129 347.67133 481.4841 348.05675 481.78619 348.57758 curveto
476.88776 351.63226 moveto
476.88775 352.68956 477.1039 353.52029 477.53619 354.12445 curveto
477.97369 354.72341 478.57265 355.02289 479.33307 355.02289 curveto
480.09348 355.02289 480.69244 354.72341 481.12994 354.12445 curveto
481.56744 353.52029 481.78619 352.68956 481.78619 351.63226 curveto
481.78619 350.57498 481.56744 349.74685 481.12994 349.14789 curveto
480.69244 348.54373 480.09348 348.24165 479.33307 348.24164 curveto
478.57265 348.24165 477.97369 348.54373 477.53619 349.14789 curveto
477.1039 349.74685 476.88775 350.57498 476.88776 351.63226 curveto
fill
grestore
gsave
0 0 0 setrgbcolor
newpath
349.83307 375.27472 moveto
352.41119 375.27472 lineto
352.41119 366.37628 lineto
349.60651 366.93878 lineto
349.60651 365.50128 lineto
352.39557 364.93878 lineto
353.97369 364.93878 lineto
353.97369 375.27472 lineto
356.55182 375.27472 lineto
356.55182 376.60284 lineto
349.83307 376.60284 lineto
349.83307 375.27472 lineto
359.34869 364.93878 moveto
366.84869 364.93878 lineto
366.84869 365.61066 lineto
362.61432 376.60284 lineto
360.96588 376.60284 lineto
364.95026 366.26691 lineto
359.34869 366.26691 lineto
359.34869 364.93878 lineto
368.22369 371.65753 moveto
378.40338 371.65753 lineto
378.40338 372.78253 lineto
368.22369 372.78253 lineto
368.22369 371.65753 lineto
381.48151 375.27472 moveto
386.98932 375.27472 lineto
386.98932 376.60284 lineto
379.58307 376.60284 lineto
379.58307 375.27472 lineto
380.18203 374.65493 380.99713 373.8242 382.02838 372.78253 curveto
383.06484 371.73566 383.71588 371.06118 383.98151 370.75909 curveto
384.48671 370.19139 384.83827 369.71223 385.03619 369.32159 curveto
385.23931 368.92577 385.34087 368.53775 385.34088 368.15753 curveto
385.34087 367.53775 385.12212 367.03254 384.68463 366.64191 curveto
384.25233 366.25129 383.68723 366.05598 382.98932 366.05597 curveto
382.49452 366.05598 381.97109 366.14192 381.41901 366.31378 curveto
380.87213 366.48567 380.28619 366.74608 379.66119 367.09503 curveto
379.66119 365.50128 lineto
380.29661 365.24608 380.89036 365.05338 381.44244 364.92316 curveto
381.99452 364.79296 382.49973 364.72786 382.95807 364.72784 curveto
384.1664 364.72786 385.12994 365.02994 385.84869 365.63409 curveto
386.56744 366.23827 386.92681 367.04556 386.92682 368.05597 curveto
386.92681 368.53514 386.83566 368.99087 386.65338 369.42316 curveto
386.47629 369.85025 386.15077 370.35545 385.67682 370.93878 curveto
385.5466 371.08983 385.13254 371.52733 384.43463 372.25128 curveto
383.73671 372.97004 382.75234 373.97785 381.48151 375.27472 curveto
395.09088 370.31378 moveto
395.84608 370.47525 396.43462 370.81118 396.85651 371.32159 curveto
397.28358 371.83202 397.49712 372.46222 397.49713 373.21222 curveto
397.49712 374.36326 397.10129 375.25389 396.30963 375.88409 curveto
395.51796 376.5143 394.39296 376.82941 392.93463 376.82941 curveto
392.44504 376.82941 391.93984 376.77993 391.41901 376.68097 curveto
390.90338 376.58722 390.36953 376.44399 389.81744 376.25128 curveto
389.81744 374.72784 lineto
390.25494 374.98305 390.73411 375.17576 391.25494 375.30597 curveto
391.77577 375.43618 392.32004 375.50128 392.88776 375.50128 curveto
393.87733 375.50128 394.62994 375.30597 395.14557 374.91534 curveto
395.6664 374.52472 395.92681 373.95701 395.92682 373.21222 curveto
395.92681 372.52472 395.68462 371.98827 395.20026 371.60284 curveto
394.72108 371.21222 394.05181 371.01691 393.19244 371.01691 curveto
391.83307 371.01691 lineto
391.83307 369.72003 lineto
393.25494 369.72003 lineto
394.03098 369.72004 394.62473 369.56639 395.03619 369.25909 curveto
395.44765 368.9466 395.65337 368.49869 395.65338 367.91534 curveto
395.65337 367.3164 395.43983 366.85806 395.01276 366.54034 curveto
394.59088 366.21744 393.98411 366.05598 393.19244 366.05597 curveto
392.76015 366.05598 392.29661 366.10285 391.80182 366.19659 curveto
391.30702 366.29035 390.76275 366.43619 390.16901 366.63409 curveto
390.16901 365.22784 lineto
390.76796 365.06119 391.32786 364.93619 391.84869 364.85284 curveto
392.37473 364.76952 392.86952 364.72786 393.33307 364.72784 curveto
394.53098 364.72786 395.4789 365.00129 396.17682 365.54816 curveto
396.87473 366.08983 397.22369 366.82421 397.22369 367.75128 curveto
397.22369 368.39712 397.03879 368.944 396.66901 369.39191 curveto
396.29921 369.83462 395.77317 370.14191 395.09088 370.31378 curveto
405.45026 364.93878 moveto
407.02838 364.93878 lineto
407.02838 375.79034 lineto
407.02838 377.19659 406.76015 378.21743 406.22369 378.85284 curveto
405.69244 379.48826 404.83567 379.80597 403.65338 379.80597 curveto
403.05182 379.80597 lineto
403.05182 378.47784 lineto
403.54401 378.47784 lineto
404.24192 378.47784 404.73411 378.28253 405.02057 377.89191 curveto
405.30703 377.50128 405.45025 376.80076 405.45026 375.79034 curveto
405.45026 364.93878 lineto
409.95807 373.14972 moveto
409.95807 367.85284 lineto
411.39557 367.85284 lineto
411.39557 373.09503 lineto
411.39557 373.92316 411.55702 374.54555 411.87994 374.96222 curveto
412.20286 375.37368 412.68723 375.57941 413.33307 375.57941 curveto
414.10911 375.57941 414.72108 375.33201 415.16901 374.83722 curveto
415.62212 374.34243 415.84869 373.66795 415.84869 372.81378 curveto
415.84869 367.85284 lineto
417.28619 367.85284 lineto
417.28619 376.60284 lineto
415.84869 376.60284 lineto
415.84869 375.25909 lineto
415.49973 375.79035 415.09348 376.18618 414.62994 376.44659 curveto
414.1716 376.7018 413.63775 376.82941 413.02838 376.82941 curveto
412.02317 376.82941 411.26015 376.51691 410.73932 375.89191 curveto
410.21848 375.26691 409.95807 374.35285 409.95807 373.14972 curveto
427.53619 371.32159 moveto
427.53619 376.60284 lineto
426.09869 376.60284 lineto
426.09869 371.36847 lineto
426.09869 370.54035 425.93723 369.92056 425.61432 369.50909 curveto
425.2914 369.09764 424.80702 368.89191 424.16119 368.89191 curveto
423.38515 368.89191 422.77317 369.13931 422.32526 369.63409 curveto
421.87734 370.12889 421.65338 370.80337 421.65338 371.65753 curveto
421.65338 376.60284 lineto
420.20807 376.60284 lineto
420.20807 367.85284 lineto
421.65338 367.85284 lineto
421.65338 369.21222 lineto
421.99713 368.68619 422.40077 368.29296 422.86432 368.03253 curveto
423.33306 367.77212 423.87213 367.64192 424.48151 367.64191 curveto
425.48671 367.64192 426.24712 367.95442 426.76276 368.57941 curveto
427.27837 369.19921 427.53619 370.11327 427.53619 371.32159 curveto
437.90338 371.86847 moveto
437.90338 372.57159 lineto
431.29401 372.57159 lineto
431.3565 373.56118 431.65338 374.31639 432.18463 374.83722 curveto
432.72109 375.35285 433.46588 375.61066 434.41901 375.61066 curveto
434.97108 375.61066 435.50494 375.54295 436.02057 375.40753 curveto
436.54139 375.27212 437.05702 375.06899 437.56744 374.79816 curveto
437.56744 376.15753 lineto
437.05181 376.37628 436.52317 376.54295 435.98151 376.65753 curveto
435.43983 376.77211 434.89035 376.82941 434.33307 376.82941 curveto
432.93723 376.82941 431.83046 376.42316 431.01276 375.61066 curveto
430.20026 374.79816 429.79401 373.6992 429.79401 372.31378 curveto
429.79401 370.8815 430.17942 369.74608 430.95026 368.90753 curveto
431.7263 368.06379 432.77056 367.64192 434.08307 367.64191 curveto
435.26015 367.64192 436.18983 368.02212 436.87213 368.78253 curveto
437.55962 369.53775 437.90337 370.56639 437.90338 371.86847 curveto
436.46588 371.44659 moveto
436.45546 370.66014 436.2341 370.03254 435.80182 369.56378 curveto
435.37473 369.09504 434.80702 368.86066 434.09869 368.86066 curveto
433.29661 368.86066 432.65338 369.08723 432.16901 369.54034 curveto
431.68984 369.99348 431.4138 370.6315 431.34088 371.45441 curveto
436.46588 371.44659 lineto
446.91901 375.27472 moveto
452.42682 375.27472 lineto
452.42682 376.60284 lineto
445.02057 376.60284 lineto
445.02057 375.27472 lineto
445.61953 374.65493 446.43463 373.8242 447.46588 372.78253 curveto
448.50234 371.73566 449.15338 371.06118 449.41901 370.75909 curveto
449.92421 370.19139 450.27577 369.71223 450.47369 369.32159 curveto
450.67681 368.92577 450.77837 368.53775 450.77838 368.15753 curveto
450.77837 367.53775 450.55962 367.03254 450.12213 366.64191 curveto
449.68983 366.25129 449.12473 366.05598 448.42682 366.05597 curveto
447.93202 366.05598 447.40859 366.14192 446.85651 366.31378 curveto
446.30963 366.48567 445.72369 366.74608 445.09869 367.09503 curveto
445.09869 365.50128 lineto
445.73411 365.24608 446.32786 365.05338 446.87994 364.92316 curveto
447.43202 364.79296 447.93723 364.72786 448.39557 364.72784 curveto
449.6039 364.72786 450.56744 365.02994 451.28619 365.63409 curveto
452.00494 366.23827 452.36431 367.04556 452.36432 368.05597 curveto
452.36431 368.53514 452.27316 368.99087 452.09088 369.42316 curveto
451.91379 369.85025 451.58827 370.35545 451.11432 370.93878 curveto
450.9841 371.08983 450.57004 371.52733 449.87213 372.25128 curveto
449.17421 372.97004 448.18984 373.97785 446.91901 375.27472 curveto
459.12213 365.97784 moveto
458.30963 365.97785 457.69765 366.3789 457.28619 367.18097 curveto
456.87994 367.97785 456.67682 369.17837 456.67682 370.78253 curveto
456.67682 372.38149 456.87994 373.58201 457.28619 374.38409 curveto
457.69765 375.18097 458.30963 375.57941 459.12213 375.57941 curveto
459.93983 375.57941 460.55181 375.18097 460.95807 374.38409 curveto
461.36952 373.58201 461.57525 372.38149 461.57526 370.78253 curveto
461.57525 369.17837 461.36952 367.97785 460.95807 367.18097 curveto
460.55181 366.3789 459.93983 365.97785 459.12213 365.97784 curveto
459.12213 364.72784 moveto
460.42942 364.72786 461.42681 365.24608 462.11432 366.28253 curveto
462.80702 367.31379 463.15337 368.81379 463.15338 370.78253 curveto
463.15337 372.74608 462.80702 374.24608 462.11432 375.28253 curveto
461.42681 376.31378 460.42942 376.82941 459.12213 376.82941 curveto
457.81484 376.82941 456.81484 376.31378 456.12213 375.28253 curveto
455.43463 374.24608 455.09088 372.74608 455.09088 370.78253 curveto
455.09088 368.81379 455.43463 367.31379 456.12213 366.28253 curveto
456.81484 365.24608 457.81484 364.72786 459.12213 364.72784 curveto
469.30963 365.97784 moveto
468.49713 365.97785 467.88515 366.3789 467.47369 367.18097 curveto
467.06744 367.97785 466.86432 369.17837 466.86432 370.78253 curveto
466.86432 372.38149 467.06744 373.58201 467.47369 374.38409 curveto
467.88515 375.18097 468.49713 375.57941 469.30963 375.57941 curveto
470.12733 375.57941 470.73931 375.18097 471.14557 374.38409 curveto
471.55702 373.58201 471.76275 372.38149 471.76276 370.78253 curveto
471.76275 369.17837 471.55702 367.97785 471.14557 367.18097 curveto
470.73931 366.3789 470.12733 365.97785 469.30963 365.97784 curveto
469.30963 364.72784 moveto
470.61692 364.72786 471.61431 365.24608 472.30182 366.28253 curveto
472.99452 367.31379 473.34087 368.81379 473.34088 370.78253 curveto
473.34087 372.74608 472.99452 374.24608 472.30182 375.28253 curveto
471.61431 376.31378 470.61692 376.82941 469.30963 376.82941 curveto
468.00234 376.82941 467.00234 376.31378 466.30963 375.28253 curveto
465.62213 374.24608 465.27838 372.74608 465.27838 370.78253 curveto
465.27838 368.81379 465.62213 367.31379 466.30963 366.28253 curveto
467.00234 365.24608 468.00234 364.72786 469.30963 364.72784 curveto
475.72369 364.93878 moveto
483.22369 364.93878 lineto
483.22369 365.61066 lineto
478.98932 376.60284 lineto
477.34088 376.60284 lineto
481.32526 366.26691 lineto
475.72369 366.26691 lineto
475.72369 364.93878 lineto
fill
grestore
gsave
0 0 0 setrgbcolor
newpath
245.7997 302.91745 moveto
245.7997 324.26901 lineto
249.03407 324.26901 lineto
252.72155 324.26902 255.53405 323.35496 257.47157 321.52682 curveto
259.42467 319.69871 260.40123 317.04246 260.40126 313.55807 curveto
260.40123 310.08935 259.43248 307.44872 257.49501 305.6362 curveto
255.55749 303.82373 252.73718 302.91748 249.03407 302.91745 curveto
245.7997 302.91745 lineto
236.77626 296.09714 moveto
246.29189 296.09714 lineto
251.60437 296.09717 255.55749 296.47998 258.15126 297.24557 curveto
260.76061 297.99561 262.99498 299.27686 264.85439 301.08932 curveto
266.49498 302.66748 267.71373 304.48779 268.51064 306.55026 curveto
269.30747 308.61278 269.70591 310.94872 269.70595 313.55807 curveto
269.70591 316.19871 269.30747 318.55809 268.51064 320.6362 curveto
267.71373 322.69871 266.49498 324.51902 264.85439 326.09714 curveto
262.97935 327.90964 260.72936 329.1987 258.10439 329.96432 curveto
255.47936 330.71433 251.54187 331.08932 246.29189 331.08932 curveto
236.77626 331.08932 lineto
236.77626 296.09714 lineto
300.22796 317.89401 moveto
300.22796 320.28464 lineto
280.61077 320.28464 lineto
280.81389 322.2534 281.52483 323.72996 282.74359 324.71432 curveto
283.96232 325.69871 285.66545 326.19089 287.85296 326.19089 curveto
289.61857 326.19089 291.42325 325.93308 293.26702 325.41745 curveto
295.12637 324.88621 297.03262 324.08933 298.98577 323.02682 curveto
298.98577 329.49557 lineto
297.00137 330.24558 295.017 330.80808 293.03265 331.18307 curveto
291.04825 331.5737 289.06388 331.76901 287.07952 331.76901 curveto
282.32951 331.76901 278.6342 330.56589 275.99359 328.15964 curveto
273.36858 325.73777 272.05609 322.34715 272.05609 317.98776 curveto
272.05609 313.70653 273.34515 310.33935 275.92327 307.8862 curveto
278.51702 305.4331 282.07951 304.20654 286.61077 304.20651 curveto
290.73575 304.20654 294.03263 305.44873 296.5014 307.93307 curveto
298.98575 310.41747 300.22793 313.73778 300.22796 317.89401 curveto
291.60296 315.10495 moveto
291.60294 313.51122 291.13419 312.22997 290.19671 311.2612 curveto
289.27482 310.27685 288.06388 309.78466 286.5639 309.78464 curveto
284.93889 309.78466 283.61857 310.2456 282.60296 311.16745 curveto
281.58733 312.07372 280.95451 313.38622 280.70452 315.10495 curveto
291.60296 315.10495 lineto
318.30466 325.67526 moveto
320.10152 325.67527 321.46871 325.01902 322.40623 323.70651 curveto
323.35933 322.39402 323.83589 320.48777 323.83591 317.98776 curveto
323.83589 315.48778 323.35933 313.58153 322.40623 312.26901 curveto
321.46871 310.95653 320.10152 310.30028 318.30466 310.30026 curveto
316.50777 310.30028 315.12496 310.96435 314.15623 312.29245 curveto
313.20309 313.60497 312.72653 315.5034 312.72654 317.98776 curveto
312.72653 320.47215 313.20309 322.3784 314.15623 323.70651 curveto
315.12496 325.01902 316.50777 325.67527 318.30466 325.67526 curveto
312.72654 308.68307 moveto
313.88278 307.15185 315.16402 306.02685 316.57029 305.30807 curveto
317.97652 304.57373 319.59371 304.20654 321.42185 304.20651 curveto
324.6562 304.20654 327.31245 305.4956 329.3906 308.0737 curveto
331.4687 310.63622 332.50776 313.9409 332.50779 317.98776 curveto
332.50776 322.03465 331.4687 325.34714 329.3906 327.92526 curveto
327.31245 330.48776 324.6562 331.76901 321.42185 331.76901 curveto
319.59371 331.76901 317.97652 331.40964 316.57029 330.69089 curveto
315.16402 329.95651 313.88278 328.8237 312.72654 327.29245 curveto
312.72654 331.08932 lineto
304.33591 331.08932 lineto
304.33591 294.62057 lineto
312.72654 294.62057 lineto
312.72654 308.68307 lineto
366.86716 329.16745 moveto
365.21088 330.02683 363.48432 330.67526 361.68748 331.11276 curveto
359.89058 331.55026 358.01558 331.76901 356.06248 331.76901 curveto
350.23434 331.76901 345.61715 330.14401 342.21091 326.89401 curveto
338.80466 323.62839 337.10154 319.20652 337.10154 313.62839 curveto
337.10154 308.03466 338.80466 303.61279 342.21091 300.36276 curveto
345.61715 297.09717 350.23434 295.46436 356.06248 295.46432 curveto
358.01558 295.46436 359.89058 295.68311 361.68748 296.12057 curveto
363.48432 296.55811 365.21088 297.20655 366.86716 298.06589 curveto
366.86716 305.30807 lineto
365.19526 304.16748 363.54682 303.33154 361.92185 302.80026 curveto
360.29683 302.26904 358.58589 302.00342 356.78904 302.00339 curveto
353.57027 302.00342 351.03902 303.03467 349.19529 305.09714 curveto
347.35153 307.15966 346.42965 310.00341 346.42966 313.62839 curveto
346.42965 317.23778 347.35153 320.07371 349.19529 322.1362 curveto
351.03902 324.19871 353.57027 325.22996 356.78904 325.22995 curveto
358.58589 325.22996 360.29683 324.96433 361.92185 324.43307 curveto
363.54682 323.90183 365.19526 323.0659 366.86716 321.92526 curveto
366.86716 329.16745 lineto
384.26418 310.20651 moveto
382.40479 310.20653 380.98291 310.87841 379.99855 312.22214 curveto
379.02979 313.55028 378.54541 315.47215 378.54543 317.98776 curveto
378.54541 320.5034 379.02979 322.43308 379.99855 323.77682 curveto
380.98291 325.10496 382.40479 325.76902 384.26418 325.76901 curveto
386.09228 325.76902 387.49072 325.10496 388.45949 323.77682 curveto
389.42822 322.43308 389.91259 320.5034 389.91261 317.98776 curveto
389.91259 315.47215 389.42822 313.55028 388.45949 312.22214 curveto
387.49072 310.87841 386.09228 310.20653 384.26418 310.20651 curveto
384.26418 304.20651 moveto
388.77978 304.20654 392.30321 305.42529 394.83449 307.86276 curveto
397.38133 310.30028 398.65477 313.67528 398.6548 317.98776 curveto
398.65477 322.30027 397.38133 325.67527 394.83449 328.11276 curveto
392.30321 330.55026 388.77978 331.76901 384.26418 331.76901 curveto
379.73291 331.76901 376.18604 330.55026 373.62355 328.11276 curveto
371.07667 325.67527 369.80324 322.30027 369.80324 317.98776 curveto
369.80324 313.67528 371.07667 310.30028 373.62355 307.86276 curveto
376.18604 305.42529 379.73291 304.20654 384.26418 304.20651 curveto
428.94244 315.10495 moveto
428.94244 331.08932 lineto
420.50494 331.08932 lineto
420.50494 328.48776 lineto
420.50494 318.85495 lineto
420.50492 316.58934 420.45023 315.02684 420.34088 314.16745 curveto
420.24711 313.30809 420.07523 312.67528 419.82526 312.26901 curveto
419.49711 311.72216 419.0518 311.30028 418.48932 311.00339 curveto
417.9268 310.69091 417.28618 310.53466 416.56744 310.53464 curveto
414.81743 310.53466 413.44243 311.21434 412.44244 312.5737 curveto
411.44243 313.91747 410.94243 315.78465 410.94244 318.17526 curveto
410.94244 331.08932 lineto
402.55182 331.08932 lineto
402.55182 304.83932 lineto
410.94244 304.83932 lineto
410.94244 308.68307 lineto
412.20806 307.15185 413.5518 306.02685 414.97369 305.30807 curveto
416.39555 304.57373 417.96586 304.20654 419.68463 304.20651 curveto
422.71586 304.20654 425.01273 305.13623 426.57526 306.99557 curveto
428.15335 308.85497 428.94241 311.55809 428.94244 315.10495 curveto
454.04401 294.62057 moveto
454.04401 300.12839 lineto
449.40338 300.12839 lineto
448.21587 300.12842 447.38774 300.34717 446.91901 300.78464 curveto
446.45024 301.20654 446.21587 301.94873 446.21588 303.0112 curveto
446.21588 304.83932 lineto
453.38776 304.83932 lineto
453.38776 310.83932 lineto
446.21588 310.83932 lineto
446.21588 331.08932 lineto
437.82526 331.08932 lineto
437.82526 310.83932 lineto
433.65338 310.83932 lineto
433.65338 304.83932 lineto
437.82526 304.83932 lineto
437.82526 303.0112 lineto
437.82525 300.15186 438.62213 298.04248 440.21588 296.68307 curveto
441.80962 295.30811 444.27837 294.62061 447.62213 294.62057 curveto
454.04401 294.62057 lineto
456.85651 296.09714 moveto
483.22369 296.09714 lineto
483.22369 301.18307 lineto
469.58307 331.08932 lineto
460.79401 331.08932 lineto
473.70807 302.72995 lineto
456.85651 302.72995 lineto
456.85651 296.09714 lineto
fill
grestore
grestore
showpage
%%EOF
