<?xml version="1.0" encoding="UTF-8" standalone="no"?>
<!-- Created with Inkscape (http://www.inkscape.org/) -->
<svg
   xmlns:dc="http://purl.org/dc/elements/1.1/"
   xmlns:cc="http://creativecommons.org/ns#"
   xmlns:rdf="http://www.w3.org/1999/02/22-rdf-syntax-ns#"
   xmlns:svg="http://www.w3.org/2000/svg"
   xmlns="http://www.w3.org/2000/svg"
   xmlns:sodipodi="http://sodipodi.sourceforge.net/DTD/sodipodi-0.dtd"
   xmlns:inkscape="http://www.inkscape.org/namespaces/inkscape"
   width="166.92198"
   height="44.062721"
   id="svg3618"
   sodipodi:version="0.32"
   inkscape:version="0.46"
   version="1.0"
   sodipodi:docname="bytemark.svg"
   inkscape:output_extension="org.inkscape.output.svg.inkscape">
  <defs
     id="defs3620">
    <inkscape:perspective
       sodipodi:type="inkscape:persp3d"
       inkscape:vp_x="0 : 526.18109 : 1"
       inkscape:vp_y="0 : 1000 : 0"
       inkscape:vp_z="744.09448 : 526.18109 : 1"
       inkscape:persp3d-origin="372.04724 : 350.78739 : 1"
       id="perspective3626" />
  </defs>
  <sodipodi:namedview
     id="base"
     pagecolor="#ffffff"
     bordercolor="#666666"
     borderopacity="1.0"
     gridtolerance="10000"
     guidetolerance="10"
     objecttolerance="10"
     inkscape:pageopacity="0.0"
     inkscape:pageshadow="2"
     inkscape:zoom="3.2709892"
     inkscape:cx="83.460991"
     inkscape:cy="22.031361"
     inkscape:document-units="px"
     inkscape:current-layer="layer1"
     showgrid="false"
     inkscape:window-width="640"
     inkscape:window-height="666"
     inkscape:window-x="510"
     inkscape:window-y="63" />
  <metadata
     id="metadata3623">
    <rdf:RDF>
      <cc:Work
         rdf:about="">
        <dc:format>image/svg+xml</dc:format>
        <dc:type
           rdf:resource="http://purl.org/dc/dcmitype/StillImage" />
      </cc:Work>
    </rdf:RDF>
  </metadata>
  <g
     inkscape:label="Layer 1"
     inkscape:groupmode="layer"
     id="layer1"
     transform="translate(-279.68187,-430.33082)">
    <g
       id="g3553"
       transform="translate(-280.50035,-333.54484)">
      <path
         style="font-size:29.59964752px;font-style:normal;font-variant:normal;font-weight:normal;font-stretch:normal;text-align:start;line-height:125%;writing-mode:lr-tb;text-anchor:start;fill:#005aa6;fill-opacity:1;stroke:none;stroke-width:1px;stroke-linecap:butt;stroke-linejoin:miter;stroke-opacity:1;font-family:Arial Black"
         id="text3543"
         d="M 560.18222,766.96767 L 566.46926,766.96767 L 566.46926,772.86447 L 560.18222,772.86447 L 560.18222,766.96767 M 560.18222,776.4199 L 566.46926,776.4199 L 566.46926,782.3167 L 560.18222,782.3167 L 560.18222,776.4199 M 570.45827,763.87566 L 582.71438,763.87566 C 584.75704,763.87568 586.32278,764.38153 587.41159,765.39322 C 588.50999,766.40494 589.0592,767.65753 589.05922,769.15099 C 589.0592,770.40359 588.66897,771.47793 587.88853,772.374 C 587.36821,772.9714 586.60702,773.44353 585.60497,773.79039 C 587.12733,774.15654 588.24502,774.78765 588.95805,775.68372 C 589.68068,776.57018 590.042,777.68787 590.04202,779.03681 C 590.042,780.13524 589.78667,781.12285 589.27602,781.99966 C 588.76533,782.87648 588.06677,783.57022 587.18034,784.08089 C 586.63111,784.39885 585.80247,784.6301 584.69443,784.77463 C 583.22021,784.96734 582.24223,785.06369 581.76048,785.06369 L 570.45827,785.06369 L 570.45827,763.87566 M 577.06327,772.18611 L 579.9105,772.18611 C 580.93183,772.18612 581.64003,772.01269 582.03509,771.6658 C 582.43976,771.30931 582.6421,770.79864 582.64211,770.13379 C 582.6421,769.51714 582.43976,769.03538 582.03509,768.68849 C 581.64003,768.34164 580.94629,768.1682 579.95386,768.16819 L 577.06327,768.16819 L 577.06327,772.18611 M 577.06327,780.51101 L 580.4019,780.51101 C 581.52922,780.51101 582.32413,780.31349 582.78664,779.91844 C 583.24912,779.51376 583.48037,778.97418 583.48038,778.29971 C 583.48037,777.67342 583.24912,777.17238 582.78664,776.7966 C 582.33377,776.4112 581.53404,776.21849 580.38745,776.21848 L 577.06327,776.21848 L 577.06327,780.51101 M 585.27051,763.87566 L 592.54035,763.87566 L 596.81842,771.02987 L 601.0965,763.87566 L 608.32297,763.87566 L 600.08479,776.18958 L 600.08479,785.06369 L 593.52315,785.06369 L 593.52315,776.18958 L 585.27051,763.87566 M 603.43602,763.87566 L 623.33774,763.87566 L 623.33774,769.10763 L 616.66047,769.10763 L 616.66047,785.06369 L 610.11329,785.06369 L 610.11329,769.10763 L 603.43602,769.10763 L 603.43602,763.87566 M 623.00421,763.87566 L 640.55009,763.87566 L 640.55009,768.39943 L 629.56585,768.39943 L 629.56585,771.76697 L 639.75518,771.76697 L 639.75518,776.0884 L 629.56585,776.0884 L 629.56585,780.26531 L 640.86806,780.26531 L 640.86806,785.06369 L 623.00421,785.06369 L 623.00421,763.87566 M 641.04038,763.87566 L 649.65434,763.87566 L 652.97852,776.76769 L 656.28824,763.87566 L 664.8733,763.87566 L 664.8733,785.06369 L 659.5257,785.06369 L 659.5257,768.90529 L 655.37771,785.06369 L 650.53597,785.06369 L 646.40242,768.90529 L 646.40242,785.06369 L 641.04038,785.06369 L 641.04038,763.87566 M 679.87472,781.56607 L 672.417,781.56607 L 671.39084,785.06369 L 664.69912,785.06369 L 672.6627,763.87566 L 679.80246,763.87566 L 687.76603,785.06369 L 680.91533,785.06369 L 679.87472,781.56607 M 678.50169,776.98449 L 676.16031,769.36778 L 673.83339,776.98449 L 678.50169,776.98449 M 685.5388,785.06369 L 685.5388,763.87566 L 696.45078,763.87566 C 698.47418,763.87568 700.02064,764.04912 701.09018,764.39597 C 702.15968,764.74286 703.02203,765.38842 703.67725,766.33266 C 704.33243,767.2673 704.66003,768.40909 704.66006,769.75801 C 704.66003,770.93353 704.40952,771.95006 703.9085,772.80758 C 703.40745,773.6555 702.71852,774.34443 701.84173,774.87436 C 701.28286,775.2116 700.51686,775.49103 699.54371,775.71263 C 700.32415,775.97279 700.89263,776.23294 701.24916,776.49309 C 701.49002,776.66653 701.83689,777.03749 702.28977,777.60596 C 702.75225,778.17445 703.06058,778.61286 703.21476,778.92118 L 706.37996,785.06369 L 698.98004,785.06369 L 695.48243,778.58877 C 695.03919,777.7505 694.64415,777.20611 694.29729,776.95558 C 693.82515,776.62799 693.29039,776.46419 692.69301,776.46418 L 692.11489,776.46418 L 692.11489,785.06369 L 685.5388,785.06369 M 692.11489,772.46071 L 694.87541,772.46071 C 695.17409,772.46073 695.75221,772.36437 696.60976,772.17165 C 697.04334,772.08495 697.39502,771.86334 697.66483,771.50682 C 697.94423,771.15033 698.08395,770.74083 698.08396,770.27832 C 698.08395,769.59423 697.86715,769.0691 697.43358,768.70295 C 696.99998,768.33682 696.18579,768.15375 694.99103,768.15373 L 692.11489,768.15373 L 692.11489,772.46071 M 704.64431,763.87566 L 711.1915,763.87566 L 711.1915,771.8826 L 718.05665,763.87566 L 726.75733,763.87566 L 719.03945,771.86814 L 727.1042,785.06369 L 719.03945,785.06369 L 714.57349,776.34856 L 711.1915,779.88953 L 711.1915,785.06369 L 704.64431,785.06369 L 704.64431,763.87566" />
      <path
         style="font-size:27.48864174px;font-style:normal;font-variant:normal;font-weight:normal;font-stretch:normal;text-align:center;line-height:125%;writing-mode:lr-tb;text-anchor:middle;fill:#000000;fill-opacity:1;stroke:none;stroke-width:1px;stroke-linecap:butt;stroke-linejoin:miter;stroke-opacity:1;font-family:'Baby\'s World'"
         id="text3548"
         d="M 602.49408,787.50981 L 605.20537,787.50981 L 605.20537,795.72419 L 615.05725,795.72419 L 615.05725,787.50981 L 617.76853,787.50981 L 617.76853,807.54913 L 615.05725,807.54913 L 615.05725,798.00596 L 605.20537,798.00596 L 605.20537,807.54913 L 602.49408,807.54913 L 602.49408,787.50981 M 631.2981,789.34865 C 629.3295,789.34866 627.76358,790.08241 626.60033,791.54988 C 625.44602,793.01739 624.86887,795.0173 624.86887,797.5496 C 624.86887,800.07298 625.44602,802.06841 626.60033,803.5359 C 627.76358,805.00339 629.3295,805.73714 631.2981,805.73714 C 633.26668,805.73714 634.82365,805.00339 635.96902,803.5359 C 637.12331,802.06841 637.70047,800.07298 637.70048,797.5496 C 637.70047,795.0173 637.12331,793.01739 635.96902,791.54988 C 634.82365,790.08241 633.26668,789.34866 631.2981,789.34865 M 631.2981,787.14741 C 634.1078,787.14743 636.35378,788.09145 638.03604,789.97949 C 639.71827,791.85861 640.55939,794.38198 640.55941,797.5496 C 640.55939,800.7083 639.71827,803.23167 638.03604,805.11972 C 636.35378,806.99882 634.1078,807.93838 631.2981,807.93838 C 628.47943,807.93838 626.22451,806.99882 624.53332,805.11972 C 622.85107,803.24062 622.00994,800.71725 622.00995,797.5496 C 622.00994,794.38198 622.85107,791.85861 624.53332,789.97949 C 626.22451,788.09145 628.47943,787.14743 631.2981,787.14741 M 656.81368,788.16749 L 656.81368,790.81166 C 655.78463,790.31953 654.81376,789.95266 653.90107,789.71104 C 652.98835,789.46946 652.10696,789.34866 651.2569,789.34865 C 649.78045,789.34866 648.63956,789.635 647.83424,790.20767 C 647.03785,790.78036 646.63966,791.59464 646.63966,792.6505 C 646.63966,793.53638 646.90363,794.20749 647.43157,794.66383 C 647.96845,795.11125 648.97959,795.47365 650.46499,795.75103 L 652.10249,796.08658 C 654.12476,796.47136 655.61462,797.15142 656.57208,798.12676 C 657.53847,799.09316 658.02166,800.39064 658.02168,802.01919 C 658.02166,803.96094 657.36845,805.4329 656.06204,806.43509 C 654.76455,807.43728 652.8586,807.93838 650.34419,807.93838 C 649.39568,807.93838 648.38454,807.831 647.31077,807.61624 C 646.24594,807.40149 645.14085,807.08383 643.99549,806.66327 L 643.99549,803.87145 C 645.09611,804.48888 646.17436,804.95418 647.23024,805.26736 C 648.28611,805.58055 649.32409,805.73714 650.34419,805.73714 C 651.8922,805.73714 653.08678,805.4329 653.92791,804.82443 C 654.76902,804.21596 655.18958,803.34799 655.1896,802.22052 C 655.18958,801.23624 654.88535,800.4667 654.27689,799.91191 C 653.67735,799.35713 652.68859,798.94105 651.31059,798.66364 L 649.65966,798.34151 C 647.63737,797.93886 646.17436,797.30801 645.2706,796.44898 C 644.36684,795.58998 643.91496,794.3954 643.91496,792.86526 C 643.91496,791.09355 644.53685,789.69764 645.78064,788.67754 C 647.03338,787.65747 648.75589,787.14743 650.94819,787.14741 C 651.88773,787.14743 652.84518,787.23243 653.82053,787.40243 C 654.79587,787.57246 655.79358,787.82748 656.81368,788.16749 M 659.47128,787.50981 L 676.4235,787.50981 L 676.4235,789.79158 L 669.30974,789.79158 L 669.30974,807.54913 L 666.58504,807.54913 L 666.58504,789.79158 L 659.47128,789.79158 L 659.47128,787.50981 M 679.05425,787.50981 L 681.76553,787.50981 L 681.76553,807.54913 L 679.05425,807.54913 L 679.05425,787.50981 M 687.16125,787.50981 L 690.81209,787.50981 L 699.69758,804.27412 L 699.69758,787.50981 L 702.32832,787.50981 L 702.32832,807.54913 L 698.67749,807.54913 L 689.792,790.78482 L 689.792,807.54913 L 687.16125,807.54913 L 687.16125,787.50981 M 721.38783,804.69021 L 721.38783,799.30791 L 716.95851,799.30791 L 716.95851,797.07983 L 724.07227,797.07983 L 724.07227,805.68345 C 723.02532,806.42614 721.87101,806.98988 720.60934,807.37464 C 719.34764,807.75047 718.00095,807.93838 716.56926,807.93838 C 713.43741,807.93838 710.98563,807.02567 709.2139,805.20025 C 707.45112,803.36589 706.56973,800.81568 706.56973,797.5496 C 706.56973,794.2746 707.45112,791.72439 709.2139,789.89896 C 710.98563,788.06461 713.43741,787.14743 716.56926,787.14741 C 717.87568,787.14743 719.11499,787.30849 720.28721,787.63061 C 721.46835,787.95276 722.55554,788.42701 723.5488,789.05336 L 723.5488,791.93913 C 722.54659,791.08907 721.48177,790.44928 720.35432,790.01976 C 719.22684,789.59026 718.04122,789.37551 716.79744,789.37549 C 714.34565,789.37551 712.50233,790.06004 711.2675,791.42909 C 710.0416,792.79816 709.42866,794.83833 709.42866,797.5496 C 709.42866,800.25194 710.0416,802.28764 711.2675,803.6567 C 712.50233,805.02576 714.34565,805.7103 716.79744,805.71029 C 717.75488,805.7103 718.60942,805.62976 719.36108,805.46869 C 720.11271,805.29868 720.78829,805.03919 721.38783,804.69021" />
    </g>
  </g>
</svg>
