<?xml version="1.0" encoding="UTF-8" standalone="no"?>
<!-- Created with Inkscape (http://www.inkscape.org/) -->
<svg
   xmlns:dc="http://purl.org/dc/elements/1.1/"
   xmlns:cc="http://creativecommons.org/ns#"
   xmlns:rdf="http://www.w3.org/1999/02/22-rdf-syntax-ns#"
   xmlns:svg="http://www.w3.org/2000/svg"
   xmlns="http://www.w3.org/2000/svg"
   xmlns:sodipodi="http://sodipodi.sourceforge.net/DTD/sodipodi-0.dtd"
   xmlns:inkscape="http://www.inkscape.org/namespaces/inkscape"
   id="svg2"
   sodipodi:version="0.32"
   inkscape:version="0.46"
   width="228.57249"
   height="127.64439"
   xml:space="preserve"
   sodipodi:docname="fon.svg"
   version="1.0"
   inkscape:export-filename="/home/dam/work/debian/debconf/media.debconf.org/dc9/sponsorlogos/steel/fon.png"
   inkscape:export-xdpi="31.5"
   inkscape:export-ydpi="31.5"
   inkscape:output_extension="org.inkscape.output.svg.inkscape"><metadata
     id="metadata7"><rdf:RDF><cc:Work
         rdf:about=""><dc:format>image/svg+xml</dc:format><dc:type
           rdf:resource="http://purl.org/dc/dcmitype/StillImage" /></cc:Work></rdf:RDF></metadata><defs
     id="defs5"><inkscape:perspective
       sodipodi:type="inkscape:persp3d"
       inkscape:vp_x="0 : 526.18109 : 1"
       inkscape:vp_y="0 : 1000 : 0"
       inkscape:vp_z="744.09448 : 526.18109 : 1"
       inkscape:persp3d-origin="372.04724 : 350.78739 : 1"
       id="perspective9" /><clipPath
       clipPathUnits="userSpaceOnUse"
       id="clipPath19"><path
         d="M 0,1021.16 L 0,0 L 1828.58,0 L 1828.58,1021.16 L 0,1021.16 z"
         id="path21" /></clipPath></defs><sodipodi:namedview
     inkscape:cy="417.84947"
     inkscape:cx="305.25953"
     inkscape:zoom="0.43415836"
     inkscape:window-height="711"
     inkscape:window-width="659"
     inkscape:pageshadow="2"
     inkscape:pageopacity="0.0"
     guidetolerance="10.0"
     gridtolerance="10.0"
     objecttolerance="10.0"
     borderopacity="1.0"
     bordercolor="#666666"
     pagecolor="#ffffff"
     id="base"
     showgrid="false"
     inkscape:window-x="1280"
     inkscape:window-y="48"
     inkscape:current-layer="g11" /><g
     id="g11"
     inkscape:groupmode="layer"
     inkscape:label="fon"
     transform="matrix(1.25,0,0,-1.25,0,127.645)"><g
       id="g17"
       clip-path="url(#clipPath19)"
       transform="scale(0.1,0.1)"><path
         d="M 957.055,258.137 C 954.34,258.195 951.52,258.344 948.891,258.449 C 859.438,263.676 788.969,338.273 789.957,428.898 C 790.895,522.23 867.301,597.074 960.699,596.047 C 1021.96,595.383 1075.16,562.238 1104.31,513.117 C 1119.59,487.336 1128.16,457.297 1127.85,425.285 C 1126.88,332.016 1050.36,257.141 957.055,258.137 z M 1614.23,825.492 C 1529.18,826.371 1467.32,789.32 1430,722.863 L 1427.84,722.863 C 1421.03,789.73 1395.49,827.824 1329.82,828.52 C 1256.47,829.309 1222.72,792.992 1221.96,724.035 L 1221.26,658.168 C 1158.09,729.926 1065.76,775.668 962.582,776.77 C 846.363,777.941 742.789,722.289 678.277,635.629 C 670.512,637.316 662.438,638.273 653.969,638.332 L 575.777,639.211 C 554.867,639.418 537.281,647.043 522.926,662.121 C 508.617,677.238 501.605,694.738 501.871,714.68 C 502.035,734.66 509.41,751.672 524.008,765.969 C 538.676,780.297 556.41,787.395 577.289,787.172 L 599.828,786.879 C 631.801,786.527 659.32,797.68 682.445,820.422 C 705.648,843.137 717.359,870.539 717.711,902.395 C 718.031,934.34 706.84,961.625 684.137,984.281 C 661.539,1007.04 634.281,1018.56 602.457,1018.91 L 388.57,1021.16 C 357.602,1021.47 330.641,1010.55 307.438,988.305 C 284.254,966.145 272.602,939.125 272.191,907.258 L 269.984,700.531 C 265.004,687.543 258.277,675.637 247.816,665.121 C 233.199,650.336 215.492,642.992 194.594,643.285 L 116.344,644.047 C 84.5156,644.418 57.2617,633.469 34.5742,611.281 C 11.8906,589.113 0.386719,562.094 0.00390625,530.238 C -0.25,498.41 10.668,471.066 32.7969,448.324 C 55.0156,425.754 82.0469,414.25 113.902,413.898 L 192.113,413.137 C 213.051,412.883 230.668,405.199 244.965,390.023 C 255.25,379.223 261.625,367.102 266.312,353.566 L 263.754,116.293 C 263.551,84.5156 274.41,57.1797 296.605,34.4375 C 318.668,11.75 345.727,0.328125 377.641,0.0117188 C 409.469,-0.308594 437.047,10.5312 460.199,32.7773 C 483.266,54.875 495.113,82.0156 495.465,114.016 L 497.758,334.953 C 498.031,354.965 505.426,372.289 520.016,387.141 C 534.633,401.867 552.359,409.211 573.336,409.008 L 609.789,408.578 C 619.223,225.785 769.457,79.457 955.18,77.4727 C 984.781,77.1797 1013.63,80.5898 1041.15,87.1719 C 1135.44,109.973 1215.08,171.008 1262.2,253.188 C 1266.05,249.367 1270.44,246.137 1275.07,243.227 C 1290.94,233.324 1310.81,228.371 1333.23,228.059 C 1378.19,227.59 1413.36,246.34 1426.85,287.082 C 1435.06,302.688 1439.78,322.113 1440.01,345.383 L 1442.11,542.727 C 1442.11,546.164 1442.37,549.406 1442.49,552.719 C 1445.76,613.664 1473,652.309 1525.25,651.809 C 1580.11,651.234 1606.73,617.512 1606.12,556.066 L 1603.78,343.695 C 1603.09,268.266 1648.95,233.324 1713.66,232.602 C 1716.95,232.602 1720.3,232.688 1723.53,232.824 C 1782.96,235.598 1825.12,269.848 1825.89,341.332 L 1828.56,605.402 C 1829.97,728.285 1768.49,823.801 1614.23,825.492"
         style="fill:#f9a22c;fill-opacity:1;fill-rule:nonzero;stroke:none"
         id="path23" /></g></g></svg>