%!PS-Adobe-3.0 EPSF-3.0
%%Creator: xpdf/pdftops 1.00
%%LanguageLevel: 2
%%BoundingBox: 0 0 218 136
%%DocumentSuppliedResources: (atend)
%%EndComments
%%BeginProlog
%%BeginResource: procset xpdf 1.00 0
/xpdf 75 dict def xpdf begin
% PDF special state
/pdfDictSize 14 def
/pdfSetup {
  3 1 roll 2 array astore
  /setpagedevice where {
    pop 3 dict begin
      /PageSize exch def
      /ImagingBBox null def
      /Policies 1 dict dup begin /PageSize 3 def end def
      /Duplex exch def
    currentdict end setpagedevice
  } {
    pop
  } ifelse
} def
/pdfStartPage {
  pdfDictSize dict begin
  /pdfFill [0] def
  /pdfStroke [0] def
  /pdfLastFill false def
  /pdfLastStroke false def
  /pdfTextMat [1 0 0 1 0 0] def
  /pdfFontSize 0 def
  /pdfCharSpacing 0 def
  /pdfTextRender 0 def
  /pdfTextRise 0 def
  /pdfWordSpacing 0 def
  /pdfHorizScaling 1 def
} def
/pdfEndPage { end } def
% separation convention operators
/findcmykcustomcolor where {
  pop
}{
  /findcmykcustomcolor { 5 array astore } def
} ifelse
/setcustomcolor where {
  pop
}{
  /setcustomcolor {
    exch
    [ exch /Separation exch dup 4 get exch /DeviceCMYK exch
      0 4 getinterval cvx
      [ exch /dup load exch { mul exch dup } /forall load
        /pop load dup ] cvx
    ] setcolorspace setcolor
  } def
} ifelse
/customcolorimage where {
  pop
}{
  /customcolorimage {
    gsave
    [ exch /Separation exch dup 4 get exch /DeviceCMYK exch
      0 4 getinterval cvx
      [ exch /dup load exch { mul exch dup } /forall load
        /pop load dup ] cvx
    ] setcolorspace
    10 dict begin
      /ImageType 1 def
      /DataSource exch def
      /ImageMatrix exch def
      /BitsPerComponent exch def
      /Height exch def
      /Width exch def
      /Decode [1 0] def
    currentdict end
    image
    grestore
  } def
} ifelse
% PDF color state
/sCol {
  pdfLastStroke not {
    pdfStroke aload length
    dup 1 eq {
      pop setgray
    }{
      dup 3 eq {
        pop setrgbcolor
      }{
        4 eq {
          setcmykcolor
        }{
          findcmykcustomcolor exch setcustomcolor
        } ifelse
      } ifelse
    } ifelse
    /pdfLastStroke true def /pdfLastFill false def
  } if
} def
/fCol {
  pdfLastFill not {
    pdfFill aload length
    dup 1 eq {
      pop setgray
    }{
      dup 3 eq {
        pop setrgbcolor
      }{
        4 eq {
          setcmykcolor
        }{
          findcmykcustomcolor exch setcustomcolor
        } ifelse
      } ifelse
    } ifelse
    /pdfLastFill true def /pdfLastStroke false def
  } if
} def
% build a font
/pdfMakeFont {
  4 3 roll findfont
  4 2 roll matrix scale makefont
  dup length dict begin
    { 1 index /FID ne { def } { pop pop } ifelse } forall
    /Encoding exch def
    currentdict
  end
  definefont pop
} def
/pdfMakeFont16 { findfont definefont pop } def
% graphics state operators
/q { gsave pdfDictSize dict begin } def
/Q { end grestore } def
/cm { concat } def
/d { setdash } def
/i { setflat } def
/j { setlinejoin } def
/J { setlinecap } def
/M { setmiterlimit } def
/w { setlinewidth } def
% color operators
/g { dup 1 array astore /pdfFill exch def setgray
     /pdfLastFill true def /pdfLastStroke false def } def
/G { dup 1 array astore /pdfStroke exch def setgray
     /pdfLastStroke true def /pdfLastFill false def } def
/rg { 3 copy 3 array astore /pdfFill exch def setrgbcolor
      /pdfLastFill true def /pdfLastStroke false def } def
/RG { 3 copy 3 array astore /pdfStroke exch def setrgbcolor
      /pdfLastStroke true def /pdfLastFill false def } def
/k { 4 copy 4 array astore /pdfFill exch def setcmykcolor
     /pdfLastFill true def /pdfLastStroke false def } def
/K { 4 copy 4 array astore /pdfStroke exch def setcmykcolor
     /pdfLastStroke true def /pdfLastFill false def } def
/ck { 6 copy 6 array astore /pdfFill exch def
      findcmykcustomcolor exch setcustomcolor
      /pdfLastFill true def /pdfLastStroke false def } def
/CK { 6 copy 6 array astore /pdfStroke exch def
      findcmykcustomcolor exch setcustomcolor
      /pdfLastStroke true def /pdfLastFill false def } def
% path segment operators
/m { moveto } def
/l { lineto } def
/c { curveto } def
/re { 4 2 roll moveto 1 index 0 rlineto 0 exch rlineto
      neg 0 rlineto closepath } def
/h { closepath } def
% path painting operators
/S { sCol stroke } def
/f { fCol fill } def
/f* { fCol eofill } def
% clipping operators
/W { clip newpath } def
/W* { eoclip newpath } def
% text state operators
/Tc { /pdfCharSpacing exch def } def
/Tf { dup /pdfFontSize exch def
      dup pdfHorizScaling mul exch matrix scale
      pdfTextMat matrix concatmatrix dup 4 0 put dup 5 0 put
      exch findfont exch makefont setfont } def
/Tr { /pdfTextRender exch def } def
/Ts { /pdfTextRise exch def } def
/Tw { /pdfWordSpacing exch def } def
/Tz { /pdfHorizScaling exch def } def
% text positioning operators
/Td { pdfTextMat transform moveto } def
/Tm { /pdfTextMat exch def } def
% text string operators
/Tj { pdfTextRender 1 and 0 eq { fCol } { sCol } ifelse
      0 pdfTextRise pdfTextMat dtransform rmoveto
      1 index stringwidth pdfTextMat idtransform pop
      sub 1 index length dup 0 ne { div } { pop pop 0 } ifelse
      pdfWordSpacing pdfHorizScaling mul 0 pdfTextMat dtransform 32
      4 3 roll pdfCharSpacing pdfHorizScaling mul add 0
      pdfTextMat dtransform
      6 5 roll awidthshow
      0 pdfTextRise neg pdfTextMat dtransform rmoveto } def
/TJm { pdfFontSize 0.001 mul mul neg 0
       pdfTextMat dtransform rmoveto } def
% Level 1 image operators
/pdfIm1 {
  /pdfImBuf1 4 index string def
  { currentfile pdfImBuf1 readhexstring pop } image
} def
/pdfIm1Sep {
  /pdfImBuf1 4 index string def
  /pdfImBuf2 4 index string def
  /pdfImBuf3 4 index string def
  /pdfImBuf4 4 index string def
  { currentfile pdfImBuf1 readhexstring pop }
  { currentfile pdfImBuf2 readhexstring pop }
  { currentfile pdfImBuf3 readhexstring pop }
  { currentfile pdfImBuf4 readhexstring pop }
  true 4 colorimage
} def
/pdfImM1 {
  /pdfImBuf1 4 index 7 add 8 idiv string def
  { currentfile pdfImBuf1 readhexstring pop } imagemask
} def
% Level 2 image operators
/pdfImBuf 100 string def
/pdfIm {
  image
  { currentfile pdfImBuf readline
    not { pop exit } if
    (%-EOD-) eq { exit } if } loop
} def
/pdfImSep {
  findcmykcustomcolor exch
  dup /Width get /pdfImBuf1 exch string def
  begin Width Height BitsPerComponent ImageMatrix DataSource end
  /pdfImData exch def
  { pdfImData pdfImBuf1 readstring pop
    0 1 2 index length 1 sub {
      1 index exch 2 copy get 255 exch sub put
    } for }
  6 5 roll customcolorimage
  { currentfile pdfImBuf readline
    not { pop exit } if
    (%-EOD-) eq { exit } if } loop
} def
/pdfImM {
  fCol imagemask
  { currentfile pdfImBuf readline
    not { pop exit } if
    (%-EOD-) eq { exit } if } loop
} def
end
%%EndResource
%%EndProlog
%%BeginSetup
xpdf begin
%%EndSetup
pdfStartPage
[] 0 d
0 i
0 j
0 J
10 M
1 w
0 g
0 G
[0.1 0 0 0.1 0 0] cm
q
Q
q
0 1359.93 m
0 0 l
2175.61 0 l
2175.61 1359.93 l
W
1 i
62.482 w
4 M
1 J
1 j
1 G
641.924 1251.78 m
861.641 1252.24 1108.43 1115.75 1096.28 869.627 c
1083.25 605.476 1082.76 1129.27 669.468 1129.27 c
407.686 1129.27 216.573 874.998 216.573 644.217 c
216.573 342.84 404.336 54.95 802.051 54.95 c
1242.86 54.95 1427.83 337.18 1427.83 337.18 c
1427.83 337.18 1263.48 31.24 801.998 31.24 c
340.528 31.24 182.125 375.603 182.125 640.779 c
182.125 905.955 417.559 1140.14 607.842 1195.46 c
773.677 1243.66 77.8955 1312.38 77.8955 645.974 c
77.8955 461.697 134.048 315.34 134.048 315.34 c
134.048 315.34 56.8994 471.941 56.8701 645.984 c
56.8506 874.373 158.682 1250.78 641.924 1251.78 c
h
S
0 0 1 rg
641.924 1251.78 m
861.641 1252.24 1108.43 1115.75 1096.28 869.627 c
1083.25 605.476 1082.76 1129.27 669.468 1129.27 c
407.686 1129.27 216.573 874.998 216.573 644.217 c
216.573 342.84 404.336 54.95 802.051 54.95 c
1242.86 54.95 1427.83 337.18 1427.83 337.18 c
1427.83 337.18 1263.48 31.24 801.998 31.24 c
340.528 31.24 182.125 375.603 182.125 640.779 c
182.125 905.955 417.559 1140.14 607.842 1195.46 c
773.677 1243.66 77.8955 1312.38 77.8955 645.974 c
77.8955 461.697 134.048 315.34 134.048 315.34 c
134.048 315.34 56.8994 471.941 56.8701 645.984 c
56.8506 874.373 158.682 1250.78 641.924 1251.78 c
f
1 g
1558.61 1167.64 m
1535.76 1179.07 1522.99 1182.44 1507.53 1182.45 c
1468.54 1182.47 1445.67 1155.59 1441.61 1097.11 c
1500.1 1097.08 l
1490.64 1029.86 l
1431.49 1029.89 l
1378.87 658.181 l
1288.12 658.22 l
1340.74 1029.94 l
1278.9 1029.97 l
1288.34 1097.19 l
1350.86 1097.16 l
1363.02 1209.41 1424.88 1256.44 1495.47 1256.4 c
1519.67 1256.39 1541.85 1251.67 1568.73 1240.9 c
1558.61 1167.64 l
f
1634.52 1062.73 m
1671.5 1090.95 1701.76 1102.36 1738.73 1102.34 c
1809.32 1102.3 1828.11 1043.14 1819.34 980.623 c
1793.03 791.746 l
1702.28 791.785 l
1727.91 973.953 l
1731.96 1003.52 1725.25 1035.12 1701.05 1035.14 c
1680.22 1035.14 1655.33 1021.04 1624.39 988.123 c
1596.74 791.844 l
1505.99 791.892 l
1549.16 1097.06 l
1639.91 1097.01 l
1634.52 1062.73 l
f
1979.37 1065.92 m
2010.98 1092.79 2033.16 1102.19 2062.07 1102.18 c
2127.28 1102.15 2175.64 1043.64 2175.61 964.988 c
2175.57 879.617 2118.38 785.535 1979.23 785.603 c
1922.09 785.633 1876.38 791.033 1850.84 795.75 c
1914.92 1250.14 l
2005.67 1250.1 l
1979.37 1065.92 l
h
1950.36 861.58 m
2042.45 848.758 2080.78 891.092 2080.82 961.004 c
2080.84 1002.01 2060.68 1028.24 2029.09 1028.25 c
2007.58 1028.26 1991.45 1018.85 1969.25 991.98 c
1950.36 861.58 l
f
0.043 0.071 1 rg
1558.61 1167.64 m
1535.76 1179.07 1522.99 1182.44 1507.53 1182.45 c
1468.54 1182.47 1445.67 1155.59 1441.61 1097.11 c
1500.1 1097.08 l
1490.64 1029.86 l
1431.49 1029.89 l
1378.87 658.181 l
1288.12 658.22 l
1340.74 1029.94 l
1278.9 1029.97 l
1288.34 1097.19 l
1350.86 1097.16 l
1363.02 1209.41 1424.88 1256.44 1495.47 1256.4 c
1519.67 1256.39 1541.85 1251.67 1568.73 1240.9 c
1558.61 1167.64 l
f
1634.52 1062.73 m
1671.5 1090.95 1701.76 1102.36 1738.73 1102.34 c
1809.32 1102.3 1828.11 1043.14 1819.34 980.623 c
1793.03 791.746 l
1702.28 791.785 l
1727.91 973.953 l
1731.96 1003.52 1725.25 1035.12 1701.05 1035.14 c
1680.22 1035.14 1655.33 1021.04 1624.39 988.123 c
1596.74 791.844 l
1505.99 791.892 l
1549.16 1097.06 l
1639.91 1097.01 l
1634.52 1062.73 l
f
1979.37 1065.92 m
2010.98 1092.79 2033.16 1102.19 2062.07 1102.18 c
2127.28 1102.15 2175.64 1043.64 2175.61 964.988 c
2175.57 879.617 2118.38 785.535 1979.23 785.603 c
1922.09 785.633 1876.38 791.033 1850.84 795.75 c
1914.92 1250.14 l
2005.67 1250.1 l
1979.37 1065.92 l
h
1950.36 861.58 m
2042.45 848.758 2080.78 891.092 2080.82 961.004 c
2080.84 1002.01 2060.68 1028.24 2029.09 1028.25 c
2007.58 1028.26 1991.45 1018.85 1969.25 991.98 c
1950.36 861.58 l
f
641.641 595.642 m
578.599 596.658 718.306 430.916 887.911 435.72 c
1057.52 440.525 1196.72 574.89 1192.23 839.226 c
1187.76 1103.56 946.27 1328.69 665.962 1328.69 c
34.4092 1328.69 31.2402 753.933 31.2402 753.933 c
31.2402 753.933 82.9053 1281.06 662.955 1281.06 c
929.229 1281.06 1125.48 1071.6 1129 844.607 c
1133.18 574.158 900.503 457.019 860.064 519.539 c
834.341 559.304 1035.46 506.424 1035.46 809.519 c
1035.46 981.59 843.687 1095.67 678.746 1095.67 c
512.896 1095.67 246.729 961.697 246.729 620.203 c
246.729 278.71 552.618 76.0801 836.597 82.3 c
1335.76 93.22 1498.68 569.392 1498.68 569.392 c
1498.68 569.392 1280.09 121.99 836.685 121.99 c
393.262 121.99 287.115 468.26 287.115 620.105 c
287.115 771.951 389.004 1040 672.979 1034.03 c
895.132 1029.35 958.287 870.974 958.287 807.185 c
958.287 745.545 949.288 596.707 806.275 596.707 c
663.257 596.707 719.747 594.373 641.641 595.642 c
h
S
0.408 0.749 1 rg
641.641 595.642 m
578.599 596.658 718.306 430.916 887.911 435.72 c
1057.52 440.525 1196.72 574.89 1192.23 839.226 c
1187.76 1103.56 946.27 1328.69 665.962 1328.69 c
34.4092 1328.69 31.2402 753.933 31.2402 753.933 c
31.2402 753.933 82.9053 1281.06 662.955 1281.06 c
929.229 1281.06 1125.48 1071.6 1129 844.607 c
1133.18 574.158 900.503 457.019 860.064 519.539 c
834.341 559.304 1035.46 506.424 1035.46 809.519 c
1035.46 981.59 843.687 1095.67 678.746 1095.67 c
512.896 1095.67 246.729 961.697 246.729 620.203 c
246.729 278.71 552.618 76.0801 836.597 82.3 c
1335.76 93.22 1498.68 569.392 1498.68 569.392 c
1498.68 569.392 1280.09 121.99 836.685 121.99 c
393.262 121.99 287.115 468.26 287.115 620.105 c
287.115 771.951 389.004 1040 672.979 1034.03 c
895.132 1029.35 958.287 870.974 958.287 807.185 c
958.287 745.545 949.288 596.707 806.275 596.707 c
663.257 596.707 719.747 594.373 641.641 595.642 c
f
0.043 0.071 1 rg
641.924 1251.78 m
861.641 1252.24 1108.43 1115.75 1096.28 869.627 c
1083.25 605.476 1082.76 1129.27 669.468 1129.27 c
407.686 1129.27 216.573 874.998 216.573 644.217 c
216.573 342.84 404.336 54.95 802.051 54.95 c
1242.86 54.95 1427.83 337.18 1427.83 337.18 c
1427.83 337.18 1263.48 31.24 801.998 31.24 c
340.528 31.24 182.125 375.603 182.125 640.779 c
182.125 905.955 417.559 1140.14 607.842 1195.46 c
773.677 1243.66 77.8955 1312.38 77.8955 645.974 c
77.8955 461.697 134.048 315.34 134.048 315.34 c
134.048 315.34 56.8994 471.941 56.8701 645.984 c
56.8506 874.373 158.682 1250.78 641.924 1251.78 c
f
Q
showpage
%%PageTrailer
pdfEndPage
%%Trailer
end
%%DocumentSuppliedResources:
%%EOF
