-----BEGIN PGP SIGNED MESSAGE-----
Hash: SHA1

SHA1 Fingerprint=68:B1:68:90:7E:7C:1F:CF:D0:AD:E2:A0:3E:79:16:FF:5B:31:5E:DC
MD5 Fingerprint=4D:42:C2:70:87:96:0B:5B:36:85:9E:07:86:90:F5:4B
-----BEGIN PGP SIGNATURE-----
Version: GnuPG v1.4.6 (GNU/Linux)
Comment: Joerg Jaspert <joerg@debian.org> -- Debian Developer

iD8DBQFINTrCcV7WoH57iskRAvoDAKCCIypr5vxwQnLHppuXuOFl5JfhVQCeKdSa
zDqG0jVqB/Y5djchUKNx45s=
=5Wxg
-----END PGP SIGNATURE-----
