<?xml version="1.0" encoding="UTF-8" standalone="no"?>
<!-- Created with Inkscape (http://www.inkscape.org/) -->
<svg
   xmlns:dc="http://purl.org/dc/elements/1.1/"
   xmlns:cc="http://creativecommons.org/ns#"
   xmlns:rdf="http://www.w3.org/1999/02/22-rdf-syntax-ns#"
   xmlns:svg="http://www.w3.org/2000/svg"
   xmlns="http://www.w3.org/2000/svg"
   xmlns:sodipodi="http://sodipodi.sourceforge.net/DTD/sodipodi-0.dtd"
   xmlns:inkscape="http://www.inkscape.org/namespaces/inkscape"
   id="svg2"
   sodipodi:version="0.32"
   inkscape:version="0.46"
   width="724"
   height="63"
   version="1.0"
   sodipodi:docname="ange.svg"
   style="display:inline"
   inkscape:output_extension="org.inkscape.output.svg.inkscape">
  <metadata
     id="metadata7">
    <rdf:RDF>
      <cc:Work
         rdf:about="">
        <dc:format>image/svg+xml</dc:format>
        <dc:type
           rdf:resource="http://purl.org/dc/dcmitype/StillImage" />
      </cc:Work>
    </rdf:RDF>
  </metadata>
  <defs
     id="defs5">
    <inkscape:perspective
       sodipodi:type="inkscape:persp3d"
       inkscape:vp_x="0 : 526.18109 : 1"
       inkscape:vp_y="0 : 1000 : 0"
       inkscape:vp_z="744.09448 : 526.18109 : 1"
       inkscape:persp3d-origin="372.04724 : 350.78739 : 1"
       id="perspective9" />
  </defs>
  <sodipodi:namedview
     inkscape:window-height="711"
     inkscape:window-width="1024"
     inkscape:pageshadow="2"
     inkscape:pageopacity="0.0"
     guidetolerance="10.0"
     gridtolerance="10.0"
     objecttolerance="10.0"
     borderopacity="1.0"
     bordercolor="#666666"
     pagecolor="#ffffff"
     id="base"
     showgrid="false"
     inkscape:zoom="1"
     inkscape:cx="397.02548"
     inkscape:cy="23.203902"
     inkscape:window-x="0"
     inkscape:window-y="42"
     inkscape:current-layer="layer2" />
  <g
     inkscape:groupmode="layer"
     id="layer2"
     inkscape:label="vector"
     style="opacity:1;display:inline">
    <path
       id="path2398"
       style="fill:#5a0016;fill-opacity:1;fill-rule:evenodd;stroke:none;stroke-width:5;stroke-linecap:round;stroke-linejoin:miter;stroke-miterlimit:4;stroke-dasharray:none;stroke-opacity:1"
       d="M 689.96875,-0.03125 C 689.06716,-0.044000724 688.22855,0.42968824 687.77403,1.2084321 C 687.31951,1.987176 687.31951,2.950324 687.77403,3.7290679 C 688.22855,4.5078118 689.06716,4.9815007 689.96875,4.96875 C 692.71117,4.9687501 690.60622,4.96875 692.78125,4.96875 C 693.0839,4.96875 693.8037,5.2071308 694.53125,5.75 C 695.2588,6.2928692 695.96439,7.0869372 696.3125,7.71875 C 697.37062,9.6391478 698.87637,12.909349 700,15.4375 C 701.17148,18.073413 703.19179,22.514059 707.15625,25.3125 C 709.15695,26.724764 711.37016,27.507233 712.90625,28.1875 C 713.56535,28.479389 713.98361,28.732951 714.25,28.90625 C 714.16997,30.359229 713.84375,31.58763 713.84375,33.40625 C 713.84373,34.989834 714.2868,36.352491 714.8125,38.15625 C 715.3382,39.960009 715.98935,41.897097 716.53125,43.375 C 717.51992,46.071408 718.35823,49.157463 718.8125,51.375 C 719.21393,53.33459 719.06844,55.632883 718.75,56.40625 C 718.34038,57.401082 718.09193,57.506599 717.25,57.75 C 715.8629,58.151011 714.4375,58.34375 714.4375,58.34375 C 713.06542,58.524968 712.10003,59.784168 712.28125,61.15625 C 712.46247,62.528332 713.72167,63.493718 715.09375,63.3125 C 715.09375,63.3125 716.80516,63.09765 718.65625,62.5625 C 720.5397,62.017993 722.46073,60.532928 723.375,58.3125 C 724.38048,55.870611 724.27303,53.080763 723.71875,50.375 C 723.2044,47.864221 722.31051,44.633824 721.21875,41.65625 C 720.72042,40.297163 720.11015,38.414629 719.625,36.75 C 719.13985,35.085371 718.84375,33.335729 718.84375,33.40625 C 718.84375,32.413989 719.31247,30.834207 719.3125,28.375 C 719.3125,26.851096 718.33561,25.703452 717.5,25.0625 C 716.66439,24.421548 715.79312,24.017756 714.90625,23.625 C 713.13251,22.839489 711.2458,22.107329 710.03125,21.25 C 707.56519,19.509255 705.66054,15.876922 704.5625,13.40625 C 703.41653,10.827819 701.922,7.5530222 700.6875,5.3125 C 699.93279,3.9427209 698.84704,2.7317968 697.53125,1.75 C 696.21546,0.76820318 694.65363,-0.031249929 692.78125,-0.03125 C 690.60622,-0.03125 692.71117,-0.031249917 689.96875,-0.03125 zM 672.96875,-0.03125 C 672.06716,-0.044000724 671.22855,0.42968824 670.77403,1.2084321 C 670.31951,1.987176 670.31951,2.950324 670.77403,3.7290679 C 671.22855,4.5078118 672.06716,4.9815007 672.96875,4.96875 C 675.71119,4.9687501 673.60622,4.96875 675.78125,4.96875 C 676.08386,4.96875 676.8037,5.2071268 677.53125,5.75 C 678.2588,6.2928732 678.9644,7.0869492 679.3125,7.71875 C 680.37061,9.6392032 681.87638,12.909371 683,15.4375 C 684.17149,18.073389 686.19178,22.514056 690.15625,25.3125 C 692.15696,26.724759 694.37017,27.507233 695.90625,28.1875 C 696.56535,28.479389 696.98361,28.732951 697.25,28.90625 C 697.16998,30.359213 696.84375,31.587612 696.84375,33.40625 C 696.84375,34.989793 697.2868,36.352492 697.8125,38.15625 C 698.3382,39.960008 698.98935,41.897092 699.53125,43.375 C 700.51993,46.07139 701.35822,49.157451 701.8125,51.375 C 702.21394,53.334566 702.06845,55.632869 701.75,56.40625 C 701.34032,57.401152 701.12316,57.506603 700.28125,57.75 C 698.89418,58.151007 697.4375,58.34375 697.4375,58.34375 C 696.06542,58.524968 695.10003,59.784168 695.28125,61.15625 C 695.46247,62.528332 696.72167,63.493718 698.09375,63.3125 C 698.09375,63.3125 699.80516,63.097654 701.65625,62.5625 C 703.53972,62.017989 705.4607,60.532858 706.375,58.3125 C 707.38047,55.870625 707.27306,53.080787 706.71875,50.375 C 706.20441,47.864233 705.31053,44.633842 704.21875,41.65625 C 703.72042,40.297168 703.11015,38.414631 702.625,36.75 C 702.13985,35.085369 701.84375,33.33577 701.84375,33.40625 C 701.84375,32.414009 702.31249,30.834231 702.3125,28.375 C 702.3125,26.851099 701.33561,25.703453 700.5,25.0625 C 699.66439,24.421547 698.79312,24.017756 697.90625,23.625 C 696.13252,22.839488 694.24581,22.107334 693.03125,21.25 C 690.5652,19.509258 688.66057,15.876945 687.5625,13.40625 C 686.41652,10.827797 684.92192,7.5529668 683.6875,5.3125 C 682.93278,3.9427089 681.84704,2.7317929 680.53125,1.75 C 679.21546,0.76820711 677.65363,-0.031249929 675.78125,-0.03125 C 673.60622,-0.03125 675.71119,-0.031249917 672.96875,-0.03125 z" />
    <path
       style="font-size:53.4406662px;font-style:normal;font-variant:normal;font-weight:normal;font-stretch:normal;text-align:start;line-height:125%;writing-mode:lr-tb;text-anchor:start;fill:#5a0016;fill-opacity:1;stroke:none;stroke-width:1px;stroke-linecap:butt;stroke-linejoin:miter;stroke-opacity:1;font-family:Good Times;-inkscape-font-specification:Good Times"
       d="M 48.920252,53.914082 L 40.74383,53.860641 L 34.598153,43.653474 L 17.283377,43.653474 L 21.131105,37.347475 L 30.803866,37.347475 L 24.444427,26.819664 L 7.9847014,53.860641 L -0.19172056,53.860641 L 19.634767,20.88775 C 20.133525,20.032733 20.828253,19.248937 21.718953,18.536361 C 22.787742,17.716973 23.749673,17.307262 24.604749,17.307225 C 25.531026,17.307262 26.492958,17.69916 27.490545,18.48292 C 28.345565,19.15987 29.040293,19.961479 29.574731,20.88775 L 48.920252,53.914082 M 88.442131,50.761082 C 88.442091,53.112472 87.640482,54.288166 86.037301,54.288166 C 84.86157,54.288166 83.543369,53.557811 82.082692,52.097099 L 58.67568,28.583206 L 58.67568,53.914082 L 52.369682,53.914082 L 52.369682,20.567106 C 52.369678,19.712089 52.601254,18.981734 53.06441,18.376039 C 53.527558,17.734787 54.186659,17.414143 55.041715,17.414107 C 56.217402,17.414143 57.428722,18.037617 58.67568,19.28453 L 82.082692,42.744982 L 82.082692,17.414107 L 88.442131,17.414107 L 88.442131,50.761082 M 137.80794,53.914082 L 114.61469,53.914082 C 109.30624,53.914082 104.90629,52.150541 101.41485,48.623456 C 97.959014,45.09638 96.231101,40.642996 96.231103,35.263289 C 96.231101,29.919246 97.9412,25.60837 101.36141,22.330648 C 104.81723,19.052989 109.23498,17.414143 114.61469,17.414107 L 135.24279,17.414107 L 135.24279,23.773546 L 114.61469,23.773546 C 111.12322,23.773576 108.23743,24.895829 105.9573,27.140308 C 103.71279,29.38484 102.59053,32.270633 102.59054,35.797696 C 102.59053,39.289167 103.71279,42.12152 105.9573,44.294762 C 108.23743,46.468023 111.12322,47.554649 114.61469,47.554642 L 131.4485,47.554642 L 131.4485,39.591983 L 114.13373,39.591983 L 114.13373,33.76695 L 137.80794,33.76695 L 137.80794,53.914082 M 173.40695,38.57661 L 152.56509,38.57661 L 152.56509,32.217171 L 173.40695,32.217171 L 173.40695,38.57661 M 175.06361,53.914082 L 143.53362,53.914082 L 143.53362,17.414107 L 175.06361,17.414107 L 175.06361,23.773546 L 149.89306,23.773546 L 149.89306,47.554642 L 175.06361,47.554642 L 175.06361,53.914082 M 245.1811,35.263289 C 245.18105,40.642996 243.45313,45.09638 239.99735,48.623456 C 236.54148,52.150541 232.14154,53.914082 226.79751,53.914082 L 216.59034,53.914082 C 211.28188,53.914082 206.88194,52.150541 203.39049,48.623456 C 199.93466,45.09638 198.20675,40.642996 198.20675,35.263289 C 198.20675,29.919246 199.91685,25.60837 203.33705,22.330648 C 206.79287,19.052989 211.21063,17.414143 216.59034,17.414107 L 226.79751,17.414107 C 232.21279,17.414143 236.63055,19.052989 240.05079,22.330648 C 243.47095,25.60837 245.18105,29.919246 245.1811,35.263289 M 238.8751,35.797696 C 238.87505,32.270633 237.73499,29.38484 235.45489,27.140308 C 233.21035,24.895829 230.32456,23.773576 226.79751,23.773546 L 216.59034,23.773546 C 213.09887,23.773576 210.21307,24.895829 207.93295,27.140308 C 205.68843,29.38484 204.56618,32.270633 204.56619,35.797696 C 204.56618,39.289167 205.68843,42.12152 207.93295,44.294762 C 210.21307,46.468023 213.09887,47.554649 216.59034,47.554642 L 226.79751,47.554642 C 230.32456,47.554649 233.21035,46.468023 235.45489,44.294762 C 237.73499,42.12152 238.87505,39.289167 238.8751,35.797696 M 290.54889,30.56051 C 290.54885,34.550766 289.08814,37.775017 286.16676,40.233271 C 283.45906,42.513418 280.05667,43.653484 275.95959,43.653474 L 259.87395,43.653474 L 259.87395,37.347475 L 276.97496,37.347475 C 279.07693,37.347492 280.84047,36.724018 282.26559,35.477052 C 283.69064,34.230123 284.40318,32.573464 284.40321,30.50707 C 284.40318,28.440723 283.69064,26.801877 282.26559,25.590528 C 280.84047,24.379236 279.07693,23.773576 276.97496,23.773546 L 256.1331,23.773546 L 256.1331,53.914082 L 249.77366,53.914082 L 249.77366,17.414107 L 275.95959,17.414107 C 280.05667,17.414143 283.45906,18.572023 286.16676,20.88775 C 289.08814,23.310424 290.54885,26.534674 290.54889,30.56051 M 328.00745,23.773546 L 313.63191,23.773546 L 313.63191,53.914082 L 307.32591,53.914082 L 307.32591,23.773546 L 292.89693,23.773546 L 292.89693,17.414107 L 328.00745,17.414107 L 328.00745,23.773546 M 339.72514,53.914082 L 333.3657,53.914082 L 333.3657,17.414107 L 339.72514,17.414107 L 339.72514,53.914082 M 402.82938,53.967522 L 395.66833,53.967522 L 390.37771,28.422884 L 378.1398,51.990218 C 377.32034,53.593438 376.18027,54.395047 374.71959,54.395048 C 373.08072,54.395047 371.83377,53.575624 370.97875,51.936777 L 358.74083,28.422884 L 353.50365,53.967522 L 346.28916,53.967522 L 354.46558,20.460225 C 354.67933,19.498327 355.14248,18.661091 355.85504,17.948513 C 356.60319,17.236008 357.45824,16.879737 358.42019,16.8797 C 359.80963,16.879737 361.12783,18.073244 362.3748,20.460225 L 374.55927,44.348202 L 386.79718,20.460225 C 388.04409,18.073244 389.36229,16.879737 390.75179,16.8797 C 391.67805,16.879737 392.5331,17.253821 393.31694,18.001954 C 393.99381,18.678904 394.45696,19.498327 394.7064,20.460225 L 402.82938,53.967522 M 417.06801,53.914082 L 410.70857,53.914082 L 410.70857,17.414107 L 417.06801,17.414107 L 417.06801,53.914082 M 463.12468,53.914082 L 429.02953,53.914082 C 426.28624,53.914082 424.9146,53.041218 424.9146,51.295489 C 424.9146,50.191052 425.5737,48.997545 426.8919,47.714964 L 450.77988,23.773546 L 424.00611,23.773546 L 424.00611,17.414107 L 457.56685,17.414107 C 458.67125,17.414143 459.61537,17.645719 460.3992,18.108835 C 461.32547,18.643277 461.78862,19.427073 461.78866,20.460225 C 461.78862,21.52907 461.25421,22.580069 460.18544,23.613224 L 436.29746,47.554642 L 463.12468,47.554642 L 463.12468,53.914082 M 515.48232,53.914082 L 507.3059,53.860641 L 501.16023,43.653474 L 483.84545,43.653474 L 487.69318,37.347475 L 497.36594,37.347475 L 491.0065,26.819664 L 474.54677,53.860641 L 466.37035,53.860641 L 486.19684,20.88775 C 486.6956,20.032733 487.39033,19.248937 488.28103,18.536361 C 489.34981,17.716973 490.31175,17.307262 491.16682,17.307225 C 492.0931,17.307262 493.05503,17.69916 494.05262,18.48292 C 494.90764,19.15987 495.60237,19.961479 496.1368,20.88775 L 515.48232,53.914082 M 541.03949,23.773546 L 526.66395,23.773546 L 526.66395,53.914082 L 520.35796,53.914082 L 520.35796,23.773546 L 505.92898,23.773546 L 505.92898,17.414107 L 541.03949,17.414107 L 541.03949,23.773546 M 552.75715,53.914082 L 546.39772,53.914082 L 546.39772,17.414107 L 552.75715,17.414107 L 552.75715,53.914082 M 607.47124,35.263289 C 607.47119,40.642996 605.74328,45.09638 602.2875,48.623456 C 598.83163,52.150541 594.43168,53.914082 589.08765,53.914082 L 578.88049,53.914082 C 573.57203,53.914082 569.17209,52.150541 565.68064,48.623456 C 562.22481,45.09638 560.49689,40.642996 560.4969,35.263289 C 560.49689,29.919246 562.20699,25.60837 565.6272,22.330648 C 569.08302,19.052989 573.50078,17.414143 578.88049,17.414107 L 589.08765,17.414107 C 594.50294,17.414143 598.92069,19.052989 602.34094,22.330648 C 605.76109,25.60837 607.47119,29.919246 607.47124,35.263289 M 601.16524,35.797696 C 601.1652,32.270633 600.02513,29.38484 597.74504,27.140308 C 595.50049,24.895829 592.6147,23.773576 589.08765,23.773546 L 578.88049,23.773546 C 575.38901,23.773576 572.50322,24.895829 570.2231,27.140308 C 567.97858,29.38484 566.85633,32.270633 566.85634,35.797696 C 566.85633,39.289167 567.97858,42.12152 570.2231,44.294762 C 572.50322,46.468023 575.38901,47.554649 578.88049,47.554642 L 589.08765,47.554642 C 592.6147,47.554649 595.50049,46.468023 597.74504,44.294762 C 600.02513,42.12152 601.1652,39.289167 601.16524,35.797696 M 649.15163,50.761082 C 649.15159,53.112472 648.34998,54.288166 646.7468,54.288166 C 645.57107,54.288166 644.25287,53.557811 642.79219,52.097099 L 619.38518,28.583206 L 619.38518,53.914082 L 613.07918,53.914082 L 613.07918,20.567106 C 613.07918,19.712089 613.31075,18.981734 613.77391,18.376039 C 614.23706,17.734787 614.89616,17.414143 615.75121,17.414107 C 616.9269,17.414143 618.13822,18.037617 619.38518,19.28453 L 642.79219,42.744982 L 642.79219,17.414107 L 649.15163,17.414107 L 649.15163,50.761082"
       id="text2384" />
  </g>
</svg>
