%!PS-Adobe-2.0 EPSF-1.2
%%Title: logo
%%Creator: Ghostscript ps2epsi from 
%%CreationDate: 2007-05-30 01:02 FINAL-logo-cs-grey.ps
%%For:freemadi freemadi
%%Pages: 1
%%DocumentFonts: NimbusSanL-Regu
%%BoundingBox: 0 0 101 101
%%EndComments

%%BeginProlog
%%BeginPreview: 101 101 8 303
% 99888888888888888888888888888888888888888888888888888888888888888888888888888888
% 88888888888888888888888888888888888888888888888888888888888888888888888888888888
% 8888888888888888888888888888888888888888bb
% 44000000000000000000000000000000000000000000000000000000000000000000000000000000
% 00000000000000000000000000000000000000000000000000000000000000000000000000000000
% 000000000000000000000000000000000000000088
% 44000000000000000000000000000000000000000000000000000000000000000000000000000000
% 00000000000000000000000000000000000000000000000000000000000000000000000000000000
% 000000000000000000000000000000000000000088
% 44000000000000000000000000000000000000000000000000000000000000000000000000000000
% 00000000000000000000000000000000000000000000000000000000000000000000000000000000
% 000000000000000000000000000000000000000088
% 44000000000000000000000000000000000000000000000000000000000000000000000000000000
% 00000000000000000000000000000000000000000000000000000000000000000000000000000000
% 000000000000000000000000000000000000000088
% 44000000000000000000000000000000000000000000000000000000000000000000000000000000
% 00000000000000000000000000000000000000000000000000000000000000000000000000000000
% 000000000000000000000000000000000000000088
% 44000000000000000000000000000000000000000000000000000000000000000000000000000000
% 00000000000000000000000000000000000000000000000000000000000000000000000000000000
% 000000000000000000000000000000000000000088
% 44000000000000000000000000000000000000000000000000000000000000000000000000000000
% 00000000000000000000000000000000000000000000000000000000000000000000000000000000
% 000000000000000000000000000000000000000088
% 44000000000000000000000000000000000000000000000000000000000000000000000000000000
% 00000000000000000000000000000000000000000000000000000000000000000000000000000000
% 000000000000000000000000000000000000000088
% 44000000000000000000000000000000000000000000000000000000000000000000000000000000
% 00000000000000000000000000000000000000000000000000000000000000000000000000000000
% 000000000000000000000000000000000000000088
% 44000000000000000000000000000000000000000000000000000000000000000000000000000000
% 00000000000000000000000000000000000000000000000000000000000000000000000000000000
% 000000000000000000000000000000000000000088
% 44000000000000000000000000000000000000000000000000000000000000000000000000000000
% 00000000000000000000000000000000000000000000000000000000000000000000000000000000
% 000000000000000000000000000000000000000088
% 44000000000000000000000000000000000000000000000000000000000000000000000000000000
% 00000000000000000000000000000000000000000000000000000000000000000000000000000000
% 000000000000000000000000000000000000000088
% 44000000000000000000000000000000000000000000000000000000000000000000000000000000
% 00000000000000000000000000000000000000000000000000000000000000000000000000000000
% 000000000000000000000000000000000000000088
% 44000000000000000000000000000000000000000000000000000000000000000000000000000000
% 00000000000000000000000000000000000000000000000000000000000000000000000000000000
% 000000000000000000000000000000000000000088
% 44000000000000000000000000000000000000000000000000000000000000000000000000000000
% 00000000000000000000000000000000000000000000000000000000000000000000000000000000
% 000000000000000000000000000000000000000088
% 44000000000000000000000000000000000000000000000000000000000000000000000000000000
% 00000000000000000000000000000000000000000000000000000000000000000000000000000000
% 000000000000000000000000000000000000000088
% 44000000000000000000000000000000000000000000000000000000000000000000000000000000
% 00000000000000000000000000000000000000000000000000000000000000000000000000000000
% 000000000000000000000000000000000000000088
% 44000000000000000000000000000000000000000000000000000000000000000000000000000000
% 00000000000000000000000000000000000000000000000000000000000000000000000000000000
% 000000000000000000000000000000000000000088
% 44000000000000000000000000000000000000000000000000000000000000000000000000000000
% 00000000000000000000000000000000000000000000000000000000000000000000000000000000
% 000000000000000000000000000000000000000088
% 44000000000000000000000000000000000000000000000000000000000000000000000000000000
% 00000000000000000000000000000000000000000000000000000000000000000000000000000000
% 000000000000000000000000000000000000000088
% 44000000000000000000000000000000000000000000000000000000000000000000000000000000
% 00000000000000000000000000000000000000000000000000000000000000000000000000000000
% 000000000000000000000000000000000000000088
% 44000000000000000000000000000000000000000000000000000000000000000000000000000000
% 00000000000000000000000000000000000000000000000000000000000000000000000000000000
% 000000000000000000000000000000000000000088
% 44000000000000000000000000000000000000000000000000000000000000000000000000000000
% 00000000000000000000000000000000000000000000000000000000000000000000000000000000
% 000000000000000000000000000000000000000088
% 44000000000000000000000000000000000000000000000000000000000000000000000000000000
% 00000000000000000000000000000000000000000000000000000000000000000000000000000000
% 000000000000000000000000000000000000000088
% 44000000000000000000000000000000000000000000000000000000000000000000000000000000
% 00000000000000000000000000000000000000000000000000000000000000000000000000000000
% 000000000000000000000000000000000000000088
% 44000000000000000000000000000000000000000000000000000000000000000000000000000000
% 00000000000000000000000000000000000000000000000000000000000000000000000000000000
% 000000000000000000000000000000000000000088
% 44000000000000000000000000000000000000000000000000000000000000000000000000000000
% 00000000000000000000000000000000000000000000000000000000000000000000000000000000
% 000000000000000000000000000000000000000088
% 44000000000000000000000000000000000000000000000000000000000000000000000000000000
% 00000000000000000000000000000000000000000000000000000000000000000000000000000000
% 000000000000000000000000000000000000000088
% 44000000000000000000000000000000000000000000000000000000000000000000000000000000
% 00000000000000000000000000000000000000000000000000000000000000000000000000000000
% 000000000000000000000000000000000000000088
% 44000000000000000000000000000000000000000000000000000000000000000000000000000000
% 00000000000000000000000000000000000000000000000000000000000000000000000000000000
% 000000000000000000000000000000000000000088
% 44000000000000000000000000000000000000000000000000000000000000000000000000000000
% 00000000000000000000000000000000000000000000000000000000000000000000000000000000
% 000000000000000000000000000000000000000088
% 44000000000000000000000000000000000000000000000000000000000000000000000000000000
% 00000000000000000000000000000000000000000000000000000000000000000000000000000000
% 000000000000000000000000000000000000000088
% 44000000000000000000000000000000000000000000000000000000000000000000000000000000
% 00000000000000000000000000000000000000000000000000000000000000000000000000000000
% 000000000000000000000000000000000000000088
% 44000000000000000000000000000000000000000000000000000000000000000000000000000000
% 00000000000000000000000000000000000000000000000000000000000000000000000000000000
% 000000000000000000000000000000000000000088
% 44000000000000000000000000000000000000000000000000000000000000000000000000000000
% 00000000000000000000000000000000000000000000000000000000000000000000000000000000
% 000000000000000000000000000000000000000088
% 44000000000000000000000000000000000000000000000000000000000000000000000000000000
% 00000000000000000000000000000000000000000000000000000000000000000000000000000000
% 000000000000000000000000000000000000000088
% 44000000000000000000000000000000000000000000000000000000000000000000000000000000
% 00000000000000000000000000000000000000000000000000000000000000000000000000000000
% 000000000000000000000000000000000000000088
% 4400000000559cd4d4c68d3800000000000000000000000000000000000000000000000000000000
% 0000000000000000000000000000000000000000000000000000388dd4d4c68d3800000000d47100
% 00000000000071d400000055c6d400000000000088
% 440000007fd4aa71718dc6d4460000000000000000000000000000000000000000000000d4710000
% 0000000000000000000000000000000000000000d47100000046d4b871717fc6d446000000d47100
% 000000000000559c000000b8aa380000d471000088
% 44000063d463000000001cb8c60000000000000000000000000000000000000000000000d4710000
% 0000000000000000000000000000000000000000d471000000b8b80e0000000eb8aa000000d47100
% 0000000000000000000000d471000000d471000088
% 440000c68d00000000000063d44600000000000000000000000000000000000000000000d4710000
% 0000000000000000000000000000000000000000d471000000d4710000000000559c000000d47100
% 0000000000000000000000d471000000d471000088
% 440038d44600000000000000000000002a8dd4d4b871000000559c0e7fc6d4b8630038d4d4d4d400
% 001c7fc6d4b8710000008dc61c00002ac67138d4d4d4d40000b8aa0e000000000000000000d48d8d
% d4d4b871000071d40038d4d4d4d438d4d4d4d40088
% 440071d400000000000000000000002ac6c671719cd47f000071d4aa713846aad4380e38d47f3800
% 1cc6d47f717fd47f00000eb8aa000eaaaa000e38d47f38000046d4c67f551c000000000000d4d49c
% 46469cd4550071d4000e38d47f380e38d47f380088
% 440071d400000000000000000000007fc62a0000007fd41c0071d4630000000ed4710000d4710000
% 7fd45500000046d42a000038d47f8dc61c000000d471000000001c639cd4d4b8710e000000d4b80e
% 00000ed4710071d4000000d471000000d471000088
% 440071d40000000000000000000000c67f000000001cd4630071d40e00000000d4710000d4710000
% c6c63838383838c66300000071d4d45500000000d47100000000000000003871c6aa0e0000d47100
% 000000d4710071d4000000d471000000d471000088
% 440038d4460000000000001c9c6300d4710000000000d4710071d40000000000d4710000d4710000
% d4d4d4d4d4d4d4d4710000000ed4c60e00000000d47100001c3800000000000038d4550000d47100
% 000000d4710071d4000000d471000000d471000088
% 440000c69c00000000000055d46300c67f000000001cd4630071d40000000000d4710000d4710000
% c6d4000000000000000000008daac67100000000d471000071d40e000000000000d4710000d47100
% 000000d4710071d4000000d471000000d471000088
% 44000071d471000000002ac6c60e008dc62a0000007fd42a0071d40000000000d4710000d4710000
% 7fd4630000002a9c46000055d42a46d438000000d47100002ad47f000000000063d4380000d47100
% 000000d4710071d4000000d471000000d471000088
% 440000007fd4b871717fd4d45500002ac6c671719cd47f000071d40000000000d4710000d48d2a00
% 1cc6d49c7171c6aa0e002ac67100009cc60e0000d48d2a00007fd4b8717171aad47f000000d47100
% 000000d4710071d4000000d471000000d48d2a0088
% 4400000000559cd4d4c68d38000000002a8dd4d4b87100000071d40000000000d471000071d4d400
% 001c7fc6d4c67f0e0000aaaa0000001cc68d000071d4d4000000468dd4d4d49c5500000000d47100
% 000000d4710071d4000000d47100000071d4d40088
% 44000000000000000000000000000000000000000000000000000000000000000000000000000000
% 00000000000000000000000000000000000000000000000000000000000000000000000000000000
% 000000000000000000000000000000000000000088
% 44000000000000000000000000000000000000000000000000000000000000000000000000000000
% 00000000000000000000000000000000000000000000000000000000000000000000000000000000
% 000000000000000000000000000000000000000088
% 44000000000000000000000000000000000000000000000000000000000000000000000000000000
% 00000000000000000000000000000000000000000000000000000000000000000000000000000000
% 000000000000000000000000000000000000000088
% 44000000000000000000000000000000000000000000000000000000000000000000000000000000
% 00000000000000000000000000000000000000000000000000000000000000000000000000000000
% 000000000000000000000000000000000000000088
% 44334444444444444444444444444444444444444444444444444444444444444444444444444444
% 44444444444444444444444444444444444444444444444444444444444444444444444444444444
% 444444444444444444444444444444444444442288
% 44000000000000000000000000000000000000000000000000000000000000000000000000000000
% 00000000000000000000000000000000000000000000000000000000000000000000000000000000
% 000000000000000000000000000000000000000088
% 44000000000000000000000000000000000000000000000000000000000000000000000000000000
% 00000000000000000000000000000000000000000000000000000000000000000000000000000000
% 000000000000000000000000000000000000000088
% 44000000000000000000000000000000000000000000000000000000000000000000000000000000
% 00000000000000000000000000000000000000000000000000000000000000000000000000000000
% 000000000000000000000000000000000000000088
% 4400000000335e808077552200000000195580806f44000000448000000000008044000044808000
% 00114d7780774d080000666600000011775500004480800000002a558080805e3300000000804400
% 000000804400448000000080440000004480800088
% 440000004d806f44444d808033000019777744445e804d0000448000000000008044000080551900
% 1177805e44447766080019774400005e7708000080551900004d806f44444466804d000000804400
% 000000804400448000000080440000008055190088
% 4400004480440000000019777708005577190000004d801900448000000000008044000080440000
% 4d803b000000195e2a00003380192a80220000008044000019804d00000000003b80220000804400
% 000000804400448000000080440000008044000088
% 440000775e00000000000033803b00774d0000000011803b00448000000000008044000080440000
% 77800000000000000000000055667744000000008044000044800800000000000080440000804400
% 000000804400448000000080440000008044000088
% 440022802a000000000000115e3b0080440000000000804400448000000000008044000080440000
% 80808080808080804400000008807708000000008044000011220000000000002280330000804400
% 000000804400448000000080440000008044000088
% 440044800000000000000000000000774d0000000011803b00448008000000008044000080440000
% 77772222222222773b00000044808033000000008044000000000000000022447766080000804400
% 000000804400448000000080440000008044000088
% 4400448000000000000000000000004d77190000004d80110044803b000000088044000080440000
% 4d80330000002a8019000022804d557711000000804400000000113b5e80806f4408000000806f08
% 000008804400448000000080440000008044000088
% 44004480000000000000000000000019777744445e804d000044806644222a6680220822804d2200
% 1177804d444d804d0000086f6600086666000822804d2200002a80774d331100000000000080805e
% 2a2a5e8033004480000822804d220822804d220088
% 440022802a0000000000000000000000195580806f44000000335e084d77806f3b00228080808000
% 00114d77806f440000005577110000197744228080808000006f6608000000000000000000805555
% 80806f440000448000228080808022808080800088
% 44000077550000000000003b802a0000000000000000000000000000000000000000000080440000
% 0000000000000000000000000000000000000000804400000080440000000000335e000000804400
% 000000000000000000000080440000008044000088
% 4400003b803b00000000116f77000000000000000000000000000000000000000000000080440000
% 000000000000000000000000000000000000000080440000006f6f08000000086f66000000804400
% 000000000000000000000080440000008044000088
% 440000004d806644445577802a000000000000000000000000000000000000000000000080440000
% 000000000000000000000000000000000000000080440000002a806f44444d77802a000000804400
% 000000000000335e0000006f662200008044000088
% 4400000000335e808077552200000000000000000000000000000000000000000000000000000000
% 00000000000000000000000000000000000000000000000000002255808077552200000000804400
% 000000000000448000000033778000000000000088
% 44000000000000000000000000000000000000000000000000000000000000000000000000000000
% 00000000000000000000000000000000000000000000000000000000000000000000000000000000
% 000000000000000000000000000000000000000088
% 44000000000000000000000000000000000000000000000000000000000000000000000000000000
% 00000000000000000000000000000000000000000000000000000000000000000000000000000000
% 000000000000000000000000000000000000000088
% 44000000000000000000000000000000000000000000000000000000000000000000000000000000
% 00000000000000000000000000000000000000000000000000000000000000000000000000000000
% 000000000000000000000000000000000000000088
% 44000000000000000000000000000000000000000000000000000000000000000000000000000000
% 00000000000000000000000000000000000000000000000000000000000000000000000000000000
% 000000000000000000000000000000000000000088
% 44000000000000000000000000000000000000000000000000000000000000000000000000000000
% 00000000000000000000000000000000000000000000000000000000000000000000000000000000
% 000000000000000000000000000000000000000088
% 44000000000000000000000000000000000000000000000000000000000000000000000000000000
% 00000000000000000000000000000000000000000000000000000000000000000000000000000000
% 000000000000000000000000000000000000000088
% 44000000000000000000000000000000000000000000000000000000000000000000000000000000
% 00000000000000000000000000000000000000000000000000000000000000000000000000000000
% 000000000000000000000000000000000000000088
% 44000000000000000000000000000000000000000000000000000000000000000000000000000000
% 00000000000000000000000000000000000000000000000000000000000000000000000000000000
% 000000000000000000000000000000000000000088
% 44000000000000000000000000000000000000000000000000000000000000000000000000000000
% 00000000000000000000000000000000000000000000000000000000000000000000000000000000
% 000000000000000000000000000000000000000088
% 44000000000000000000000000000000000000000000000000000000000000000000000000000000
% 00000000000000000000000000000000000000000000000000000000000000000000000000000000
% 000000000000000000000000000000000000000088
% 44000000000000000000000000000000000000000000000000000000000000000000000000000000
% 00000000000000000000000000000000000000000000000000000000000000000000000000000000
% 000000000000000000000000000000000000000088
% 44000000000000000000000000000000000000000000000000000000000000000000000000000000
% 00000000000000000000000000000000000000000000000000000000000000000000000000000000
% 000000000000000000000000000000000000000088
% 44000000000000000000000000000000000000000000000000000000000000000000000000000000
% 00000000000000000000000000000000000000000000000000000000000000000000000000000000
% 000000000000000000000000000000000000000088
% 44000000000000000000000000000000000000000000000000000000000000000000000000000000
% 00000000000000000000000000000000000000000000000000000000000000000000000000000000
% 000000000000000000000000000000000000000088
% 44000000000000000000000000000000000000000000000000000000000000000000000000000000
% 00000000000000000000000000000000000000000000000000000000000000000000000000000000
% 000000000000000000000000000000000000000088
% 44000000000000000000000000000000000000000000000000000000000000000000000000000000
% 00000000000000000000000000000000000000000000000000000000000000000000000000000000
% 000000000000000000000000000000000000000088
% 44000000000000000000000000000000000000000000000000000000000000000000000000000000
% 00000000000000000000000000000000000000000000000000000000000000000000000000000000
% 000000000000000000000000000000000000000088
% 44000000000000000000000000000000000000000000000000000000000000000000000000000000
% 00000000000000000000000000000000000000000000000000000000000000000000000000000000
% 000000000000000000000000000000000000000088
% 44000000000000000000000000000000000000000000000000000000000000000000000000000000
% 00000000000000000000000000000000000000000000000000000000000000000000000000000000
% 000000000000000000000000000000000000000088
% 44000000000000000000000000000000000000000000000000000000000000000000000000000000
% 00000000000000000000000000000000000000000000000000000000000000000000000000000000
% 000000000000000000000000000000000000000088
% 44000000000000000000000000000000000000000000000000000000000000000000000000000000
% 00000000000000000000000000000000000000000000000000000000000000000000000000000000
% 000000000000000000000000000000000000000088
% 44000000000000000000000000000000000000000000000000000000000000000000000000000000
% 00000000000000000000000000000000000000000000000000000000000000000000000000000000
% 000000000000000000000000000000000000000088
% 44000000000000000000000000000000000000000000000000000000000000000000000000000000
% 00000000000000000000000000000000000000000000000000000000000000000000000000000000
% 000000000000000000000000000000000000000088
% 44000000000000000000000000000000000000000000000000000000000000000000000000000000
% 00000000000000000000000000000000000000000000000000000000000000000000000000000000
% 000000000000000000000000000000000000000088
% 44000000000000000000000000000000000000000000000000000000000000000000000000000000
% 00000000000000000000000000000000000000000000000000000000000000000000000000000000
% 000000000000000000000000000000000000000088
% 44000000000000000000000000000000000000000000000000000000000000000000000000000000
% 00000000000000000000000000000000000000000000000000000000000000000000000000000000
% 000000000000000000000000000000000000000088
% 44000000000000000000000000000000000000000000000000000000000000000000000000000000
% 00000000000000000000000000000000000000000000000000000000000000000000000000000000
% 000000000000000000000000000000000000000088
% 44000000000000000000000000000000000000000000000000000000000000000000000000000000
% 00000000000000000000000000000000000000000000000000000000000000000000000000000000
% 000000000000000000000000000000000000000088
% 77444444444444444444444444444444444444444444444444444444444444444444444444444444
% 44444444444444444444444444444444444444444444444444444444444444444444444444444444
% 444444444444444444444444444444444444444499
%%EndImage
%%EndPreview
save countdictstack mark newpath /showpage {} def /setpagedevice {pop} def
%%EndProlog
%%Page 1 1
/mm { 72 mul 25.4 div } bind def
/inch { 72 mul } def

  /FSF {findfont exch scalefont} bind def
  /MS  {neg moveto show} bind def
  /GS  {glyphshow} bind def
  /MV  {neg moveto} bind def
  /BP  {gsave 72 exch div dup scale} bind def
  /SZ  {/HH exch def /WW exch def} bind def
  /BPP {BP SZ 0 HH translate} bind def
  /BPL {BP SZ 90 rotate} bind def
  /EP  {grestore showpage} bind def
  /ML  {neg moveto neg lineto stroke} bind def
  /LAT {dup length dict copy dup begin
         {1 index /FID ne {def} {pop pop} ifelse} forall
         /Encoding ISOLatin1Encoding 256 array copy def
         Encoding 39 /quotesingle put
         Encoding 45 /hyphen put
         currentdict
         end} bind def
  /EXC {exch definefont pop} bind def
  /CP {closepath} bind def
  /F {fill} bind def
  /LT {neg lineto} bind def
  /MT {neg moveto} bind def
%  /F0 {18 /NimbusSanL-BoldItal FSF setfont} bind def
  /F0 {18 /NimbusSanL-Regu FSF setfont} bind def
  /F1 {3.6 /NimbusSanL-BoldItal FSF setfont} bind def
  /F2 {12 /NimbusSanL-Regu FSF setfont} bind def
  /F3 {2.4 /NimbusSanL-Regu FSF setfont} bind def
  /F4 {11 /NimbusSanL-Regu FSF setfont} bind def
  /F5 {2.2 /NimbusSanL-Regu FSF setfont} bind def
  /F6 {10 /NimbusSanL-Bold FSF setfont} bind def
  /F7 {15 /NimbusSanL-Bold FSF setfont} bind def
%  /F8 {10 /NimbusSanL-Regu FSF setfont} bind def
  /F8 {15 /NimbusSanL-Regu FSF setfont} bind def
  /F9 {2 /NimbusSanL-Regu FSF setfont} bind def
%  /F10 {8 /NimbusSanL-Regu FSF setfont} bind def
  /F10 {11 /NimbusSanL-Regu FSF setfont} bind def
  /F11 {1.6 /NimbusSanL-Regu FSF setfont} bind def

/logo {
/logowidth 1.4 inch def
/logoheight 1.4 inch def

%currentlinewidth
%0.2 mm setlinewidth
%0 0 moveto
%logowidth 0 rlineto
%0 logoheight rlineto
%logowidth neg 0 rlineto
%closepath
%stroke
%setlinewidth

% Company logo
F0
%0.50 0.0 0.1875 setrgbcolor
% greyscale: Y = 0.3*R + 0.59*G + 0.11*B
% 0.3 * 0.5 + 0.59 * 0 + 0.11 * 0.2 = 0.15 + 0.022 = 0.172
0.17 0.17 0.17 setrgbcolor
(ContextShift)
dup stringwidth pop logowidth exch sub 2 div
logoheight 2 div moveto
show

0.50 0.50 0.50 setrgbcolor
[1.0 0 0 -1.0 0 0] concat
(ContextShift)
dup stringwidth pop neg 3 mm rmoveto
show
[1.0 0 0 -1.0 0 0] concat

% underline
currentlinewidth
0.2 mm setlinewidth
0.50 0.50 0.50 setrgbcolor
(ContextShift)
dup stringwidth pop
dup neg 1.4 mm rmoveto
dup 0 rlineto
stroke
setlinewidth

} bind def
/NimbusSanL-Regu findfont LAT /NimbusSanL-Regu EXC
logo
EP
%%Trailer
cleartomark countdictstack exch sub { end } repeat restore
%%EOF
