<?xml version="1.0" encoding="UTF-8"?>
<svg width="80pt" xmlns:xlink="http://www.w3.org/1999/xlink" xmlns="http://www.w3.org/2000/svg" height="89pt" >
 <g transform="translate(24.5938, 78.9961)" style="fill:#000000; fill-rule:evenodd; stroke:none; stroke-width:1pt; stroke-linecap:butt; stroke-linejoin:miter; stroke-dasharray:none;" >
  <path d="M6.5 1.4687 C6.5 1.4687 4.0781 1.4687 4.0781 1.4687 C3.5273 1.4687 3.1523 1.582 2.9531 1.8086 C2.7539 2.0312 2.6562 2.4336 2.6562 3.0078 C2.6562 3.0078 2.6562 4.3437 2.6562 4.3437 C2.6562 4.3437 5.8124 4.3437 5.8124 4.3437 C5.8124 4.3437 5.8124 6.125 5.8124 6.125 C5.8124 6.125 2.6562 6.125 2.6562 6.125 C2.6562 6.125 2.6562 13.1875 2.6562 13.1875 C2.6562 13.1875 0 13.1875 0 13.1875 C0 13.1875 0 3.0469 0 3.0469 C0 1.957 0.2382 1.1797 0.7187 0.707 C1.1953 0.2383 2.0078 0 3.1523 0 C3.1523 0 6.5 0 6.5 0 C6.5 0 6.5 1.4687 6.5 1.4687 Z" />
 </g>
 <g transform="translate(31.7812, 82.0898)" style="fill:#000000; fill-rule:evenodd; stroke:none; stroke-width:1pt; stroke-linecap:butt; stroke-linejoin:miter; stroke-dasharray:none;" >
  <path d="M6.6563 10.0938 C6.6563 10.0938 4.5938 10.0938 4.5938 10.0938 C4.5938 10.0938 4.4219 9.5938 4.4219 9.5938 C4.2344 9.7774 3.9532 9.918 3.5821 10.0274 C3.2071 10.1329 2.8282 10.1875 2.4415 10.1875 C1.6016 10.1875 0.9844 9.9688 0.5899 9.5352 C0.1954 9.1055 0 8.4297 0 7.5118 C0 7.5118 0 0 0 0 C0 0 2.5 0 2.5 0 C2.5 0 2.5 7.629 2.5 7.629 C2.5 7.9414 2.5704 8.168 2.711 8.3125 C2.8516 8.461 3.0586 8.5313 3.3243 8.5313 C3.4727 8.5313 3.6172 8.5196 3.7696 8.4961 C3.918 8.4727 4.0469 8.4336 4.1563 8.375 C4.1563 8.375 4.1563 0 4.1563 0 C4.1563 0 6.6563 0 6.6563 0 C6.6563 0 6.6563 10.0938 6.6563 10.0938 Z" />
 </g>
 <g transform="translate(39.7539, 81.9336)" style="fill:#000000; fill-rule:evenodd; stroke:none; stroke-width:1pt; stroke-linecap:butt; stroke-linejoin:miter; stroke-dasharray:none;" >
  <path d="M6.6602 10.25 C6.6602 10.25 4.1602 10.25 4.1602 10.25 C4.1602 10.25 4.1602 2.5234 4.1602 2.5234 C4.1602 2.2305 4.0781 2.0078 3.9219 1.8672 C3.7656 1.7266 3.5508 1.6562 3.2813 1.6562 C3.1602 1.6562 3.0234 1.668 2.875 1.6914 C2.7266 1.7148 2.6016 1.7461 2.5039 1.7891 C2.5039 1.7891 2.5039 10.25 2.5039 10.25 C2.5039 10.25 0 10.25 0 10.25 C0 10.25 0 0.1562 0 0.1562 C0 0.1562 2.0625 0.1562 2.0625 0.1562 C2.0625 0.1562 2.2031 0.5703 2.2031 0.5703 C2.5547 0.3633 2.8789 0.2148 3.1875 0.1289 C3.4922 0.043 3.8438 0 4.2383 0 C5 0 5.5938 0.207 6.0195 0.6289 C6.4453 1.0508 6.6602 1.6484 6.6602 2.4258 C6.6602 2.4258 6.6602 10.25 6.6602 10.25 Z" />
 </g>
 <g transform="translate(47.6016, 78.9961)" style="fill:#000000; fill-rule:evenodd; stroke:none; stroke-width:1pt; stroke-linecap:butt; stroke-linejoin:miter; stroke-dasharray:none;" >
  <path d="M3.8554 11.7461 C3.7617 11.7695 3.6211 11.7812 3.4336 11.7812 C3.2109 11.7812 3.0429 11.7148 2.9296 11.5859 C2.8164 11.4531 2.7382 11.2344 2.6992 10.918 C2.6679 10.5977 2.6406 10.1601 2.6211 9.6016 C2.6015 9.043 2.5937 8.4805 2.5937 7.9062 C2.5937 7.7109 2.5976 7.3633 2.6172 6.8633 C2.6367 6.3633 2.6601 5.9062 2.6992 5.4961 C2.7265 5.1445 2.8086 4.8945 2.9375 4.75 C3.0664 4.6055 3.2656 4.5312 3.5312 4.5312 C3.6172 4.5312 3.7109 4.5469 3.8086 4.5703 C3.9062 4.5977 4.0117 4.6328 4.125 4.6797 C4.125 4.6797 4.125 11.5859 4.125 11.5859 C4.039 11.6719 3.9531 11.7227 3.8554 11.7461 Z M6.625 0 C6.625 0 4.125 0 4.125 0 C4.125 0 4.125 3.3125 4.125 3.3125 C3.957 3.1797 3.7695 3.0781 3.5625 3.0234 C3.3554 2.9648 3.0742 2.9375 2.7148 2.9375 C2.1093 2.9375 1.6015 3.125 1.1836 3.5 C0.7656 3.875 0.4687 4.3984 0.2851 5.0586 C0.2031 5.3477 0.1328 5.7578 0.0781 6.293 C0.0234 6.8242 0 7.3594 0 7.8906 C0 8.3555 0.0117 8.832 0.039 9.3203 C0.0703 9.8086 0.1054 10.25 0.1523 10.6484 C0.2539 11.4727 0.5273 12.1211 0.9726 12.582 C1.4218 13.0508 2 13.2812 2.707 13.2812 C3.0664 13.2812 3.3593 13.25 3.5898 13.1953 C3.8203 13.1406 4.0742 13 4.3476 12.7812 C4.3476 12.7812 4.5625 13.1875 4.5625 13.1875 C4.5625 13.1875 6.625 13.1875 6.625 13.1875 C6.625 13.1875 6.625 0 6.625 0 Z" />
 </g>
 <g transform="translate(55.2891, 81.9336)" style="fill:#000000; fill-rule:evenodd; stroke:none; stroke-width:1pt; stroke-linecap:butt; stroke-linejoin:miter; stroke-dasharray:none;" >
  <path d="M3.8867 8.8359 C3.7148 8.9023 3.539 8.9375 3.3671 8.9375 C3.039 8.9375 2.8164 8.7969 2.6914 8.5156 C2.5625 8.2383 2.5 7.6094 2.5 6.6367 C2.5 5.8008 2.5742 5.207 2.7265 4.8633 C2.8828 4.5156 3.1328 4.3437 3.4726 4.3437 C3.6797 4.3437 3.8437 4.3867 3.9726 4.4805 C4.1015 4.5703 4.1953 4.7031 4.25 4.8789 C4.25 4.8789 4.25 8.6016 4.25 8.6016 C4.1718 8.6914 4.0547 8.7695 3.8867 8.8359 Z M6.6875 2.8711 C6.6875 1.9687 6.4297 1.2656 5.9101 0.7578 C5.3984 0.2539 4.6953 0 3.8086 0 C3.2968 0 2.8125 0.043 2.3515 0.1211 C1.8906 0.2031 1.4609 0.3398 1.0625 0.5312 C1.0625 0.5312 1.0625 2.0312 1.0625 2.0312 C1.4062 1.832 1.7265 1.6953 2.0351 1.6172 C2.3437 1.5391 2.7031 1.5 3.1054 1.5 C3.4765 1.5 3.7617 1.6055 3.957 1.8125 C4.1523 2.0195 4.25 2.3008 4.25 2.6484 C4.25 2.6484 4.25 3.375 4.25 3.375 C4.1328 3.2187 3.957 3.0898 3.7187 2.9922 C3.4804 2.8906 3.2109 2.8437 2.9101 2.8437 C1.9062 2.8437 1.1718 3.1445 0.7031 3.75 C0.2304 4.3594 0 5.3047 0 6.5937 C0 7.7617 0.2421 8.6797 0.7265 9.3437 C1.2187 10.0117 1.8476 10.3437 2.6289 10.3437 C3.0429 10.3437 3.4023 10.3008 3.6992 10.2148 C3.9961 10.1289 4.2304 10 4.4062 9.8281 C4.4062 9.8281 4.6562 10.25 4.6562 10.25 C4.6562 10.25 6.6875 10.25 6.6875 10.25 C6.6875 10.25 6.6875 2.8711 6.6875 2.8711 Z" />
 </g>
 <g transform="translate(63.0391, 81.9336)" style="fill:#000000; fill-rule:evenodd; stroke:none; stroke-width:1pt; stroke-linecap:butt; stroke-linejoin:miter; stroke-dasharray:none;" >
  <path d="M6.1875 3.0312 C6.1875 3.0312 4 3.0312 4 3.0312 C4 2.4141 3.9531 2.0117 3.8632 1.832 C3.7734 1.6523 3.6211 1.5625 3.4062 1.5625 C3.0468 1.5625 2.8203 1.8203 2.7304 2.3398 C2.6406 2.8633 2.5937 3.8047 2.5937 5.168 C2.5937 6.7383 2.6445 7.7305 2.75 8.1484 C2.8515 8.5703 3.0781 8.7812 3.4297 8.7812 C3.6445 8.7812 3.8086 8.7148 3.9101 8.582 C4.0195 8.4492 4.0898 8.1602 4.125 7.7187 C4.125 7.7187 5.9687 7.7187 5.9687 7.7187 C5.9687 8.6172 5.7382 9.2734 5.2734 9.7031 C4.8125 10.1289 4.1171 10.3437 3.1914 10.3437 C2.1445 10.3437 1.3515 9.9102 0.8125 9.043 C0.2695 8.1719 0 6.8789 0 5.1641 C0 3.457 0.2812 2.1719 0.8437 1.3047 C1.4062 0.4336 2.2578 0 3.3867 0 C4.289 0 4.9804 0.25 5.4648 0.75 C5.9453 1.2539 6.1875 2.0117 6.1875 3.0312 Z" />
 </g>
 <g transform="translate(70.1094, 78.9961)" style="fill:#000000; fill-rule:evenodd; stroke:none; stroke-width:1pt; stroke-linecap:butt; stroke-linejoin:miter; stroke-dasharray:none;" >
  <path d="M2.5 2.3125 C2.5 2.3125 0 2.3125 0 2.3125 C0 2.3125 0 0 0 0 C0 0 2.5 0 2.5 0 C2.5 0 2.5 2.3125 2.5 2.3125 Z M2.5 13.1875 C2.5 13.1875 0 13.1875 0 13.1875 C0 13.1875 0 3.0937 0 3.0937 C0 3.0937 2.5 3.0937 2.5 3.0937 C2.5 3.0937 2.5 13.1875 2.5 13.1875 Z" />
 </g>
 <g transform="translate(73.8242, 78.9961)" style="fill:#000000; fill-rule:evenodd; stroke:none; stroke-width:1pt; stroke-linecap:butt; stroke-linejoin:miter; stroke-dasharray:none;" >
  <path d="M3.9219 11.0742 C3.8203 11.5039 3.625 11.7187 3.332 11.7187 C3.0196 11.7187 2.8164 11.5156 2.7305 11.1172 C2.6367 10.7148 2.5977 9.7227 2.5977 8.1484 C2.5977 6.5351 2.6367 5.5234 2.7227 5.1172 C2.8047 4.7031 3.0039 4.5 3.332 4.5 C3.6602 4.5 3.8633 4.6953 3.9414 5.0898 C4.0235 5.4844 4.0625 6.4922 4.0625 8.1094 C4.0625 9.6601 4.0156 10.6484 3.9219 11.0742 Z M5.8828 4.2031 C5.3672 3.3594 4.5117 2.9375 3.3164 2.9375 C2.1836 2.9375 1.3516 3.3555 0.8086 4.1914 C0.2735 5.0312 0 6.332 0 8.1016 C0 9.8164 0.2813 11.1094 0.836 11.9805 C1.3906 12.8477 2.2188 13.2812 3.3164 13.2812 C4.4414 13.2812 5.2813 12.8711 5.832 12.0469 C6.3828 11.2187 6.6602 9.9062 6.6602 8.1016 C6.6602 6.3477 6.3985 5.0508 5.8828 4.2031 Z M4.043 0 C4.043 0 2.0625 2.5625 2.0625 2.5625 C2.0625 2.5625 4.0664 2.5625 4.0664 2.5625 C4.0664 2.5625 6.4102 0 6.4102 0 C6.4102 0 4.043 0 4.043 0 Z" />
 </g>
 <g transform="translate(81.543, 81.9336)" style="fill:#000000; fill-rule:evenodd; stroke:none; stroke-width:1pt; stroke-linecap:butt; stroke-linejoin:miter; stroke-dasharray:none;" >
  <path d="M6.6523 10.25 C6.6523 10.25 4.1523 10.25 4.1523 10.25 C4.1523 10.25 4.1523 2.5234 4.1523 2.5234 C4.1523 2.2305 4.0781 2.0078 3.9179 1.8672 C3.7617 1.7266 3.5468 1.6562 3.2773 1.6562 C3.1523 1.6562 3.0195 1.668 2.8711 1.6914 C2.7187 1.7148 2.5976 1.7461 2.5 1.7891 C2.5 1.7891 2.5 10.25 2.5 10.25 C2.5 10.25 0 10.25 0 10.25 C0 10.25 0 0.1562 0 0.1562 C0 0.1562 2.0625 0.1562 2.0625 0.1562 C2.0625 0.1562 2.2031 0.5703 2.2031 0.5703 C2.5508 0.3633 2.8789 0.2148 3.1836 0.1289 C3.4882 0.043 3.8398 0 4.2382 0 C5 0 5.5898 0.207 6.0156 0.6289 C6.4414 1.0508 6.6523 1.6484 6.6523 2.4258 C6.6523 2.4258 6.6523 10.25 6.6523 10.25 Z" />
 </g>
 <g transform="translate(75.0508, 69.3086)" style="fill:#000000; fill-rule:evenodd; stroke:none; stroke-width:1pt; stroke-linecap:butt; stroke-linejoin:miter; stroke-dasharray:none;" >
  <path d="M8.7422 0 C9.207 0 9.6445 0.0781 10.0508 0.2305 C10.4609 0.3789 10.8398 0.6094 11.1953 0.918 C11.5469 1.2226 11.8867 1.5312 12.2187 1.8359 C12.5547 2.1445 12.875 2.4609 13.1875 2.7812 C13.1875 2.7812 13.1875 4.8125 13.1875 4.8125 C13.1875 4.8125 10.0703 7.25 10.0703 7.25 C10.0703 7.25 0 7.25 0 7.25 C0 7.25 0 4.5937 0 4.5937 C0 4.5937 9.9375 4.5937 9.9375 4.5937 C9.9375 4.5937 11.4219 3.4687 11.4219 3.4687 C11.4219 3.4687 10.4375 2.6562 10.4375 2.6562 C10.4375 2.6562 0 2.6562 0 2.6562 C0 2.6562 0 0 0 0 C0 0 8.7422 0 8.7422 0 Z" />
 </g>
 <g transform="translate(75.0508, 64.0664)" style="fill:#000000; fill-rule:evenodd; stroke:none; stroke-width:1pt; stroke-linecap:butt; stroke-linejoin:miter; stroke-dasharray:none;" >
  <path d="M13.1875 1.7852 C13.1875 1.7852 13.1875 4.2852 13.1875 4.2852 C13.1875 4.2852 3.0937 4.2852 3.0937 4.2852 C3.0937 4.2852 3.0937 1.7852 3.0937 1.7852 C3.0937 1.7852 13.1875 1.7852 13.1875 1.7852 Z M0 0 C0 0 2.5625 2.3398 2.5625 2.3398 C2.5625 2.3398 2.5625 4.3477 2.5625 4.3477 C2.5625 4.3477 0 2.3633 0 2.3633 C0 2.3633 0 0 0 0 Z" />
 </g>
 <g transform="translate(77.9883, 58.6133)" style="fill:#000000; fill-rule:evenodd; stroke:none; stroke-width:1pt; stroke-linecap:butt; stroke-linejoin:miter; stroke-dasharray:none;" >
  <path d="M8.8359 2.8008 C8.9023 2.9687 8.9375 3.1406 8.9375 3.3203 C8.9375 3.6406 8.8008 3.8711 8.5195 3.9961 C8.2383 4.125 7.6094 4.1875 6.6367 4.1875 C5.8008 4.1875 5.207 4.1133 4.8633 3.957 C4.5195 3.8047 4.3437 3.5547 4.3437 3.2109 C4.3437 3.0078 4.3906 2.8398 4.4805 2.7109 C4.5742 2.5781 4.707 2.4922 4.8828 2.4375 C4.8828 2.4375 8.6055 2.4375 8.6055 2.4375 C8.6914 2.5078 8.7695 2.6289 8.8359 2.8008 Z M2.875 0 C1.9687 0 1.2656 0.2578 0.7617 0.7695 C0.2539 1.2851 0 1.9922 0 2.8789 C0 3.3867 0.0429 3.875 0.125 4.332 C0.207 4.7929 0.3398 5.2226 0.5312 5.625 C0.5312 5.625 2.0312 5.625 2.0312 5.625 C1.8359 5.2812 1.6992 4.9531 1.6211 4.6484 C1.5429 4.3398 1.5 3.9844 1.5 3.5781 C1.5 3.207 1.6055 2.9258 1.8125 2.7305 C2.0195 2.5351 2.3008 2.4375 2.6484 2.4375 C2.6484 2.4375 3.375 2.4375 3.375 2.4375 C3.2187 2.5547 3.0898 2.7265 2.9922 2.9648 C2.8945 3.2031 2.8437 3.4726 2.8437 3.7734 C2.8437 4.7773 3.1484 5.5117 3.7539 5.9805 C4.3594 6.4531 5.3047 6.6875 6.5937 6.6875 C7.7656 6.6875 8.6836 6.4414 9.3437 5.9531 C10.0117 5.4687 10.3437 4.8359 10.3437 4.0586 C10.3437 3.6406 10.3008 3.2812 10.2148 2.9883 C10.1289 2.6875 10 2.4531 9.8281 2.2812 C9.8281 2.2812 10.25 2.0312 10.25 2.0312 C10.25 2.0312 10.25 0 10.25 0 C10.25 0 2.875 0 2.875 0 Z" />
 </g>
 <g transform="translate(75.0508, 48.1328)" style="fill:#000000; fill-rule:evenodd; stroke:none; stroke-width:1pt; stroke-linecap:butt; stroke-linejoin:miter; stroke-dasharray:none;" >
  <path d="M13.1875 0 C13.1875 0 13.1875 3.3438 13.1875 3.3438 C13.1875 4.3672 12.914 5.1484 12.3633 5.6875 C11.8164 6.2305 11.0312 6.5 10.0156 6.5 C10.0156 6.5 0 6.5 0 6.5 C0 6.5 0 3.8438 0 3.8438 C0 3.8438 9.9375 3.8438 9.9375 3.8438 C10.6562 3.8438 11.1328 3.711 11.3672 3.4492 C11.6015 3.1875 11.7187 2.8242 11.7187 2.3555 C11.7187 2.3555 11.7187 0 11.7187 0 C11.7187 0 13.1875 0 13.1875 0 Z" />
 </g>
 <g transform="translate(75.0508, 44.8203)" style="fill:#000000; fill-rule:evenodd; stroke:none; stroke-width:1pt; stroke-linecap:butt; stroke-linejoin:miter; stroke-dasharray:none;" >
  <path d="M2.3125 0 C2.3125 0 2.3125 2.5 2.3125 2.5 C2.3125 2.5 0 2.5 0 2.5 C0 2.5 0 0 0 0 C0 0 2.3125 0 2.3125 0 Z M13.1875 0 C13.1875 0 13.1875 2.5 13.1875 2.5 C13.1875 2.5 3.0937 2.5 3.0937 2.5 C3.0937 2.5 3.0937 0 3.0937 0 C3.0937 0 13.1875 0 13.1875 0 Z" />
 </g>
 <g transform="translate(75.0508, 37.375)" style="fill:#000000; fill-rule:evenodd; stroke:none; stroke-width:1pt; stroke-linecap:butt; stroke-linejoin:miter; stroke-dasharray:none;" >
  <path d="M9.582 2.6211 C10.2422 2.6406 10.6719 2.6602 10.8711 2.6797 C11.207 2.7109 11.4492 2.7891 11.5937 2.9219 C11.7422 3.0508 11.8125 3.2266 11.8125 3.4414 C11.8125 3.6055 11.7969 3.75 11.7578 3.8711 C11.7148 3.9961 11.668 4.0898 11.6054 4.1562 C11.6054 4.1562 4.7031 4.1562 4.7031 4.1562 C4.668 4.0391 4.6406 3.9297 4.6211 3.8242 C4.6054 3.7227 4.5937 3.625 4.5937 3.5273 C4.5937 3.2578 4.6484 3.0586 4.7617 2.9258 C4.875 2.793 5.1406 2.7109 5.5547 2.6797 C5.9804 2.6484 6.3945 2.625 6.8047 2.6133 C7.2109 2.6016 7.582 2.5938 7.918 2.5938 C8.3633 2.5938 8.918 2.6055 9.582 2.6211 Z M6.4453 0.043 C5.9687 0.0703 5.582 0.1055 5.2812 0.1484 C4.5039 0.2578 3.918 0.5 3.5273 0.875 C3.1367 1.2539 2.9375 1.7695 2.9375 2.4219 C2.9375 2.7852 2.9844 3.1211 3.0742 3.4336 C3.168 3.7461 3.2851 3.9844 3.4297 4.1562 C3.4297 4.1562 0 4.1562 0 4.1562 C0 4.1562 0 6.6562 0 6.6562 C0 6.6562 13.1875 6.6562 13.1875 6.6562 C13.1875 6.6562 13.1875 4.5938 13.1875 4.5938 C13.1875 4.5938 12.875 4.4141 12.875 4.4141 C13.0156 4.2031 13.1172 3.9844 13.1836 3.7617 C13.25 3.5391 13.2812 3.2344 13.2812 2.8516 C13.2812 2.0469 13.0469 1.4102 12.5781 0.9414 C12.1054 0.4766 11.4648 0.2031 10.6523 0.125 C10.1797 0.0781 9.7304 0.0469 9.3125 0.0273 C8.8906 0.0117 8.418 0 7.8945 0 C7.4023 0 6.9219 0.0156 6.4453 0.043 Z" />
 </g>
 <g transform="translate(77.9883, 31.7812)" style="fill:#000000; fill-rule:evenodd; stroke:none; stroke-width:1pt; stroke-linecap:butt; stroke-linejoin:miter; stroke-dasharray:none;" >
  <path d="M2.3125 0 C2.2344 0.1993 2.1758 0.3946 2.1289 0.5899 C2.0859 0.7852 2.0625 0.9922 2.0625 1.211 C2.0625 1.4454 2.082 1.6719 2.1133 1.8946 C2.1445 2.1172 2.1992 2.2774 2.2812 2.375 C2.2812 2.375 10.25 2.375 10.25 2.375 C10.25 2.375 10.25 4.875 10.25 4.875 C10.25 4.875 0.1562 4.875 0.1562 4.875 C0.1562 4.875 0.1562 2.8126 0.1562 2.8126 C0.1562 2.8126 0.5937 2.6719 0.5937 2.6719 C0.3906 2.4415 0.2383 2.1758 0.1445 1.8711 C0.0508 1.5665 0 1.2305 0 0.8594 C0 0.7032 0.0195 0.5508 0.0547 0.4063 C0.0898 0.2618 0.1406 0.125 0.2031 0 C0.2031 0 2.3125 0 2.3125 0 Z" />
 </g>
 <g transform="translate(77.9883, 25.4922)" style="fill:#000000; fill-rule:evenodd; stroke:none; stroke-width:1pt; stroke-linecap:butt; stroke-linejoin:miter; stroke-dasharray:none;" >
  <path d="M3.8437 3.6172 C2.8984 3.6172 2.2812 3.5664 1.9961 3.4687 C1.707 3.3711 1.5625 3.164 1.5625 2.8437 C1.5625 2.5078 1.7226 2.293 2.0508 2.1992 C2.3711 2.1094 2.9687 2.0625 3.8437 2.0625 C3.8437 2.0625 3.8437 3.6172 3.8437 3.6172 Z M4.1719 0 C2.7812 0 1.7383 0.2266 1.0429 0.6875 C0.3476 1.1445 0 1.8594 0 2.8359 C0 3.9648 0.4375 4.8125 1.3047 5.375 C2.1719 5.9375 3.457 6.2187 5.164 6.2187 C6.8828 6.2187 8.1758 5.9453 9.0429 5.4062 C9.9101 4.8633 10.3437 4.0703 10.3437 3.0273 C10.3437 2.0781 10.1367 1.3789 9.7109 0.9258 C9.2929 0.4766 8.6406 0.25 7.75 0.25 C7.75 0.25 7.75 2.0312 7.75 2.0312 C8.1328 2.0312 8.3984 2.0898 8.5508 2.207 C8.707 2.3242 8.7812 2.5039 8.7812 2.7461 C8.7812 3.1055 8.5781 3.3398 8.1679 3.4531 C7.7617 3.5664 6.8086 3.625 5.3125 3.625 C5.3125 3.625 5.3125 0 5.3125 0 C5.3125 0 4.1719 0 4.1719 0 Z" />
 </g>
 <g transform="translate(14.9102, 18.9336)" style="fill:#9934cc; fill-rule:evenodd; stroke:none; stroke-width:1pt; stroke-linecap:butt; stroke-linejoin:miter; stroke-dasharray:none;" >
  <path d="M54.5976 54.4766 C54.5976 54.4766 0 54.4766 0 54.4766 C0 54.4766 0 0 0 0 C0 0 54.5976 0 54.5976 0 C54.5976 0 54.5976 54.4766 54.5976 54.4766 Z" />
 </g>
 <g transform="translate(36.8906, 4.24609)" style="fill:#ff9900; fill-rule:evenodd; stroke:none; stroke-width:1pt; stroke-linecap:butt; stroke-linejoin:miter; stroke-dasharray:none;" >
  <path d="M1.8242 1.44141 C1.8242 1.44141 0.2852 6.41016 0.2852 6.41016 C0 7.33594 0.5156 8.31641 1.4414 8.60157 C2.3633 8.88672 3.3438 8.3711 3.6289 7.44532 C3.6289 7.44532 5.1719 2.47657 5.1719 2.47657 C5.4571 1.55079 4.9375 0.570312 4.0156 0.285156 C3.0899 0 2.1094 0.515625 1.8242 1.44141 Z" />
 </g>
 <g transform="translate(44.75, 10.5898)" style="fill:#ff9900; fill-rule:evenodd; stroke:none; stroke-width:1pt; stroke-linecap:butt; stroke-linejoin:miter; stroke-dasharray:none;" >
  <path d="M4.3633 0.6836 C4.3633 0.6836 0.6836 4.36326 0.6836 4.36326 C0 5.04686 0 6.15236 0.6836 6.83596 C1.3672 7.51956 2.4727 7.51956 3.1562 6.83596 C3.1562 6.83596 6.8359 3.15625 6.8359 3.15625 C7.5195 2.47266 7.5195 1.36719 6.8359 0.6836 C6.1523 0 5.0469 0 4.3633 0.6836 Z" />
 </g>
 <g transform="translate(48.9102, 21.418)" style="fill:#ff9900; fill-rule:evenodd; stroke:none; stroke-width:1pt; stroke-linecap:butt; stroke-linejoin:miter; stroke-dasharray:none;" >
  <path d="M6.8398 0.0976 C6.8398 0.0976 1.6601 0.6289 1.6601 0.6289 C0.6992 0.7265 0 1.5859 0.0976 2.5468 C0.1992 3.5078 1.0586 4.207 2.0195 4.1093 C2.0195 4.1093 7.1953 3.5781 7.1953 3.5781 C8.1562 3.4804 8.8554 2.6211 8.7578 1.6601 C8.6601 0.6992 7.7968 0 6.8398 0.0976 Z" />
 </g>
 <g transform="translate(25.3984, 4.25)" style="fill:#ff9900; fill-rule:evenodd; stroke:none; stroke-width:1pt; stroke-linecap:butt; stroke-linejoin:miter; stroke-dasharray:none;" >
  <path d="M1.4375 0.285156 C0.5157 0.574219 0 1.55469 0.2852 2.47656 C0.2852 2.47656 1.8243 7.44922 1.8243 7.44922 C2.1094 8.37109 3.0899 8.88672 4.0118 8.60156 C4.9375 8.31641 5.4532 7.33594 5.168 6.41406 C5.168 6.41406 3.6289 1.44141 3.6289 1.44141 C3.3438 0.519531 2.3633 0 1.4375 0.285156 Z" />
 </g>
 <g transform="translate(15.9727, 10.0938)" style="fill:#ff9900; fill-rule:evenodd; stroke:none; stroke-width:1pt; stroke-linecap:butt; stroke-linejoin:miter; stroke-dasharray:none;" >
  <path d="M0.68359 0.68359 C0 1.36719 0 2.47656 0.68359 3.16016 C0.68359 3.16016 4.36324 6.83985 4.36324 6.83985 C5.04684 7.52345 6.15624 7.52345 6.83984 6.83985 C7.52344 6.15625 7.52344 5.04685 6.83984 4.36325 C6.83984 4.36325 3.16014 0.68359 3.16014 0.68359 C2.47656 0 1.36718 0 0.68359 0.68359 Z" />
 </g>
 <g transform="translate(10.4766, 20.9219)" style="fill:#ff9900; fill-rule:evenodd; stroke:none; stroke-width:1pt; stroke-linecap:butt; stroke-linejoin:miter; stroke-dasharray:none;" >
  <path d="M0.09766 1.6601 C0 2.6211 0.69922 3.4804 1.66016 3.582 C1.66016 3.582 6.83985 4.1093 6.83985 4.1093 C7.80078 4.2109 8.66014 3.5078 8.75784 2.5469 C8.85544 1.5859 8.15625 0.7265 7.19532 0.6289 C7.19532 0.6289 2.01953 0.0976 2.01953 0.0976 C1.0586 0 0.19922 0.6992 0.09766 1.6601 Z" />
 </g>
 <g transform="translate(11.6211, 41.875)" style="fill:#9934cc; fill-rule:evenodd; stroke:none; stroke-width:1pt; stroke-linecap:butt; stroke-linejoin:miter; stroke-dasharray:none;" >
  <path d="M39.6133 7.3672 C39.6133 7.3672 0 7.3672 0 7.3672 C0 7.3672 0 21.8125 0 21.8125 C0 21.8125 39.6133 21.8125 39.6133 21.8125 C39.6133 21.8125 39.5898 21.8281 39.5898 21.8281 C39.5898 21.8281 39.5898 29.1953 39.5898 29.1953 C39.5898 29.1953 55.2851 14.6367 55.2851 14.6367 C55.2851 14.6367 39.6133 0 39.6133 0 C39.6133 0 39.5977 7.3672 39.5977 7.3672 C39.5977 7.3672 39.6133 7.3672 39.6133 7.3672 Z" />
 </g>
 <g transform="translate(9.37109, 39.9922)" style="fill:#ff9900; fill-rule:evenodd; stroke:none; stroke-width:1pt; stroke-linecap:butt; stroke-linejoin:miter; stroke-dasharray:none;" >
  <path d="M40.668 0.2773 C40.0273 0.5547 39.6133 1.1836 39.6133 1.8789 C39.6133 1.8789 39.6055 5.4648 39.6016 7.5 C36.3867 7.5 1.75 7.5 1.75 7.5 C0.785156 7.5 0 8.2812 0 9.25 C0 9.25 0 23.6953 0 23.6953 C0 24.6601 0.785156 25.4453 1.75 25.4453 C1.75 25.4453 36.3555 25.4453 39.5898 25.4453 C39.5898 27.4726 39.5898 31.0781 39.5898 31.0781 C39.5898 31.7734 40.0039 32.4023 40.6406 32.6836 C41.2773 32.9609 42.0195 32.832 42.5273 32.3633 C42.5273 32.3633 58.2266 17.8047 58.2266 17.8047 C58.582 17.4726 58.7851 17.0078 58.7851 16.5234 C58.7891 16.039 58.5859 15.5742 58.2305 15.2422 C58.2305 15.2422 42.5586 0.6055 42.5586 0.6055 C42.0469 0.1289 41.3047 0 40.668 0.2773 Z M41.3633 11 C42.3281 11 43.0977 10.2148 43.0977 9.25 C43.0977 9.25 43.1016 7.5625 43.1055 5.9062 C46.5664 9.1367 52.6484 14.8203 54.4648 16.5156 C52.6445 18.207 46.5547 23.8555 43.0898 27.0664 C43.0898 25.4023 43.0898 23.7109 43.0898 23.7109 C43.0898 22.7461 42.3281 21.9453 41.3633 21.9453 C41.3633 21.9453 6.69922 21.9453 3.5 21.9453 C3.5 19.6172 3.5 13.3281 3.5 11 C6.69922 11 41.3633 11 41.3633 11 Z" />
 </g>
 <g transform="translate(11.4375, 15.0781)" style="fill:#019966; fill-rule:evenodd; stroke:none; stroke-width:1pt; stroke-linecap:butt; stroke-linejoin:miter; stroke-dasharray:none;" >
  <path d="M5.83594 48.8789 C41.8125 47.2969 27.0977 17.8477 27.0977 17.8477 C27.0977 17.8477 42.7461 22.1133 42.7461 22.1133 C42.7461 22.1133 22.4414 0 22.4414 0 C22.4414 0 4.59375 21.4688 4.59375 21.4688 C4.59375 21.4688 18.4297 17.9766 18.4297 17.9766 C18.4297 17.9766 22.2305 34.4727 5.77344 34.4102 C5.77344 34.4102 0 34.4297 0 34.4297 C0 34.4297 0.06641 48.8438 0.06641 48.8438 C0.06641 48.8438 5.83594 48.8789 5.83594 48.8789 Z" />
 </g>
 <g transform="translate(9.1875, 13.3164)" style="fill:#ff9900; fill-rule:evenodd; stroke:none; stroke-width:1pt; stroke-linecap:butt; stroke-linejoin:miter; stroke-dasharray:none;" >
  <path d="M24.1484 0.01171 C23.6445 0.02343 23.168 0.2539 22.8437 0.64062 C22.8437 0.64062 4.99609 22.1133 4.99609 22.1133 C4.51172 22.6953 4.45703 23.5234 4.85938 24.1641 C5.26562 24.8047 6.03516 25.1133 6.76953 24.9258 C6.76953 24.9258 15.9141 22.6211 18.7266 21.9102 C18.7734 22.418 18.8086 23 18.8086 23.6445 C18.8086 25.9024 18.3945 28.8047 16.6367 30.9922 C14.7969 33.2852 11.7344 34.4336 7.52734 34.4219 C7.51562 34.4219 1.74609 34.4414 1.74609 34.4414 C1.28125 34.4414 0.83594 34.6289 0.507812 34.957 C0.183594 35.2891 0 35.7344 0 36.1992 C0 36.1992 0.066406 50.6133 0.066406 50.6133 C0.070312 51.5703 0.84766 52.3516 1.80469 52.3555 C1.80469 52.3555 7.57812 52.3906 7.57812 52.3906 C7.60547 52.3906 7.63672 52.3906 7.66406 52.3906 C19.4609 51.8711 27.3555 48.3555 31.1328 41.9336 C32.9531 38.8398 33.5859 35.457 33.5859 32.2578 C33.5859 28.3555 32.6484 24.7266 31.7891 22.2266 C35.957 23.3633 44.0391 25.5664 44.0391 25.5664 C44.7891 25.7695 45.5859 25.4531 45.9922 24.7852 C46.3945 24.1211 46.3125 23.2656 45.7852 22.6914 C45.7852 22.6914 25.4805 0.57812 25.4805 0.57812 C25.1367 0.20703 24.6523 0 24.1484 0.01171 Z M24.2578 4.41799 C26.1055 6.43359 34.3203 15.3789 39.1055 20.5938 C34.5195 19.3398 29.3086 17.9219 29.3086 17.9219 C28.6406 17.7383 27.9336 17.9648 27.4961 18.5 C27.2344 18.8164 27.0977 19.2109 27.0977 19.6094 C27.0977 19.875 27.1563 20.1406 27.2813 20.3906 C27.3203 20.4688 30.0703 26.1055 30.0703 32.2891 C30.0703 34.9492 29.5625 37.7109 28.1094 40.1758 C24.9727 45.4922 18.0508 48.4258 7.53906 48.8906 C7.45312 48.8906 5.23047 48.875 3.55859 48.8633 C3.54688 46.5547 3.51953 40.2695 3.50781 37.9336 C5.20703 37.9258 7.52734 37.9219 7.52734 37.9219 C12.8516 37.9414 16.8437 36.3398 19.3789 33.168 C23.7461 27.7031 21.9648 19.6836 21.8867 19.3438 C21.7813 18.8867 21.4961 18.4883 21.0937 18.2461 C20.6914 18 20.2109 17.9258 19.7539 18.043 C19.7539 18.043 15.1719 19.1953 11.1211 20.2188 C15.2031 15.3086 22.5078 6.52339 24.2578 4.41799 Z" />
 </g>
</svg>
