/* XPM */
static char * mail_xpm[] = {
"16 17 175 2",
"  	c None",
". 	c #374453",
"+ 	c #44505D",
"@ 	c #2F3B48",
"# 	c #84A0BE",
"$ 	c #B8D5F4",
"% 	c #CDE1F7",
"& 	c #AFB9C3",
"* 	c #181819",
"= 	c #232D37",
"- 	c #748FAC",
"; 	c #B2D1F2",
"> 	c #C8DEF6",
", 	c #DBEAF9",
"' 	c #EAF3FC",
") 	c #F6FAFE",
"! 	c #9D9D9E",
"~ 	c #192129",
"{ 	c #647D98",
"] 	c #ABCCF0",
"^ 	c #C3DBF5",
"/ 	c #D6E7F9",
"( 	c #E7F1FB",
"_ 	c #F4F9FE",
": 	c #FCFDFF",
"< 	c #FAFCFF",
"[ 	c #ECF2F9",
"} 	c #252729",
"| 	c #10151A",
"1 	c #556C85",
"2 	c #A2C5EA",
"3 	c #BDD8F4",
"4 	c #D2E4F8",
"5 	c #E3EFFB",
"6 	c #F1F7FD",
"7 	c #FBFDFF",
"8 	c #F2F8FD",
"9 	c #D1E4F8",
"0 	c #4C5660",
"a 	c #1B3C60",
"b 	c #183B61",
"c 	c #607285",
"d 	c #CCE0F6",
"e 	c #DFECFA",
"f 	c #EEF5FD",
"g 	c #F9FBFE",
"h 	c #FCFEFF",
"i 	c #E8F1FC",
"j 	c #D6E7F8",
"k 	c #C0DAF5",
"l 	c #A8CCF1",
"m 	c #44576C",
"n 	c #2B4867",
"o 	c #4A93E1",
"p 	c #3184DC",
"q 	c #133860",
"r 	c #8C9196",
"s 	c #FDFEFF",
"t 	c #F8FBFE",
"u 	c #ECF4FC",
"v 	c #C6DDF6",
"w 	c #AFCFF2",
"x 	c #95C0EE",
"y 	c #79AFE9",
"z 	c #2D4968",
"A 	c #4C75A1",
"B 	c #4376AE",
"C 	c #2E4155",
"D 	c #707070",
"E 	c #494949",
"F 	c #ECEEF0",
"G 	c #F0F6FD",
"H 	c #CCE1F7",
"I 	c #B5D3F3",
"J 	c #9CC4EF",
"K 	c #81B4EA",
"L 	c #8389BE",
"M 	c #6380C2",
"N 	c #1E4166",
"O 	c #2C353E",
"P 	c #948E8F",
"Q 	c #E5E6E6",
"R 	c #6C6C6C",
"S 	c #383838",
"T 	c #929AA2",
"U 	c #BBD7F4",
"V 	c #A3C8F0",
"W 	c #88B8EB",
"X 	c #7F9FD6",
"Y 	c #B83C57",
"Z 	c #D10204",
"` 	c #795281",
" .	c #474747",
"..	c #EF5959",
"+.	c #AC4F4F",
"@.	c #5F5F5F",
"#.	c #BDBDBD",
"$.	c #596573",
"%.	c #A7CBF1",
"&.	c #84B4E7",
"*.	c #7DB1E8",
"=.	c #A5C1E0",
"-.	c #BBB8BB",
";.	c #BF0606",
">.	c #C00000",
",.	c #785280",
"'.	c #676565",
").	c #8F1415",
"!.	c #9F7575",
"~.	c #FD5E5E",
"{.	c #FFFFFF",
"].	c #BFBFBF",
"^.	c #435569",
"/.	c #78AFE9",
"(.	c #6097D1",
"_.	c #BDC2C7",
":.	c #7D8B9A",
"<.	c #3D5D85",
"[.	c #BC0102",
"}.	c #BD0202",
"|.	c #6C6096",
"1.	c #676767",
"2.	c #878080",
"3.	c #DC5B5B",
"4.	c #FF3F3F",
"5.	c #FFFFFE",
"6.	c #2E4966",
"7.	c #4B94E1",
"8.	c #417EBF",
"9.	c #436C97",
"0.	c #3A7DC5",
"a.	c #3A71B2",
"b.	c #8C1826",
"c.	c #434A75",
"d.	c #3F87D4",
"e.	c #152D46",
"f.	c #878787",
"g.	c #DCBEBE",
"h.	c #FFFCFC",
"i.	c #BCBCBC",
"j.	c #244364",
"k.	c #428FE0",
"l.	c #2F7CCF",
"m.	c #428EDF",
"n.	c #4390E0",
"o.	c #397ABF",
"p.	c #3066A0",
"q.	c #214871",
"r.	c #09141F",
"s.	c #DCDCDC",
"t.	c #FEFEFE",
"u.	c #9C9C9C",
"v.	c #214061",
"w.	c #428FDF",
"x.	c #2A5B8F",
"y.	c #0C1A2A",
"z.	c #4C4C4C",
"A.	c #3F3F3F",
"B.	c #DADADA",
"C.	c #DDDDDD",
"D.	c #66686B",
"E.	c #35506E",
"F.	c #1F4165",
"G.	c #3169A5",
"H.	c #102337",
"I.	c #000000",
"J.	c #5C5C5C",
"K.	c #0F0F0F",
"L.	c #374B61",
"M.	c #699DD6",
"N.	c #214469",
"O.	c #3573B4",
"P.	c #152C45",
"Q.	c #0A1015",
"R.	c #070F17",
"                      . +       ",
"                  @ # $ % & *   ",
"              = - ; > , ' ) !   ",
"          ~ { ] ^ / ( _ : < [ } ",
"      | 1 2 3 4 5 6 7 : 8 5 9 0 ",
"    a b c d e f g h ) i j k l m ",
"  n o p q r ) s t u , v w x y z ",
"  A B C D E F G e H I J K L M N ",
"  O P Q R S T 9 U V W X Y Z ` N ",
" ...+.@.#.#.$.%.&.*.=.-.;.>.,.N ",
"'.).!.~.{.].^./.(._.:.<.[.}.|.N ",
"1.2.3.4.5.#.6.7.8.9.0.a.b.c.d.e.",
"1.f.g.h.5.i.j.k.l.m.n.o.p.q.r.  ",
"1.f.s.{.t.u.v.n.k.n.w.x.y.      ",
"z.A.B.C.D.E.F.n.n.G.H.          ",
"  I.J.K.L.M.N.O.P.              ",
"          Q.R.                  "};
