<?xml version="1.0" encoding="UTF-8" standalone="no"?>
<!DOCTYPE svg PUBLIC "-//W3C//DTD SVG 20010904//EN"
"http://www.w3.org/TR/2001/REC-SVG-20010904/DTD/svg10.dtd">
<!-- Created with Sodipodi ("http://www.sodipodi.com/") -->
<svg
   id="svg604"
   sodipodi:version="0.32"
   width="72pt"
   height="72pt"
   sodipodi:docbase="/home/zeus/images/icons/gartoon/svg/"
   sodipodi:docname="/home/zeus/images/icons/gartoon/svg/gnome-fs-regular.svg"
   xmlns="http://www.w3.org/2000/svg"
   xmlns:sodipodi="http://sodipodi.sourceforge.net/DTD/sodipodi-0.dtd"
   xmlns:xlink="http://www.w3.org/1999/xlink">
  <defs
     id="defs606">
    <linearGradient
       id="linearGradient705">
      <stop
         style="stop-color:#7fa8e3;stop-opacity:0.741176;"
         offset="0.000000"
         id="stop706" />
      <stop
         style="stop-color:#ffffff;stop-opacity:0;"
         offset="1.000000"
         id="stop707" />
    </linearGradient>
    <linearGradient
       id="linearGradient612">
      <stop
         style="stop-color:#ffffff;stop-opacity:1;"
         offset="0.000000"
         id="stop613" />
      <stop
         style="stop-color:#ffffff;stop-opacity:0;"
         offset="1.000000"
         id="stop614" />
    </linearGradient>
    <linearGradient
       xlink:href="#linearGradient705"
       id="linearGradient615"
       x1="50.6438866"
       y1="5.36792946"
       x2="35.7520943"
       y2="68.0443573"
       gradientUnits="userSpaceOnUse"
       spreadMethod="pad" />
    <radialGradient
       xlink:href="#linearGradient612"
       id="radialGradient704"
       cx="8.17300129"
       cy="62.0631676"
       fx="8.17300129"
       fy="62.0631676"
       r="4.03522396"
       gradientUnits="userSpaceOnUse"
       spreadMethod="pad"
       gradientTransform="matrix(1.111950,0.000000,0.000000,0.899321,3.428790e-7,-1.512959e-6)" />
    <radialGradient
       xlink:href="#linearGradient612"
       id="radialGradient708"
       cx="0.05366803"
       cy="0.10153580"
       fx="0.05366803"
       fy="0.10153580"
       r="0.75628221"
       gradientUnits="objectBoundingBox"
       spreadMethod="pad" />
  </defs>
  <sodipodi:namedview
     id="base" />
  <path
     style="fill:#000000;fill-rule:evenodd;stroke:none;stroke-opacity:1;stroke-width:1pt;stroke-linejoin:miter;stroke-linecap:butt;fill-opacity:0.301471;"
     d="M 12.8163 74.753 C 10.3856 73.6481 7.07107 70.1126 8.83884 65.2512 C 9.72267 59.948 25.6326 13.1021 29.1682 10.8924 C 31.3778 8.90368 34.582 8.13026 39.1119 9.34561 C 42.8684 10.2295 76.6769 19.0684 78.6656 20.8361 C 80.6544 22.6039 82.2012 24.0402 80.6544 27.9072 C 79.5496 29.8959 66.4017 74.532 66.1808 77.4047 C 65.2969 80.4983 62.7558 84.2548 58.5573 84.0338 C 54.3589 83.8128 15.9099 75.4159 12.8163 74.753 z "
     id="path794"
     sodipodi:nodetypes="ccccccccc"
     transform="matrix(1.114903,0.000000,0.000000,1.114903,-5.305332,-3.889256)" />
  <path
     style="fill:#143c69;fill-rule:evenodd;stroke:none;stroke-opacity:1;stroke-width:1pt;stroke-linejoin:miter;stroke-linecap:butt;fill-opacity:1;"
     d="M 12.8163 74.753 C 10.3856 73.6481 7.07107 70.1126 8.83884 65.2512 C 9.72267 59.948 25.6326 13.1021 29.1682 10.8924 C 31.3778 8.90368 34.582 8.13026 39.1119 9.34561 C 42.8684 10.2295 76.6769 19.0684 78.6656 20.8361 C 80.6544 22.6039 82.2012 24.0402 80.6544 27.9072 C 79.5496 29.8959 66.4017 74.532 66.1808 77.4047 C 65.2969 80.4983 62.7558 84.2548 58.5573 84.0338 C 54.3589 83.8128 15.9099 75.4159 12.8163 74.753 z "
     id="path609"
     sodipodi:nodetypes="ccccccccc"
     transform="matrix(1.114903,0.000000,0.000000,1.114903,-8.162471,-8.460684)" />
  <path
     style="fill:#ffffff;fill-rule:evenodd;stroke:none;stroke-opacity:1;stroke-width:1pt;stroke-linejoin:miter;stroke-linecap:butt;fill-opacity:1;"
     d="M 17.8987 70.9965 C 15.3576 70.3336 11.7114 69.6706 13.0373 65.6932 C 15.468 55.9705 27.8424 18.6264 33.1456 13.986 C 34.361 12.8811 38.4489 12.4392 46.1829 14.8699 C 55.0218 17.5215 72.9204 23.4877 74.6882 24.3716 C 76.4559 25.2555 77.1189 25.2555 75.793 29.233 C 73.8043 33.2105 64.9655 67.24 62.7557 72.9852 C 61.209 77.0732 60.8775 78.9514 58.2258 78.9514 "
     id="path608"
     sodipodi:nodetypes="cccccccs"
     transform="matrix(1.114903,0.000000,0.000000,1.114903,-8.162471,-8.460684)" />
  <path
     style="fill:url(#linearGradient615);fill-rule:evenodd;stroke:none;stroke-opacity:1;stroke-width:1pt;stroke-linejoin:miter;stroke-linecap:butt;fill-opacity:1;"
     d="M 28.75 13.75 C 28.75 13.75 31.875 7.49995 39.6875 9.37495 C 47.5 11.25 78.125 19.375 77.8125 21.875 C 77.5 24.375 71.875 39.0625 71.5625 40.3125 C 71.25 41.5625 42.5 40.9375 31.5625 47.5 C 20.625 54.0625 12.5 59.6875 12.5 59.6875 C 12.5 59.6875 23.75 24.6875 28.75 13.75 z "
     id="path636"
     transform="matrix(0.946780,0.000000,0.000000,0.946780,-0.480566,0.409517)" />
  <path
     style="font-size:12;fill:#0d0000;fill-opacity:0.301471;fill-rule:evenodd;stroke-width:1pt;"
     d="M 7.73398 34.2049 L 12.0429 51.3301 C 5.08232 51.2196 4.19844 55.9705 4.64039 59.1746 C 6.73961 68.2343 17.4567 65.6933 24.5277 62.7102 C 23.6438 59.506 20.3293 44.3696 19.8874 41.7178 C 23.7543 40.7235 31.8198 38.4033 31.8198 38.4033 C 31.8198 38.4033 34.6924 45.5849 35.1343 47.0212 C 26.0745 46.6897 25.4117 52.3244 26.1851 54.8656 C 27.6214 61.9367 34.0295 61.8262 37.5651 60.8318 C 40.8796 60.2795 45.52 58.2907 48.0612 57.1859 C 47.0668 53.3189 38.3384 29.233 37.2336 26.1394 C 32.9246 27.6862 7.62349 34.4258 7.73398 34.2049 z "
     id="path635"
     sodipodi:nodetypes="cccccccccccc"
     transform="matrix(1.035546,0.000000,0.000000,1.035546,15.56160,-11.72637)" />
  <path
     style="font-size:12;fill:#0d3c07;fill-rule:evenodd;stroke-width:1pt;"
     d="M 7.73398 34.2049 L 12.0429 51.3301 C 5.08232 51.2196 4.19844 55.9705 4.64039 59.1746 C 6.73961 68.2343 17.4567 65.6933 24.5277 62.7102 C 23.6438 59.506 20.3293 44.3696 19.8874 41.7178 C 23.7543 40.7235 31.8198 38.4033 31.8198 38.4033 C 31.8198 38.4033 34.6924 45.5849 35.1343 47.0212 C 26.0745 46.6897 25.4117 52.3244 26.1851 54.8656 C 27.6214 61.9367 34.0295 61.8262 37.5651 60.8318 C 40.8796 60.2795 45.52 58.2907 48.0612 57.1859 C 47.0668 53.3189 38.3384 29.233 37.2336 26.1394 C 32.9246 27.6862 7.62349 34.4258 7.73398 34.2049 z "
     id="path616"
     sodipodi:nodetypes="cccccccccccc"
     transform="translate(14.83929,-11.42410)" />
  <path
     style="font-size:12;fill:#2aaf18;fill-rule:evenodd;stroke-width:1pt;"
     d="M 15.7994 54.2027 L 11.159 35.9726 L 35.7973 29.1225 L 44.7466 54.9761 C 44.7466 54.9761 33.3666 59.506 31.7093 57.5173 C 28.9471 57.4067 26.7375 51.2197 33.4771 50.0043 C 37.1231 49.8938 38.5594 49.6728 39.5538 50.0042 L 33.3666 34.0944 L 15.247 39.3977 L 20.3293 60.0584 C 20.3293 60.0584 13.7002 64.9198 7.95495 60.1689 C 6.73961 59.0641 6.62912 56.0809 8.61786 54.9761 C 10.2751 52.8769 15.6889 54.4237 15.7994 54.2027 z "
     id="path574"
     sodipodi:nodetypes="ccccccccccccc"
     transform="translate(14.83929,-11.42410)" />
  <path
     transform="matrix(1.488889,0.000000,0.000000,1.488889,8.836250,-40.12308)"
     style="font-size:12;fill-rule:evenodd;stroke-width:1pt;fill:url(#radialGradient704);"
     d="M 14.4736 57.5725 C 12.6184 56.7928 11.9994 58.2032 11.601 60.0584 C 10.0153 60.0584 8.87676 59.2416 8.87676 57.8693 C 8.87676 56.4971 9.94109 55.5318 11.5268 55.5318 C 13.1125 55.5318 14.4736 56.2003 14.4736 57.5725 z "
     id="path623"
     sodipodi:nodetypes="ccccc" />
  <path
     style="font-size:12;fill-rule:evenodd;stroke-width:1pt;fill:url(#radialGradient708);"
     d="M 37.3441 53.6503 C 33.3666 51.8834 34.4706 54.4237 33.6428 56.8544 C 31.5997 56.8544 29.9416 55.4189 29.9416 53.6503 C 29.9416 51.8816 31.5997 50.4462 33.6428 50.4462 C 35.6859 50.4462 37.3441 51.8816 37.3441 53.6503 z "
     id="path625"
     sodipodi:nodetypes="ccccc"
     transform="translate(14.83929,-11.42410)" />
  <path
     style="font-size:12;fill:#34674b;fill-rule:evenodd;stroke-width:1pt;"
     d="M 15.3575 39.5082 L 33.3666 34.2049 L 33.8085 32.5476 L 15.7994 37.7404 L 15.3575 39.5082 z "
     id="path630"
     sodipodi:nodetypes="ccccc"
     transform="translate(14.83929,-11.42410)" />
  <path
     style="font-size:12;fill:#cbff87;fill-rule:evenodd;stroke-width:1pt;"
     d="M 11.159 35.9726 L 13.3687 36.5251 L 36.1287 30.2274 L 35.6868 29.1225 L 11.159 35.9726 z "
     id="path631"
     transform="translate(14.83929,-11.42410)" />
  <path
     style="font-size:12;fill:#cbff87;fill-rule:evenodd;stroke-width:1pt;"
     d="M 33.6981 32.879 L 39.6643 49.8938 L 33.2561 34.2049 L 33.6981 32.879 z "
     id="path633"
     transform="translate(14.83929,-11.42410)" />
  <path
     style="font-size:12;fill:#cbff87;fill-rule:evenodd;stroke-width:1pt;"
     d="M 13.1478 36.1936 C 13.1478 36.1936 16.1309 54.3132 16.0204 54.3132 C 15.9099 54.3132 11.2695 36.0831 11.2695 36.0831 L 13.1478 36.1936 z "
     id="path634"
     transform="translate(14.83929,-11.42410)" />
  <path
     transform="matrix(0.971361,0.237605,-0.237605,0.971361,0.000000,0.000000)"
     style="font-size:13;font-weight:bold;fill:#133b68;fill-opacity:0.995768;stroke-width:1pt;font-family:Kid Kosmic;"
     d="M 70.0265 52.0782 L 70.0392 52.1163 C 68.4988 53.0981 67.0473 53.881 65.6847 54.465 C 67.8683 55.8022 68.9601 57.1267 68.9601 58.4386 C 68.9601 58.6079 68.9431 58.7729 68.9093 58.9337 C 68.7231 59.8139 68.046 60.4529 66.878 60.8507 C 66.074 61.1215 65.0922 61.2739 63.9327 61.3077 C 62.0792 61.35 59.9083 60.9269 57.42 60.0382 C 57.3185 59.6827 57.2931 59.3823 57.3439 59.1368 C 57.4877 58.4597 57.8517 58.1212 58.4356 58.1212 C 58.5457 58.1212 58.6684 58.1381 58.8038 58.172 C 61.072 58.7306 62.7774 59.0141 63.92 59.0226 C 65.0795 59.0395 65.6931 58.8872 65.7608 58.5655 C 65.837 58.1931 65.3715 57.6388 64.3644 56.9025 C 63.7465 56.4539 63.0652 56.0222 62.3204 55.6075 C 62.2696 55.616 62.2189 55.6202 62.1681 55.6202 C 61.6179 55.6202 61.3429 55.3663 61.3429 54.8585 C 61.3429 54.7654 61.3513 54.6638 61.3683 54.5538 C 61.4783 54.0629 61.9099 53.7456 62.6632 53.6017 C 63.645 53.1277 64.559 52.603 65.4054 52.0275 C 64.0851 52.0613 62.2781 52.1883 59.9845 52.4083 C 59.409 52.4591 59.0408 52.2644 58.88 51.8243 C 58.8377 51.7228 58.8165 51.6212 58.8165 51.5196 C 58.8165 51.1896 59.0323 50.8087 59.464 50.3771 C 62.2739 49.8946 64.851 49.6534 67.1954 49.6534 C 68.0418 49.6534 68.9135 49.6831 69.8107 49.7423 C 70.2761 49.9708 70.5089 50.3305 70.5089 50.8214 C 70.5089 51.38 70.3481 51.7989 70.0265 52.0782 z M 44.8136 54.922 C 44.8898 54.575 45.0971 53.7625 45.4356 52.4845 C 45.7996 51.1134 46.0069 50.4067 46.0577 50.3644 C 46.1085 50.4321 46.1381 50.4744 46.1466 50.4913 L 46.2481 50.1359 L 46.3116 50.1232 C 46.7263 49.7169 47.2595 49.5138 47.9112 49.5138 C 48.1398 49.5138 48.3471 49.5476 48.5333 49.6153 C 50.0144 49.3699 51.4659 49.2514 52.8878 49.2599 C 54.3858 49.2683 55.2534 49.5307 55.4903 50.047 C 56.1251 51.4519 56.4425 52.6665 56.4425 53.6905 C 56.4425 54.9516 55.9728 55.9249 55.0333 56.6105 C 53.6707 57.5922 51.5379 58.0831 48.6349 58.0831 C 47.9916 58.0831 47.3146 58.062 46.6036 58.0196 C 46.5105 58.866 46.4851 59.6954 46.5274 60.5079 C 46.4597 60.8803 46.2947 61.1935 46.0323 61.4474 C 45.7784 61.6928 45.4695 61.8155 45.1056 61.8155 C 44.7416 61.8155 44.3565 61.6251 43.9503 61.2443 C 44.1111 59.0014 44.3989 56.894 44.8136 54.922 z M 46.9591 55.8107 C 47.5261 55.8784 48.2625 55.9122 49.1681 55.9122 C 51.4617 55.8953 52.9724 55.4086 53.7003 54.4523 C 53.8526 54.2576 53.9288 54.0206 53.9288 53.7413 C 53.9288 53.3605 53.7892 52.9077 53.5099 52.3829 C 52.9682 52.0782 52.3419 51.9259 51.631 51.9259 C 50.8692 51.9259 49.6843 52.0952 48.0763 52.4337 C 47.5769 53.5255 47.2045 54.6512 46.9591 55.8107 z M 41.8175 50.2755 C 41.809 50.2501 41.8133 50.212 41.8302 50.1612 C 42.2618 49.6026 42.795 49.3234 43.4298 49.3234 C 44.2338 49.3234 44.6358 49.5688 44.6358 50.0597 C 44.6358 50.1697 44.6062 50.2924 44.547 50.4278 C 44.0476 51.6297 43.6371 53.1404 43.3155 54.9601 C 43.0447 56.4666 42.7823 58.2566 42.5284 60.3302 C 42.4861 60.6941 42.3295 61.003 42.0587 61.2569 C 41.7879 61.5024 41.4747 61.6251 41.1192 61.6251 C 40.7468 61.6251 40.3575 61.4304 39.9513 61.0411 C 40.2898 59.6023 40.6537 57.7065 41.0431 55.3536 C 40.019 56.4454 38.9991 57.3806 37.9835 58.1593 C 37.6619 58.701 37.1964 58.9845 36.587 59.0099 C 35.9184 59.0437 35.5121 58.8152 35.3683 58.3243 C 34.7843 57.0887 34.3442 55.7176 34.048 54.211 C 33.5063 55.963 33.2355 57.7657 33.2355 59.6193 C 33.2355 59.8562 33.2397 60.089 33.2481 60.3175 C 33.1804 60.6899 33.0154 61.003 32.753 61.2569 C 32.4907 61.5024 32.1775 61.6251 31.8136 61.6251 C 31.4496 61.6251 31.0688 61.4347 30.671 61.0538 C 30.9503 57.1437 31.6697 53.5086 32.8292 50.1485 C 33.2947 49.5307 33.9464 49.2556 34.7843 49.3234 C 35.4868 49.3826 35.838 49.6238 35.838 50.047 C 35.838 50.1485 35.8168 50.2501 35.7745 50.3517 C 36.0454 52.6453 36.5828 54.3168 37.3868 55.3663 C 38.741 54.6385 40.2179 52.9415 41.8175 50.2755 z M 29.8839 59.4415 C 29.8839 59.8647 29.6808 60.2371 29.2745 60.5587 C 28.8767 60.8803 28.4493 61.0411 27.9923 61.0411 C 27.823 61.0411 27.6664 61.0157 27.5226 60.965 C 27.0994 60.7957 26.8878 60.4952 26.8878 60.0636 C 26.8878 59.7674 26.9936 59.4796 27.2052 59.2003 C 27.6114 58.684 28.1192 58.4259 28.7286 58.4259 C 28.9064 58.4259 29.0756 58.4555 29.2364 58.5148 C 29.6681 58.6756 29.8839 58.9845 29.8839 59.4415 z "
     id="path890" />
</svg>
