<?xml version="1.0" encoding="UTF-8" standalone="no"?>
<!DOCTYPE svg PUBLIC "-//W3C//DTD SVG 20010904//EN"
"http://www.w3.org/TR/2001/REC-SVG-20010904/DTD/svg10.dtd">
<!-- Created with Sodipodi ("http://www.sodipodi.com/") -->
<svg
   xmlns="http://www.w3.org/2000/svg"
   xmlns:sodipodi="http://sodipodi.sourceforge.net/DTD/sodipodi-0.dtd"
   xmlns:xlink="http://www.w3.org/1999/xlink"
   id="svg604"
   sodipodi:version="0.34"
   width="72pt"
   height="72pt"
   sodipodi:docbase="/home/zeus/.themes/Zeus-Test/gtk-2.0/"
   sodipodi:docname="/home/zeus/.themes/Zeus-Test/gtk-2.0/stock-right.svg">
  <defs
     id="defs606">
    <linearGradient
       id="linearGradient612">
      <stop
         style="stop-color:#7fa8e3;stop-opacity:0.741176;"
         offset="0.000000"
         id="stop613" />
      <stop
         style="stop-color:#ffffff;stop-opacity:0;"
         offset="1.000000"
         id="stop614" />
    </linearGradient>
    <linearGradient
       xlink:href="#linearGradient612"
       id="linearGradient615"
       x1="50.6438866"
       y1="5.36792946"
       x2="35.7520943"
       y2="68.0443573"
       gradientUnits="userSpaceOnUse"
       spreadMethod="pad" />
  </defs>
  <sodipodi:namedview
     id="base" />
  <path
     style="fill:#3d4e67;fill-rule:evenodd;stroke:none;stroke-opacity:1;stroke-width:1pt;stroke-linejoin:miter;stroke-linecap:butt;fill-opacity:1;"
     d="M 18.66009 89.43362 C 14.92703 89.37986 8.668617 87.13797 8.122164 81.12188 C 6.195128 75.04347 -0.503833 17.59218 2.728707 13.59055 C 4.398992 10.44012 8.036168 8.12742 14.50736 7.325687 C 19.80232 6.528341 67.96599 0.29697 71.51747 1.264151 C 75.06908 2.231396 77.86675 3.049285 78.12224 7.900025 C 77.85957 10.53808 86.80538 64.34643 88.1778 67.51946 C 88.83265 71.23609 87.7577 76.42984 82.28122 78.14072 C 76.80484 79.85157 22.98324 88.70747 18.66009 89.43362 z "
     id="path609"
     sodipodi:nodetypes="ccccccccc" />
  <path
     style="fill:#ffffff;fill-rule:evenodd;stroke:none;stroke-opacity:1;stroke-width:1pt;stroke-linejoin:miter;stroke-linecap:butt;fill-opacity:1;"
     d="M 22.97286 83.06131 C 19.35362 83.53121 14.32633 84.51352 13.72584 79.64723 C 11.22531 68.12751 5.492056 22.47217 9.577273 15.0527 C 10.4897 13.30803 15.44364 10.93987 26.69681 9.951256 C 39.4849 8.686354 65.7241 6.762815 68.48531 6.887765 C 71.2464 7.012747 72.0911 6.705294 72.69168 11.57169 C 72.44777 16.74546 80.77746 57.21817 81.26954 64.38397 C 81.65244 69.47087 82.31137 71.63219 78.93286 72.86196 "
     id="path608"
     sodipodi:nodetypes="cccccccs" />
  <path
     style="fill:url(#linearGradient615);fill-rule:evenodd;stroke:none;stroke-opacity:1;stroke-width:1pt;stroke-linejoin:miter;stroke-linecap:butt;fill-opacity:1;"
     d="M 10.48272 21.94195 C 10.48272 21.94195 10.80823 15.03803 20.17776 13.6632 C 29.54726 12.28839 66.65461 7.602412 67.53875 9.994747 C 68.42287 12.38708 69.51748 27.93423 69.79048 29.19194 C 70.06348 30.44962 38.65154 41.20492 30.02597 51.46922 C 21.40038 61.7335 15.3595 70.0392 15.3595 70.0392 C 15.3595 70.0392 10.42022 33.83906 10.48272 21.94195 z "
     id="path636" />
  <path
     style="font-size:12;fill:none;fill-rule:evenodd;stroke:#4a5a71;stroke-width:4.212558;stroke-linecap:round;"
     d="M 16.57824 25.17461 L 65.51829 18.6255 "
     id="path706"
     sodipodi:nodetypes="cc" />
  <path
     style="font-size:12;fill:none;fill-rule:evenodd;stroke:#4a5a71;stroke-width:4.212558;stroke-linecap:round;"
     d="M 31.0645 35.77794 L 66.69284 30.16442 "
     id="path707"
     sodipodi:nodetypes="cc" />
  <path
     style="font-size:12;fill:none;fill-rule:evenodd;stroke:#4a5a71;stroke-width:4.212558;stroke-linecap:round;"
     d="M 19.71042 48.87617 L 67.86742 41.39147 "
     id="path708"
     sodipodi:nodetypes="cc" />
  <path
     style="font-size:12;fill:none;fill-rule:evenodd;stroke:#4a5a71;stroke-width:4.212558;stroke-linecap:round;"
     d="M 38.11187 59.79136 L 69.43347 54.48969 "
     id="path709"
     sodipodi:nodetypes="cc" />
  <path
     style="font-size:12;fill:none;fill-rule:evenodd;stroke:#4a5a71;stroke-width:4.212558;stroke-linecap:round;"
     d="M 23.62561 74.13704 L 72.56565 64.78117 "
     id="path710"
     sodipodi:nodetypes="cc" />
</svg>
