<?xml version="1.0" encoding="UTF-8" standalone="no"?>
<!DOCTYPE svg PUBLIC "-//W3C//DTD SVG 20010904//EN"
"http://www.w3.org/TR/2001/REC-SVG-20010904/DTD/svg10.dtd">
<!-- Created with Sodipodi ("http://www.sodipodi.com/") -->
<!-- Feito por Valessio S. Brito, para Debian-BR-CDD -->
<!-- Desenho protegido sob termos GPL -->
<svg
   xmlns="http://www.w3.org/2000/svg"
   xmlns:xlink="http://www.w3.org/1999/xlink"
   xmlns:sodipodi="http://sodipodi.sourceforge.net/DTD/sodipodi-0.dtd"
   version="1.0"
   x="0.0000000"
   y="0.0000000"
   width="90.000000"
   height="90.000000"
   id="svg940"
   sodipodi:version="0.34"
   sodipodi:docname="/home/valessio/Desktop/gnome-main-menu.svg"
   sodipodi:docbase="/home/valessio/Desktop/">
  <sodipodi:namedview
     id="base" />
  <defs
     id="defs942" />
  <metadata
     id="metadata943">
    <RDF
       id="RDF944">
      <Work
         about=""
         id="Work945">
        <format
           id="format946">image/svg+xml</format>
        <type
           id="type948"
           resource="http://purl.org/dc/dcmitype/StillImage" />
      </Work>
    </RDF>
  </metadata>
  <g
     id="g660"
     transform="matrix(1.006512,0,0,1.01309,-3.811146e-3,-0.592279)">
    <path
       d="M 229.12288,48.178308 C 261.99739,116.06379 289.39907,194.20134 285.08410,297.19655 L 275.43726,297.32643 C 287.54896,244.51473 254.79101,134.04576 214.04940,55.345998 L 229.12288,48.178308 z "
       transform="matrix(0.247622,2.909941e-2,-2.909941e-2,0.247622,-49.41933,-16.70001)"
       style="font-size:12;fill:#005f00;stroke-width:3;"
       id="path1176" />
    <path
       d="M 250.77571,303.29865 C 378.47987,265.50739 558.01613,320.46000 601.47324,345.91955 L 596.42718,352.50134 C 464.19838,316.78782 375.16281,288.32755 247.95761,308.46553 L 250.77571,303.29865 z "
       transform="matrix(0.247622,2.909941e-2,-2.909941e-2,0.247622,-49.41933,-16.70001)"
       style="font-size:12;fill:#005f00;stroke-width:3;"
       id="path1175" />
    <path
       d="M 563.90789,80.849826 C 543.20878,167.42898 544.00958,275.09305 586.03400,343.22824 L 575.94414,345.57644 C 529.52729,271.76653 523.75230,130.36990 535.15318,86.300876 L 563.90789,80.849826 z "
       transform="matrix(0.247622,2.909941e-2,-2.909941e-2,0.247622,-49.41933,-16.70001)"
       style="font-size:12;fill:#005f00;stroke-width:3;"
       id="path1177" />
    <path
       d="M 232.22113,50.982366 C 339.79412,102.95827 507.79318,99.630444 538.35583,92.377494 L 539.33510,100.41417 C 489.62380,108.03273 332.56338,117.56187 234.35206,67.223177 L 232.22113,50.982366 z "
       transform="matrix(0.247622,2.909941e-2,-2.909941e-2,0.247622,-49.41933,-16.70001)"
       style="font-size:12;fill:#005f00;stroke-width:3;"
       id="path1174" />
    <path
       d="M 232.01770,44.340227 C 339.59069,96.316132 507.58975,92.988306 538.15240,85.735356 L 539.13167,93.772036 C 489.42037,101.39059 332.35995,110.91973 234.14863,60.581039 L 232.01770,44.340227 z "
       transform="matrix(0.247622,2.909941e-2,-2.909941e-2,0.247622,-49.41933,-16.70001)"
       style="font-size:12;fill:#008800;stroke-width:3;"
       id="path974" />
    <path
       d="M 246.67827,308.98753 C 374.38243,271.19627 553.91869,326.14888 597.37580,351.60843 L 588.37118,359.57111 C 495.84650,324.45917 392.98410,293.00353 265.77890,313.14151 L 246.67827,308.98753 z "
       transform="matrix(0.247622,2.909941e-2,-2.909941e-2,0.247622,-49.41933,-16.70001)"
       style="font-size:12;fill:#008800;stroke-width:3;"
       id="path973" />
    <path
       d="M 479.81514,17.805800 C 512.68965,85.691282 540.09133,163.82883 535.77636,266.82404 L 526.12952,266.95392 C 538.24122,214.14222 505.48327,103.67325 464.74166,24.973490 L 479.81514,17.805800 z "
       transform="matrix(0.247622,2.909941e-2,-2.909941e-2,0.247622,-113.7683,-16.18666)"
       style="font-size:12;fill:#008800;stroke-width:3;"
       id="path972" />
    <path
       d="M 570.19446,79.399694 C 549.49535,165.97885 550.29615,273.64292 592.32057,341.77811 L 582.23071,344.12631 C 535.81386,270.31640 530.03887,128.91977 541.43975,84.850744 L 570.19446,79.399694 z "
       transform="matrix(0.247622,2.909941e-2,-2.909941e-2,0.247622,-49.41933,-16.70001)"
       style="font-size:12;fill:#008800;stroke-width:3;"
       id="path971" />
    <path
       d="M 390.40130,167.75501 C 367.99368,196.15656 413.47979,201.37376 425.20471,179.97743 C 439.58199,152.15412 416.82324,120.93435 376.15306,131.00802 C 322.38235,139.02769 316.36376,243.51811 411.93944,251.22759 C 434.58477,251.36999 451.87711,247.67201 448.85516,231.50581 C 447.43202,224.23503 419.67608,215.64765 417.32691,195.77486 C 391.44671,209.15885 368.92215,192.23693 373.71055,171.60598 C 379.27285,153.10983 399.65905,148.67724 409.76760,169.49194 C 411.08179,178.97305 382.38361,184.46995 390.40130,167.75501 z "
       transform="matrix(0.247622,2.909941e-2,-2.909941e-2,0.247622,-49.41933,-16.70001)"
       style="font-size:12;fill:#008dc8;fill-rule:evenodd;stroke-width:1;"
       id="path970" />
    <path
       d="M 390.38641,167.65952 C 367.59435,194.24801 423.88576,187.71255 424.08400,163.31506 C 423.57595,132.00078 394.30920,116.12778 358.54651,137.84296 C 316.85357,167.84867 361.12963,270.02031 448.96604,231.56366 C 446.83674,215.81914 441.78355,202.72223 417.98030,195.17495 C 400.61008,204.01834 384.34991,197.26295 378.80058,176.82355 C 372.15936,156.56060 395.73866,140.16836 408.35771,160.59610 C 413.41501,168.53190 375.10801,191.03992 390.38641,167.65952 z "
       transform="matrix(0.247622,2.909941e-2,-2.909941e-2,0.247622,-49.41933,-16.70001)"
       style="font-size:12;fill:#4dd3ff;fill-rule:evenodd;stroke-width:1;"
       id="path969" />
    <path
       d="M 397.23467,298.62322 C 387.08050,267.01520 270.44265,220.18444 242.75570,212.28316 L 253.22187,204.91279 C 293.11409,214.55545 394.86851,260.61596 412.49979,295.72941 L 397.23467,298.62322 z "
       transform="matrix(0.247622,2.909941e-2,-2.909941e-2,0.247622,-49.41933,-16.70001)"
       style="font-size:12;fill:#ffd302;stroke-width:3;"
       id="path1158" />
    <path
       d="M 539.87554,208.51005 C 517.57966,217.19553 457.12168,246.07633 443.07222,304.72908 C 438.84133,304.17993 434.61043,303.63079 430.37954,303.08164 C 452.32705,238.03368 491.84236,222.97607 525.98578,205.85050 C 530.61570,206.73702 535.24562,207.62353 539.87554,208.51005 z "
       transform="matrix(0.247622,2.909941e-2,-2.909941e-2,0.247622,-49.41933,-16.70001)"
       style="font-size:12;fill:#ffd302;stroke-width:3;"
       id="path1159" />
    <path
       d="M 383.71958,88.828073 C 409.38445,125.37508 484.75389,151.97033 527.52680,155.94500 L 514.64507,163.95208 C 465.21012,158.26261 405.28208,134.28196 375.68914,95.920666 L 383.71958,88.828073 z "
       transform="matrix(0.247622,2.909941e-2,-2.909941e-2,0.247622,-49.41933,-16.70001)"
       style="font-size:12;fill:#ffd302;stroke-width:3;"
       id="path1160" />
    <path
       d="M 267.01528,183.77752 C 285.84859,170.23574 326.66347,132.28006 354.60985,88.685890 L 359.34921,90.350880 C 334.72670,134.26968 316.37690,158.33362 270.72423,185.37543 L 267.01528,183.77752 z "
       transform="matrix(0.247622,2.909941e-2,-2.909941e-2,0.247622,-49.41933,-16.70001)"
       style="font-size:12;fill:#ffd302;stroke-width:3;"
       id="path1161" />
    <path
       d="M 658.40801,265.17694 C 648.25384,233.56892 531.61599,186.73816 503.92904,178.83688 L 509.58157,172.78531 C 549.47379,182.42797 656.04185,227.16968 673.67313,262.28313 L 658.40801,265.17694 z "
       transform="matrix(0.247622,2.909941e-2,-2.909941e-2,0.247622,-113.7683,-16.18666)"
       style="font-size:12;fill:#ffe900;stroke-width:3;"
       id="path967" />
    <path
       d="M 534.21000,207.74938 C 511.91412,216.43486 451.45614,245.31566 437.40668,303.96841 C 433.17579,303.41926 428.94489,302.87012 424.71400,302.32097 C 446.66151,237.27301 486.17682,222.21540 520.32024,205.08983 C 524.95016,205.97635 529.58008,206.86286 534.21000,207.74938 z "
       transform="matrix(0.247622,2.909941e-2,-2.909941e-2,0.247622,-49.41933,-16.70001)"
       style="font-size:12;fill:#ffe900;stroke-width:3;"
       id="path965" />
    <path
       d="M 386.93992,85.528584 C 412.60479,122.07559 482.98866,151.70129 525.76157,155.67596 L 517.47438,160.60371 C 468.03943,154.91424 408.50242,130.98247 378.90948,92.621178 L 386.93992,85.528584 z "
       transform="matrix(0.247622,2.909941e-2,-2.909941e-2,0.247622,-49.41933,-16.70001)"
       style="font-size:12;fill:#ffe900;stroke-width:3;"
       id="path963" />
    <path
       d="M 265.14279,174.37904 C 290.09028,163.07415 320.81225,136.94510 343.74312,86.872560 L 355.58779,88.955510 C 330.96528,132.87431 312.61548,156.93825 266.96281,183.98006 L 265.14279,174.37904 z "
       transform="matrix(0.247622,2.909941e-2,-2.909941e-2,0.247622,-49.41933,-16.70001)"
       style="font-size:12;fill:#ffe900;stroke-width:3;"
       id="path961" />
  </g>
</svg>
