<?xml version="1.0" encoding="UTF-8" standalone="no"?>
<!DOCTYPE svg PUBLIC "-//W3C//DTD SVG 20010904//EN"
"http://www.w3.org/TR/2001/REC-SVG-20010904/DTD/svg10.dtd">
<!-- Created with Sodipodi ("http://www.sodipodi.com/") -->
<svg
   xmlns="http://www.w3.org/2000/svg"
   xmlns:sodipodi="http://sodipodi.sourceforge.net/DTD/sodipodi-0.dtd"
   xmlns:xlink="http://www.w3.org/1999/xlink"
   id="svg604"
   sodipodi:version="0.34"
   width="72pt"
   height="72pt"
   sodipodi:docbase="/home/zeus/Project"
   sodipodi:docname="/home/zeus/Project/gtk-italic.svg">
  <defs
     id="defs606">
    <linearGradient
       id="linearGradient612">
      <stop
         style="stop-color:#7fa8e3;stop-opacity:0.741176;"
         offset="0.000000"
         id="stop613" />
      <stop
         style="stop-color:#ffffff;stop-opacity:0;"
         offset="1.000000"
         id="stop614" />
    </linearGradient>
    <linearGradient
       xlink:href="#linearGradient612"
       id="linearGradient615"
       x1="50.6438866"
       y1="5.36792946"
       x2="35.7520943"
       y2="68.0443573"
       gradientUnits="userSpaceOnUse"
       spreadMethod="pad" />
  </defs>
  <sodipodi:namedview
     id="base" />
  <path
     style="fill:#3d4e67;fill-rule:evenodd;stroke:none;stroke-opacity:1;stroke-width:1pt;stroke-linejoin:miter;stroke-linecap:butt;fill-opacity:1;"
     d="M 19.2491 89.14328 C 15.5787 89.08953 9.425319 86.84765 8.888039 80.83154 C 6.993349 74.75314 0.406825 17.30186 3.585106 13.30023 C 5.227361 10.1498 8.803489 7.837098 15.16606 7.035365 C 20.37216 6.238019 67.72743 0.006649 71.21931 0.97383 C 74.71132 1.941075 77.46203 2.758964 77.71323 7.609703 C 77.45497 10.24775 86.25064 64.0561 87.60002 67.22913 C 88.24387 70.94575 87.18696 76.13951 81.80241 77.85038 C 76.41793 79.56123 23.49969 88.41713 19.2491 89.14328 z "
     id="path609"
     sodipodi:nodetypes="ccccccccc" />
  <path
     style="fill:#ffffff;fill-rule:evenodd;stroke:none;stroke-opacity:1;stroke-width:1pt;stroke-linejoin:miter;stroke-linecap:butt;fill-opacity:1;"
     d="M 23.48948 82.77097 C 19.93099 83.24087 14.98807 84.22318 14.39766 79.3569 C 11.93911 67.83718 6.302088 22.18184 10.31872 14.76237 C 11.21584 13.0177 16.08662 10.64955 27.15093 9.660934 C 39.72438 8.396033 65.52318 6.472493 68.23804 6.597443 C 70.95278 6.722426 71.78331 6.414972 72.37381 11.28137 C 72.134 16.45514 80.32389 56.92784 80.80771 64.09364 C 81.18418 69.18054 81.83205 71.34186 78.51023 72.57163 "
     id="path608"
     sodipodi:nodetypes="cccccccs" />
  <path
     style="fill:url(#linearGradient615);fill-rule:evenodd;stroke:none;stroke-opacity:1;stroke-width:1pt;stroke-linejoin:miter;stroke-linecap:butt;fill-opacity:1;"
     d="M 11.20899 21.65162 C 11.20899 21.65162 11.52903 14.74771 20.7413 13.37287 C 29.95353 11.99807 66.43807 7.31209 67.30738 9.704429 C 68.17665 12.09676 69.25289 27.6439 69.52131 28.90162 C 69.78973 30.15929 38.90501 40.9146 30.4242 51.17889 C 21.9434 61.44317 16.0039 69.74887 16.0039 69.74887 C 16.0039 69.74887 11.14753 33.54875 11.20899 21.65162 z "
     id="path636" />
  <path
     transform="matrix(6.730487,-1.323885,1.323885,6.730487,0,0)"
     style="font-size:12;font-weight:bold;fill:#3d4e67;stroke-width:1;font-family:Bitstream Charter;"
     d="M 3.299861 11.51726 L 6.887861 11.51726 L 6.887861 10.92926 L 6.083861 10.86926 L 5.891861 10.67726 L 5.891861 4.281262 L 6.083861 4.113262 L 6.887861 4.053262 L 6.887861 3.465262 L 3.299861 3.465262 L 3.299861 4.053262 L 4.091861 4.113262 L 4.283861 4.281262 L 4.283861 10.67726 L 4.091861 10.86926 L 3.299861 10.92926 L 3.299861 11.51726 z "
     id="path724" />
</svg>
