<?xml version="1.0" encoding="UTF-8" standalone="no"?>
<!DOCTYPE svg PUBLIC "-//W3C//DTD SVG 20010904//EN"
"http://www.w3.org/TR/2001/REC-SVG-20010904/DTD/svg10.dtd">
<!-- Created with Sodipodi ("http://www.sodipodi.com/") -->
<svg
   xmlns="http://www.w3.org/2000/svg"
   xmlns:sodipodi="http://sodipodi.sourceforge.net/DTD/sodipodi-0.dtd"
   xmlns:xlink="http://www.w3.org/1999/xlink"
   id="svg604"
   sodipodi:version="0.34"
   width="72pt"
   height="72pt"
   sodipodi:docbase="/home/zeus"
   sodipodi:docname="/home/zeus/stock_new.svg">
  <defs
     id="defs606">
    <linearGradient
       id="linearGradient671">
      <stop
         style="stop-color:#7fa8e3;stop-opacity:0.741176;"
         offset="0.000000"
         id="stop672" />
      <stop
         style="stop-color:#ffffff;stop-opacity:0;"
         offset="1.000000"
         id="stop673" />
    </linearGradient>
    <linearGradient
       id="linearGradient612">
      <stop
         style="stop-color:#955801;stop-opacity:0.4471;"
         offset="0"
         id="stop613" />
      <stop
         style="stop-color:#000500;stop-opacity:0;"
         offset="1"
         id="stop614" />
    </linearGradient>
    <linearGradient
       xlink:href="#linearGradient612"
       id="linearGradient615"
       x1="36.2169151"
       y1="12.4090004"
       x2="37.9645462"
       y2="72.9033051"
       gradientUnits="userSpaceOnUse"
       spreadMethod="pad" />
    <linearGradient
       xlink:href="#linearGradient671"
       id="linearGradient710"
       x1="36.2169151"
       y1="12.4090004"
       x2="37.9645462"
       y2="72.9033051"
       gradientUnits="userSpaceOnUse" />
  </defs>
  <sodipodi:namedview
     id="base" />
  <path
     style="fill:#000000;fill-rule:evenodd;stroke:none;stroke-opacity:1;stroke-width:1pt;stroke-linejoin:miter;stroke-linecap:butt;fill-opacity:0.3;"
     d="M 23.53202 87.91928 C 20.50708 87.86926 15.43578 85.78222 14.99297 80.18164 C 13.43148 74.52307 8.003192 21.03985 10.62257 17.31462 C 11.97603 14.38177 14.9233 12.22882 20.16699 11.48247 C 24.4576 10.7402 63.48537 4.939206 66.36319 5.839584 C 69.24113 6.740023 71.50811 7.501418 71.71516 12.01713 C 71.50228 14.47297 78.75124 64.56486 79.86331 67.51873 C 80.39395 70.97865 79.52291 75.81367 75.08521 77.40639 C 70.64762 78.99906 27.03514 87.2433 23.53202 87.91928 z "
     id="path829"
     sodipodi:nodetypes="ccccccccc" />
  <path
     style="fill:#7e0000;fill-rule:evenodd;stroke:none;stroke-opacity:1;stroke-width:1pt;stroke-linejoin:miter;stroke-linecap:butt;fill-opacity:1;"
     d="M 18.37677 85.65941 C 15.35182 85.60937 10.28052 83.52233 9.837715 77.92175 C 8.276209 72.26318 2.847939 18.77998 5.467316 15.05474 C 6.820774 12.1219 9.768035 9.968933 15.01175 9.222574 C 19.30234 8.4803 58.33011 2.679322 61.20794 3.579701 C 64.08586 4.48014 66.35286 5.241538 66.55989 9.757243 C 66.34704 12.21309 73.59597 62.30497 74.70806 65.25884 C 75.2387 68.71876 74.36764 73.55379 69.92997 75.1465 C 65.49237 76.73918 21.87989 84.98342 18.37677 85.65941 z "
     id="path609"
     sodipodi:nodetypes="ccccccccc" />
  <path
     style="fill:#ffd056;fill-rule:evenodd;stroke:none;stroke-opacity:1;stroke-width:1pt;stroke-linejoin:miter;stroke-linecap:butt;fill-opacity:1;"
     d="M 21.87148 79.72723 C 18.93875 80.16467 14.86506 81.07914 14.37847 76.54896 C 12.35226 65.82489 7.706506 23.32291 11.01682 16.41589 C 11.75618 14.79172 15.77042 12.58713 24.88906 11.6668 C 35.25144 10.48926 56.51347 8.698579 58.75093 8.814899 C 60.98828 8.931249 61.67276 8.645031 62.15941 13.17532 C 61.96177 17.99174 68.71146 55.66905 69.1102 62.33991 C 69.42046 67.07547 69.9544 69.08751 67.21674 70.23234 "
     id="path608"
     sodipodi:nodetypes="cccccccs" />
  <path
     style="fill:url(#linearGradient615);fill-rule:evenodd;stroke:none;stroke-opacity:1;stroke-width:1pt;stroke-linejoin:miter;stroke-linecap:butt;fill-opacity:1;"
     d="M 11.75053 22.82931 C 11.75053 22.82931 12.01429 16.40224 19.60656 15.12236 C 27.19882 13.84251 57.26748 9.480186 57.98392 11.70729 C 58.70033 13.93438 59.58731 28.40771 59.80853 29.57856 C 60.02975 30.74937 34.57615 40.76181 27.58672 50.31717 C 20.59728 59.87251 15.70225 67.60454 15.70225 67.60454 C 15.70225 67.60454 11.69988 33.90471 11.75053 22.82931 z "
     id="path636" />
  <path
     style="fill:#4e4e4e;fill-rule:evenodd;stroke:none;stroke-opacity:1;stroke-width:1pt;stroke-linejoin:miter;stroke-linecap:butt;fill-opacity:1;"
     d="M 24.96774 3.774195 C 24.96774 3.774195 40.06452 1.161289 40.93549 1.741934 C 41.80646 2.322578 41.80645 6.967745 42.67742 7.548389 C 43.54839 8.129034 47.90323 7.258062 48.48388 8.419352 C 49.06452 9.580641 49.64516 14.51613 49.64516 14.51613 L 21.7742 18.87097 C 21.7742 18.87097 18 13.93548 20.90323 12.19355 C 23.80646 10.45161 26.12904 11.32258 26.12904 9.870968 C 26.12904 8.419352 24.96774 3.774195 24.96774 3.774195 z "
     id="path674" />
  <path
     style="fill:#a4a4a4;fill-rule:evenodd;stroke:none;stroke-opacity:1;stroke-width:1pt;stroke-linejoin:miter;stroke-linecap:butt;fill-opacity:1;"
     d="M 26.48672 4.649906 C 26.48672 4.649906 39.23336 2.389565 39.96875 2.891855 C 40.70414 3.394156 40.41381 8.28352 41.1492 8.78582 C 41.88459 9.28812 45.85182 7.663698 46.34208 8.668289 C 46.83233 9.67289 46.74193 11.61985 47.03226 13.36179 L 24.08064 17.12902 C 23.20968 15.96773 21.18431 14.02078 23.63558 12.51389 C 26.08687 11.00699 28.62853 11.17979 28.62853 9.92404 C 28.62853 8.668289 26.48672 4.649906 26.48672 4.649906 z "
     id="path675"
     sodipodi:nodetypes="ccccccccc" />
  <path
     style="fill:#f8f8f8;fill-rule:evenodd;stroke:none;stroke-opacity:1;stroke-width:1pt;stroke-linejoin:miter;stroke-linecap:butt;fill-opacity:1;"
     d="M 45.29032 9.870968 L 45.58064 13.06452 L 26.41936 15.96774 C 26.41936 15.96774 44.41936 13.35484 45.29032 9.870968 z "
     id="path676" />
  <path
     style="fill:#656565;fill-rule:evenodd;stroke:none;stroke-opacity:1;stroke-width:1pt;stroke-linejoin:miter;stroke-linecap:butt;fill-opacity:1;"
     d="M 27.87097 5.225811 L 29.90323 9.290323 C 29.90323 9.290323 22.93548 12.48387 22.93548 13.64516 C 22.93548 14.80645 24.96774 16.54839 24.96774 16.54839 L 27 15.96774 C 27 15.96774 24.67742 14.51613 25.83871 13.35484 C 27 12.19355 33.3871 11.32257 32.22581 8.999996 C 31.06452 6.677418 28.45161 4.935484 27.87097 5.225811 z "
     id="path677" />
  <path
     style="fill:#000000;fill-rule:evenodd;stroke:none;stroke-opacity:1;stroke-width:1pt;stroke-linejoin:miter;stroke-linecap:butt;fill-opacity:0.3;"
     d="M 41.68582 87.62896 C 39.2912 87.58937 35.27662 85.93721 34.92607 81.50363 C 33.68996 77.02415 29.39277 34.68533 31.46634 31.73633 C 32.53778 29.4146 34.87092 27.71027 39.02198 27.11944 C 42.41854 26.53184 73.314 21.93961 75.5922 22.65237 C 77.8704 23.36518 79.66505 23.96792 79.82897 27.54269 C 79.6604 29.4868 85.39896 69.14095 86.27924 71.47932 C 86.69938 74.21829 86.00981 78.04583 82.49679 79.30666 C 78.98386 80.56747 44.459 87.09384 41.68582 87.62896 z "
     id="path702"
     sodipodi:nodetypes="ccccccccc" />
  <path
     style="fill:#3d4e67;fill-rule:evenodd;stroke:none;stroke-opacity:1;stroke-width:1pt;stroke-linejoin:miter;stroke-linecap:butt;fill-opacity:1;"
     d="M 37.60479 85.83999 C 35.21015 85.80038 31.19556 84.14822 30.84504 79.71464 C 29.6089 75.23516 25.31173 32.89635 27.3853 29.94735 C 28.45674 27.62563 30.78987 25.92128 34.94094 25.33044 C 38.3375 24.74284 69.23296 20.15062 71.51116 20.86338 C 73.78945 21.5762 75.584 22.17894 75.74792 25.7537 C 75.57945 27.69782 81.31791 67.35196 82.19829 69.69033 C 82.61824 72.4293 81.92876 76.25684 78.41574 77.51768 C 74.90281 78.77848 40.37795 85.30486 37.60479 85.83999 z "
     id="path703"
     sodipodi:nodetypes="ccccccccc" />
  <path
     style="fill:#ffffff;fill-rule:evenodd;stroke:none;stroke-opacity:1;stroke-width:1pt;stroke-linejoin:miter;stroke-linecap:butt;fill-opacity:1;"
     d="M 40.37129 81.14391 C 38.04967 81.4902 34.82481 82.21412 34.43961 78.6279 C 32.83562 70.13842 29.15791 36.49266 31.77844 31.02487 C 32.36374 29.73913 35.54152 27.99391 42.7601 27.26536 C 50.96325 26.33319 67.79488 24.91563 69.56608 25.00771 C 71.33731 25.09982 71.87909 24.87324 72.26433 28.45955 C 72.10789 32.27235 77.45118 62.09878 77.7668 67.37961 C 78.01246 71.12842 78.43506 72.72121 76.26793 73.62749 "
     id="path704"
     sodipodi:nodetypes="cccccccs" />
  <path
     style="fill:url(#linearGradient710);fill-rule:evenodd;stroke:none;stroke-opacity:1;stroke-width:1pt;stroke-linejoin:miter;stroke-linecap:butt;fill-opacity:1;"
     d="M 32.35927 36.10192 C 32.35927 36.10192 32.56807 31.01406 38.57832 30.00088 C 44.58857 28.98771 68.39177 25.53437 68.95888 27.29741 C 69.52599 29.06044 70.22823 40.51793 70.40327 41.44481 C 70.57848 42.37166 50.42867 50.29779 44.89564 57.86208 C 39.3626 65.42635 35.48756 71.54725 35.48756 71.54725 C 35.48756 71.54725 32.31917 44.86951 32.35927 36.10192 z "
     id="path705" />
</svg>
