<?xml version="1.0" encoding="UTF-8" standalone="no"?>
<!DOCTYPE svg PUBLIC "-//W3C//DTD SVG 20010904//EN"
"http://www.w3.org/TR/2001/REC-SVG-20010904/DTD/svg10.dtd">
<!-- Created with Sodipodi ("http://www.sodipodi.com/") -->
<svg
   id="svg604"
   sodipodi:version="0.32"
   width="72pt"
   height="72pt"
   sodipodi:docbase="/home/zeus/desktop/icons/gartoon/svg"
   sodipodi:docname="/home/zeus/desktop/icons/gartoon/svg/gnome-mime-audio-aiff.svg"
   xmlns="http://www.w3.org/2000/svg"
   xmlns:sodipodi="http://sodipodi.sourceforge.net/DTD/sodipodi-0.dtd"
   xmlns:xlink="http://www.w3.org/1999/xlink">
  <defs
     id="defs606">
    <linearGradient
       id="linearGradient705">
      <stop
         style="stop-color:#7fa8e3;stop-opacity:0.741176;"
         offset="0.000000"
         id="stop706" />
      <stop
         style="stop-color:#ffffff;stop-opacity:0;"
         offset="1.000000"
         id="stop707" />
    </linearGradient>
    <linearGradient
       id="linearGradient612">
      <stop
         style="stop-color:#ffffff;stop-opacity:1;"
         offset="0.000000"
         id="stop613" />
      <stop
         style="stop-color:#ffffff;stop-opacity:0;"
         offset="1.000000"
         id="stop614" />
    </linearGradient>
    <linearGradient
       xlink:href="#linearGradient705"
       id="linearGradient615"
       x1="50.6438866"
       y1="5.36792946"
       x2="35.7520943"
       y2="68.0443573"
       gradientUnits="userSpaceOnUse"
       spreadMethod="pad" />
    <radialGradient
       xlink:href="#linearGradient612"
       id="radialGradient704"
       cx="8.17300129"
       cy="62.0631676"
       fx="8.17300129"
       fy="62.0631676"
       r="4.03522396"
       gradientUnits="userSpaceOnUse"
       spreadMethod="pad"
       gradientTransform="matrix(1.111950,0.000000,0.000000,0.899321,3.428790e-7,-1.512959e-6)" />
    <radialGradient
       xlink:href="#linearGradient612"
       id="radialGradient708"
       cx="0.05366803"
       cy="0.10153580"
       fx="0.05366803"
       fy="0.10153580"
       r="0.75628221"
       gradientUnits="objectBoundingBox"
       spreadMethod="pad" />
  </defs>
  <sodipodi:namedview
     id="base" />
  <path
     style="fill:#000000;fill-rule:evenodd;stroke:none;stroke-opacity:1;stroke-width:1pt;stroke-linejoin:miter;stroke-linecap:butt;fill-opacity:0.301471;"
     d="M 12.8163 74.753 C 10.3856 73.6481 7.07107 70.1126 8.83884 65.2512 C 9.72267 59.948 25.6326 13.1021 29.1682 10.8924 C 31.3778 8.90368 34.582 8.13026 39.1119 9.34561 C 42.8684 10.2295 76.6769 19.0684 78.6656 20.8361 C 80.6544 22.6039 82.2012 24.0402 80.6544 27.9072 C 79.5496 29.8959 66.4017 74.532 66.1808 77.4047 C 65.2969 80.4983 62.7558 84.2548 58.5573 84.0338 C 54.3589 83.8128 15.9099 75.4159 12.8163 74.753 z "
     id="path794"
     sodipodi:nodetypes="ccccccccc"
     transform="matrix(1.114903,0.000000,0.000000,1.114903,-5.305332,-3.889256)" />
  <path
     style="fill:#143c69;fill-rule:evenodd;stroke:none;stroke-opacity:1;stroke-width:1pt;stroke-linejoin:miter;stroke-linecap:butt;fill-opacity:1;"
     d="M 12.8163 74.753 C 10.3856 73.6481 7.07107 70.1126 8.83884 65.2512 C 9.72267 59.948 25.6326 13.1021 29.1682 10.8924 C 31.3778 8.90368 34.582 8.13026 39.1119 9.34561 C 42.8684 10.2295 76.6769 19.0684 78.6656 20.8361 C 80.6544 22.6039 82.2012 24.0402 80.6544 27.9072 C 79.5496 29.8959 66.4017 74.532 66.1808 77.4047 C 65.2969 80.4983 62.7558 84.2548 58.5573 84.0338 C 54.3589 83.8128 15.9099 75.4159 12.8163 74.753 z "
     id="path609"
     sodipodi:nodetypes="ccccccccc"
     transform="matrix(1.114903,0.000000,0.000000,1.114903,-8.162471,-8.460684)" />
  <path
     style="fill:#ffffff;fill-rule:evenodd;stroke:none;stroke-opacity:1;stroke-width:1pt;stroke-linejoin:miter;stroke-linecap:butt;fill-opacity:1;"
     d="M 17.8987 70.9965 C 15.3576 70.3336 11.7114 69.6706 13.0373 65.6932 C 15.468 55.9705 27.8424 18.6264 33.1456 13.986 C 34.361 12.8811 38.4489 12.4392 46.1829 14.8699 C 55.0218 17.5215 72.9204 23.4877 74.6882 24.3716 C 76.4559 25.2555 77.1189 25.2555 75.793 29.233 C 73.8043 33.2105 64.9655 67.24 62.7557 72.9852 C 61.209 77.0732 60.8775 78.9514 58.2258 78.9514 "
     id="path608"
     sodipodi:nodetypes="cccccccs"
     transform="matrix(1.114903,0.000000,0.000000,1.114903,-8.162471,-8.460684)" />
  <path
     style="fill:url(#linearGradient615);fill-rule:evenodd;stroke:none;stroke-opacity:1;stroke-width:1pt;stroke-linejoin:miter;stroke-linecap:butt;fill-opacity:1;"
     d="M 28.75 13.75 C 28.75 13.75 31.875 7.49995 39.6875 9.37495 C 47.5 11.25 78.125 19.375 77.8125 21.875 C 77.5 24.375 71.875 39.0625 71.5625 40.3125 C 71.25 41.5625 42.5 40.9375 31.5625 47.5 C 20.625 54.0625 12.5 59.6875 12.5 59.6875 C 12.5 59.6875 23.75 24.6875 28.75 13.75 z "
     id="path636"
     transform="matrix(0.946780,0.000000,0.000000,0.946780,-0.480566,0.409517)" />
  <path
     style="font-size:12;fill:#0d0000;fill-opacity:0.301471;fill-rule:evenodd;stroke-width:1pt;"
     d="M 7.73398 34.2049 L 12.0429 51.3301 C 5.08232 51.2196 4.19844 55.9705 4.64039 59.1746 C 6.73961 68.2343 17.4567 65.6933 24.5277 62.7102 C 23.6438 59.506 20.3293 44.3696 19.8874 41.7178 C 23.7543 40.7235 31.8198 38.4033 31.8198 38.4033 C 31.8198 38.4033 34.6924 45.5849 35.1343 47.0212 C 26.0745 46.6897 25.4117 52.3244 26.1851 54.8656 C 27.6214 61.9367 34.0295 61.8262 37.5651 60.8318 C 40.8796 60.2795 45.52 58.2907 48.0612 57.1859 C 47.0668 53.3189 38.3384 29.233 37.2336 26.1394 C 32.9246 27.6862 7.62349 34.4258 7.73398 34.2049 z "
     id="path635"
     sodipodi:nodetypes="cccccccccccc"
     transform="matrix(1.035546,0.000000,0.000000,1.035546,15.56160,-11.72637)" />
  <path
     style="font-size:12;fill:#0d3c07;fill-rule:evenodd;stroke-width:1pt;"
     d="M 7.73398 34.2049 L 12.0429 51.3301 C 5.08232 51.2196 4.19844 55.9705 4.64039 59.1746 C 6.73961 68.2343 17.4567 65.6933 24.5277 62.7102 C 23.6438 59.506 20.3293 44.3696 19.8874 41.7178 C 23.7543 40.7235 31.8198 38.4033 31.8198 38.4033 C 31.8198 38.4033 34.6924 45.5849 35.1343 47.0212 C 26.0745 46.6897 25.4117 52.3244 26.1851 54.8656 C 27.6214 61.9367 34.0295 61.8262 37.5651 60.8318 C 40.8796 60.2795 45.52 58.2907 48.0612 57.1859 C 47.0668 53.3189 38.3384 29.233 37.2336 26.1394 C 32.9246 27.6862 7.62349 34.4258 7.73398 34.2049 z "
     id="path616"
     sodipodi:nodetypes="cccccccccccc"
     transform="translate(14.83929,-11.42410)" />
  <path
     style="font-size:12;fill:#2aaf18;fill-rule:evenodd;stroke-width:1pt;"
     d="M 15.7994 54.2027 L 11.159 35.9726 L 35.7973 29.1225 L 44.7466 54.9761 C 44.7466 54.9761 33.3666 59.506 31.7093 57.5173 C 28.9471 57.4067 26.7375 51.2197 33.4771 50.0043 C 37.1231 49.8938 38.5594 49.6728 39.5538 50.0042 L 33.3666 34.0944 L 15.247 39.3977 L 20.3293 60.0584 C 20.3293 60.0584 13.7002 64.9198 7.95495 60.1689 C 6.73961 59.0641 6.62912 56.0809 8.61786 54.9761 C 10.2751 52.8769 15.6889 54.4237 15.7994 54.2027 z "
     id="path574"
     sodipodi:nodetypes="ccccccccccccc"
     transform="translate(14.83929,-11.42410)" />
  <path
     transform="matrix(1.488889,0.000000,0.000000,1.488889,8.836250,-40.12308)"
     style="font-size:12;fill-rule:evenodd;stroke-width:1pt;fill:url(#radialGradient704);"
     d="M 14.4736 57.5725 C 12.6184 56.7928 11.9994 58.2032 11.601 60.0584 C 10.0153 60.0584 8.87676 59.2416 8.87676 57.8693 C 8.87676 56.4971 9.94109 55.5318 11.5268 55.5318 C 13.1125 55.5318 14.4736 56.2003 14.4736 57.5725 z "
     id="path623"
     sodipodi:nodetypes="ccccc" />
  <path
     style="font-size:12;fill-rule:evenodd;stroke-width:1pt;fill:url(#radialGradient708);"
     d="M 37.3441 53.6503 C 33.3666 51.8834 34.4706 54.4237 33.6428 56.8544 C 31.5997 56.8544 29.9416 55.4189 29.9416 53.6503 C 29.9416 51.8816 31.5997 50.4462 33.6428 50.4462 C 35.6859 50.4462 37.3441 51.8816 37.3441 53.6503 z "
     id="path625"
     sodipodi:nodetypes="ccccc"
     transform="translate(14.83929,-11.42410)" />
  <path
     style="font-size:12;fill:#34674b;fill-rule:evenodd;stroke-width:1pt;"
     d="M 15.3575 39.5082 L 33.3666 34.2049 L 33.8085 32.5476 L 15.7994 37.7404 L 15.3575 39.5082 z "
     id="path630"
     sodipodi:nodetypes="ccccc"
     transform="translate(14.83929,-11.42410)" />
  <path
     style="font-size:12;fill:#cbff87;fill-rule:evenodd;stroke-width:1pt;"
     d="M 11.159 35.9726 L 13.3687 36.5251 L 36.1287 30.2274 L 35.6868 29.1225 L 11.159 35.9726 z "
     id="path631"
     transform="translate(14.83929,-11.42410)" />
  <path
     style="font-size:12;fill:#cbff87;fill-rule:evenodd;stroke-width:1pt;"
     d="M 33.6981 32.879 L 39.6643 49.8938 L 33.2561 34.2049 L 33.6981 32.879 z "
     id="path633"
     transform="translate(14.83929,-11.42410)" />
  <path
     style="font-size:12;fill:#cbff87;fill-rule:evenodd;stroke-width:1pt;"
     d="M 13.1478 36.1936 C 13.1478 36.1936 16.1309 54.3132 16.0204 54.3132 C 15.9099 54.3132 11.2695 36.0831 11.2695 36.0831 L 13.1478 36.1936 z "
     id="path634"
     transform="translate(14.83929,-11.42410)" />
  <path
     style="font-size:13;font-weight:bold;fill:#143c69;stroke-width:1pt;font-family:Kid Kosmic;"
     d="M 63.3552 54.7005 C 65.2764 54.3619 66.6094 54.0192 67.3542 53.6722 C 67.9805 53.833 68.2937 54.1715 68.2937 54.6878 C 68.2937 54.7724 68.2852 54.8613 68.2683 54.9544 C 68.1498 55.5891 67.7689 56.0039 67.1257 56.1985 L 59.3308 57.722 C 59.1446 58.1536 59.0515 58.5133 59.0515 58.8011 C 59.0515 58.9534 59.0769 59.0931 59.1277 59.22 C 59.2377 59.4908 59.2927 59.7828 59.2927 60.096 C 59.2927 60.316 59.2631 60.5488 59.2038 60.7942 C 58.9838 61.2936 58.5691 61.5644 57.9597 61.6067 C 57.3418 61.649 56.9441 61.4755 56.7663 61.0862 C 56.7663 59.5205 56.9441 57.9166 57.2995 56.2747 C 57.6465 54.6582 58.1332 52.7835 58.7595 50.6507 C 59.6905 49.6943 62.7839 49.25 68.0398 49.3177 C 68.6999 49.7154 69.03 50.1767 69.03 50.7015 C 69.03 51.2939 68.628 51.7636 67.8239 52.1106 C 66.656 51.8483 65.5388 51.7171 64.4724 51.7171 C 63.4398 51.7255 62.2253 52.0852 60.8288 52.7962 C 60.4818 53.7356 60.211 54.5227 60.0163 55.1575 C 60.6257 55.149 61.7387 54.9967 63.3552 54.7005 z M 50.9392 54.7005 C 52.8604 54.3619 54.1934 54.0192 54.9382 53.6722 C 55.5645 53.833 55.8777 54.1715 55.8777 54.6878 C 55.8777 54.7724 55.8692 54.8613 55.8523 54.9544 C 55.7338 55.5891 55.3529 56.0039 54.7097 56.1985 L 46.9148 57.722 C 46.7286 58.1536 46.6355 58.5133 46.6355 58.8011 C 46.6355 58.9534 46.6609 59.0931 46.7116 59.22 C 46.8217 59.4908 46.8767 59.7828 46.8767 60.096 C 46.8767 60.316 46.8471 60.5488 46.7878 60.7942 C 46.5678 61.2936 46.153 61.5644 45.5437 61.6067 C 44.9258 61.649 44.528 61.4755 44.3503 61.0862 C 44.3503 59.5205 44.528 57.9166 44.8835 56.2747 C 45.2305 54.6582 45.7172 52.7835 46.3435 50.6507 C 47.2745 49.6943 50.3679 49.25 55.6237 49.3177 C 56.2839 49.7154 56.614 50.1767 56.614 50.7015 C 56.614 51.2939 56.212 51.7636 55.4079 52.1106 C 54.24 51.8483 53.1228 51.7171 52.0564 51.7171 C 51.0238 51.7255 49.8093 52.0852 48.4128 52.7962 C 48.0658 53.7356 47.795 54.5227 47.6003 55.1575 C 48.2097 55.149 49.3226 54.9967 50.9392 54.7005 z M 42.4079 49.2542 C 42.8142 49.2542 43.1696 49.3515 43.4743 49.5462 C 43.8298 49.7662 44.0075 50.0667 44.0075 50.4475 C 44.0075 50.5153 44.0033 50.583 43.9948 50.6507 C 42.8015 54.5862 42.0355 57.9335 41.697 60.6927 C 41.5446 61.3782 41.1257 61.6956 40.4402 61.6448 C 39.7461 61.594 39.3907 61.3317 39.3737 60.8577 C 39.7377 57.8108 40.4232 54.1165 41.4304 49.7747 C 41.6758 49.4277 42.0017 49.2542 42.4079 49.2542 z M 29.8015 50.7395 C 30.267 50.3164 31.2995 49.9778 32.8991 49.7239 C 34.2364 49.5123 35.4086 49.4192 36.4157 49.4446 C 37.2367 49.47 37.8165 49.6435 38.155 49.9651 C 38.1973 50.7353 38.2185 51.5097 38.2185 52.2884 C 38.2185 54.7766 38.0111 57.3369 37.5964 59.969 C 37.4864 60.6715 37.1224 61.1328 36.5046 61.3528 C 36.2761 61.429 36.0814 61.4671 35.9206 61.4671 C 35.5821 61.4671 35.3578 61.2978 35.2478 60.9593 C 35.6032 59.7659 35.8402 58.6529 35.9587 57.6204 L 28.9636 58.8011 C 28.8282 59.0634 28.5785 59.5839 28.2146 60.3626 C 28.0538 61.0566 27.639 61.4671 26.9704 61.594 C 26.8012 61.6279 26.6784 61.6448 26.6023 61.6448 C 26.196 61.6448 25.9929 61.484 25.9929 61.1624 C 25.9929 61.0693 26.014 60.972 26.0564 60.8704 C 27.6644 57.3242 28.9128 53.9472 29.8015 50.7395 z M 35.6032 52.428 C 35.4763 52.1318 35.0785 51.9837 34.4099 51.9837 C 33.9698 51.9837 33.4281 52.0641 32.7849 52.2249 C 32.057 52.4111 31.5746 52.6227 31.3376 52.8597 C 31.0329 53.9007 30.6436 54.9798 30.1696 56.097 L 36.0349 54.8401 C 35.9587 54.0361 35.8148 53.232 35.6032 52.428 z M 25.5866 59.4231 C 25.5866 59.8463 25.3835 60.2187 24.9773 60.5403 C 24.5795 60.8619 24.1521 61.0227 23.695 61.0227 C 23.5258 61.0227 23.3692 60.9973 23.2253 60.9466 C 22.8021 60.7773 22.5905 60.4768 22.5905 60.0452 C 22.5905 59.749 22.6963 59.4612 22.9079 59.1819 C 23.3142 58.6656 23.822 58.4075 24.4314 58.4075 C 24.6091 58.4075 24.7784 58.4371 24.9392 58.4964 C 25.3708 58.6572 25.5866 58.9661 25.5866 59.4231 z "
     id="path586"
     transform="matrix(0.971264,0.238004,-0.238004,0.971264,2.801138,0.975943)" />
</svg>
