/* XPM */
static char * menuButtonI_xpm[] = {
"26 42 132 2",
"  	c None",
". 	c #F1F1F1",
"+ 	c #ECECEC",
"@ 	c #EBEBEB",
"# 	c #E9E9E9",
"$ 	c #E7E7E7",
"% 	c #C6C6C6",
"& 	c #737373",
"* 	c #5A5A52",
"= 	c #4A4A4A",
"- 	c #525252",
"; 	c #5A5A5A",
"> 	c #7B7B7B",
", 	c #CECECE",
"' 	c #ADADAD",
") 	c #6B6B6B",
"! 	c #949494",
"~ 	c #D6D6D6",
"{ 	c #EFEFEF",
"] 	c #F7F7F7",
"^ 	c #DEDEDE",
"/ 	c #636363",
"( 	c #B5B5B5",
"_ 	c #E6E6E6",
": 	c #848484",
"< 	c #FFFFFF",
"[ 	c #E4E4E4",
"} 	c #BDBDBD",
"| 	c #D9D9D9",
"1 	c #8C8C8C",
"2 	c #DDDDDD",
"3 	c #A5A5A5",
"4 	c #E1E1E1",
"5 	c #9C9C9C",
"6 	c #424242",
"7 	c #393939",
"8 	c #F0F0F0",
"9 	c #F5F5F5",
"0 	c #FAFAFA",
"a 	c #FDFDFD",
"b 	c #F3F3F3",
"c 	c #747474",
"d 	c #C6C6D6",
"e 	c #6B6BA5",
"f 	c #292984",
"g 	c #000084",
"h 	c #00088C",
"i 	c #00008C",
"j 	c #29298C",
"k 	c #6B6BAD",
"l 	c #CECED6",
"m 	c #ADADBD",
"n 	c #393994",
"o 	c #2942AD",
"p 	c #738CCE",
"q 	c #ADB5E7",
"r 	c #B5C6E7",
"s 	c #B5CEEF",
"t 	c #ADBDE7",
"u 	c #B5BDE7",
"v 	c #ADB5DE",
"w 	c #7B94D6",
"x 	c #294AB5",
"y 	c #31398C",
"z 	c #B5B5BD",
"A 	c #4A4A8C",
"B 	c #0031A5",
"C 	c #4A8CCE",
"D 	c #8CB5DE",
"E 	c #9CBDE7",
"F 	c #94BDDE",
"G 	c #94BDE7",
"H 	c #9CBDEF",
"I 	c #94B5DE",
"J 	c #528CCE",
"K 	c #0029A5",
"L 	c #183994",
"M 	c #216BC6",
"N 	c #639CD6",
"O 	c #7BADDE",
"P 	c #84ADE7",
"Q 	c #73A5DE",
"R 	c #84ADDE",
"S 	c #103994",
"T 	c #0842AD",
"U 	c #397BCE",
"V 	c #4284CE",
"W 	c #4A8CD6",
"X 	c #4A94DE",
"Y 	c #428CD6",
"Z 	c #4A8CDE",
"` 	c #317BCE",
" .	c #0039A5",
"..	c #215AA5",
"+.	c #5294DE",
"@.	c #5A9CE7",
"#.	c #5AA5E7",
"$.	c #63A5EF",
"%.	c #63A5F7",
"&.	c #5AA5EF",
"*.	c #63ADF7",
"=.	c #5294E7",
"-.	c #5A9CDE",
";.	c #18529C",
">.	c #39638C",
",.	c #5294D6",
"'.	c #63A5E7",
").	c #6BADEF",
"!.	c #7BBDFF",
"~.	c #73BDFF",
"{.	c #7BC6FF",
"].	c #73C6FF",
"^.	c #73B5F7",
"/.	c #639CDE",
"(.	c #42638C",
"_.	c #6B737B",
":.	c #426B9C",
"<.	c #8CCEFF",
"[.	c #8CD6FF",
"}.	c #94DEFF",
"|.	c #94D6FF",
"1.	c #63737B",
"2.	c #5A6B73",
"3.	c #426B8C",
"4.	c #639CC6",
"5.	c #84CEF7",
"6.	c #94E7FF",
"7.	c #9CEFFF",
"8.	c #9CE7FF",
"9.	c #94EFFF",
"0.	c #639CBD",
"a.	c #5A6373",
". . . . . . . . . . . . . . . . . . . . . . . . . . ",
"+ + + + + + + + + + + + + + + + + + + + + + + + + + ",
"@ @ @ @ @ @ @ @ @ @ @ @ @ @ @ @ @ @ @ @ @ @ @ @ @ @ ",
"# # # # # # # # # # # # # # # # # # # # # # # # # # ",
"$ $ $ $ % & * = - - - ; - - = ; - - = - > , $ $ $ $ ",
"$ $ $ ' ) ! ~ { ] ] ] ] ] ] ] ] ] ] { ^ ! / ( $ $ $ ",
"_ _ , ) : , { ] ] { ] { ] { < { { ] ] { , : ) , _ _ ",
"[ [ ( & ' , ~ ~ ~ ^ ^ ~ ~ ^ ~ ~ ^ ~ ^ ~ % ' & } [ [ ",
"| | ' ! } % % , , , , % , % % , % , , % % ( 1 ( | | ",
"2 2 3 1 , , ~ ^ ^ $ ^ ^ ^ ^ $ ^ ^ ^ ~ ~ ~ , 1 3 2 2 ",
"4 4 5 > % ^ $ ] < ] ] < ] ] ] ] ] ] ] $ ~ , : 5 4 4 ",
"[ [ ( > ! ^ { < < < < < < < < < < < < { ^ ! > ( [ [ ",
"$ $ $ 3 ) : % ] < < < < < < < < < < ] } : ) 5 $ $ $ ",
"+ + + % ! & - 6 7 7 7 7 7 7 7 7 7 7 6 = & ! % + + + ",
"8 8 8 8 % ' 5 1 1 1 1 ! : 1 1 1 1 1 ! 5 ' } 8 8 8 8 ",
"9 9 9 9 9 9 9 9 9 9 9 9 9 9 9 9 9 9 9 9 9 9 9 9 9 9 ",
"0 0 0 0 0 0 0 0 0 0 0 0 0 0 0 0 0 0 0 0 0 0 0 0 0 0 ",
"a a a a a a a a a a a a a a a a a a a a a a a a a a ",
"0 0 0 0 0 0 0 0 0 0 0 0 0 0 0 0 0 0 0 0 0 0 0 0 0 0 ",
"b b b b b b b b b b b b b b b b b b b b b b b b b b ",
"c c c c c c c c c c c c c c c c c c c c c c c c c c ",
". . . . . . . . . . . . . . . . . . . . . . . . . . ",
"+ + + + + + + + + + + + + + + + + + + + + + + + + + ",
"@ @ @ @ @ @ @ @ @ @ @ @ @ @ @ @ @ @ @ @ @ @ @ @ @ @ ",
"# # # # # # # # # # # # # # # # # # # # # # # # # # ",
"$ $ $ $ $ $ $ $ $ $ $ $ $ $ $ $ $ $ $ $ $ $ $ $ $ $ ",
"$ $ $ $ d e f g g g g h g g g i g i g j k l $ $ $ $ ",
"_ _ _ m n o p q r s r t r r u r r r v w x y z _ _ _ ",
"[ [ , A B C D E E F G E E F H I E E G D J K A , [ [ ",
"| | ( L M N O O O O P Q O R Q O O O O Q N M S } | | ",
"2 2 ' T U V V W X W W W W Y Y Z W W W V V `  .( 2 2 ",
"4 4 3 ..W +.@.#.$.%.&.$.*.&.%.$.&.$.=.-.-.W ;.3 4 4 ",
"[ [ 5 >.,.'.).!.!.~.{.{.~.].!.!.!.{.~.^./.,.(.5 [ [ ",
"$ $ ( _.:.).!.<.[.}.}.[.[.[.[.[.}.<.|.!.).:.1.( $ $ ",
"+ + + 3 2.3.4.5.6.7.}.8.7.6.6.6.6.9.5.0.3.a.5 + + + ",
"8 8 8 % ! & - 6 7 7 7 7 7 7 7 7 7 7 6 = & ! % 8 8 8 ",
"9 9 9 9 % ' 5 1 1 1 1 ! : 1 1 1 1 1 ! 5 ' } 9 9 9 9 ",
"0 0 0 0 0 0 0 0 0 0 0 0 0 0 0 0 0 0 0 0 0 0 0 0 0 0 ",
"a a a a a a a a a a a a a a a a a a a a a a a a a a ",
"0 0 0 0 0 0 0 0 0 0 0 0 0 0 0 0 0 0 0 0 0 0 0 0 0 0 ",
"b b b b b b b b b b b b b b b b b b b b b b b b b b ",
"c c c c c c c c c c c c c c c c c c c c c c c c c c "};
