<?xml version="1.0" encoding="UTF-8" standalone="no"?>
<!DOCTYPE svg PUBLIC "-//W3C//DTD SVG 20010904//EN"
"http://www.w3.org/TR/2001/REC-SVG-20010904/DTD/svg10.dtd">
<!-- Created with Sodipodi ("http://www.sodipodi.com/") -->
<svg
   id="svg604"
   sodipodi:version="0.32"
   width="72pt"
   height="72pt"
   sodipodi:docbase="/home/zeus/.icons/gartoon/scalable/mimetypes/"
   sodipodi:docname="/home/zeus/.icons/gartoon/scalable/mimetypes/gnome-mime-video-mpeg.svg"
   xmlns="http://www.w3.org/2000/svg"
   xmlns:sodipodi="http://sodipodi.sourceforge.net/DTD/sodipodi-0.dtd"
   xmlns:xlink="http://www.w3.org/1999/xlink">
  <defs
     id="defs606">
    <linearGradient
       id="linearGradient575">
      <stop
         style="stop-color:#de8a17;stop-opacity:0.741176;"
         offset="0.000000"
         id="stop576" />
      <stop
         style="stop-color:#1ac5aa;stop-opacity:0.929412;"
         offset="1.000000"
         id="stop577" />
    </linearGradient>
    <linearGradient
       id="linearGradient612">
      <stop
         style="stop-color:#7fa8e3;stop-opacity:0.741176;"
         offset="0.000000"
         id="stop613" />
      <stop
         style="stop-color:#ffffff;stop-opacity:0;"
         offset="1.000000"
         id="stop614" />
    </linearGradient>
    <linearGradient
       xlink:href="#linearGradient612"
       id="linearGradient615"
       x1="50.6438866"
       y1="5.36792946"
       x2="35.7520943"
       y2="68.0443573"
       gradientUnits="userSpaceOnUse"
       spreadMethod="pad" />
    <linearGradient
       xlink:href="#linearGradient575"
       id="linearGradient574"
       x1="38.7992325"
       y1="47.4790993"
       x2="23.6706333"
       y2="51.0043793"
       gradientUnits="userSpaceOnUse"
       spreadMethod="pad"
       gradientTransform="scale(1.044094,0.957768)" />
    <linearGradient
       xlink:href="#linearGradient575"
       id="linearGradient578"
       x1="1.32557678"
       y1="0.18749924"
       x2="0.82945710"
       y2="0.34375003"
       gradientUnits="objectBoundingBox"
       spreadMethod="pad" />
  </defs>
  <sodipodi:namedview
     id="base" />
  <path
     style="fill:#000000;fill-rule:evenodd;stroke:none;stroke-opacity:1;stroke-width:1pt;stroke-linejoin:miter;stroke-linecap:butt;fill-opacity:0.301471;"
     d="M 12.8163 74.753 C 10.3856 73.6481 7.07107 70.1126 8.83884 65.2512 C 9.72267 59.948 25.6326 13.1021 29.1682 10.8924 C 31.3778 8.90368 34.582 8.13026 39.1119 9.34561 C 42.8684 10.2295 76.6769 19.0684 78.6656 20.8361 C 80.6544 22.6039 82.2012 24.0402 80.6544 27.9072 C 79.5496 29.8959 66.4017 74.532 66.1808 77.4047 C 65.2969 80.4983 62.7558 84.2548 58.5573 84.0338 C 54.3589 83.8128 15.9099 75.4159 12.8163 74.753 z "
     id="path794"
     sodipodi:nodetypes="ccccccccc"
     transform="matrix(1.114903,0.000000,0.000000,1.114903,-5.305332,-3.889256)" />
  <path
     style="fill:#3d4e67;fill-rule:evenodd;stroke:none;stroke-opacity:1;stroke-width:1pt;stroke-linejoin:miter;stroke-linecap:butt;fill-opacity:1;"
     d="M 12.8163 74.753 C 10.3856 73.6481 7.07107 70.1126 8.83884 65.2512 C 9.72267 59.948 25.6326 13.1021 29.1682 10.8924 C 31.3778 8.90368 34.582 8.13026 39.1119 9.34561 C 42.8684 10.2295 76.6769 19.0684 78.6656 20.8361 C 80.6544 22.6039 82.2012 24.0402 80.6544 27.9072 C 79.5496 29.8959 66.4017 74.532 66.1808 77.4047 C 65.2969 80.4983 62.7558 84.2548 58.5573 84.0338 C 54.3589 83.8128 15.9099 75.4159 12.8163 74.753 z "
     id="path609"
     sodipodi:nodetypes="ccccccccc"
     transform="matrix(1.114903,0.000000,0.000000,1.114903,-8.162471,-8.460684)" />
  <path
     style="fill:#ffffff;fill-rule:evenodd;stroke:none;stroke-opacity:1;stroke-width:1pt;stroke-linejoin:miter;stroke-linecap:butt;fill-opacity:1;"
     d="M 17.8987 70.9965 C 15.3576 70.3336 11.7114 69.6706 13.0373 65.6932 C 15.468 55.9705 27.8424 18.6264 33.1456 13.986 C 34.361 12.8811 38.4489 12.4392 46.1829 14.8699 C 55.0218 17.5215 72.9204 23.4877 74.6882 24.3716 C 76.4559 25.2555 77.1189 25.2555 75.793 29.233 C 73.8043 33.2105 64.9655 67.24 62.7557 72.9852 C 61.209 77.0732 60.8775 78.9514 58.2258 78.9514 "
     id="path608"
     sodipodi:nodetypes="cccccccs"
     transform="matrix(1.114903,0.000000,0.000000,1.114903,-8.162471,-8.460684)" />
  <path
     style="fill:url(#linearGradient615);fill-rule:evenodd;stroke:none;stroke-opacity:1;stroke-width:1pt;stroke-linejoin:miter;stroke-linecap:butt;fill-opacity:1;"
     d="M 28.75 13.75 C 28.75 13.75 31.875 7.49995 39.6875 9.37495 C 47.5 11.25 78.125 19.375 77.8125 21.875 C 77.5 24.375 71.875 39.0625 71.5625 40.3125 C 71.25 41.5625 42.5 40.9375 31.5625 47.5 C 20.625 54.0625 12.5 59.6875 12.5 59.6875 C 12.5 59.6875 23.75 24.6875 28.75 13.75 z "
     id="path636"
     transform="matrix(0.946780,0.000000,0.000000,0.946780,-0.480566,0.409517)" />
  <path
     style="font-size:12;fill-rule:evenodd;stroke-width:1pt;"
     d="M 67.7143 20.8571 C 67.9048 22 69.5094 24.7591 69.6999 25.9019 C 67.8904 26.5686 66.6869 27.5383 64.8774 28.205 C 66.4012 34.9669 67.319 38.7993 68.8428 45.5612 C 70.9612 45.2034 72.2713 44.0374 73.7836 42.6695 C 74.0693 44.2886 74.7591 46.6147 75.0448 48.2338 C 60.0003 57.6914 35.2584 67.149 12.2338 67.2122 C 11.7576 65.7836 12.1905 63.1428 11.7143 61.7143 C 13.9221 61.7489 14.6147 61.5816 16.5195 61.3132 C 15.3766 55.5989 14.6377 49.1776 13.4949 43.4633 C 11.2929 43.6307 10.404 43.4949 8.10106 43.5612 C 7.72009 41.5612 7.52382 40.2857 7.14286 38.2857 C 30.4762 36.1905 49.5238 30.9523 67.7143 20.8571 z "
     id="path559"
     sodipodi:nodetypes="ccccccccccccc"
     transform="translate(5.142860,-12.00001)" />
  <path
     style="font-size:12;fill:#f1e36c;fill-rule:evenodd;stroke-width:1pt;fill-opacity:1;"
     d="M 20.9102 59.3924 C 27.3752 59.7628 33.5371 57.9108 39.295 56.0588 C 38.0491 49.4591 37.0053 46.3951 35.7594 39.7954 C 30.3383 42.0851 24.21 43.2636 17.8797 43.533 "
     id="path560"
     sodipodi:nodetypes="cccc"
     transform="translate(5.142860,-12.00001)" />
  <path
     style="font-size:12;fill:#f1e36c;fill-rule:evenodd;stroke-width:1pt;fill-opacity:1;"
     d="M 22.2234 60.6046 C 30.4056 59.6618 35.6583 56.0926 40.8102 53.2304 C 39.5643 46.6307 38.2174 44.6778 36.9715 38.0781 C 31.2474 40.9739 24.4122 43.9706 18.2839 44.7451 "
     id="path561"
     sodipodi:nodetypes="cccc"
     transform="translate(27.97231,-18.06092)" />
  <path
     transform="matrix(0.989443,-0.144927,0.146771,0.989170,0.147348,-9.823467)"
     style="font-size:12;fill:#ffffff;fill-rule:evenodd;stroke-width:1pt;"
     d="M 17.3956 62.593 C 17.3956 63.8494 17.5098 64.9108 17.5098 66.1672 C 19.3789 66.1672 21.1337 66.3623 23.0229 66.0599 C 23.0229 64.8035 23.0027 63.8494 23.0027 62.593 C 21.2076 63.0027 19.2445 62.8954 17.3956 62.593 z "
     id="path563"
     sodipodi:nodetypes="ccccc" />
  <path
     transform="matrix(0.965794,-0.259313,0.261113,0.965308,3.265204,-8.097851)"
     style="font-size:12;fill:#ffffff;fill-rule:evenodd;stroke-width:1pt;"
     d="M 17.3956 62.593 C 17.3956 63.8494 17.5098 64.9108 17.5098 66.1672 C 19.3789 66.1672 21.1337 66.3623 23.0229 66.0599 C 23.0229 64.8035 23.0027 63.8494 23.0027 62.593 C 21.2076 63.0027 19.2445 62.8954 17.3956 62.593 z "
     id="path564"
     sodipodi:nodetypes="ccccc" />
  <path
     transform="matrix(0.965794,-0.259313,0.261113,0.965308,12.35658,-10.52221)"
     style="font-size:12;fill:#ffffff;fill-rule:evenodd;stroke-width:1pt;"
     d="M 17.3956 62.593 C 17.3956 63.8494 17.5098 64.9108 17.5098 66.1672 C 19.3789 66.1672 21.1337 66.3623 23.0229 66.0599 C 23.0229 64.8035 23.0027 63.8494 23.0027 62.593 C 21.2076 63.0027 19.2445 62.8954 17.3956 62.593 z "
     id="path565"
     sodipodi:nodetypes="ccccc" />
  <path
     transform="matrix(0.965794,-0.259313,0.261113,0.965308,21.44796,-13.24963)"
     style="font-size:12;fill:#ffffff;fill-rule:evenodd;stroke-width:1pt;"
     d="M 17.3956 62.593 C 17.3956 63.8494 17.5098 64.9108 17.5098 66.1672 C 19.3789 66.1672 21.1337 66.3623 23.0229 66.0599 C 23.0229 64.8035 23.0027 63.8494 23.0027 62.593 C 21.2076 63.0027 19.2445 62.8954 17.3956 62.593 z "
     id="path566"
     sodipodi:nodetypes="ccccc" />
  <path
     transform="matrix(0.965794,-0.259313,0.261113,0.965308,21.44796,-13.24963)"
     style="font-size:12;fill:#ffffff;fill-rule:evenodd;stroke-width:1pt;"
     d="M 17.3956 62.593 C 17.3956 63.8494 17.5098 64.9108 17.5098 66.1672 C 19.3789 66.1672 21.1337 66.3623 23.0229 66.0599 C 23.0229 64.8035 23.0027 63.8494 23.0027 62.593 C 21.2076 63.0027 19.2445 62.8954 17.3956 62.593 z "
     id="path567"
     sodipodi:nodetypes="ccccc" />
  <path
     transform="matrix(0.965794,-0.259313,0.261113,0.965308,30.03426,-16.78517)"
     style="font-size:12;fill:#ffffff;fill-rule:evenodd;stroke-width:1pt;"
     d="M 17.3956 62.593 C 17.3956 63.8494 17.5098 64.9108 17.5098 66.1672 C 19.3789 66.1672 21.1337 66.3623 23.0229 66.0599 C 23.0229 64.8035 23.0027 63.8494 23.0027 62.593 C 21.2076 63.0027 19.2445 62.8954 17.3956 62.593 z "
     id="path568"
     sodipodi:nodetypes="ccccc" />
  <path
     transform="matrix(0.989443,-0.144927,0.146771,0.989170,-4.297325,-32.65293)"
     style="font-size:12;fill:#ffffff;fill-rule:evenodd;stroke-width:1pt;"
     d="M 17.3956 62.593 C 17.3956 63.8494 17.5098 64.9108 17.5098 66.1672 C 19.3789 66.1672 21.1337 66.3623 23.0229 66.0599 C 23.0229 64.8035 23.0027 63.8494 23.0027 62.593 C 21.2076 63.0027 19.2445 62.8954 17.3956 62.593 z "
     id="path569"
     sodipodi:nodetypes="ccccc" />
  <path
     transform="matrix(0.965794,-0.259313,0.261113,0.965308,-1.179469,-30.92732)"
     style="font-size:12;fill:#ffffff;fill-rule:evenodd;stroke-width:1pt;"
     d="M 17.3956 62.593 C 17.3956 63.8494 17.5098 64.9108 17.5098 66.1672 C 19.3789 66.1672 21.1337 66.3623 23.0229 66.0599 C 23.0229 64.8035 23.0027 63.8494 23.0027 62.593 C 21.2076 63.0027 19.2445 62.8954 17.3956 62.593 z "
     id="path570"
     sodipodi:nodetypes="ccccc" />
  <path
     transform="matrix(0.965794,-0.259313,0.261113,0.965308,7.911911,-33.35167)"
     style="font-size:12;fill:#ffffff;fill-rule:evenodd;stroke-width:1pt;"
     d="M 17.3956 62.593 C 17.3956 63.8494 17.5098 64.9108 17.5098 66.1672 C 19.3789 66.1672 21.1337 66.3623 23.0229 66.0599 C 23.0229 64.8035 23.0027 63.8494 23.0027 62.593 C 21.2076 63.0027 19.2445 62.8954 17.3956 62.593 z "
     id="path571"
     sodipodi:nodetypes="ccccc" />
  <path
     transform="matrix(0.965794,-0.259313,0.261113,0.965308,17.00329,-36.07908)"
     style="font-size:12;fill:#ffffff;fill-rule:evenodd;stroke-width:1pt;"
     d="M 17.3956 62.593 C 17.3956 63.8494 17.5098 64.9108 17.5098 66.1672 C 19.3789 66.1672 21.1337 66.3623 23.0229 66.0599 C 23.0229 64.8035 23.0027 63.8494 23.0027 62.593 C 21.2076 63.0027 19.2445 62.8954 17.3956 62.593 z "
     id="path572"
     sodipodi:nodetypes="ccccc" />
  <path
     transform="matrix(0.965794,-0.259313,0.261113,0.965308,25.58959,-39.61462)"
     style="font-size:12;fill:#ffffff;fill-rule:evenodd;stroke-width:1pt;"
     d="M 17.3956 62.593 C 17.3956 63.8494 17.5098 64.9108 17.5098 66.1672 C 19.3789 66.1672 21.1337 66.3623 23.0229 66.0599 C 23.0229 64.8035 23.0027 63.8494 23.0027 62.593 C 21.2076 63.0027 19.2445 62.8954 17.3956 62.593 z "
     id="path573"
     sodipodi:nodetypes="ccccc" />
  <path
     transform="matrix(0.980119,0.198412,-0.198412,0.980119,0.000000,0.000000)"
     style="font-size:12;font-weight:bold;stroke-width:1pt;font-family:Kid Kosmic;fill:#3d4e67;fill-opacity:1;"
     d="M 66.3837 55.4236 C 66.3212 55.7361 66.1219 55.9939 65.786 56.197 C 65.4813 56.3923 65.161 56.49 64.8251 56.49 C 64.4032 56.49 64.0868 56.2673 63.8759 55.822 C 63.743 55.4392 63.6063 55.0603 63.4657 54.6853 C 61.4657 54.6853 59.9344 55.1892 58.8719 56.197 C 57.7938 57.2361 57.2391 58.2361 57.2079 59.197 C 57.1844 60.1345 57.6766 60.7947 58.6844 61.1775 C 58.9266 61.2712 59.1962 61.3181 59.493 61.3181 C 60.4852 61.3181 61.8212 60.8376 63.5009 59.8767 C 63.5243 59.7986 63.5516 59.6892 63.5829 59.5486 C 63.3641 59.3376 62.9969 59.2322 62.4813 59.2322 C 61.5282 59.2322 60.6727 59.4275 59.9149 59.8181 C 59.4696 59.779 59.1844 59.5329 59.0594 59.0798 C 59.036 58.9939 59.0243 58.9118 59.0243 58.8337 C 59.0243 58.49 59.2079 58.1853 59.5751 57.9197 C 60.036 57.404 60.8876 57.1462 62.1298 57.1462 C 62.5048 57.1462 62.9774 57.1736 63.5477 57.2283 C 64.2977 57.2908 64.7079 57.3259 64.7782 57.3337 C 65.6141 57.7556 66.0321 58.2283 66.0321 58.7517 C 66.0321 59.0017 65.9579 59.3493 65.8094 59.7947 C 65.5907 60.4822 65.2782 60.9431 64.8719 61.1775 C 64.0673 61.7868 63.1259 62.279 62.0477 62.654 C 60.9462 63.0368 59.9032 63.2283 58.9188 63.2283 C 57.4813 63.2283 56.411 62.7751 55.7079 61.8689 C 55.1063 61.0876 54.8055 60.2283 54.8055 59.2908 C 54.8055 58.8767 54.8602 58.4548 54.9696 58.0251 C 55.4696 56.0954 56.7118 54.6267 58.6962 53.6189 C 60.3837 52.7517 62.3094 52.3415 64.4735 52.3884 C 65.2079 52.49 65.7157 52.7439 65.9969 53.1501 C 66.2235 53.4861 66.3485 54.0447 66.3719 54.8259 C 66.4188 55.0525 66.4227 55.2517 66.3837 55.4236 z M 42.9696 57.1931 C 43.0399 56.8728 43.2313 56.1228 43.5438 54.9431 C 43.8798 53.6775 44.0712 53.0251 44.118 52.9861 C 44.1649 53.0486 44.1923 53.0876 44.2001 53.1033 L 44.2938 52.7751 L 44.3524 52.7634 C 44.7352 52.3884 45.2274 52.2009 45.829 52.2009 C 46.0399 52.2009 46.2313 52.2322 46.4032 52.2947 C 47.7704 52.0681 49.1102 51.9587 50.4227 51.9665 C 51.8055 51.9743 52.6063 52.2165 52.8251 52.6931 C 53.411 53.99 53.704 55.1111 53.704 56.0564 C 53.704 57.2204 53.2704 58.1189 52.4032 58.7517 C 51.1454 59.6579 49.1766 60.1111 46.4969 60.1111 C 45.9032 60.1111 45.2782 60.0915 44.6219 60.0525 C 44.536 60.8337 44.5126 61.5993 44.5516 62.3493 C 44.4891 62.6931 44.3368 62.9822 44.0946 63.2165 C 43.8602 63.4431 43.5751 63.5564 43.2391 63.5564 C 42.9032 63.5564 42.5477 63.3806 42.1727 63.029 C 42.3212 60.9587 42.5868 59.0134 42.9696 57.1931 z M 44.9501 58.0134 C 45.4735 58.0759 46.1532 58.1072 46.9891 58.1072 C 49.1063 58.0915 50.5009 57.6423 51.1727 56.7595 C 51.3134 56.5798 51.3837 56.3611 51.3837 56.1033 C 51.3837 55.7517 51.2548 55.3337 50.9969 54.8493 C 50.4969 54.5681 49.9188 54.4275 49.2626 54.4275 C 48.5594 54.4275 47.4657 54.5837 45.9813 54.8962 C 45.5204 55.904 45.1766 56.9431 44.9501 58.0134 z M 40.204 52.904 C 40.1962 52.8806 40.2001 52.8454 40.2157 52.7986 C 40.6141 52.2829 41.1063 52.0251 41.6923 52.0251 C 42.4345 52.0251 42.8055 52.2517 42.8055 52.7048 C 42.8055 52.8064 42.7782 52.9197 42.7235 53.0447 C 42.2626 54.154 41.8837 55.5486 41.5868 57.2283 C 41.3368 58.6189 41.0946 60.2712 40.8602 62.1853 C 40.8212 62.5212 40.6766 62.8064 40.4266 63.0408 C 40.1766 63.2673 39.8876 63.3806 39.5595 63.3806 C 39.2157 63.3806 38.8563 63.2009 38.4813 62.8415 C 38.7938 61.5134 39.1298 59.7634 39.4891 57.5915 C 38.5438 58.5993 37.6024 59.4626 36.6649 60.1814 C 36.368 60.6814 35.9384 60.9431 35.3759 60.9665 C 34.7587 60.9978 34.3837 60.7868 34.2509 60.3337 C 33.7118 59.1931 33.3055 57.9275 33.0321 56.5368 C 32.5321 58.154 32.2821 59.8181 32.2821 61.529 C 32.2821 61.7478 32.286 61.9626 32.2938 62.1736 C 32.2313 62.5173 32.079 62.8064 31.8368 63.0408 C 31.5946 63.2673 31.3055 63.3806 30.9696 63.3806 C 30.6337 63.3806 30.2821 63.2048 29.9149 62.8533 C 30.1727 59.2439 30.8368 55.8884 31.9071 52.7868 C 32.3368 52.2165 32.9384 51.9626 33.7118 52.0251 C 34.3602 52.0798 34.6845 52.3025 34.6845 52.6931 C 34.6845 52.7868 34.6649 52.8806 34.6259 52.9743 C 34.8759 55.0915 35.372 56.6345 36.1141 57.6033 C 37.3641 56.9314 38.7274 55.365 40.204 52.904 z M 29.1884 61.365 C 29.1884 61.7556 29.0009 62.0993 28.6259 62.3962 C 28.2587 62.6931 27.8641 62.8415 27.4423 62.8415 C 27.286 62.8415 27.1415 62.8181 27.0087 62.7712 C 26.618 62.615 26.4227 62.3376 26.4227 61.9392 C 26.4227 61.6658 26.5204 61.4001 26.7157 61.1423 C 27.0907 60.6658 27.5595 60.4275 28.122 60.4275 C 28.286 60.4275 28.4423 60.4548 28.5907 60.5095 C 28.9891 60.6579 29.1884 60.9431 29.1884 61.365 z "
     id="path611" />
</svg>
