<?xml version="1.0" encoding="UTF-8" standalone="no"?>
<!DOCTYPE svg PUBLIC "-//W3C//DTD SVG 20010904//EN"
"http://www.w3.org/TR/2001/REC-SVG-20010904/DTD/svg10.dtd">
<!-- Created with Sodipodi ("http://www.sodipodi.com/") -->
<svg
   id="svg604"
   sodipodi:version="0.32"
   width="72pt"
   height="72pt"
   sodipodi:docbase="/home/zeus/.icons/gartoon/scalable/mimetypes/"
   sodipodi:docname="/home/zeus/.icons/gartoon/scalable/mimetypes/gnome-mime-video-quicktime.svg"
   xmlns="http://www.w3.org/2000/svg"
   xmlns:sodipodi="http://sodipodi.sourceforge.net/DTD/sodipodi-0.dtd"
   xmlns:xlink="http://www.w3.org/1999/xlink">
  <defs
     id="defs606">
    <linearGradient
       id="linearGradient575">
      <stop
         style="stop-color:#de8a17;stop-opacity:0.741176;"
         offset="0.000000"
         id="stop576" />
      <stop
         style="stop-color:#1ac5aa;stop-opacity:0.929412;"
         offset="1.000000"
         id="stop577" />
    </linearGradient>
    <linearGradient
       id="linearGradient612">
      <stop
         style="stop-color:#7fa8e3;stop-opacity:0.741176;"
         offset="0.000000"
         id="stop613" />
      <stop
         style="stop-color:#ffffff;stop-opacity:0;"
         offset="1.000000"
         id="stop614" />
    </linearGradient>
    <linearGradient
       xlink:href="#linearGradient612"
       id="linearGradient615"
       x1="50.6438866"
       y1="5.36792946"
       x2="35.7520943"
       y2="68.0443573"
       gradientUnits="userSpaceOnUse"
       spreadMethod="pad" />
    <linearGradient
       xlink:href="#linearGradient575"
       id="linearGradient574"
       x1="38.7992325"
       y1="47.4790993"
       x2="23.6706333"
       y2="51.0043793"
       gradientUnits="userSpaceOnUse"
       spreadMethod="pad"
       gradientTransform="scale(1.044094,0.957768)" />
    <linearGradient
       xlink:href="#linearGradient575"
       id="linearGradient578"
       x1="1.32557678"
       y1="0.18749924"
       x2="0.82945710"
       y2="0.34375003"
       gradientUnits="objectBoundingBox"
       spreadMethod="pad" />
  </defs>
  <sodipodi:namedview
     id="base" />
  <path
     style="fill:#000000;fill-rule:evenodd;stroke:none;stroke-opacity:1;stroke-width:1pt;stroke-linejoin:miter;stroke-linecap:butt;fill-opacity:0.301471;"
     d="M 12.8163 74.753 C 10.3856 73.6481 7.07107 70.1126 8.83884 65.2512 C 9.72267 59.948 25.6326 13.1021 29.1682 10.8924 C 31.3778 8.90368 34.582 8.13026 39.1119 9.34561 C 42.8684 10.2295 76.6769 19.0684 78.6656 20.8361 C 80.6544 22.6039 82.2012 24.0402 80.6544 27.9072 C 79.5496 29.8959 66.4017 74.532 66.1808 77.4047 C 65.2969 80.4983 62.7558 84.2548 58.5573 84.0338 C 54.3589 83.8128 15.9099 75.4159 12.8163 74.753 z "
     id="path794"
     sodipodi:nodetypes="ccccccccc"
     transform="matrix(1.114903,0.000000,0.000000,1.114903,-5.305332,-3.889256)" />
  <path
     style="fill:#3d4e67;fill-rule:evenodd;stroke:none;stroke-opacity:1;stroke-width:1pt;stroke-linejoin:miter;stroke-linecap:butt;fill-opacity:1;"
     d="M 12.8163 74.753 C 10.3856 73.6481 7.07107 70.1126 8.83884 65.2512 C 9.72267 59.948 25.6326 13.1021 29.1682 10.8924 C 31.3778 8.90368 34.582 8.13026 39.1119 9.34561 C 42.8684 10.2295 76.6769 19.0684 78.6656 20.8361 C 80.6544 22.6039 82.2012 24.0402 80.6544 27.9072 C 79.5496 29.8959 66.4017 74.532 66.1808 77.4047 C 65.2969 80.4983 62.7558 84.2548 58.5573 84.0338 C 54.3589 83.8128 15.9099 75.4159 12.8163 74.753 z "
     id="path609"
     sodipodi:nodetypes="ccccccccc"
     transform="matrix(1.114903,0.000000,0.000000,1.114903,-8.162471,-8.460684)" />
  <path
     style="fill:#ffffff;fill-rule:evenodd;stroke:none;stroke-opacity:1;stroke-width:1pt;stroke-linejoin:miter;stroke-linecap:butt;fill-opacity:1;"
     d="M 17.8987 70.9965 C 15.3576 70.3336 11.7114 69.6706 13.0373 65.6932 C 15.468 55.9705 27.8424 18.6264 33.1456 13.986 C 34.361 12.8811 38.4489 12.4392 46.1829 14.8699 C 55.0218 17.5215 72.9204 23.4877 74.6882 24.3716 C 76.4559 25.2555 77.1189 25.2555 75.793 29.233 C 73.8043 33.2105 64.9655 67.24 62.7557 72.9852 C 61.209 77.0732 60.8775 78.9514 58.2258 78.9514 "
     id="path608"
     sodipodi:nodetypes="cccccccs"
     transform="matrix(1.114903,0.000000,0.000000,1.114903,-8.162471,-8.460684)" />
  <path
     style="fill:url(#linearGradient615);fill-rule:evenodd;stroke:none;stroke-opacity:1;stroke-width:1pt;stroke-linejoin:miter;stroke-linecap:butt;fill-opacity:1;"
     d="M 28.75 13.75 C 28.75 13.75 31.875 7.49995 39.6875 9.37495 C 47.5 11.25 78.125 19.375 77.8125 21.875 C 77.5 24.375 71.875 39.0625 71.5625 40.3125 C 71.25 41.5625 42.5 40.9375 31.5625 47.5 C 20.625 54.0625 12.5 59.6875 12.5 59.6875 C 12.5 59.6875 23.75 24.6875 28.75 13.75 z "
     id="path636"
     transform="matrix(0.946780,0.000000,0.000000,0.946780,-0.480566,0.409517)" />
  <path
     style="font-size:12;fill-rule:evenodd;stroke-width:1pt;"
     d="M 67.7143 20.8571 C 67.9048 22 69.5094 24.7591 69.6999 25.9019 C 67.8904 26.5686 66.6869 27.5383 64.8774 28.205 C 66.4012 34.9669 67.319 38.7993 68.8428 45.5612 C 70.9612 45.2034 72.2713 44.0374 73.7836 42.6695 C 74.0693 44.2886 74.7591 46.6147 75.0448 48.2338 C 60.0003 57.6914 35.2584 67.149 12.2338 67.2122 C 11.7576 65.7836 12.1905 63.1428 11.7143 61.7143 C 13.9221 61.7489 14.6147 61.5816 16.5195 61.3132 C 15.3766 55.5989 14.6377 49.1776 13.4949 43.4633 C 11.2929 43.6307 10.404 43.4949 8.10106 43.5612 C 7.72009 41.5612 7.52382 40.2857 7.14286 38.2857 C 30.4762 36.1905 49.5238 30.9523 67.7143 20.8571 z "
     id="path559"
     sodipodi:nodetypes="ccccccccccccc"
     transform="translate(5.142860,-12.00001)" />
  <path
     style="font-size:12;fill:#f1e36c;fill-rule:evenodd;stroke-width:1pt;fill-opacity:1;"
     d="M 20.9102 59.3924 C 27.3752 59.7628 33.5371 57.9108 39.295 56.0588 C 38.0491 49.4591 37.0053 46.3951 35.7594 39.7954 C 30.3383 42.0851 24.21 43.2636 17.8797 43.533 "
     id="path560"
     sodipodi:nodetypes="cccc"
     transform="translate(5.142860,-12.00001)" />
  <path
     style="font-size:12;fill:#f1e36c;fill-rule:evenodd;stroke-width:1pt;fill-opacity:1;"
     d="M 22.2234 60.6046 C 30.4056 59.6618 35.6583 56.0926 40.8102 53.2304 C 39.5643 46.6307 38.2174 44.6778 36.9715 38.0781 C 31.2474 40.9739 24.4122 43.9706 18.2839 44.7451 "
     id="path561"
     sodipodi:nodetypes="cccc"
     transform="translate(27.97231,-18.06092)" />
  <path
     transform="matrix(0.989443,-0.144927,0.146771,0.989170,0.147348,-9.823467)"
     style="font-size:12;fill:#ffffff;fill-rule:evenodd;stroke-width:1pt;"
     d="M 17.3956 62.593 C 17.3956 63.8494 17.5098 64.9108 17.5098 66.1672 C 19.3789 66.1672 21.1337 66.3623 23.0229 66.0599 C 23.0229 64.8035 23.0027 63.8494 23.0027 62.593 C 21.2076 63.0027 19.2445 62.8954 17.3956 62.593 z "
     id="path563"
     sodipodi:nodetypes="ccccc" />
  <path
     transform="matrix(0.965794,-0.259313,0.261113,0.965308,3.265204,-8.097851)"
     style="font-size:12;fill:#ffffff;fill-rule:evenodd;stroke-width:1pt;"
     d="M 17.3956 62.593 C 17.3956 63.8494 17.5098 64.9108 17.5098 66.1672 C 19.3789 66.1672 21.1337 66.3623 23.0229 66.0599 C 23.0229 64.8035 23.0027 63.8494 23.0027 62.593 C 21.2076 63.0027 19.2445 62.8954 17.3956 62.593 z "
     id="path564"
     sodipodi:nodetypes="ccccc" />
  <path
     transform="matrix(0.965794,-0.259313,0.261113,0.965308,12.35658,-10.52221)"
     style="font-size:12;fill:#ffffff;fill-rule:evenodd;stroke-width:1pt;"
     d="M 17.3956 62.593 C 17.3956 63.8494 17.5098 64.9108 17.5098 66.1672 C 19.3789 66.1672 21.1337 66.3623 23.0229 66.0599 C 23.0229 64.8035 23.0027 63.8494 23.0027 62.593 C 21.2076 63.0027 19.2445 62.8954 17.3956 62.593 z "
     id="path565"
     sodipodi:nodetypes="ccccc" />
  <path
     transform="matrix(0.965794,-0.259313,0.261113,0.965308,21.44796,-13.24963)"
     style="font-size:12;fill:#ffffff;fill-rule:evenodd;stroke-width:1pt;"
     d="M 17.3956 62.593 C 17.3956 63.8494 17.5098 64.9108 17.5098 66.1672 C 19.3789 66.1672 21.1337 66.3623 23.0229 66.0599 C 23.0229 64.8035 23.0027 63.8494 23.0027 62.593 C 21.2076 63.0027 19.2445 62.8954 17.3956 62.593 z "
     id="path566"
     sodipodi:nodetypes="ccccc" />
  <path
     transform="matrix(0.965794,-0.259313,0.261113,0.965308,21.44796,-13.24963)"
     style="font-size:12;fill:#ffffff;fill-rule:evenodd;stroke-width:1pt;"
     d="M 17.3956 62.593 C 17.3956 63.8494 17.5098 64.9108 17.5098 66.1672 C 19.3789 66.1672 21.1337 66.3623 23.0229 66.0599 C 23.0229 64.8035 23.0027 63.8494 23.0027 62.593 C 21.2076 63.0027 19.2445 62.8954 17.3956 62.593 z "
     id="path567"
     sodipodi:nodetypes="ccccc" />
  <path
     transform="matrix(0.965794,-0.259313,0.261113,0.965308,30.03426,-16.78517)"
     style="font-size:12;fill:#ffffff;fill-rule:evenodd;stroke-width:1pt;"
     d="M 17.3956 62.593 C 17.3956 63.8494 17.5098 64.9108 17.5098 66.1672 C 19.3789 66.1672 21.1337 66.3623 23.0229 66.0599 C 23.0229 64.8035 23.0027 63.8494 23.0027 62.593 C 21.2076 63.0027 19.2445 62.8954 17.3956 62.593 z "
     id="path568"
     sodipodi:nodetypes="ccccc" />
  <path
     transform="matrix(0.989443,-0.144927,0.146771,0.989170,-4.297325,-32.65293)"
     style="font-size:12;fill:#ffffff;fill-rule:evenodd;stroke-width:1pt;"
     d="M 17.3956 62.593 C 17.3956 63.8494 17.5098 64.9108 17.5098 66.1672 C 19.3789 66.1672 21.1337 66.3623 23.0229 66.0599 C 23.0229 64.8035 23.0027 63.8494 23.0027 62.593 C 21.2076 63.0027 19.2445 62.8954 17.3956 62.593 z "
     id="path569"
     sodipodi:nodetypes="ccccc" />
  <path
     transform="matrix(0.965794,-0.259313,0.261113,0.965308,-1.179469,-30.92732)"
     style="font-size:12;fill:#ffffff;fill-rule:evenodd;stroke-width:1pt;"
     d="M 17.3956 62.593 C 17.3956 63.8494 17.5098 64.9108 17.5098 66.1672 C 19.3789 66.1672 21.1337 66.3623 23.0229 66.0599 C 23.0229 64.8035 23.0027 63.8494 23.0027 62.593 C 21.2076 63.0027 19.2445 62.8954 17.3956 62.593 z "
     id="path570"
     sodipodi:nodetypes="ccccc" />
  <path
     transform="matrix(0.965794,-0.259313,0.261113,0.965308,7.911911,-33.35167)"
     style="font-size:12;fill:#ffffff;fill-rule:evenodd;stroke-width:1pt;"
     d="M 17.3956 62.593 C 17.3956 63.8494 17.5098 64.9108 17.5098 66.1672 C 19.3789 66.1672 21.1337 66.3623 23.0229 66.0599 C 23.0229 64.8035 23.0027 63.8494 23.0027 62.593 C 21.2076 63.0027 19.2445 62.8954 17.3956 62.593 z "
     id="path571"
     sodipodi:nodetypes="ccccc" />
  <path
     transform="matrix(0.965794,-0.259313,0.261113,0.965308,17.00329,-36.07908)"
     style="font-size:12;fill:#ffffff;fill-rule:evenodd;stroke-width:1pt;"
     d="M 17.3956 62.593 C 17.3956 63.8494 17.5098 64.9108 17.5098 66.1672 C 19.3789 66.1672 21.1337 66.3623 23.0229 66.0599 C 23.0229 64.8035 23.0027 63.8494 23.0027 62.593 C 21.2076 63.0027 19.2445 62.8954 17.3956 62.593 z "
     id="path572"
     sodipodi:nodetypes="ccccc" />
  <path
     transform="matrix(0.965794,-0.259313,0.261113,0.965308,25.58959,-39.61462)"
     style="font-size:12;fill:#ffffff;fill-rule:evenodd;stroke-width:1pt;"
     d="M 17.3956 62.593 C 17.3956 63.8494 17.5098 64.9108 17.5098 66.1672 C 19.3789 66.1672 21.1337 66.3623 23.0229 66.0599 C 23.0229 64.8035 23.0027 63.8494 23.0027 62.593 C 21.2076 63.0027 19.2445 62.8954 17.3956 62.593 z "
     id="path573"
     sodipodi:nodetypes="ccccc" />
  <path
     transform="matrix(0.982311,0.187257,-0.187257,0.982311,8.170246,1.299677)"
     style="font-size:12;font-weight:bold;stroke-width:1pt;font-family:Kid Kosmic;fill:#3d4e67;fill-opacity:1;"
     d="M 49.812 52.7606 C 50.2573 52.7606 50.5385 52.9793 50.6557 53.4168 C 50.6557 55.3778 50.7065 56.7684 50.808 57.5887 C 51.0346 59.3856 51.4955 60.4207 52.1909 60.6942 C 52.9487 60.3582 53.894 59.2372 55.0268 57.3309 C 55.5112 56.5184 56.2338 55.1551 57.1948 53.2411 C 57.4448 53.0067 57.6948 52.8895 57.9448 52.8895 C 58.2182 52.8895 58.4643 52.9872 58.683 53.1825 C 58.9018 53.37 59.0112 53.5965 59.0112 53.8622 C 59.0112 54.0653 58.9252 54.2918 58.7534 54.5418 C 57.5268 57.2137 55.5815 60.1317 52.9174 63.2957 C 52.4643 63.6942 52.0463 63.8934 51.6635 63.8934 C 51.3198 63.8934 51.0034 63.7372 50.7143 63.4247 C 49.2612 61.2137 48.437 58.1629 48.2416 54.2723 C 48.187 53.8895 48.3432 53.5379 48.7104 53.2176 C 49.0463 52.9129 49.4135 52.7606 49.812 52.7606 z M 43.1205 62.3582 C 41.6284 63.3582 40.1596 63.8622 38.7143 63.87 C 37.2612 63.8778 36.0268 63.4207 35.0112 62.4989 C 34.0971 61.6707 33.6401 60.6864 33.6401 59.5457 C 33.6401 57.9989 34.5112 56.4325 36.2534 54.8465 C 37.7612 53.4637 39.312 52.7684 40.9057 52.7606 C 42.3823 52.7528 43.6401 53.3504 44.6791 54.5536 C 45.5307 55.5457 45.9565 56.6278 45.9565 57.7997 C 45.9565 58.0497 45.937 58.3036 45.8979 58.5614 C 45.6791 59.9911 44.7534 61.2567 43.1205 62.3582 z M 41.5268 55.4559 C 41.1674 55.2059 40.7651 55.0809 40.3198 55.0809 C 39.7182 55.0809 39.1049 55.2918 38.4799 55.7137 C 37.8315 56.1512 37.2729 56.659 36.8041 57.2372 C 36.1948 57.9793 35.8901 58.6747 35.8901 59.3231 C 35.8901 59.6512 35.9721 59.9598 36.1362 60.2489 C 36.769 61.3504 37.6987 61.9012 38.9252 61.9012 C 39.8784 61.9012 40.8745 61.5301 41.9135 60.7879 C 42.8666 60.1161 43.3432 59.3582 43.3432 58.5145 C 43.3432 58.202 43.269 57.8817 43.1205 57.5536 C 42.7221 56.6161 42.1909 55.9168 41.5268 55.4559 z M 31.2495 53.534 C 31.2416 53.5106 31.2455 53.4754 31.2612 53.4286 C 31.6596 52.9129 32.1518 52.6551 32.7377 52.6551 C 33.4799 52.6551 33.851 52.8817 33.851 53.3348 C 33.851 53.4364 33.8237 53.5497 33.769 53.6747 C 33.308 54.784 32.9291 56.1786 32.6323 57.8582 C 32.3823 59.2489 32.1401 60.9012 31.9057 62.8153 C 31.8666 63.1512 31.7221 63.4364 31.4721 63.6707 C 31.2221 63.8973 30.933 64.0106 30.6049 64.0106 C 30.2612 64.0106 29.9018 63.8309 29.5268 63.4715 C 29.8393 62.1434 30.1752 60.3934 30.5346 58.2215 C 29.5893 59.2293 28.6479 60.0926 27.7104 60.8114 C 27.4135 61.3114 26.9838 61.5731 26.4213 61.5965 C 25.8041 61.6278 25.4291 61.4168 25.2963 60.9637 C 24.7573 59.8231 24.351 58.5575 24.0776 57.1668 C 23.5776 58.784 23.3276 60.4481 23.3276 62.159 C 23.3276 62.3778 23.3315 62.5926 23.3393 62.8036 C 23.2768 63.1473 23.1245 63.4364 22.8823 63.6707 C 22.6401 63.8973 22.351 64.0106 22.0151 64.0106 C 21.6791 64.0106 21.3276 63.8348 20.9604 63.4832 C 21.2182 59.8739 21.8823 56.5184 22.9526 53.4168 C 23.3823 52.8465 23.9838 52.5926 24.7573 52.6551 C 25.4057 52.7098 25.7299 52.9325 25.7299 53.3231 C 25.7299 53.4168 25.7104 53.5106 25.6713 53.6043 C 25.9213 55.7215 26.4174 57.2645 27.1596 58.2332 C 28.4096 57.5614 29.7729 55.995 31.2495 53.534 z M 20.2338 61.995 C 20.2338 62.3856 20.0463 62.7293 19.6713 63.0262 C 19.3041 63.3231 18.9096 63.4715 18.4877 63.4715 C 18.3315 63.4715 18.187 63.4481 18.0541 63.4012 C 17.6635 63.245 17.4682 62.9676 17.4682 62.5692 C 17.4682 62.2957 17.5659 62.0301 17.7612 61.7723 C 18.1362 61.2957 18.6049 61.0575 19.1674 61.0575 C 19.3315 61.0575 19.4877 61.0848 19.6362 61.1395 C 20.0346 61.2879 20.2338 61.5731 20.2338 61.995 z "
     id="path616" />
</svg>
