<?xml version="1.0" encoding="UTF-8" standalone="no"?>
<!DOCTYPE svg PUBLIC "-//W3C//DTD SVG 20010904//EN"
"http://www.w3.org/TR/2001/REC-SVG-20010904/DTD/svg10.dtd">
<!-- Created with Sodipodi ("http://www.sodipodi.com/") -->
<svg
   xmlns="http://www.w3.org/2000/svg"
   xmlns:sodipodi="http://sodipodi.sourceforge.net/DTD/sodipodi-0.dtd"
   xmlns:xlink="http://www.w3.org/1999/xlink"
   xmlns:inkscape="http://www.inkscape.org/namespaces/inkscape"
   version="1"
   x="0.00000000"
   y="0.00000000"
   width="48pt"
   height="48pt"
   id="svg548"
   sodipodi:version="0.34"
   sodipodi:docname="/home/zeus/.themes/Zeus-Test/gtk-2.0/stock_open.svg"
   sodipodi:docbase="/home/zeus/.themes/Zeus-Test/gtk-2.0/"
   inkscape:version="0.37">
  <sodipodi:namedview
     id="base"
     inkscape:zoom="4.29166667"
     inkscape:cx="36.0000000"
     inkscape:cy="36.0000000"
     inkscape:window-width="1014"
     inkscape:window-height="696"
     inkscape:window-x="0"
     inkscape:window-y="0" />
  <defs
     id="defs550">
    <linearGradient
       x1="0.00000000"
       y1="0.00000000"
       x2="1.00000000"
       y2="0.00000000"
       id="linearGradient632"
       gradientUnits="objectBoundingBox"
       spreadMethod="pad">
      <stop
         style="stop-color:#ffb700;stop-opacity:1;"
         offset="0.000000"
         id="stop633" />
      <stop
         style="stop-color:#ffd58f;stop-opacity:0;"
         offset="1.000000"
         id="stop634" />
    </linearGradient>
    <linearGradient
       x1="0.00000000"
       y1="0.00000000"
       x2="1.00000000"
       y2="0.00000000"
       id="linearGradient556"
       gradientUnits="objectBoundingBox"
       spreadMethod="pad">
      <stop
         style="stop-color:#000000;stop-opacity:1;"
         offset="0.000000"
         id="stop557" />
      <stop
         style="stop-color:#bdf2ff;stop-opacity:0.384314;"
         offset="1.000000"
         id="stop558" />
    </linearGradient>
    <linearGradient
       id="linearGradient559"
       xlink:href="#linearGradient632"
       x1="60.6446152"
       y1="19.2956886"
       x2="35.3705750"
       y2="69.1427994"
       gradientUnits="userSpaceOnUse"
       spreadMethod="pad" />
    <linearGradient
       xlink:href="#linearGradient632"
       id="linearGradient631"
       x1="85.6376572"
       y1="17.4438438"
       x2="73.9162979"
       y2="54.6281815"
       gradientUnits="userSpaceOnUse"
       spreadMethod="pad"
       gradientTransform="scale(0.740666,1.350136)" />
  </defs>
  <path
     d="M 51.29536 9.993893 C 51.72379 9.944163 58.00953 7.965904 57.88755 11.47738 C 57.76558 14.98886 55.69695 40.44295 53.0795 43.60163 C 51.85956 45.63458 48.9898 48.53697 44.2914 50.18836 C 40.47475 51.52328 18.19892 58.90179 16.52281 58.77502 C 14.84668 58.64832 11.2809 59.02629 11.01197 55.23898 C 10.74295 51.4516 9.399904 41.18046 9.538839 37.14821 C 10.08916 33.58706 8.422013 30.92532 12.83475 28.29835 C 15.75721 27.38832 45.60552 14.3055 47.21791 13.76162 C 48.83021 13.21766 50.14451 13.02494 51.29536 9.993893 z "
     style="font-size:12;fill:#000009;fill-opacity:0.301471;fill-rule:evenodd;stroke-width:1pt;"
     id="path783"
     sodipodi:nodetypes="cccccccccc" />
  <path
     d="M 50.80506 8.964857 C 51.23349 8.915166 57.51923 6.936897 57.39725 10.44838 C 57.27528 13.95984 52.34551 39.08338 49.72807 42.24199 C 48.50812 44.27494 45.63836 47.17733 40.93997 48.82873 C 37.12331 50.16364 12.50148 56.58979 10.82535 56.46308 C 9.149239 56.33631 5.58346 56.71428 5.314523 52.92698 C 5.045498 49.13967 5.659484 26.11593 5.885498 25.37601 C 6.435821 21.81479 10.03758 19.89816 11.66237 19.24566 C 14.58482 18.33563 42.2997 9.416237 43.91208 8.872363 C 45.52438 8.328424 49.73205 7.26931 50.80506 8.964857 z "
     style="font-size:12;fill:#593a28;fill-rule:evenodd;stroke-width:1pt;"
     id="path554"
     sodipodi:nodetypes="cccccccccc" />
  <path
     d="M 48.13212 9.877147 C 48.13212 9.877147 49.72515 12.23059 49.87622 12.14172 C 52.06822 11.03235 55.0945 11.33754 54.4291 13.44891 C 54.00345 15.92503 50.38384 39.98296 44.78012 43.38095 C 39.16537 48.10064 11.11232 53.96735 10.38166 54.19489 C 9.651091 54.42237 8.138514 54.09825 8.160678 51.45484 C 8.182842 48.81142 8.016385 28.81098 8.569498 27.67615 C 8.781684 25.83155 9.724356 23.7594 12.39449 22.59314 C 15.06463 21.42689 47.3003 9.759527 48.13212 9.877147 z "
     style="font-size:12;fill:#f1e36c;fill-rule:evenodd;stroke-width:1pt;"
     id="path552"
     sodipodi:nodetypes="ccccccccc" />
  <path
     d="M 41.11029 16.08497 C 41.11029 16.08497 13.31495 23.95377 11.99376 25.64155 C 10.67255 27.3294 10.55354 50.24937 10.49116 50.79188 C 10.42877 51.33446 17.64328 32.4077 20.57822 31.38913 C 23.51315 30.37063 35.82279 27.22389 37.30619 24.12547 C 38.78958 21.02704 39.22062 16.58971 42.29424 15.59075 "
     style="font-size:12;fill:url(#linearGradient631);fill-rule:evenodd;stroke-width:1pt;"
     id="path562"
     sodipodi:nodetypes="cccccc" />
  <path
     d="M 11.3411 51.92665 C 15.89253 42.97654 17.08042 36.9084 19.25713 33.90808 C 21.24517 31.32203 21.82466 31.1835 24.46975 30.23432 C 28.95469 29.21438 37.88704 26.45554 38.16288 25.28151 C 40.11637 25.44743 39.04595 18.10883 43.83168 15.69791 C 46.96768 14.15644 55.04047 10.1151 55.04047 10.1151 L 49.9622 10.16896 C 48.13637 11.34429 40.08853 15.16861 39.28301 16.04713 C 37.68318 16.48262 38.44849 21.57262 36.87497 23.00425 C 35.31528 25.54049 22.41385 28.50996 21.36849 29.02378 C 20.32322 29.53761 18.13268 31.43332 17.20248 33.397 C 13.00602 42.15848 11.97886 48.22768 11.3411 51.92665 z "
     style="font-size:12;fill:#593a28;fill-rule:evenodd;stroke-width:1pt;"
     id="path553"
     sodipodi:nodetypes="cccccccccccc" />
  <path
     style="font-size:12;fill:url(#linearGradient559);fill-rule:evenodd;stroke-width:1pt;"
     d="M 54.0701 14.4659 C 52.41194 14.72094 46.03003 17.65177 43.94311 19.74104 C 42.87662 22.08547 43.44753 26.95736 39.2087 29.16508 C 34.96988 31.37273 25.15511 32.03705 23.50036 34.29823 C 21.8456 36.55948 14.89418 50.09505 14.34321 51.42066 C 13.79231 52.74635 44.95996 44.95333 46.34614 41.56253 C 48.2425 38.17167 51.14894 31.20726 54.0701 14.4659 z "
     id="path635"
     sodipodi:nodetypes="ccccccc" />
</svg>
