<?xml version="1.0" encoding="UTF-8" standalone="no"?>
<!DOCTYPE svg PUBLIC "-//W3C//DTD SVG 20010904//EN"
"http://www.w3.org/TR/2001/REC-SVG-20010904/DTD/svg10.dtd">
<!-- Created with Sodipodi ("http://www.sodipodi.com/") -->
<svg
   xmlns="http://www.w3.org/2000/svg"
   xmlns:xlink="http://www.w3.org/1999/xlink"
   version="1.0"
   x="0"
   y="0"
   width="90"
   height="90"
   id="svg604"
   xmlns:sodipodi="http://sodipodi.sourceforge.net/DTD/sodipodi-0.dtd"
   sodipodi:version="0.34"
   sodipodi:docname="/home/zeus/Project/stock_overline.svg"
   sodipodi:docbase="/home/zeus/Project">
  <sodipodi:namedview
     id="base" />
  <defs
     id="defs606">
    <linearGradient
       id="linearGradient612">
      <stop
         style="stop-color:#7fa8e3;stop-opacity:0.7412;"
         offset="0"
         id="stop613" />
      <stop
         style="stop-color:#ffffff;stop-opacity:0;"
         offset="1"
         id="stop614" />
    </linearGradient>
    <linearGradient
       x1="50.6438866"
       y1="5.36792946"
       x2="35.7520943"
       y2="68.0443573"
       id="linearGradient615"
       xlink:href="#linearGradient612"
       gradientUnits="userSpaceOnUse"
       spreadMethod="pad" />
  </defs>
  <path
     d="M 19.2491 89.14328 C 15.5787 89.08953 9.425319 86.84765 8.888039 80.83154 C 6.993349 74.75314 0.406825 17.30186 3.585106 13.30023 C 5.227361 10.1498 8.803489 7.837098 15.16606 7.035365 C 20.37216 6.238019 67.72743 0.006649 71.21931 0.97383 C 74.71132 1.941075 77.46203 2.758964 77.71323 7.609703 C 77.45497 10.24775 86.25064 64.0561 87.60002 67.22913 C 88.24387 70.94575 87.18696 76.13951 81.80241 77.85038 C 76.41793 79.56123 23.49969 88.41713 19.2491 89.14328 z "
     style="font-size:12;fill:#3d4e67;fill-rule:evenodd;stroke-width:1;"
     id="path609" />
  <path
     d="M 23.48948 82.77097 C 19.93099 83.24087 14.98807 84.22318 14.39766 79.3569 C 11.93911 67.83718 6.302088 22.18184 10.31872 14.76237 C 11.21584 13.0177 16.08662 10.64955 27.15093 9.660934 C 39.72438 8.396033 65.52318 6.472493 68.23804 6.597443 C 70.95278 6.722426 71.78331 6.414972 72.37381 11.28137 C 72.134 16.45514 80.32389 56.92784 80.80771 64.09364 C 81.18418 69.18054 81.83205 71.34186 78.51023 72.57163 "
     style="font-size:12;fill:#ffffff;fill-rule:evenodd;stroke-width:1;"
     id="path608" />
  <path
     d="M 11.20899 21.65162 C 11.20899 21.65162 11.52903 14.74771 20.7413 13.37287 C 29.95353 11.99807 66.43807 7.31209 67.30738 9.704429 C 68.17665 12.09676 69.25289 27.6439 69.52131 28.90162 C 69.78973 30.15929 38.90501 40.9146 30.4242 51.17889 C 21.9434 61.44317 16.0039 69.74887 16.0039 69.74887 C 16.0039 69.74887 11.14753 33.54875 11.20899 21.65162 z "
     style="font-size:12;fill:url(#linearGradient615);fill-rule:evenodd;stroke-width:1;"
     id="path636" />
  <path
     d="M 15.09676 25.25807 L 65.03225 15.67742 "
     style="font-size:12;fill:none;fill-rule:evenodd;stroke:#3d4e67;stroke-width:4.75;"
     id="path680" />
  <path
     style="font-size:12;font-weight:normal;stroke-width:1;font-family:Bitstream Vera Sans;fill:#3d4e67;fill-opacity:1;"
     d="M 42.81449 31.16219 C 38.16896 31.71347 34.67919 33.88348 32.34508 37.67226 C 30.03206 41.45849 29.23015 46.33953 29.9393 52.31534 C 30.64593 58.27001 32.56667 62.8172 35.7016 65.957 C 38.8576 69.09422 42.75834 70.38724 47.40386 69.83597 C 52.04934 69.28469 55.51805 67.11714 57.80991 63.33343 C 60.12294 59.54713 60.92611 54.67669 60.21948 48.72202 C 59.51033 42.74621 57.58832 38.18842 54.4534 35.04869 C 51.33963 31.90641 47.45996 30.61092 42.81449 31.16219 z M 42.19806 25.96767 C 48.82845 25.18085 54.3929 26.77962 58.89138 30.76399 C 63.38742 34.72722 66.07897 40.44641 66.96602 47.92142 C 67.85056 55.3753 66.5723 61.56556 63.1312 66.49211 C 59.68766 71.39752 54.65067 74.24362 48.02028 75.03044 C 41.36878 75.81976 35.78444 74.23409 31.26733 70.27335 C 26.77134 66.31007 24.0798 60.59095 23.19275 53.11594 C 22.3057 45.64093 23.58396 39.45065 27.02751 34.54524 C 30.48969 29.61619 35.54656 26.75699 42.19806 25.96767 z "
     id="path665" />
</svg>
