<?xml version="1.0" encoding="UTF-8" standalone="no"?>
<!DOCTYPE svg PUBLIC "-//W3C//DTD SVG 20010904//EN"
"http://www.w3.org/TR/2001/REC-SVG-20010904/DTD/svg10.dtd">
<!-- Created with Sodipodi ("http://www.sodipodi.com/") -->
<svg
   id="svg596"
   sodipodi:version="0.32"
   width="72pt"
   height="72pt"
   sodipodi:docbase="/home/zeus/desktop/icons/gartoon/svg"
   sodipodi:docname="/home/zeus/desktop/icons/gartoon/svg/gnome-mime-image-x-xfig.svg"
   xmlns="http://www.w3.org/2000/svg"
   xmlns:sodipodi="http://sodipodi.sourceforge.net/DTD/sodipodi-0.dtd"
   xmlns:xlink="http://www.w3.org/1999/xlink">
  <defs
     id="defs598">
    <linearGradient
       id="linearGradient612">
      <stop
         style="stop-color:#7fa8e3;stop-opacity:0.741176;"
         offset="0.000000"
         id="stop613" />
      <stop
         style="stop-color:#ffffff;stop-opacity:0;"
         offset="1.000000"
         id="stop614" />
    </linearGradient>
    <linearGradient
       id="linearGradient626">
      <stop
         style="stop-color:#ff0047;stop-opacity:1;"
         offset="0.000000"
         id="stop627" />
      <stop
         style="stop-color:#ab322d;stop-opacity:0;"
         offset="1.000000"
         id="stop628" />
    </linearGradient>
    <linearGradient
       id="linearGradient618">
      <stop
         style="stop-color:#956d47;stop-opacity:1;"
         offset="0.000000"
         id="stop619" />
      <stop
         style="stop-color:#ab322d;stop-opacity:0;"
         offset="1.000000"
         id="stop620" />
    </linearGradient>
    <linearGradient
       id="linearGradient614">
      <stop
         style="stop-color:#000;stop-opacity:1;"
         offset="0"
         id="stop615" />
      <stop
         style="stop-color:#fff;stop-opacity:1;"
         offset="1"
         id="stop616" />
    </linearGradient>
    <linearGradient
       xlink:href="#linearGradient618"
       id="linearGradient617"
       y2="0.52343726"
       x2="1.07843077"
       y1="0.57031226"
       x1="-0.19608469"
       spreadMethod="pad"
       gradientUnits="objectBoundingBox" />
    <linearGradient
       xlink:href="#linearGradient626"
       id="linearGradient625"
       x1="42.9995728"
       y1="77.3980103"
       x2="28.5382881"
       y2="63.0152588"
       gradientUnits="userSpaceOnUse"
       spreadMethod="pad"
       gradientTransform="matrix(0.934001,0.000000,0.000000,1.070663,-1.516226e-6,-1.716230e-7)" />
    <linearGradient
       xlink:href="#linearGradient612"
       id="linearGradient636"
       x1="16.4110699"
       y1="10.6072874"
       x2="24.6243172"
       y2="61.6665344"
       gradientUnits="userSpaceOnUse"
       spreadMethod="pad" />
  </defs>
  <sodipodi:namedview
     id="base" />
  <g
     id="g898"
     transform="translate(-1.146498,1.146498)">
    <path
       style="fill:#000000;fill-rule:evenodd;stroke:none;stroke-opacity:1;stroke-width:1pt;stroke-linejoin:miter;stroke-linecap:butt;fill-opacity:0.301471;"
       d="M 12.8163 74.753 C 10.3856 73.6481 7.07107 70.1126 8.83884 65.2512 C 9.72267 59.948 25.6326 13.1021 29.1682 10.8924 C 31.3778 8.90368 34.582 8.13026 39.1119 9.34561 C 42.8684 10.2295 76.6769 19.0684 78.6656 20.8361 C 80.6544 22.6039 82.2012 24.0402 80.6544 27.9072 C 79.5496 29.8959 66.4017 74.532 66.1808 77.4047 C 65.2969 80.4983 62.7558 84.2548 58.5573 84.0338 C 54.3589 83.8128 15.9099 75.4159 12.8163 74.753 z "
       id="path794"
       sodipodi:nodetypes="ccccccccc"
       transform="matrix(1.114903,0.000000,0.000000,1.114903,1.287023,-5.035753)" />
    <path
       style="fill:#3d4e67;fill-rule:evenodd;stroke:none;stroke-opacity:1;stroke-width:1pt;stroke-linejoin:miter;stroke-linecap:butt;fill-opacity:1;"
       d="M 12.8163 74.753 C 10.3856 73.6481 7.07107 70.1126 8.83884 65.2512 C 9.72267 59.948 25.6326 13.1021 29.1682 10.8924 C 31.3778 8.90368 34.582 8.13026 39.1119 9.34561 C 42.8684 10.2295 76.6769 19.0684 78.6656 20.8361 C 80.6544 22.6039 82.2012 24.0402 80.6544 27.9072 C 79.5496 29.8959 66.4017 74.532 66.1808 77.4047 C 65.2969 80.4983 62.7558 84.2548 58.5573 84.0338 C 54.3589 83.8128 15.9099 75.4159 12.8163 74.753 z "
       id="path895"
       sodipodi:nodetypes="ccccccccc"
       transform="matrix(1.114903,0.000000,0.000000,1.114903,-1.570116,-9.607182)" />
    <path
       style="fill:#ffffff;fill-rule:evenodd;stroke:none;stroke-opacity:1;stroke-width:1pt;stroke-linejoin:miter;stroke-linecap:butt;fill-opacity:1;"
       d="M 17.8987 70.9965 C 15.3576 70.3336 11.7114 69.6706 13.0373 65.6932 C 15.468 55.9705 27.8424 18.6264 33.1456 13.986 C 34.361 12.8811 38.4489 12.4392 46.1829 14.8699 C 55.0218 17.5215 72.9204 23.4877 74.6882 24.3716 C 76.4559 25.2555 77.1189 25.2555 75.793 29.233 C 73.8043 33.2105 64.9655 67.24 62.7557 72.9852 C 61.209 77.0732 60.8775 78.9514 58.2258 78.9514 "
       id="path896"
       sodipodi:nodetypes="cccccccs"
       transform="matrix(1.114903,0.000000,0.000000,1.114903,-1.570116,-9.607182)" />
    <path
       style="fill:url(#linearGradient636);fill-rule:evenodd;stroke:none;stroke-opacity:1;stroke-width:1pt;stroke-linejoin:miter;stroke-linecap:butt;fill-opacity:1;"
       d="M 28.75 13.75 C 28.75 13.75 31.875 7.49995 39.6875 9.37495 C 47.5 11.25 78.125 19.375 77.8125 21.875 C 77.5 24.375 71.875 39.0625 71.5625 40.3125 C 71.25 41.5625 42.5 40.9375 31.5625 47.5 C 20.625 54.0625 12.5 59.6875 12.5 59.6875 C 12.5 59.6875 23.75 24.6875 28.75 13.75 z "
       id="path636"
       transform="matrix(0.946780,0.000000,0.000000,0.946780,6.111789,-0.736980)" />
  </g>
  <path
     style="font-size:12;fill:#470000;fill-rule:evenodd;stroke-width:1pt;"
     d="M 67.911 66.4866 C 67.911 68.1832 66.4512 69.56 64.6525 69.56 C 62.8537 69.56 61.3939 68.1832 61.3939 66.4866 C 61.3939 64.7901 62.8537 63.4132 64.6525 63.4132 C 66.4512 63.4132 67.911 64.7901 67.911 66.4866 z "
     id="path613"
     transform="matrix(0.665098,0.000000,0.000000,0.665098,26.75834,4.099827)" />
  <path
     style="font-size:12;fill:#470000;fill-rule:evenodd;stroke-width:1pt;"
     d="M 61.2458 74.2998 C 59.6905 72.5223 57.1726 73.4851 56.3579 74.7441 C 55.4692 77.8545 56.8764 80.6687 60.5793 79.3357 C 64.2822 78.0026 65.6152 75.929 65.6152 76.0771 C 65.6152 76.2253 62.6529 84.0754 58.2094 84.6678 C 53.7659 85.2603 51.322 85.4084 46.4342 85.4825 C 41.3983 86.3712 38.9544 86.2971 38.9544 86.2971 L 45.1752 77.4102 C 45.1752 77.4102 46.8045 76.5215 49.4706 72.078 C 52.1367 67.6346 56.8763 66.5977 59.2462 68.0789 C 61.3939 68.9675 62.5788 70.1525 63.1713 72.4483 C 63.0232 74.9662 62.5788 75.929 61.2458 74.2998 z "
     id="path610"
     sodipodi:nodetypes="cccccccccccc"
     transform="matrix(0.665098,0.000000,0.000000,0.665098,26.75834,4.099827)" />
  <path
     style="font-size:12;fill:#230000;fill-opacity:0.99899;fill-rule:evenodd;stroke-width:1pt;"
     d="M 37.9176 76.4474 C 40.1393 77.0399 37.5473 80.2243 36.1402 78.0026 C 35.0293 79.5578 35.5477 75.7809 35.5477 75.7809 L 30.808 85.7046 C 30.808 85.7046 38.9544 88.667 42.0648 84.3716 C 45.1752 80.0763 45.5456 77.8545 43.8423 76.0771 C 41.8426 73.3371 40.0652 74.4479 39.3247 74.8922 C 38.5841 75.3366 38.2879 75.6328 37.9176 76.4474 z "
     id="path609"
     sodipodi:nodetypes="cccccccc"
     transform="matrix(0.665098,0.000000,0.000000,0.665098,26.95536,4.099827)" />
  <path
     style="font-size:12;fill:#230000;fill-rule:evenodd;stroke-width:1pt;"
     d="M 36.1402 62.0062 C 36.1402 62.0062 37.0288 56.674 36.7326 53.8598 C 36.2883 47.787 23.5503 -3.31281 14.071 5.57413 C 3.11042 9.86949 16.1446 58.8957 17.7739 61.7099 C 19.4031 64.5241 21.773 66.5977 21.773 66.5977 C 21.773 66.5977 18.07 83.483 31.9189 85.8527 C 36.9549 76.5215 40.5087 72.8006 39.695 68.5973 C 39.2506 66.2275 38.6582 64.0057 36.1402 62.0062 z "
     id="path608"
     sodipodi:nodetypes="cccccccc"
     transform="matrix(0.665098,0.000000,0.000000,0.665098,26.75834,4.099827)" />
  <path
     style="font-size:12;fill:#f2962c;fill-rule:evenodd;stroke-width:1pt;"
     d="M 19.4031 58.3033 C 22.0692 55.0448 25.0315 52.6749 32.5854 53.4155 C 30.2156 40.2331 21.773 4.68543 15.7002 7.94398 C 8.88697 9.12891 15.2559 48.8239 19.4031 58.3033 z "
     id="path600"
     sodipodi:nodetypes="cccc"
     transform="matrix(0.665098,0.000000,0.000000,0.665098,26.75834,4.099827)" />
  <path
     style="font-size:12;fill:#8b8b8b;fill-rule:evenodd;stroke-width:1pt;"
     d="M 19.8475 59.6363 C 19.8475 59.6363 21.1805 63.9316 24.7353 64.2279 C 26.3646 61.7099 30.0675 61.2656 33.1779 61.4137 C 33.9185 58.5995 34.5109 55.1928 33.326 55.0447 C 31.8449 54.156 23.5504 52.5268 19.8475 59.6363 z "
     id="path601"
     sodipodi:nodetypes="ccccc"
     transform="matrix(0.665098,0.000000,0.000000,0.665098,26.75834,4.099827)" />
  <path
     style="font-size:12;fill:#65532d;fill-rule:evenodd;stroke-width:1pt;"
     d="M 24.8834 66.4496 C 25.624 63.1911 31.2524 60.9694 33.7703 63.6354 C 39.8431 67.0421 37.177 75.4847 34.5109 75.6328 C 33.7703 86.149 40.8799 80.3724 40.7318 78.1508 C 46.0639 77.4102 41.7686 84.9641 38.2138 84.5197 C 33.326 85.2603 20.2918 80.8169 24.8834 66.4496 z "
     id="path602"
     sodipodi:nodetypes="cccccc"
     transform="matrix(0.665098,0.000000,0.000000,0.665098,26.75834,4.099827)" />
  <path
     style="font-size:12;fill:#bc0000;fill-rule:evenodd;stroke-width:1pt;"
     d="M 44.5828 81.2612 C 44.7309 81.4093 46.6564 81.2612 47.6932 79.4838 C 48.73 77.7064 52.2848 70.4487 54.8028 70.3006 C 60.8755 68.0789 60.8755 72.2261 60.8755 72.2261 C 60.8755 72.2261 55.2471 70.1525 54.6546 73.7073 C 54.0622 77.2621 53.0254 79.3357 59.8386 82.1499 C 55.9877 83.4829 43.966 83.74 43.2253 83.74 C 42.4847 83.74 44.7309 81.1131 44.5828 81.2612 z "
     id="path603"
     sodipodi:nodetypes="cccccccc"
     transform="matrix(0.665098,0.000000,0.000000,0.665098,26.75834,4.099827)" />
  <path
     style="font-size:12;fill:#470000;fill-rule:evenodd;stroke-width:1pt;"
     d="M 46.6564 67.6346 C 48.4338 64.9685 54.5806 66.3015 57.3947 65.7091 C 60.8014 64.8204 59.02 58.5954 55.169 58.5955 C 52.5142 58.0648 46.9527 58.1551 46.6564 67.6346 z "
     id="path611"
     sodipodi:nodetypes="cccc"
     transform="matrix(0.665098,0.000000,0.000000,0.665098,26.75834,4.099827)" />
  <path
     style="font-size:12;fill:#bc0000;fill-rule:evenodd;stroke-width:1pt;"
     d="M 48.1376 64.8204 C 48.1376 64.8204 54.5065 64.2279 56.1358 64.2279 C 58.0613 64.6397 58.1915 61.7181 56.5801 60.6731 C 53.766 58.7476 49.9149 58.5995 48.1376 64.8204 z "
     id="path604"
     sodipodi:nodetypes="cccc"
     transform="matrix(0.665098,0.000000,0.000000,0.665098,26.75834,4.099827)" />
  <path
     style="font-size:12;fill:#bc0000;fill-rule:evenodd;stroke-width:1pt;"
     d="M 66.8001 66.5977 C 66.8001 67.7424 65.838 68.6714 64.6524 68.6714 C 63.4669 68.6714 62.5048 67.7424 62.5048 66.5977 C 62.5048 65.4531 63.4669 64.5241 64.6524 64.5241 C 65.838 64.5241 66.8001 65.4531 66.8001 66.5977 z "
     id="path606"
     transform="matrix(0.665098,0.000000,0.000000,0.665098,26.75834,4.099827)" />
  <path
     style="font-size:12;fill:url(#linearGradient617);fill-rule:evenodd;stroke-width:1pt;"
     d="M 19.4031 58.3033 C 22.0692 55.0448 25.0315 52.6749 32.5854 53.4155 C 30.2156 40.2331 21.773 4.68543 15.7002 7.94398 C 8.88697 9.12891 15.2559 48.8239 19.4031 58.3033 z "
     id="path621"
     sodipodi:nodetypes="cccc"
     transform="matrix(0.665098,0.000000,0.000000,0.665098,26.75834,4.099827)" />
  <path
     style="font-size:12;fill:#f2d0a8;fill-rule:evenodd;stroke-width:1pt;"
     d="M 28.4382 52.5267 C 25.1369 52.6775 14.6017 8.00417 18.6625 10.462 C 19.6179 11.1298 34.3749 52.522 28.4382 52.5267 z "
     id="path622"
     sodipodi:nodetypes="css"
     transform="matrix(0.665098,0.000000,0.000000,0.665098,26.75834,4.099827)" />
  <path
     style="font-size:12;fill:#f2f2f2;fill-rule:evenodd;stroke-width:1pt;"
     d="M 30.5118 54.4523 L 31.1043 61.2656 L 27.6976 62.0062 L 26.2165 54.6003 C 26.2165 54.6003 30.2156 54.1561 30.5118 54.4523 z "
     id="path623"
     sodipodi:nodetypes="ccccc"
     transform="matrix(0.665098,0.000000,0.000000,0.665098,26.75834,4.099827)" />
  <path
     style="font-size:12;fill:url(#linearGradient625);fill-rule:nonzero;stroke-width:1pt;"
     d="M 24.8834 66.4496 C 25.624 63.1911 31.2524 60.9694 33.7703 63.6354 C 39.8431 67.0421 37.177 75.4847 34.5109 75.6328 C 33.7703 86.149 40.8799 80.3724 40.7318 78.1508 C 46.0639 77.4102 41.7686 84.9641 38.2138 84.5197 C 33.326 85.2603 20.2918 80.8169 24.8834 66.4496 z "
     id="path624"
     sodipodi:nodetypes="cccccc"
     transform="matrix(0.665098,0.000000,0.000000,0.665098,26.75834,4.099827)" />
  <path
     style="font-size:12;fill:none;fill-rule:evenodd;stroke:#3d4e67;stroke-width:1.3625;stroke-linejoin:round;stroke-opacity:1;"
     d="M 31.8153 50.4459 L 31.8153 55.6051 L 36.9745 55.6051 L 36.9745 50.4459 L 31.8153 50.4459 z "
     id="path1064" />
  <path
     style="font-size:12;fill:none;fill-rule:evenodd;stroke:#3d4e67;stroke-width:1.3625;stroke-linejoin:round;stroke-opacity:1;"
     d="M 31.8153 50.4459 L 31.8153 55.6051 L 36.9745 55.6051 L 36.9745 50.4459 L 31.8153 50.4459 z "
     id="path1065"
     transform="translate(-4.299364,-21.21019)" />
  <path
     style="font-size:12;fill:none;fill-rule:evenodd;stroke:#3d4e67;stroke-width:1pt;stroke-opacity:1;"
     d="M 32.3885 32.6752 L 38.4076 42.9936 L 34.1083 50.1592 "
     id="path1066" />
  <path
     style="font-size:12;fill:none;fill-rule:evenodd;stroke:#3d4e67;stroke-width:1.3625;stroke-linejoin:round;stroke-opacity:1;"
     d="M 31.8153 50.4459 L 31.8153 55.6051 L 36.9745 55.6051 L 36.9745 50.4459 L 31.8153 50.4459 z "
     id="path1072"
     transform="matrix(-0.977600,0.424534,0.398324,0.917245,70.71647,-27.10711)" />
  <path
     style="font-size:12;fill:none;fill-rule:evenodd;stroke:#3d4e67;stroke-width:1.3625;stroke-linejoin:round;stroke-opacity:1;"
     d="M 31.8153 50.4459 L 31.8153 55.6051 L 36.9745 55.6051 L 36.9745 50.4459 L 31.8153 50.4459 z "
     id="path1073"
     transform="matrix(-0.977600,0.424534,0.398324,0.917245,64.75126,-47.52740)" />
  <path
     style="font-size:12;fill:none;fill-rule:evenodd;stroke:#3d4e67;stroke-width:1pt;stroke-opacity:1;"
     d="M 32.3885 32.6752 L 38.4076 42.9936 L 34.1083 50.1592 "
     id="path1074"
     transform="matrix(-0.977600,0.424534,0.398324,0.917245,68.99673,-26.24723)" />
  <path
     transform="matrix(0.979862,0.199678,-0.199678,0.979862,0.000000,0.000000)"
     style="font-size:13;font-weight:bold;fill:#3d4e67;stroke-width:1pt;font-family:Kid Kosmic;"
     d="M 66.4882 55.6863 C 66.4205 56.0249 66.2047 56.3042 65.8407 56.5242 C 65.5107 56.7358 65.1637 56.8416 64.7997 56.8416 C 64.3427 56.8416 63.9999 56.6004 63.7714 56.118 C 63.6275 55.7033 63.4794 55.2928 63.3271 54.8865 C 61.1604 54.8865 59.5016 55.4324 58.3505 56.5242 C 57.1825 57.6499 56.5816 58.7332 56.5478 59.7742 C 56.5224 60.7899 57.0556 61.505 58.1474 61.9197 C 58.4098 62.0213 58.7017 62.0721 59.0234 62.0721 C 60.0982 62.0721 61.5455 61.5516 63.3652 60.5106 C 63.3905 60.4259 63.4202 60.3074 63.454 60.1551 C 63.217 59.9266 62.8193 59.8123 62.2607 59.8123 C 61.2281 59.8123 60.3014 60.0239 59.4804 60.4471 C 58.998 60.4048 58.6891 60.1382 58.5536 59.6473 C 58.5282 59.5542 58.5155 59.4653 58.5155 59.3807 C 58.5155 59.0083 58.7144 58.6782 59.1122 58.3904 C 59.6116 57.8319 60.5341 57.5526 61.8798 57.5526 C 62.2861 57.5526 62.7981 57.5822 63.4159 57.6414 C 64.2284 57.7091 64.6728 57.7472 64.7489 57.7557 C 65.6545 58.2127 66.1073 58.7248 66.1073 59.2918 C 66.1073 59.5626 66.0269 59.9393 65.8661 60.4217 C 65.6292 61.1665 65.2906 61.6658 64.8505 61.9197 C 63.9788 62.5799 62.9589 63.1131 61.7909 63.5194 C 60.5976 63.9341 59.4677 64.1414 58.4013 64.1414 C 56.844 64.1414 55.6845 63.6505 54.9228 62.6688 C 54.2711 61.8224 53.9452 60.8914 53.9452 59.8758 C 53.9452 59.4272 54.0045 58.9702 54.123 58.5047 C 54.6646 56.4142 56.0103 54.8231 58.1601 53.7313 C 59.9882 52.7918 62.0745 52.3475 64.4189 52.3983 C 65.2144 52.5083 65.7646 52.7834 66.0693 53.2235 C 66.3147 53.5874 66.4501 54.1925 66.4755 55.0389 C 66.5263 55.2843 66.5305 55.5001 66.4882 55.6863 z M 51.7363 51.9539 C 52.1425 51.9539 52.498 52.0513 52.8027 52.2459 C 53.1581 52.466 53.3359 52.7664 53.3359 53.1473 C 53.3359 53.215 53.3316 53.2827 53.3232 53.3504 C 52.1298 57.286 51.3639 60.6333 51.0253 63.3924 C 50.873 64.0779 50.454 64.3953 49.7685 64.3446 C 49.0745 64.2938 48.719 64.0314 48.7021 63.5574 C 49.066 60.5106 49.7516 56.8162 50.7587 52.4744 C 51.0042 52.1274 51.33 51.9539 51.7363 51.9539 z M 42.7226 57.4002 C 44.6438 57.0617 45.9768 56.7189 46.7216 56.3719 C 47.3479 56.5327 47.6611 56.8712 47.6611 57.3875 C 47.6611 57.4722 47.6526 57.561 47.6357 57.6541 C 47.5172 58.2889 47.1363 58.7036 46.4931 58.8983 L 38.6982 60.4217 C 38.512 60.8533 38.4189 61.213 38.4189 61.5008 C 38.4189 61.6531 38.4443 61.7928 38.495 61.9197 C 38.6051 62.1906 38.6601 62.4826 38.6601 62.7957 C 38.6601 63.0158 38.6305 63.2485 38.5712 63.494 C 38.3512 63.9933 37.9364 64.2641 37.3271 64.3065 C 36.7092 64.3488 36.3114 64.1753 36.1337 63.786 C 36.1337 62.2202 36.3114 60.6164 36.6669 58.9744 C 37.0139 57.3579 37.5006 55.4832 38.1269 53.3504 C 39.0579 52.394 42.1513 51.9497 47.4072 52.0174 C 48.0673 52.4152 48.3974 52.8765 48.3974 53.4012 C 48.3974 53.9936 47.9954 54.4634 47.1913 54.8104 C 46.0234 54.548 44.9062 54.4168 43.8398 54.4168 C 42.8072 54.4253 41.5927 54.785 40.1962 55.4959 C 39.8492 56.4354 39.5784 57.2225 39.3837 57.8572 C 39.9931 57.8488 41.106 57.6964 42.7226 57.4002 z M 35.0927 62.1229 C 35.0927 62.546 34.8896 62.9184 34.4833 63.2401 C 34.0855 63.5617 33.6581 63.7225 33.2011 63.7225 C 33.0318 63.7225 32.8752 63.6971 32.7314 63.6463 C 32.3082 63.477 32.0966 63.1766 32.0966 62.7449 C 32.0966 62.4487 32.2024 62.161 32.414 61.8817 C 32.8202 61.3654 33.328 61.1072 33.9374 61.1072 C 34.1152 61.1072 34.2844 61.1369 34.4452 61.1961 C 34.8769 61.3569 35.0927 61.6658 35.0927 62.1229 z "
     id="path1142" />
</svg>
