<?xml version="1.0" encoding="UTF-8" standalone="no"?>
<!DOCTYPE svg PUBLIC "-//W3C//DTD SVG 20010904//EN"
"http://www.w3.org/TR/2001/REC-SVG-20010904/DTD/svg10.dtd">
<!-- Created with Sodipodi ("http://www.sodipodi.com/") -->
<svg
   id="svg596"
   sodipodi:version="0.32"
   width="72pt"
   height="72pt"
   sodipodi:docbase="/home/zeus/desktop/icons/gartoon/svg"
   sodipodi:docname="/home/zeus/desktop/icons/gartoon/svg/gnome-mime-image-x-xwindowdump.svg"
   xmlns="http://www.w3.org/2000/svg"
   xmlns:sodipodi="http://sodipodi.sourceforge.net/DTD/sodipodi-0.dtd"
   xmlns:xlink="http://www.w3.org/1999/xlink">
  <defs
     id="defs598">
    <linearGradient
       id="linearGradient612">
      <stop
         style="stop-color:#7fa8e3;stop-opacity:0.741176;"
         offset="0.000000"
         id="stop613" />
      <stop
         style="stop-color:#ffffff;stop-opacity:0;"
         offset="1.000000"
         id="stop614" />
    </linearGradient>
    <linearGradient
       id="linearGradient626">
      <stop
         style="stop-color:#ff0047;stop-opacity:1;"
         offset="0.000000"
         id="stop627" />
      <stop
         style="stop-color:#ab322d;stop-opacity:0;"
         offset="1.000000"
         id="stop628" />
    </linearGradient>
    <linearGradient
       id="linearGradient618">
      <stop
         style="stop-color:#956d47;stop-opacity:1;"
         offset="0.000000"
         id="stop619" />
      <stop
         style="stop-color:#ab322d;stop-opacity:0;"
         offset="1.000000"
         id="stop620" />
    </linearGradient>
    <linearGradient
       id="linearGradient614">
      <stop
         style="stop-color:#000;stop-opacity:1;"
         offset="0"
         id="stop615" />
      <stop
         style="stop-color:#fff;stop-opacity:1;"
         offset="1"
         id="stop616" />
    </linearGradient>
    <linearGradient
       xlink:href="#linearGradient618"
       id="linearGradient617"
       y2="0.52343726"
       x2="1.07843077"
       y1="0.57031226"
       x1="-0.19608469"
       spreadMethod="pad"
       gradientUnits="objectBoundingBox" />
    <linearGradient
       xlink:href="#linearGradient626"
       id="linearGradient625"
       x1="42.9995728"
       y1="77.3980103"
       x2="28.5382881"
       y2="63.0152588"
       gradientUnits="userSpaceOnUse"
       spreadMethod="pad"
       gradientTransform="matrix(0.934001,0.000000,0.000000,1.070663,-1.516226e-6,-1.716230e-7)" />
    <linearGradient
       xlink:href="#linearGradient612"
       id="linearGradient636"
       x1="16.4110699"
       y1="10.6072874"
       x2="24.6243172"
       y2="61.6665344"
       gradientUnits="userSpaceOnUse"
       spreadMethod="pad" />
  </defs>
  <sodipodi:namedview
     id="base" />
  <g
     id="g898"
     transform="translate(-1.146498,1.146498)">
    <path
       style="fill:#000000;fill-rule:evenodd;stroke:none;stroke-opacity:1;stroke-width:1pt;stroke-linejoin:miter;stroke-linecap:butt;fill-opacity:0.301471;"
       d="M 12.8163 74.753 C 10.3856 73.6481 7.07107 70.1126 8.83884 65.2512 C 9.72267 59.948 25.6326 13.1021 29.1682 10.8924 C 31.3778 8.90368 34.582 8.13026 39.1119 9.34561 C 42.8684 10.2295 76.6769 19.0684 78.6656 20.8361 C 80.6544 22.6039 82.2012 24.0402 80.6544 27.9072 C 79.5496 29.8959 66.4017 74.532 66.1808 77.4047 C 65.2969 80.4983 62.7558 84.2548 58.5573 84.0338 C 54.3589 83.8128 15.9099 75.4159 12.8163 74.753 z "
       id="path794"
       sodipodi:nodetypes="ccccccccc"
       transform="matrix(1.114903,0.000000,0.000000,1.114903,1.287023,-5.035753)" />
    <path
       style="fill:#3d4e67;fill-rule:evenodd;stroke:none;stroke-opacity:1;stroke-width:1pt;stroke-linejoin:miter;stroke-linecap:butt;fill-opacity:1;"
       d="M 12.8163 74.753 C 10.3856 73.6481 7.07107 70.1126 8.83884 65.2512 C 9.72267 59.948 25.6326 13.1021 29.1682 10.8924 C 31.3778 8.90368 34.582 8.13026 39.1119 9.34561 C 42.8684 10.2295 76.6769 19.0684 78.6656 20.8361 C 80.6544 22.6039 82.2012 24.0402 80.6544 27.9072 C 79.5496 29.8959 66.4017 74.532 66.1808 77.4047 C 65.2969 80.4983 62.7558 84.2548 58.5573 84.0338 C 54.3589 83.8128 15.9099 75.4159 12.8163 74.753 z "
       id="path895"
       sodipodi:nodetypes="ccccccccc"
       transform="matrix(1.114903,0.000000,0.000000,1.114903,-1.570116,-9.607182)" />
    <path
       style="fill:#ffffff;fill-rule:evenodd;stroke:none;stroke-opacity:1;stroke-width:1pt;stroke-linejoin:miter;stroke-linecap:butt;fill-opacity:1;"
       d="M 17.8987 70.9965 C 15.3576 70.3336 11.7114 69.6706 13.0373 65.6932 C 15.468 55.9705 27.8424 18.6264 33.1456 13.986 C 34.361 12.8811 38.4489 12.4392 46.1829 14.8699 C 55.0218 17.5215 72.9204 23.4877 74.6882 24.3716 C 76.4559 25.2555 77.1189 25.2555 75.793 29.233 C 73.8043 33.2105 64.9655 67.24 62.7557 72.9852 C 61.209 77.0732 60.8775 78.9514 58.2258 78.9514 "
       id="path896"
       sodipodi:nodetypes="cccccccs"
       transform="matrix(1.114903,0.000000,0.000000,1.114903,-1.570116,-9.607182)" />
    <path
       style="fill:url(#linearGradient636);fill-rule:evenodd;stroke:none;stroke-opacity:1;stroke-width:1pt;stroke-linejoin:miter;stroke-linecap:butt;fill-opacity:1;"
       d="M 28.75 13.75 C 28.75 13.75 31.875 7.49995 39.6875 9.37495 C 47.5 11.25 78.125 19.375 77.8125 21.875 C 77.5 24.375 71.875 39.0625 71.5625 40.3125 C 71.25 41.5625 42.5 40.9375 31.5625 47.5 C 20.625 54.0625 12.5 59.6875 12.5 59.6875 C 12.5 59.6875 23.75 24.6875 28.75 13.75 z "
       id="path636"
       transform="matrix(0.946780,0.000000,0.000000,0.946780,6.111789,-0.736980)" />
  </g>
  <path
     style="font-size:12;fill:#470000;fill-rule:evenodd;stroke-width:1pt;"
     d="M 67.911 66.4866 C 67.911 68.1832 66.4512 69.56 64.6525 69.56 C 62.8537 69.56 61.3939 68.1832 61.3939 66.4866 C 61.3939 64.7901 62.8537 63.4132 64.6525 63.4132 C 66.4512 63.4132 67.911 64.7901 67.911 66.4866 z "
     id="path613"
     transform="matrix(0.665098,0.000000,0.000000,0.665098,26.75834,4.099827)" />
  <path
     style="font-size:12;fill:#470000;fill-rule:evenodd;stroke-width:1pt;"
     d="M 61.2458 74.2998 C 59.6905 72.5223 57.1726 73.4851 56.3579 74.7441 C 55.4692 77.8545 56.8764 80.6687 60.5793 79.3357 C 64.2822 78.0026 65.6152 75.929 65.6152 76.0771 C 65.6152 76.2253 62.6529 84.0754 58.2094 84.6678 C 53.7659 85.2603 51.322 85.4084 46.4342 85.4825 C 41.3983 86.3712 38.9544 86.2971 38.9544 86.2971 L 45.1752 77.4102 C 45.1752 77.4102 46.8045 76.5215 49.4706 72.078 C 52.1367 67.6346 56.8763 66.5977 59.2462 68.0789 C 61.3939 68.9675 62.5788 70.1525 63.1713 72.4483 C 63.0232 74.9662 62.5788 75.929 61.2458 74.2998 z "
     id="path610"
     sodipodi:nodetypes="cccccccccccc"
     transform="matrix(0.665098,0.000000,0.000000,0.665098,26.75834,4.099827)" />
  <path
     style="font-size:12;fill:#230000;fill-opacity:0.99899;fill-rule:evenodd;stroke-width:1pt;"
     d="M 37.9176 76.4474 C 40.1393 77.0399 37.5473 80.2243 36.1402 78.0026 C 35.0293 79.5578 35.5477 75.7809 35.5477 75.7809 L 30.808 85.7046 C 30.808 85.7046 38.9544 88.667 42.0648 84.3716 C 45.1752 80.0763 45.5456 77.8545 43.8423 76.0771 C 41.8426 73.3371 40.0652 74.4479 39.3247 74.8922 C 38.5841 75.3366 38.2879 75.6328 37.9176 76.4474 z "
     id="path609"
     sodipodi:nodetypes="cccccccc"
     transform="matrix(0.665098,0.000000,0.000000,0.665098,26.95536,4.099827)" />
  <path
     style="font-size:12;fill:#230000;fill-rule:evenodd;stroke-width:1pt;"
     d="M 36.1402 62.0062 C 36.1402 62.0062 37.0288 56.674 36.7326 53.8598 C 36.2883 47.787 23.5503 -3.31281 14.071 5.57413 C 3.11042 9.86949 16.1446 58.8957 17.7739 61.7099 C 19.4031 64.5241 21.773 66.5977 21.773 66.5977 C 21.773 66.5977 18.07 83.483 31.9189 85.8527 C 36.9549 76.5215 40.5087 72.8006 39.695 68.5973 C 39.2506 66.2275 38.6582 64.0057 36.1402 62.0062 z "
     id="path608"
     sodipodi:nodetypes="cccccccc"
     transform="matrix(0.665098,0.000000,0.000000,0.665098,26.75834,4.099827)" />
  <path
     style="font-size:12;fill:#f2962c;fill-rule:evenodd;stroke-width:1pt;"
     d="M 19.4031 58.3033 C 22.0692 55.0448 25.0315 52.6749 32.5854 53.4155 C 30.2156 40.2331 21.773 4.68543 15.7002 7.94398 C 8.88697 9.12891 15.2559 48.8239 19.4031 58.3033 z "
     id="path600"
     sodipodi:nodetypes="cccc"
     transform="matrix(0.665098,0.000000,0.000000,0.665098,26.75834,4.099827)" />
  <path
     style="font-size:12;fill:#8b8b8b;fill-rule:evenodd;stroke-width:1pt;"
     d="M 19.8475 59.6363 C 19.8475 59.6363 21.1805 63.9316 24.7353 64.2279 C 26.3646 61.7099 30.0675 61.2656 33.1779 61.4137 C 33.9185 58.5995 34.5109 55.1928 33.326 55.0447 C 31.8449 54.156 23.5504 52.5268 19.8475 59.6363 z "
     id="path601"
     sodipodi:nodetypes="ccccc"
     transform="matrix(0.665098,0.000000,0.000000,0.665098,26.75834,4.099827)" />
  <path
     style="font-size:12;fill:#65532d;fill-rule:evenodd;stroke-width:1pt;"
     d="M 24.8834 66.4496 C 25.624 63.1911 31.2524 60.9694 33.7703 63.6354 C 39.8431 67.0421 37.177 75.4847 34.5109 75.6328 C 33.7703 86.149 40.8799 80.3724 40.7318 78.1508 C 46.0639 77.4102 41.7686 84.9641 38.2138 84.5197 C 33.326 85.2603 20.2918 80.8169 24.8834 66.4496 z "
     id="path602"
     sodipodi:nodetypes="cccccc"
     transform="matrix(0.665098,0.000000,0.000000,0.665098,26.75834,4.099827)" />
  <path
     style="font-size:12;fill:#bc0000;fill-rule:evenodd;stroke-width:1pt;"
     d="M 44.5828 81.2612 C 44.7309 81.4093 46.6564 81.2612 47.6932 79.4838 C 48.73 77.7064 52.2848 70.4487 54.8028 70.3006 C 60.8755 68.0789 60.8755 72.2261 60.8755 72.2261 C 60.8755 72.2261 55.2471 70.1525 54.6546 73.7073 C 54.0622 77.2621 53.0254 79.3357 59.8386 82.1499 C 55.9877 83.4829 43.966 83.74 43.2253 83.74 C 42.4847 83.74 44.7309 81.1131 44.5828 81.2612 z "
     id="path603"
     sodipodi:nodetypes="cccccccc"
     transform="matrix(0.665098,0.000000,0.000000,0.665098,26.75834,4.099827)" />
  <path
     style="font-size:12;fill:#470000;fill-rule:evenodd;stroke-width:1pt;"
     d="M 46.6564 67.6346 C 48.4338 64.9685 54.5806 66.3015 57.3947 65.7091 C 60.8014 64.8204 59.02 58.5954 55.169 58.5955 C 52.5142 58.0648 46.9527 58.1551 46.6564 67.6346 z "
     id="path611"
     sodipodi:nodetypes="cccc"
     transform="matrix(0.665098,0.000000,0.000000,0.665098,26.75834,4.099827)" />
  <path
     style="font-size:12;fill:#bc0000;fill-rule:evenodd;stroke-width:1pt;"
     d="M 48.1376 64.8204 C 48.1376 64.8204 54.5065 64.2279 56.1358 64.2279 C 58.0613 64.6397 58.1915 61.7181 56.5801 60.6731 C 53.766 58.7476 49.9149 58.5995 48.1376 64.8204 z "
     id="path604"
     sodipodi:nodetypes="cccc"
     transform="matrix(0.665098,0.000000,0.000000,0.665098,26.75834,4.099827)" />
  <path
     style="font-size:12;fill:#bc0000;fill-rule:evenodd;stroke-width:1pt;"
     d="M 66.8001 66.5977 C 66.8001 67.7424 65.838 68.6714 64.6524 68.6714 C 63.4669 68.6714 62.5048 67.7424 62.5048 66.5977 C 62.5048 65.4531 63.4669 64.5241 64.6524 64.5241 C 65.838 64.5241 66.8001 65.4531 66.8001 66.5977 z "
     id="path606"
     transform="matrix(0.665098,0.000000,0.000000,0.665098,26.75834,4.099827)" />
  <path
     style="font-size:12;fill:url(#linearGradient617);fill-rule:evenodd;stroke-width:1pt;"
     d="M 19.4031 58.3033 C 22.0692 55.0448 25.0315 52.6749 32.5854 53.4155 C 30.2156 40.2331 21.773 4.68543 15.7002 7.94398 C 8.88697 9.12891 15.2559 48.8239 19.4031 58.3033 z "
     id="path621"
     sodipodi:nodetypes="cccc"
     transform="matrix(0.665098,0.000000,0.000000,0.665098,26.75834,4.099827)" />
  <path
     style="font-size:12;fill:#f2d0a8;fill-rule:evenodd;stroke-width:1pt;"
     d="M 28.4382 52.5267 C 25.1369 52.6775 14.6017 8.00417 18.6625 10.462 C 19.6179 11.1298 34.3749 52.522 28.4382 52.5267 z "
     id="path622"
     sodipodi:nodetypes="css"
     transform="matrix(0.665098,0.000000,0.000000,0.665098,26.75834,4.099827)" />
  <path
     style="font-size:12;fill:#f2f2f2;fill-rule:evenodd;stroke-width:1pt;"
     d="M 30.5118 54.4523 L 31.1043 61.2656 L 27.6976 62.0062 L 26.2165 54.6003 C 26.2165 54.6003 30.2156 54.1561 30.5118 54.4523 z "
     id="path623"
     sodipodi:nodetypes="ccccc"
     transform="matrix(0.665098,0.000000,0.000000,0.665098,26.75834,4.099827)" />
  <path
     style="font-size:12;fill:url(#linearGradient625);fill-rule:nonzero;stroke-width:1pt;"
     d="M 24.8834 66.4496 C 25.624 63.1911 31.2524 60.9694 33.7703 63.6354 C 39.8431 67.0421 37.177 75.4847 34.5109 75.6328 C 33.7703 86.149 40.8799 80.3724 40.7318 78.1508 C 46.0639 77.4102 41.7686 84.9641 38.2138 84.5197 C 33.326 85.2603 20.2918 80.8169 24.8834 66.4496 z "
     id="path624"
     sodipodi:nodetypes="cccccc"
     transform="matrix(0.665098,0.000000,0.000000,0.665098,26.75834,4.099827)" />
  <path
     style="font-size:12;fill:none;fill-rule:evenodd;stroke:#3d4e67;stroke-width:1.3625;stroke-linejoin:round;stroke-opacity:1;"
     d="M 31.8153 50.4459 L 31.8153 55.6051 L 36.9745 55.6051 L 36.9745 50.4459 L 31.8153 50.4459 z "
     id="path1064" />
  <path
     style="font-size:12;fill:none;fill-rule:evenodd;stroke:#3d4e67;stroke-width:1.3625;stroke-linejoin:round;stroke-opacity:1;"
     d="M 31.8153 50.4459 L 31.8153 55.6051 L 36.9745 55.6051 L 36.9745 50.4459 L 31.8153 50.4459 z "
     id="path1065"
     transform="translate(-4.299364,-21.21019)" />
  <path
     style="font-size:12;fill:none;fill-rule:evenodd;stroke:#3d4e67;stroke-width:1pt;stroke-opacity:1;"
     d="M 32.3885 32.6752 L 38.4076 42.9936 L 34.1083 50.1592 "
     id="path1066" />
  <path
     style="font-size:12;fill:none;fill-rule:evenodd;stroke:#3d4e67;stroke-width:1.3625;stroke-linejoin:round;stroke-opacity:1;"
     d="M 31.8153 50.4459 L 31.8153 55.6051 L 36.9745 55.6051 L 36.9745 50.4459 L 31.8153 50.4459 z "
     id="path1072"
     transform="matrix(-0.977600,0.424534,0.398324,0.917245,70.71647,-27.10711)" />
  <path
     style="font-size:12;fill:none;fill-rule:evenodd;stroke:#3d4e67;stroke-width:1.3625;stroke-linejoin:round;stroke-opacity:1;"
     d="M 31.8153 50.4459 L 31.8153 55.6051 L 36.9745 55.6051 L 36.9745 50.4459 L 31.8153 50.4459 z "
     id="path1073"
     transform="matrix(-0.977600,0.424534,0.398324,0.917245,64.75126,-47.52740)" />
  <path
     style="font-size:12;fill:none;fill-rule:evenodd;stroke:#3d4e67;stroke-width:1pt;stroke-opacity:1;"
     d="M 32.3885 32.6752 L 38.4076 42.9936 L 34.1083 50.1592 "
     id="path1074"
     transform="matrix(-0.977600,0.424534,0.398324,0.917245,68.99673,-26.24723)" />
  <path
     transform="matrix(0.970839,0.239733,-0.239733,0.970839,0.000000,0.000000)"
     style="font-size:13;font-weight:bold;fill:#3d4e67;stroke-width:1pt;font-family:Kid Kosmic;"
     d="M 69.4492 50.2383 C 71.1927 50.2383 72.5131 50.6615 73.4102 51.5078 C 74.3158 52.3457 74.8828 53.6787 75.1114 55.5068 C 75.086 57.9189 74.0196 59.6201 71.9121 60.6103 C 70.1856 61.4313 67.6084 61.8291 64.1807 61.8037 C 63.7067 61.7191 63.419 61.6344 63.3174 61.5498 C 63.2074 61.4652 63.0677 61.1986 62.8985 60.75 C 62.8985 58.0586 63.1524 55.5957 63.6602 53.3613 C 63.6856 53.2682 63.6983 53.1751 63.6983 53.082 C 63.6983 52.9635 63.6729 52.8112 63.6221 52.625 C 63.5629 52.4303 63.5332 52.2907 63.5332 52.206 C 63.5332 51.8337 63.7956 51.4993 64.3203 51.2031 C 66.2585 50.5599 67.9681 50.2383 69.4492 50.2383 z M 65.4121 56.4717 C 65.3275 57.208 65.2852 57.8343 65.2852 58.3506 C 65.2852 58.8161 65.319 59.1927 65.3867 59.4805 C 65.8353 59.5143 66.2966 59.5312 66.7705 59.5312 C 68.3786 59.5312 69.6778 59.3323 70.668 58.9346 C 72.0983 58.359 72.8135 57.3857 72.8135 56.0146 C 72.5342 53.848 71.1631 52.7646 68.7002 52.7646 C 67.8454 52.7646 66.9313 52.9128 65.958 53.209 C 65.7211 54.2923 65.5391 55.3799 65.4121 56.4717 z M 61.4385 55.748 C 61.0323 57.5254 60.5117 59.3747 59.877 61.2959 C 59.4369 61.8799 58.8487 62.1634 58.1123 62.1465 C 57.3252 62.138 56.9147 61.901 56.8809 61.4355 C 56.2123 60.0052 55.6537 58.359 55.2051 56.4971 C 54.1556 58.2659 52.6872 59.9248 50.7998 61.4736 C 50.3428 62.0745 49.7419 62.3411 48.9971 62.2734 C 48.3623 62.2142 48.045 61.9814 48.045 61.5752 C 48.045 61.4567 48.0746 61.3297 48.1338 61.1943 C 48.6247 59.9671 49.014 58.4521 49.3018 56.6494 C 49.5895 54.8382 49.8223 53.0524 50 51.292 C 50.0508 50.8519 50.2624 50.5049 50.6348 50.251 C 50.9733 50.0225 51.3627 49.9082 51.8028 49.9082 C 52.1752 49.9082 52.4841 49.9971 52.7295 50.1748 C 52.9834 50.3525 53.0935 50.598 53.0596 50.9111 C 52.7126 52.3499 52.2175 54.5166 51.5742 57.4111 C 52.5983 56.387 53.6013 55.0583 54.583 53.4248 C 54.9131 52.8662 55.3786 52.5657 55.9795 52.5234 C 56.6397 52.4726 57.0544 52.7012 57.2237 53.209 L 57.6553 56.3828 C 57.7823 57.2884 58.0531 58.0882 58.4678 58.7822 C 59.0518 57.2842 59.3438 55.2995 59.3438 52.8281 C 59.3438 52.3034 59.3311 51.749 59.3057 51.165 C 59.3649 50.7588 59.5596 50.4329 59.8897 50.1875 C 60.2028 49.9674 60.5668 49.8574 60.9815 49.8574 C 61.3877 49.8574 61.794 50.0309 62.2002 50.3779 C 62.0987 52.1722 61.8448 53.9622 61.4385 55.748 z M 37 51.2793 C 37.0847 50.9069 37.3513 50.6064 37.7998 50.3779 C 38.1892 50.1833 38.5912 50.0902 39.0059 50.0986 C 39.3952 50.0986 39.7041 50.2467 39.9326 50.543 C 40.4997 52.1341 41.0837 53.5137 41.6846 54.6816 C 42.7933 53.4967 43.9825 52.1003 45.252 50.4922 C 45.5567 50.2298 45.8952 50.0986 46.2676 50.0986 C 47.0886 50.0817 47.6133 50.361 47.8418 50.9365 C 47.8757 51.0127 47.8926 51.0973 47.8926 51.1904 C 47.8926 51.3935 47.8037 51.6051 47.626 51.8252 C 45.8741 53.9411 44.3252 55.638 42.9795 56.916 C 43.7751 58.1432 44.6511 59.1335 45.6075 59.8867 C 45.7937 60.1237 45.8867 60.3649 45.8867 60.6103 C 45.8867 60.9743 45.709 61.2959 45.3535 61.5752 C 45.0065 61.846 44.6468 61.9814 44.2744 61.9814 C 43.9274 61.9814 43.6905 61.8545 43.5635 61.6006 C 42.5817 60.7627 41.6888 59.8232 40.8848 58.7822 C 39.6153 59.8317 38.3076 60.7796 36.9619 61.626 C 36.7504 61.8629 36.4838 61.9814 36.1621 61.9814 C 35.849 61.9814 35.5739 61.8799 35.3369 61.6768 C 35.0915 61.4736 34.9688 61.224 34.9688 60.9277 C 34.9688 60.5638 35.1719 60.2083 35.5782 59.8613 C 36.8646 59.0996 38.1807 58.0924 39.5264 56.8398 C 39.1032 56.1712 38.6039 55.2572 38.0284 54.0976 C 37.2666 52.5742 36.9239 51.6348 37 51.2793 z M 34.3467 59.9629 C 34.3467 60.3861 34.1436 60.7585 33.7373 61.0801 C 33.3396 61.4017 32.9121 61.5625 32.4551 61.5625 C 32.2858 61.5625 32.1293 61.5371 31.9854 61.4863 C 31.5622 61.317 31.3506 61.0166 31.3506 60.585 C 31.3506 60.2887 31.4564 60.001 31.668 59.7217 C 32.0743 59.2054 32.5821 58.9473 33.1914 58.9473 C 33.3692 58.9473 33.5384 58.9769 33.6993 59.0361 C 34.1309 59.1969 34.3467 59.5059 34.3467 59.9629 z "
     id="path1150" />
</svg>
