<?xml version="1.0" encoding="UTF-8" standalone="no"?>
<!DOCTYPE svg PUBLIC "-//W3C//DTD SVG 20010904//EN"
"http://www.w3.org/TR/2001/REC-SVG-20010904/DTD/svg10.dtd">
<!-- Created with Sodipodi ("http://www.sodipodi.com/") -->
<svg
   xmlns="http://www.w3.org/2000/svg"
   xmlns:inkscape="http://www.inkscape.org/namespaces/inkscape"
   xmlns:sodipodi="http://sodipodi.sourceforge.net/DTD/sodipodi-0.dtd"
   xmlns:xlink="http://www.w3.org/1999/xlink"
   id="svg582"
   sodipodi:version="0.34"
   inkscape:version="0.37"
   width="72pt"
   height="72pt"
   sodipodi:docbase="/home/zeus/gartoon-stock.0.1/"
   sodipodi:docname="/home/zeus/gartoon-stock.0.1/stock_dialog_error.svg">
  <defs
     id="defs584" />
  <sodipodi:namedview
     id="base"
     pagecolor="#ffffff"
     bordercolor="#666666"
     borderopacity="1.0"
     inkscape:pageopacity="0.0"
     inkscape:pageshadow="2"
     inkscape:zoom="5.65685424"
     inkscape:cx="23.9193414"
     inkscape:cy="39.7605898"
     inkscape:window-width="1014"
     inkscape:window-height="696"
     inkscape:window-x="0"
     inkscape:window-y="0" />
  <path
     sodipodi:type="arc"
     style="font-size:12;fill:#000000;fill-opacity:1;fill-rule:evenodd;stroke:none;stroke-width:1pt;stroke-opacity:1;"
     id="path585"
     sodipodi:cx="51.64590836"
     sodipodi:cy="51.64590836"
     sodipodi:rx="44.91992950"
     sodipodi:ry="44.91992950"
     d="M 96.56584 51.64591 A 44.91993 44.91993 0 1 0 6.725979 51.64591 A 44.91993 44.91993 0 1 0  96.56584 51.64591 z"
     transform="matrix(0.978610,0.000000,0.000000,0.978610,-5.461111,-5.461111)" />
  <path
     sodipodi:type="arc"
     style="font-size:12;fill:#ff1500;fill-opacity:1;fill-rule:evenodd;stroke:none;stroke-width:1pt;stroke-opacity:1;"
     id="path586"
     sodipodi:cx="51.64590836"
     sodipodi:cy="51.64590836"
     sodipodi:rx="44.91992950"
     sodipodi:ry="44.91992950"
     d="M 96.56584 51.64591 A 44.91993 44.91993 0 1 0 6.725979 51.64591 A 44.91993 44.91993 0 1 0  96.56584 51.64591 z"
     transform="matrix(0.856155,0.000000,0.000000,0.856155,1.133850,1.293991)" />
  <path
     style="font-size:12;fill:#ffffff;fill-opacity:1;fill-rule:evenodd;stroke:none;stroke-width:0.913174pt;"
     d="M 16.539898 37.864607 L 16.473792 52.191255 L 73.780388 52.45568 L 73.846495 38.129031 L 16.539898 37.864607 z "
     id="path590"
     sodipodi:nodetypes="ccccc" />
  <path
     transform="matrix(0.856155,0.000000,0.000000,0.856155,1.133850,1.293991)"
     style="font-size:12;fill:#cb0000;fill-rule:evenodd;stroke-width:1pt;fill-opacity:1;"
     d="M 96.565838 51.645908 C 96.565838 54.745383 96.251398 57.771863 95.6527 60.695168 C 95.054002 63.618473 94.171044 66.438602 93.034008 69.125376 C 91.896973 71.812149 90.505859 74.365566 88.890847 76.755447 C 87.275835 79.145327 85.436925 81.371672 83.404298 83.404298 C 81.371672 85.436925 79.145327 87.275835 76.755447 88.890847 C 74.365566 90.505859 71.812149 91.896973 69.125376 93.034008 C 66.438602 94.171044 63.618473 95.054002 60.695168 95.6527 C 57.771863 96.251398 54.745383 96.565838 51.645908 96.565838 C 48.546433 96.565838 45.519953 96.251398 42.596648 95.6527 C 39.673343 95.054002 36.853214 94.171044 34.166441 93.034008 C 31.479667 91.896973 23.690679 88.419842 26.536369 88.890847 C 112.1575 103.01974 87.275835 24.146489 88.890847 26.536369 C 90.505859 28.92625 91.896973 31.479667 93.034008 34.166441 C 94.171044 36.853214 95.054002 39.673343 95.6527 42.596648 C 96.251398 45.519953 96.565838 48.546433 96.565838 51.645908 z "
     id="path582"
     sodipodi:nodetypes="cssssssscssssssc" />
  <path
     style="font-size:12;fill:#ffffff;fill-rule:evenodd;stroke-width:1pt;fill-opacity:1;"
     d="M 6.2268474 46.816907 C 6.0633174 44.16832 6.1723364 41.565519 6.5297064 39.035886 C 6.8870754 36.506253 7.4927964 34.049789 8.3226694 31.693875 C 9.1525424 29.337963 10.206568 27.082601 11.460549 24.955173 C 12.71453 22.827745 14.168467 20.82825 15.798161 18.984072 C 17.427854 17.139894 19.233306 15.451031 21.190316 13.944867 C 23.147327 12.438703 25.255897 11.115238 27.491829 10.001855 C 29.727761 8.8884713 32.091054 7.9851673 34.557512 7.3193283 C 37.02397 6.6534893 39.593591 6.2251133 42.242179 6.0615833 C 44.890766 5.8980543 47.493567 6.0070733 50.0232 6.3644423 C 52.552833 6.7218113 55.009297 7.3275323 57.36521 8.1574053 C 59.721123 8.9872783 66.699902 12.634744 64.324884 11.958198 C 4.9978803 -4.8786996 8.1504314 56.968031 7.4845924 54.501574 C 6.8187534 52.035116 6.3903774 49.465495 6.2268474 46.816907 z "
     id="path583"
     sodipodi:nodetypes="cssssssscssssc" />
</svg>
