<?xml version="1.0" encoding="UTF-8" standalone="no"?>
<!DOCTYPE svg PUBLIC "-//W3C//DTD SVG 20010904//EN"
"http://www.w3.org/TR/2001/REC-SVG-20010904/DTD/svg10.dtd">
<!-- Created with Sodipodi ("http://www.sodipodi.com/") -->
<svg
   xmlns="http://www.w3.org/2000/svg"
   xmlns:sodipodi="http://sodipodi.sourceforge.net/DTD/sodipodi-0.dtd"
   xmlns:xlink="http://www.w3.org/1999/xlink"
   id="svg604"
   sodipodi:version="0.34"
   width="72pt"
   height="72pt"
   sodipodi:docbase="/home/zeus/.themes/Zeus-Test/gtk-2.0/"
   sodipodi:docname="/home/zeus/.themes/Zeus-Test/gtk-2.0/stock_new.svg">
  <defs
     id="defs606">
    <linearGradient
       id="linearGradient612">
      <stop
         style="stop-color:#7fa8e3;stop-opacity:0.741176;"
         offset="0.000000"
         id="stop613" />
      <stop
         style="stop-color:#ffffff;stop-opacity:0;"
         offset="1.000000"
         id="stop614" />
    </linearGradient>
    <linearGradient
       xlink:href="#linearGradient612"
       id="linearGradient615"
       x1="50.6438866"
       y1="5.36792946"
       x2="35.7520943"
       y2="68.0443573"
       gradientUnits="userSpaceOnUse"
       spreadMethod="pad" />
  </defs>
  <sodipodi:namedview
     id="base" />
  <path
     style="fill:#3d4e67;fill-rule:evenodd;stroke:none;stroke-opacity:1;stroke-width:1pt;stroke-linejoin:miter;stroke-linecap:butt;fill-opacity:1;"
     d="M 20.18483 89.14329 C 16.56455 89.09024 10.4952 86.87786 9.96526 80.9409 C 8.096444 74.94246 1.599868 18.247 4.734746 14.29802 C 6.354573 11.18903 9.881865 8.906756 16.15755 8.115571 C 21.29255 7.328715 68.00113 1.179323 71.44533 2.13378 C 74.88963 3.0883 77.60279 3.895429 77.85056 8.682353 C 77.59582 11.2857 86.27138 64.38615 87.60233 67.51744 C 88.23739 71.18516 87.19491 76.31059 81.88388 77.99896 C 76.57295 79.6873 24.37737 88.4267 20.18483 89.14329 z "
     id="path609"
     sodipodi:nodetypes="ccccccccc" />
  <path
     style="fill:#ffffff;fill-rule:evenodd;stroke:none;stroke-opacity:1;stroke-width:1pt;stroke-linejoin:miter;stroke-linecap:butt;fill-opacity:1;"
     d="M 24.3673 82.85482 C 20.85741 83.31853 15.98199 84.28792 15.39964 79.48566 C 12.97466 68.11749 7.414623 23.06278 11.37641 15.74092 C 12.26127 14.0192 17.06553 11.6822 27.97875 10.7066 C 40.38049 9.458338 65.82697 7.560103 68.50477 7.68341 C 71.18244 7.806749 72.00162 7.50334 72.58405 12.30572 C 72.34752 17.41142 80.42556 57.35167 80.90278 64.4232 C 81.2741 69.44318 81.91313 71.57606 78.63668 72.78965 "
     id="path608"
     sodipodi:nodetypes="cccccccs" />
  <path
     style="fill:url(#linearGradient615);fill-rule:evenodd;stroke:none;stroke-opacity:1;stroke-width:1pt;stroke-linejoin:miter;stroke-linecap:butt;fill-opacity:1;"
     d="M 12.25451 22.53954 C 12.25451 22.53954 12.57018 15.72645 21.65665 14.3697 C 30.74309 13.01299 66.72937 8.388655 67.58682 10.74952 C 68.44421 13.11037 69.50575 28.45298 69.77051 29.69416 C 70.03527 30.93529 39.57231 41.54909 31.20733 51.67835 C 22.84233 61.8076 16.98394 70.00403 16.98394 70.00403 C 16.98394 70.00403 12.1939 34.28015 12.25451 22.53954 z "
     id="path636" />
</svg>
