<?xml version="1.0" encoding="UTF-8" standalone="no"?>
<!DOCTYPE svg PUBLIC "-//W3C//DTD SVG 20010904//EN"
"http://www.w3.org/TR/2001/REC-SVG-20010904/DTD/svg10.dtd">
<!-- Created with Sodipodi ("http://www.sodipodi.com/") -->
<svg
   id="svg604"
   sodipodi:version="0.32"
   width="72pt"
   height="72pt"
   sodipodi:docbase="/home/zeus/.icons/gartoon/scalable/mimetypes/"
   sodipodi:docname="/home/zeus/.icons/gartoon/scalable/mimetypes/gnome-mime-video-x-msvideo.svg"
   xmlns="http://www.w3.org/2000/svg"
   xmlns:sodipodi="http://sodipodi.sourceforge.net/DTD/sodipodi-0.dtd"
   xmlns:xlink="http://www.w3.org/1999/xlink">
  <defs
     id="defs606">
    <linearGradient
       id="linearGradient575">
      <stop
         style="stop-color:#de8a17;stop-opacity:0.741176;"
         offset="0.000000"
         id="stop576" />
      <stop
         style="stop-color:#1ac5aa;stop-opacity:0.929412;"
         offset="1.000000"
         id="stop577" />
    </linearGradient>
    <linearGradient
       id="linearGradient612">
      <stop
         style="stop-color:#7fa8e3;stop-opacity:0.741176;"
         offset="0.000000"
         id="stop613" />
      <stop
         style="stop-color:#ffffff;stop-opacity:0;"
         offset="1.000000"
         id="stop614" />
    </linearGradient>
    <linearGradient
       xlink:href="#linearGradient612"
       id="linearGradient615"
       x1="50.6438866"
       y1="5.36792946"
       x2="35.7520943"
       y2="68.0443573"
       gradientUnits="userSpaceOnUse"
       spreadMethod="pad" />
    <linearGradient
       xlink:href="#linearGradient575"
       id="linearGradient574"
       x1="38.7992325"
       y1="47.4790993"
       x2="23.6706333"
       y2="51.0043793"
       gradientUnits="userSpaceOnUse"
       spreadMethod="pad"
       gradientTransform="scale(1.044094,0.957768)" />
    <linearGradient
       xlink:href="#linearGradient575"
       id="linearGradient578"
       x1="1.32557678"
       y1="0.18749924"
       x2="0.82945710"
       y2="0.34375003"
       gradientUnits="objectBoundingBox"
       spreadMethod="pad" />
  </defs>
  <sodipodi:namedview
     id="base" />
  <path
     style="fill:#000000;fill-rule:evenodd;stroke:none;stroke-opacity:1;stroke-width:1pt;stroke-linejoin:miter;stroke-linecap:butt;fill-opacity:0.301471;"
     d="M 12.8163 74.753 C 10.3856 73.6481 7.07107 70.1126 8.83884 65.2512 C 9.72267 59.948 25.6326 13.1021 29.1682 10.8924 C 31.3778 8.90368 34.582 8.13026 39.1119 9.34561 C 42.8684 10.2295 76.6769 19.0684 78.6656 20.8361 C 80.6544 22.6039 82.2012 24.0402 80.6544 27.9072 C 79.5496 29.8959 66.4017 74.532 66.1808 77.4047 C 65.2969 80.4983 62.7558 84.2548 58.5573 84.0338 C 54.3589 83.8128 15.9099 75.4159 12.8163 74.753 z "
     id="path794"
     sodipodi:nodetypes="ccccccccc"
     transform="matrix(1.114903,0.000000,0.000000,1.114903,-5.305332,-3.889256)" />
  <path
     style="fill:#3d4e67;fill-rule:evenodd;stroke:none;stroke-opacity:1;stroke-width:1pt;stroke-linejoin:miter;stroke-linecap:butt;fill-opacity:1;"
     d="M 12.8163 74.753 C 10.3856 73.6481 7.07107 70.1126 8.83884 65.2512 C 9.72267 59.948 25.6326 13.1021 29.1682 10.8924 C 31.3778 8.90368 34.582 8.13026 39.1119 9.34561 C 42.8684 10.2295 76.6769 19.0684 78.6656 20.8361 C 80.6544 22.6039 82.2012 24.0402 80.6544 27.9072 C 79.5496 29.8959 66.4017 74.532 66.1808 77.4047 C 65.2969 80.4983 62.7558 84.2548 58.5573 84.0338 C 54.3589 83.8128 15.9099 75.4159 12.8163 74.753 z "
     id="path609"
     sodipodi:nodetypes="ccccccccc"
     transform="matrix(1.114903,0.000000,0.000000,1.114903,-8.162471,-8.460684)" />
  <path
     style="fill:#ffffff;fill-rule:evenodd;stroke:none;stroke-opacity:1;stroke-width:1pt;stroke-linejoin:miter;stroke-linecap:butt;fill-opacity:1;"
     d="M 17.8987 70.9965 C 15.3576 70.3336 11.7114 69.6706 13.0373 65.6932 C 15.468 55.9705 27.8424 18.6264 33.1456 13.986 C 34.361 12.8811 38.4489 12.4392 46.1829 14.8699 C 55.0218 17.5215 72.9204 23.4877 74.6882 24.3716 C 76.4559 25.2555 77.1189 25.2555 75.793 29.233 C 73.8043 33.2105 64.9655 67.24 62.7557 72.9852 C 61.209 77.0732 60.8775 78.9514 58.2258 78.9514 "
     id="path608"
     sodipodi:nodetypes="cccccccs"
     transform="matrix(1.114903,0.000000,0.000000,1.114903,-8.162471,-8.460684)" />
  <path
     style="fill:url(#linearGradient615);fill-rule:evenodd;stroke:none;stroke-opacity:1;stroke-width:1pt;stroke-linejoin:miter;stroke-linecap:butt;fill-opacity:1;"
     d="M 28.75 13.75 C 28.75 13.75 31.875 7.49995 39.6875 9.37495 C 47.5 11.25 78.125 19.375 77.8125 21.875 C 77.5 24.375 71.875 39.0625 71.5625 40.3125 C 71.25 41.5625 42.5 40.9375 31.5625 47.5 C 20.625 54.0625 12.5 59.6875 12.5 59.6875 C 12.5 59.6875 23.75 24.6875 28.75 13.75 z "
     id="path636"
     transform="matrix(0.946780,0.000000,0.000000,0.946780,-0.480566,0.409517)" />
  <path
     style="font-size:12;fill-rule:evenodd;stroke-width:1pt;"
     d="M 67.7143 20.8571 C 67.9048 22 69.5094 24.7591 69.6999 25.9019 C 67.8904 26.5686 66.6869 27.5383 64.8774 28.205 C 66.4012 34.9669 67.319 38.7993 68.8428 45.5612 C 70.9612 45.2034 72.2713 44.0374 73.7836 42.6695 C 74.0693 44.2886 74.7591 46.6147 75.0448 48.2338 C 60.0003 57.6914 35.2584 67.149 12.2338 67.2122 C 11.7576 65.7836 12.1905 63.1428 11.7143 61.7143 C 13.9221 61.7489 14.6147 61.5816 16.5195 61.3132 C 15.3766 55.5989 14.6377 49.1776 13.4949 43.4633 C 11.2929 43.6307 10.404 43.4949 8.10106 43.5612 C 7.72009 41.5612 7.52382 40.2857 7.14286 38.2857 C 30.4762 36.1905 49.5238 30.9523 67.7143 20.8571 z "
     id="path559"
     sodipodi:nodetypes="ccccccccccccc"
     transform="translate(5.142860,-12.00001)" />
  <path
     style="font-size:12;fill:#f1e36c;fill-rule:evenodd;stroke-width:1pt;fill-opacity:1;"
     d="M 20.9102 59.3924 C 27.3752 59.7628 33.5371 57.9108 39.295 56.0588 C 38.0491 49.4591 37.0053 46.3951 35.7594 39.7954 C 30.3383 42.0851 24.21 43.2636 17.8797 43.533 "
     id="path560"
     sodipodi:nodetypes="cccc"
     transform="translate(5.142860,-12.00001)" />
  <path
     style="font-size:12;fill:#f1e36c;fill-rule:evenodd;stroke-width:1pt;fill-opacity:1;"
     d="M 22.2234 60.6046 C 30.4056 59.6618 35.6583 56.0926 40.8102 53.2304 C 39.5643 46.6307 38.2174 44.6778 36.9715 38.0781 C 31.2474 40.9739 24.4122 43.9706 18.2839 44.7451 "
     id="path561"
     sodipodi:nodetypes="cccc"
     transform="translate(27.97231,-18.06092)" />
  <path
     transform="matrix(0.989443,-0.144927,0.146771,0.989170,0.147348,-9.823467)"
     style="font-size:12;fill:#ffffff;fill-rule:evenodd;stroke-width:1pt;"
     d="M 17.3956 62.593 C 17.3956 63.8494 17.5098 64.9108 17.5098 66.1672 C 19.3789 66.1672 21.1337 66.3623 23.0229 66.0599 C 23.0229 64.8035 23.0027 63.8494 23.0027 62.593 C 21.2076 63.0027 19.2445 62.8954 17.3956 62.593 z "
     id="path563"
     sodipodi:nodetypes="ccccc" />
  <path
     transform="matrix(0.965794,-0.259313,0.261113,0.965308,3.265204,-8.097851)"
     style="font-size:12;fill:#ffffff;fill-rule:evenodd;stroke-width:1pt;"
     d="M 17.3956 62.593 C 17.3956 63.8494 17.5098 64.9108 17.5098 66.1672 C 19.3789 66.1672 21.1337 66.3623 23.0229 66.0599 C 23.0229 64.8035 23.0027 63.8494 23.0027 62.593 C 21.2076 63.0027 19.2445 62.8954 17.3956 62.593 z "
     id="path564"
     sodipodi:nodetypes="ccccc" />
  <path
     transform="matrix(0.965794,-0.259313,0.261113,0.965308,12.35658,-10.52221)"
     style="font-size:12;fill:#ffffff;fill-rule:evenodd;stroke-width:1pt;"
     d="M 17.3956 62.593 C 17.3956 63.8494 17.5098 64.9108 17.5098 66.1672 C 19.3789 66.1672 21.1337 66.3623 23.0229 66.0599 C 23.0229 64.8035 23.0027 63.8494 23.0027 62.593 C 21.2076 63.0027 19.2445 62.8954 17.3956 62.593 z "
     id="path565"
     sodipodi:nodetypes="ccccc" />
  <path
     transform="matrix(0.965794,-0.259313,0.261113,0.965308,21.44796,-13.24963)"
     style="font-size:12;fill:#ffffff;fill-rule:evenodd;stroke-width:1pt;"
     d="M 17.3956 62.593 C 17.3956 63.8494 17.5098 64.9108 17.5098 66.1672 C 19.3789 66.1672 21.1337 66.3623 23.0229 66.0599 C 23.0229 64.8035 23.0027 63.8494 23.0027 62.593 C 21.2076 63.0027 19.2445 62.8954 17.3956 62.593 z "
     id="path566"
     sodipodi:nodetypes="ccccc" />
  <path
     transform="matrix(0.965794,-0.259313,0.261113,0.965308,21.44796,-13.24963)"
     style="font-size:12;fill:#ffffff;fill-rule:evenodd;stroke-width:1pt;"
     d="M 17.3956 62.593 C 17.3956 63.8494 17.5098 64.9108 17.5098 66.1672 C 19.3789 66.1672 21.1337 66.3623 23.0229 66.0599 C 23.0229 64.8035 23.0027 63.8494 23.0027 62.593 C 21.2076 63.0027 19.2445 62.8954 17.3956 62.593 z "
     id="path567"
     sodipodi:nodetypes="ccccc" />
  <path
     transform="matrix(0.965794,-0.259313,0.261113,0.965308,30.03426,-16.78517)"
     style="font-size:12;fill:#ffffff;fill-rule:evenodd;stroke-width:1pt;"
     d="M 17.3956 62.593 C 17.3956 63.8494 17.5098 64.9108 17.5098 66.1672 C 19.3789 66.1672 21.1337 66.3623 23.0229 66.0599 C 23.0229 64.8035 23.0027 63.8494 23.0027 62.593 C 21.2076 63.0027 19.2445 62.8954 17.3956 62.593 z "
     id="path568"
     sodipodi:nodetypes="ccccc" />
  <path
     transform="matrix(0.989443,-0.144927,0.146771,0.989170,-4.297325,-32.65293)"
     style="font-size:12;fill:#ffffff;fill-rule:evenodd;stroke-width:1pt;"
     d="M 17.3956 62.593 C 17.3956 63.8494 17.5098 64.9108 17.5098 66.1672 C 19.3789 66.1672 21.1337 66.3623 23.0229 66.0599 C 23.0229 64.8035 23.0027 63.8494 23.0027 62.593 C 21.2076 63.0027 19.2445 62.8954 17.3956 62.593 z "
     id="path569"
     sodipodi:nodetypes="ccccc" />
  <path
     transform="matrix(0.965794,-0.259313,0.261113,0.965308,-1.179469,-30.92732)"
     style="font-size:12;fill:#ffffff;fill-rule:evenodd;stroke-width:1pt;"
     d="M 17.3956 62.593 C 17.3956 63.8494 17.5098 64.9108 17.5098 66.1672 C 19.3789 66.1672 21.1337 66.3623 23.0229 66.0599 C 23.0229 64.8035 23.0027 63.8494 23.0027 62.593 C 21.2076 63.0027 19.2445 62.8954 17.3956 62.593 z "
     id="path570"
     sodipodi:nodetypes="ccccc" />
  <path
     transform="matrix(0.965794,-0.259313,0.261113,0.965308,7.911911,-33.35167)"
     style="font-size:12;fill:#ffffff;fill-rule:evenodd;stroke-width:1pt;"
     d="M 17.3956 62.593 C 17.3956 63.8494 17.5098 64.9108 17.5098 66.1672 C 19.3789 66.1672 21.1337 66.3623 23.0229 66.0599 C 23.0229 64.8035 23.0027 63.8494 23.0027 62.593 C 21.2076 63.0027 19.2445 62.8954 17.3956 62.593 z "
     id="path571"
     sodipodi:nodetypes="ccccc" />
  <path
     transform="matrix(0.965794,-0.259313,0.261113,0.965308,17.00329,-36.07908)"
     style="font-size:12;fill:#ffffff;fill-rule:evenodd;stroke-width:1pt;"
     d="M 17.3956 62.593 C 17.3956 63.8494 17.5098 64.9108 17.5098 66.1672 C 19.3789 66.1672 21.1337 66.3623 23.0229 66.0599 C 23.0229 64.8035 23.0027 63.8494 23.0027 62.593 C 21.2076 63.0027 19.2445 62.8954 17.3956 62.593 z "
     id="path572"
     sodipodi:nodetypes="ccccc" />
  <path
     transform="matrix(0.965794,-0.259313,0.261113,0.965308,25.58959,-39.61462)"
     style="font-size:12;fill:#ffffff;fill-rule:evenodd;stroke-width:1pt;"
     d="M 17.3956 62.593 C 17.3956 63.8494 17.5098 64.9108 17.5098 66.1672 C 19.3789 66.1672 21.1337 66.3623 23.0229 66.0599 C 23.0229 64.8035 23.0027 63.8494 23.0027 62.593 C 21.2076 63.0027 19.2445 62.8954 17.3956 62.593 z "
     id="path573"
     sodipodi:nodetypes="ccccc" />
  <path
     transform="matrix(0.975286,0.220944,-0.220944,0.975286,19.17974,-6.479530)"
     style="font-size:12;font-weight:bold;stroke-width:1pt;font-family:Kid Kosmic;fill:#313f54;fill-opacity:0.815767;"
     d="M 45.6602 59.4654 C 46.0352 59.4654 46.3633 59.5552 46.6445 59.7349 C 46.9727 59.938 47.1367 60.2154 47.1367 60.5669 C 47.1367 60.6294 47.1328 60.6919 47.125 60.7544 C 46.0234 64.3873 45.3164 67.4771 45.0039 70.024 C 44.8633 70.6568 44.4766 70.9498 43.8438 70.9029 C 43.2031 70.856 42.875 70.6138 42.8594 70.1763 C 43.1953 67.3638 43.8281 63.9537 44.7578 59.9459 C 44.9844 59.6255 45.2852 59.4654 45.6602 59.4654 z M 34.0703 59.6177 C 34.5156 59.6177 34.7969 59.8365 34.9141 60.274 C 34.9141 62.2349 34.9649 63.6255 35.0664 64.4459 C 35.293 66.2427 35.7539 67.2779 36.4492 67.5513 C 37.207 67.2154 38.1524 66.0943 39.2852 64.188 C 39.7695 63.3755 40.4922 62.0123 41.4531 60.0982 C 41.7031 59.8638 41.9531 59.7466 42.2031 59.7466 C 42.4766 59.7466 42.7227 59.8443 42.9414 60.0396 C 43.1602 60.2271 43.2695 60.4537 43.2695 60.7193 C 43.2695 60.9224 43.1836 61.149 43.0117 61.399 C 41.7852 64.0709 39.8399 66.9888 37.1758 70.1529 C 36.7227 70.5513 36.3047 70.7505 35.9219 70.7505 C 35.5781 70.7505 35.2617 70.5943 34.9727 70.2818 C 33.5195 68.0709 32.6953 65.0201 32.5 61.1294 C 32.4453 60.7466 32.6016 60.3951 32.9688 60.0748 C 33.3047 59.7701 33.6719 59.6177 34.0703 59.6177 z M 22.4102 60.8365 C 22.8399 60.4459 23.793 60.1334 25.2695 59.899 C 26.5039 59.7037 27.5859 59.6177 28.5156 59.6412 C 29.2734 59.6646 29.8086 59.8248 30.1211 60.1216 C 30.1602 60.8326 30.1797 61.5474 30.1797 62.2662 C 30.1797 64.563 29.9883 66.9263 29.6055 69.356 C 29.5039 70.0044 29.168 70.4302 28.5977 70.6334 C 28.3867 70.7037 28.207 70.7388 28.0586 70.7388 C 27.7461 70.7388 27.5391 70.5826 27.4375 70.2701 C 27.7656 69.1685 27.9844 68.1412 28.0938 67.188 L 21.6367 68.2779 C 21.5117 68.5201 21.2813 69.0005 20.9453 69.7193 C 20.7969 70.3599 20.4141 70.7388 19.7969 70.856 C 19.6406 70.8873 19.5274 70.9029 19.457 70.9029 C 19.082 70.9029 18.8945 70.7544 18.8945 70.4576 C 18.8945 70.3716 18.9141 70.2818 18.9531 70.188 C 20.4375 66.9146 21.5899 63.7974 22.4102 60.8365 z M 27.7656 62.3951 C 27.6484 62.1216 27.2813 61.9849 26.6641 61.9849 C 26.2578 61.9849 25.7578 62.0591 25.1641 62.2076 C 24.4922 62.3794 24.0469 62.5748 23.8281 62.7935 C 23.5469 63.7544 23.1875 64.7505 22.75 65.7818 L 28.1641 64.6216 C 28.0938 63.8794 27.9609 63.1373 27.7656 62.3951 z M 18.5195 68.8521 C 18.5195 69.2427 18.332 69.5865 17.957 69.8834 C 17.5899 70.1802 17.1953 70.3287 16.7734 70.3287 C 16.6172 70.3287 16.4727 70.3052 16.3399 70.2584 C 15.9492 70.1021 15.7539 69.8248 15.7539 69.4263 C 15.7539 69.1529 15.8516 68.8873 16.0469 68.6294 C 16.4219 68.1529 16.8906 67.9146 17.4531 67.9146 C 17.6172 67.9146 17.7734 67.9419 17.9219 67.9966 C 18.3203 68.1451 18.5195 68.4302 18.5195 68.8521 z "
     id="path625" />
</svg>
