/* XPM */
static char * xscreensaver_16x16_xpm[] = {
"16 16 122 2",
"  	c None",
". 	c #525252",
"+ 	c #787878",
"@ 	c #5D5D5D",
"# 	c #808080",
"$ 	c #ACACAC",
"% 	c #D1D1D1",
"& 	c #D8D8D8",
"* 	c #D6D6D6",
"= 	c #6F6F6F",
"- 	c #6C6C6C",
"; 	c #919191",
"> 	c #B8B8B8",
", 	c #DADADA",
"' 	c #D9D9D9",
") 	c #D5D5D5",
"! 	c #BEBEBE",
"~ 	c #868686",
"{ 	c #B7B7B7",
"] 	c #727272",
"^ 	c #6E6E6E",
"/ 	c #E3E3E3",
"( 	c #D4D4D4",
"_ 	c #BFBFBF",
": 	c #ABABAB",
"< 	c #878787",
"[ 	c #636363",
"} 	c #4D4D4D",
"| 	c #524040",
"1 	c #383838",
"2 	c #AFAFAF",
"3 	c #737373",
"4 	c #838383",
"5 	c #3E3E3E",
"6 	c #472B2B",
"7 	c #5E2826",
"8 	c #3D3D3D",
"9 	c #5B4545",
"0 	c #623A3A",
"a 	c #464646",
"b 	c #6A6A6A",
"c 	c #6B6B6B",
"d 	c #717171",
"e 	c #2F2F2F",
"f 	c #4C2C2C",
"g 	c #9B100E",
"h 	c #853635",
"i 	c #7F4241",
"j 	c #606060",
"k 	c #8F8F8F",
"l 	c #656565",
"m 	c #343434",
"n 	c #676767",
"o 	c #323232",
"p 	c #373737",
"q 	c #5D3636",
"r 	c #A94240",
"s 	c #633332",
"t 	c #A8A8A8",
"u 	c #383835",
"v 	c #7B7B7B",
"w 	c #272727",
"x 	c #747474",
"y 	c #353535",
"z 	c #3C3A3A",
"A 	c #78302F",
"B 	c #604242",
"C 	c #6E4340",
"D 	c #8D8D8D",
"E 	c #8E8B62",
"F 	c #F2EA8E",
"G 	c #9A9A9A",
"H 	c #5C5936",
"I 	c #757575",
"J 	c #642A29",
"K 	c #4A3838",
"L 	c #2C2C2C",
"M 	c #C7BE5C",
"N 	c #848484",
"O 	c #A8A583",
"P 	c #F8F2AC",
"Q 	c #AC9C65",
"R 	c #B2983E",
"S 	c #7F701E",
"T 	c #777777",
"U 	c #3C3C3C",
"V 	c #616161",
"W 	c #8A8A8A",
"X 	c #DEB624",
"Y 	c #AE9854",
"Z 	c #DBC569",
"` 	c #F4DA5E",
" .	c #EABB29",
"..	c #CC7A02",
"+.	c #765900",
"@.	c #C2C2C2",
"#.	c #DCDCDC",
"$.	c #E1E1E1",
"%.	c #C0C0C0",
"&.	c #F6D818",
"*.	c #F6EA82",
"=.	c #FAE21F",
"-.	c #6B5C00",
";.	c #443405",
">.	c #D78A00",
",.	c #AAAAAA",
"'.	c #6D6D6D",
").	c #F7D817",
"!.	c #FEF8A3",
"~.	c #FCE922",
"{.	c #7F6C00",
"].	c #98780E",
"^.	c #CF7E00",
"/.	c #E8C50B",
"(.	c #FEF592",
"_.	c #DFBB00",
":.	c #CD9202",
"<.	c #9E6A00",
"[.	c #554200",
"}.	c #AC9637",
"|.	c #A68D0E",
"1.	c #836500",
"                                ",
"                    . +         ",
"            @ # $ % & * =       ",
"    - ; > , ' ) ! $ ~ { ]       ",
"  ^ / ( _ : < [ } | 1 2 3       ",
"  = * 4 5 6 7 8 9 0 a b }       ",
"  c ) d e f g h i j k - l m     ",
"  n ) ] o p q r s t 5 u v w     ",
"  l ( x y z A B C D E F G H     ",
"  l ) I 1 J K L M N O P Q R S   ",
"  l ) T U V W ] X Y Z `  ...+.  ",
"  l ) @.#.$.%.[ &.*.=.-.;.>.+.  ",
"    ,.W '.      ).!.~.{.].^.+.  ",
"                /.(.~._.:.<.    ",
"                [.}.|.1.        ",
"                                "};
