<?xml version="1.0" encoding="UTF-8" standalone="no"?>
<!DOCTYPE svg PUBLIC "-//W3C//DTD SVG 1.0//EN"
"http://www.w3.org/TR/2001/REC-SVG-20010904/DTD/svg10.dtd">
<!-- Created with Sodipodi ("http://www.sodipodi.com/") -->
<svg
   xmlns="http://www.w3.org/2000/svg"
   xmlns:xlink="http://www.w3.org/1999/xlink"
   version="1.0"
   x="0"
   y="0"
   width="60"
   height="60"
   id="svg1">
  <defs
     id="defs3" />
  <path
     d="M 0.320285 31.81495 C 1.180346 44.14104 11.91046 60.39447 17.93594 59.89324 C 26.79561 59.3498 33.2837 53.55611 43.88038 40.37722 C 50.90651 31.39824 53.17573 27.97478 58.87796 12.85222 C 60.45197 8.531218 54.00782 1.70042 49.12479 8.346686 C 33.65245 29.59952 25.54486 35.45492 22.02664 36.37814 C 17.62595 37.42617 17.28794 24.94363 12.43187 20.11662 C 11.34488 19.03615 -0.487473 20.432 0.320285 31.81495 z "
     style="font-size:12;fill:#0d3c07;fill-rule:evenodd;stroke-width:1;"
     id="path574" />
  <path
     d="M 3.401724 32.72672 C 4.901983 40.82515 14.19969 58.12222 18.14005 57.27557 C 22.23993 56.37936 27.19722 52.07201 36.2041 41.88869 C 48.26559 28.4706 52.70291 18.83315 54.95232 15.23799 C 59.8601 7.200503 53.18755 9.462109 47.63525 17.44724 C 43.22912 23.93757 24.8678 47.21614 20.41994 41.93796 C 18.28175 39.30757 14.68377 27.72971 11.44685 24.51217 C 10.72229 23.79195 1.960087 25.13829 3.401724 32.72672 z "
     style="font-size:12;fill:#2aaf18;fill-rule:evenodd;stroke-width:1;"
     id="path584" />
  <path
     d="M 5.231317 31.70819 C 5.802325 30.48048 7.113711 30.08918 8.113879 30.74733 C 9.55218 31.62354 9.509628 34.04286 8.434164 34.69751 C 7.480143 35.18353 4.881497 33.48526 5.231317 31.70819 z "
     style="font-size:12;fill:#ffffff;fill-rule:evenodd;stroke:#ffffff;stroke-width:1;"
     id="path587" />
  <path
     d="M 14.19929 49.53737 C 15.87964 52.33327 22.56406 51.18663 24.23488 49.53737 C 28.16804 45.54819 22.77073 53.7496 17.93594 53.70107 C 14.46711 53.66546 11.62771 45.4362 14.19929 49.53737 z "
     style="font-size:12;fill:#208c11;fill-rule:evenodd;stroke:#208c11;stroke-width:1;"
     id="path589" />
  <path
     d="M 12.50187 13.99917 L 13.36587 16.64517 L 16.13787 16.64517 L 11.60187 3.523171 L 8.613871 3.523171 L 3.951871 16.64517 L 6.705871 16.64517 L 7.587871 13.99917 L 12.50187 13.99917 z M 11.76387 11.74917 L 8.343871 11.74917 L 10.05387 6.619171 L 11.76387 11.74917 z M 17.95587 16.64517 L 23.85987 16.64517 C 25.37187 16.64517 26.37987 16.35717 27.17187 15.69117 C 27.96387 15.02517 28.46787 13.90917 28.46787 12.86517 C 28.46787 11.56917 27.76587 10.54317 26.28987 9.679171 C 27.58587 8.851171 28.08987 8.095171 28.08987 6.979171 C 28.08987 6.079171 27.63987 5.125171 26.90187 4.477171 C 26.12787 3.811171 25.20987 3.523171 23.80587 3.523171 L 17.95587 3.523171 L 17.95587 16.64517 z M 20.65587 5.773171 L 23.58987 5.773171 C 24.83187 5.773171 25.49787 6.295171 25.49787 7.267171 C 25.49787 8.221171 24.83187 8.743171 23.58987 8.743171 L 20.65587 8.743171 L 20.65587 5.773171 z M 20.65587 10.99317 L 23.87787 10.99317 C 25.19187 10.99317 25.87587 11.58717 25.87587 12.70317 C 25.87587 13.80117 25.19187 14.39517 23.87787 14.39517 L 20.65587 14.39517 L 20.65587 10.99317 z M 41.75187 7.969171 C 41.66187 6.835171 41.42787 6.115171 40.86987 5.377171 C 39.86187 4.045171 38.24187 3.307171 36.27987 3.307171 C 32.57187 3.307171 30.26787 5.953171 30.26787 10.20117 C 30.26787 14.41317 32.55387 17.05917 36.20787 17.05917 C 39.46587 17.05917 41.64387 15.16917 41.80587 12.16317 L 39.17787 12.16317 C 39.01587 13.83717 37.95387 14.79117 36.27987 14.79117 C 34.19187 14.79117 32.96787 13.09917 32.96787 10.23717 C 32.96787 7.339171 34.24587 5.611171 36.36987 5.611171 C 37.30587 5.611171 38.07987 5.935171 38.58387 6.565171 C 38.87187 6.925171 39.01587 7.267171 39.17787 7.969171 L 41.75187 7.969171 z "
     style="font-size:18;font-weight:bold;fill:#ff933d;stroke:#7b0000;stroke-opacity:0.9783;font-family:Nimbus Sans L;"
     id="path687" />
  <g
     transform="translate(53.6129,1.741934)"
     style="font-size:12;"
     id="g652">
    <defs
       id="defs604" />
    <text
       x="9.49569321"
       y="18.2028809"
       style="font-weight:bold;stroke-width:1;font-family:Bitstream Vera Sans Mono;"
       id="text605"
       xml:space="preserve"><tspan
   x="9.49569321"
   y="18.2028809"
   id="tspan608">Gartoon Pallete</tspan></text>
    <text
       x="9.3354826"
       y="135.787292"
       style="font-size:8;font-weight:normal;stroke-width:1;font-family:Bitstream Charter;"
       id="text829"
       xml:space="preserve"><tspan
   x="9.3354826"
   y="135.787292"
   id="tspan836">Use this color as the primary color option,</tspan><tspan
   x="9.3354826"
   y="143.787292"
   id="tspan838">If force to use other colors, use the color with</tspan><tspan
   x="9.3354826"
   y="151.787292"
   id="tspan840">similar Hue.</tspan></text>
    <rect
       width="11.4020376"
       height="12.0021057"
       x="9.30165958"
       y="29.7796783"
       transform="matrix(0.483181,0,0,0.483181,14.98208,25.62382)"
       style="fill:#ff933d;fill-rule:evenodd;"
       id="rect652" />
    <rect
       width="11.4020376"
       height="12.0021057"
       x="20.4036407"
       y="29.7796478"
       transform="matrix(0.483181,0,0,0.483181,14.98208,25.62382)"
       style="fill:#ffd056;fill-rule:evenodd;"
       id="rect653" />
    <rect
       width="11.4020376"
       height="12.0021057"
       x="9.30165958"
       y="46.2825623"
       transform="matrix(0.483181,0,0,0.483181,14.98208,25.62382)"
       style="fill:#999999;fill-rule:evenodd;"
       id="rect654" />
    <rect
       width="11.4020376"
       height="12.0021057"
       x="20.10359"
       y="46.2825317"
       transform="matrix(0.483181,0,0,0.483181,14.98208,25.62382)"
       style="fill:#bbbbbb;fill-rule:evenodd;"
       id="rect655" />
    <rect
       width="11.4020376"
       height="12.0021057"
       x="31.5056248"
       y="46.2825012"
       transform="matrix(0.483181,0,0,0.483181,14.98208,25.62382)"
       style="fill:#c9c9c9;fill-rule:evenodd;"
       id="rect656" />
    <rect
       width="11.4020376"
       height="12.0021057"
       x="20.1035881"
       y="63.6856079"
       transform="matrix(0.483181,0,0,0.483181,14.98208,25.62382)"
       style="fill:#2aaf18;fill-rule:evenodd;"
       id="rect670" />
    <rect
       width="11.4020376"
       height="12.0021057"
       x="9.00160599"
       y="63.6855774"
       transform="matrix(0.483181,0,0,0.483181,14.98208,25.62382)"
       style="fill:#1f8b10;fill-rule:evenodd;"
       id="rect671" />
    <rect
       width="11.4020376"
       height="12.0021057"
       x="31.5056248"
       y="29.7796173"
       transform="matrix(0.483181,0,0,0.483181,14.98208,25.62382)"
       style="fill:#efe16b;fill-rule:evenodd;"
       id="rect712" />
    <rect
       width="11.4020376"
       height="12.0021057"
       x="73.039444"
       y="80.0126343"
       transform="matrix(0.483181,0,0,0.483181,14.98208,25.62382)"
       style="fill:#bae6ff;fill-rule:evenodd;"
       id="rect713" />
    <rect
       width="11.4020376"
       height="12.0021057"
       x="8.70155239"
       y="97.591568"
       transform="matrix(0.483181,0,0,0.483181,14.98208,25.62382)"
       style="fill:#7e0000;fill-rule:evenodd;"
       id="rect792" />
    <rect
       width="11.4020376"
       height="12.0021057"
       x="20.1035881"
       y="97.5915375"
       transform="matrix(0.483181,0,0,0.483181,14.98208,25.62382)"
       style="fill:#cb0000;fill-rule:evenodd;"
       id="rect793" />
    <rect
       width="11.4020376"
       height="12.0021057"
       x="31.2055683"
       y="97.591507"
       transform="matrix(0.483181,0,0,0.483181,14.98208,25.62382)"
       style="fill:#ff1500;fill-rule:evenodd;"
       id="rect794" />
    <rect
       width="11.4020376"
       height="12.0021057"
       x="62.7861366"
       y="80.0125427"
       transform="matrix(0.483181,0,0,0.483181,14.98208,25.62382)"
       style="fill:#31baff;fill-rule:evenodd;"
       id="rect705" />
    <rect
       width="11.4020376"
       height="12.0021057"
       x="9.30165958"
       y="80.1884613"
       transform="matrix(0.483181,0,0,0.483181,14.98208,25.62382)"
       style="fill:#3d4e67;fill-rule:evenodd;"
       id="rect728" />
    <rect
       width="11.4020376"
       height="12.0021057"
       x="31.8093338"
       y="80.1884155"
       transform="matrix(0.483181,0,0,0.483181,14.98208,25.62382)"
       style="fill:#9bb9e3;fill-rule:evenodd;"
       id="rect729" />
    <rect
       width="11.4020376"
       height="12.0021057"
       x="20.3344936"
       y="80.1884308"
       transform="matrix(0.483181,0,0,0.483181,14.98208,25.62382)"
       style="fill:#437caf;fill-rule:evenodd;"
       id="rect766" />
    <rect
       width="11.4020376"
       height="12.0021057"
       x="63.4413834"
       y="29.6971741"
       transform="matrix(0.483181,0,0,0.483181,14.98208,25.62382)"
       style="fill:#955801;fill-rule:evenodd;"
       id="rect791" />
    <rect
       width="11.4020376"
       height="12.0021057"
       x="97.1763916"
       y="29.6970215"
       transform="matrix(0.483181,0,0,0.483181,14.98208,25.62382)"
       style="fill:#ffe6ba;fill-rule:evenodd;"
       id="rect795" />
    <rect
       width="11.4020376"
       height="12.0021057"
       x="85.9314041"
       y="29.6969757"
       transform="matrix(0.483181,0,0,0.483181,14.98208,25.62382)"
       style="fill:#e9a93d;fill-rule:evenodd;"
       id="rect796" />
    <rect
       width="11.4020376"
       height="12.0021057"
       x="74.4742126"
       y="29.696991"
       transform="matrix(0.483181,0,0,0.483181,14.98208,25.62382)"
       style="fill:#c89134;fill-rule:evenodd;"
       id="rect797" />
    <rect
       width="11.4020376"
       height="12.0021057"
       x="62.5927048"
       y="98.4402466"
       transform="matrix(0.483181,0,0,0.483181,14.98208,25.62382)"
       style="fill:#000001;fill-rule:evenodd;"
       id="rect842" />
    <rect
       width="11.4020376"
       height="12.0021057"
       x="73.6255493"
       y="98.4402161"
       transform="matrix(0.483181,0,0,0.483181,14.98208,25.62382)"
       style="fill:#ffffff;fill-rule:evenodd;stroke:#000000;"
       id="rect843" />
  </g>
</svg>
