<?xml version="1.0" encoding="UTF-8" standalone="no"?>
<!DOCTYPE svg PUBLIC "-//W3C//DTD SVG 20010904//EN"
"http://www.w3.org/TR/2001/REC-SVG-20010904/DTD/svg10.dtd">
<!-- Created with Sodipodi ("http://www.sodipodi.com/") -->
<svg
   id="svg596"
   sodipodi:version="0.32"
   width="72pt"
   height="72pt"
   sodipodi:docbase="/home/zeus/desktop/icons/gartoon/svg"
   sodipodi:docname="/home/zeus/desktop/icons/gartoon/svg/gnome-mime-image-jpg.svg"
   xmlns="http://www.w3.org/2000/svg"
   xmlns:sodipodi="http://sodipodi.sourceforge.net/DTD/sodipodi-0.dtd"
   xmlns:xlink="http://www.w3.org/1999/xlink">
  <defs
     id="defs598">
    <linearGradient
       id="linearGradient612">
      <stop
         style="stop-color:#7fa8e3;stop-opacity:0.741176;"
         offset="0.000000"
         id="stop613" />
      <stop
         style="stop-color:#ffffff;stop-opacity:0;"
         offset="1.000000"
         id="stop614" />
    </linearGradient>
    <linearGradient
       id="linearGradient626">
      <stop
         style="stop-color:#ff0047;stop-opacity:1;"
         offset="0.000000"
         id="stop627" />
      <stop
         style="stop-color:#ab322d;stop-opacity:0;"
         offset="1.000000"
         id="stop628" />
    </linearGradient>
    <linearGradient
       id="linearGradient618">
      <stop
         style="stop-color:#956d47;stop-opacity:1;"
         offset="0.000000"
         id="stop619" />
      <stop
         style="stop-color:#ab322d;stop-opacity:0;"
         offset="1.000000"
         id="stop620" />
    </linearGradient>
    <linearGradient
       id="linearGradient614">
      <stop
         style="stop-color:#000;stop-opacity:1;"
         offset="0"
         id="stop615" />
      <stop
         style="stop-color:#fff;stop-opacity:1;"
         offset="1"
         id="stop616" />
    </linearGradient>
    <linearGradient
       xlink:href="#linearGradient618"
       id="linearGradient617"
       x1="-0.19608469"
       y1="0.57031226"
       x2="1.07843077"
       y2="0.52343726"
       gradientUnits="objectBoundingBox"
       spreadMethod="pad" />
    <linearGradient
       xlink:href="#linearGradient626"
       id="linearGradient625"
       x1="42.9995728"
       y1="77.3980103"
       x2="28.5382881"
       y2="63.0152588"
       gradientUnits="userSpaceOnUse"
       spreadMethod="pad"
       gradientTransform="matrix(0.934001,0.000000,0.000000,1.070663,-1.516226e-6,-1.716230e-7)" />
    <linearGradient
       xlink:href="#linearGradient612"
       id="linearGradient636"
       x1="16.4110699"
       y1="10.6072874"
       x2="24.6243172"
       y2="61.6665344"
       gradientUnits="userSpaceOnUse"
       spreadMethod="pad" />
  </defs>
  <sodipodi:namedview
     id="base" />
  <g
     id="g898"
     transform="translate(-1.146498,1.146498)">
    <path
       style="fill:#000000;fill-rule:evenodd;stroke:none;stroke-opacity:1;stroke-width:1pt;stroke-linejoin:miter;stroke-linecap:butt;fill-opacity:0.301471;"
       d="M 12.8163 74.753 C 10.3856 73.6481 7.07107 70.1126 8.83884 65.2512 C 9.72267 59.948 25.6326 13.1021 29.1682 10.8924 C 31.3778 8.90368 34.582 8.13026 39.1119 9.34561 C 42.8684 10.2295 76.6769 19.0684 78.6656 20.8361 C 80.6544 22.6039 82.2012 24.0402 80.6544 27.9072 C 79.5496 29.8959 66.4017 74.532 66.1808 77.4047 C 65.2969 80.4983 62.7558 84.2548 58.5573 84.0338 C 54.3589 83.8128 15.9099 75.4159 12.8163 74.753 z "
       id="path794"
       sodipodi:nodetypes="ccccccccc"
       transform="matrix(1.114903,0.000000,0.000000,1.114903,1.287023,-5.035753)" />
    <path
       style="fill:#3d4e67;fill-rule:evenodd;stroke:none;stroke-opacity:1;stroke-width:1pt;stroke-linejoin:miter;stroke-linecap:butt;fill-opacity:1;"
       d="M 12.8163 74.753 C 10.3856 73.6481 7.07107 70.1126 8.83884 65.2512 C 9.72267 59.948 25.6326 13.1021 29.1682 10.8924 C 31.3778 8.90368 34.582 8.13026 39.1119 9.34561 C 42.8684 10.2295 76.6769 19.0684 78.6656 20.8361 C 80.6544 22.6039 82.2012 24.0402 80.6544 27.9072 C 79.5496 29.8959 66.4017 74.532 66.1808 77.4047 C 65.2969 80.4983 62.7558 84.2548 58.5573 84.0338 C 54.3589 83.8128 15.9099 75.4159 12.8163 74.753 z "
       id="path895"
       sodipodi:nodetypes="ccccccccc"
       transform="matrix(1.114903,0.000000,0.000000,1.114903,-1.570116,-9.607182)" />
    <path
       style="fill:#ffffff;fill-rule:evenodd;stroke:none;stroke-opacity:1;stroke-width:1pt;stroke-linejoin:miter;stroke-linecap:butt;fill-opacity:1;"
       d="M 17.8987 70.9965 C 15.3576 70.3336 11.7114 69.6706 13.0373 65.6932 C 15.468 55.9705 27.8424 18.6264 33.1456 13.986 C 34.361 12.8811 38.4489 12.4392 46.1829 14.8699 C 55.0218 17.5215 72.9204 23.4877 74.6882 24.3716 C 76.4559 25.2555 77.1189 25.2555 75.793 29.233 C 73.8043 33.2105 64.9655 67.24 62.7557 72.9852 C 61.209 77.0732 60.8775 78.9514 58.2258 78.9514 "
       id="path896"
       sodipodi:nodetypes="cccccccs"
       transform="matrix(1.114903,0.000000,0.000000,1.114903,-1.570116,-9.607182)" />
    <path
       style="fill:url(#linearGradient636);fill-rule:evenodd;stroke:none;stroke-opacity:1;stroke-width:1pt;stroke-linejoin:miter;stroke-linecap:butt;fill-opacity:1;"
       d="M 28.75 13.75 C 28.75 13.75 31.875 7.49995 39.6875 9.37495 C 47.5 11.25 78.125 19.375 77.8125 21.875 C 77.5 24.375 71.875 39.0625 71.5625 40.3125 C 71.25 41.5625 42.5 40.9375 31.5625 47.5 C 20.625 54.0625 12.5 59.6875 12.5 59.6875 C 12.5 59.6875 23.75 24.6875 28.75 13.75 z "
       id="path636"
       transform="matrix(0.946780,0.000000,0.000000,0.946780,6.111789,-0.736980)" />
  </g>
  <path
     style="font-size:12;fill:#470000;fill-rule:evenodd;stroke-width:1pt;"
     d="M 67.911 66.4866 C 67.911 68.1832 66.4512 69.56 64.6525 69.56 C 62.8537 69.56 61.3939 68.1832 61.3939 66.4866 C 61.3939 64.7901 62.8537 63.4132 64.6525 63.4132 C 66.4512 63.4132 67.911 64.7901 67.911 66.4866 z "
     id="path613"
     transform="matrix(0.665098,0.000000,0.000000,0.665098,26.75834,4.099827)" />
  <path
     style="font-size:12;fill:#470000;fill-rule:evenodd;stroke-width:1pt;"
     d="M 61.2458 74.2998 C 59.6905 72.5223 57.1726 73.4851 56.3579 74.7441 C 55.4692 77.8545 56.8764 80.6687 60.5793 79.3357 C 64.2822 78.0026 65.6152 75.929 65.6152 76.0771 C 65.6152 76.2253 62.6529 84.0754 58.2094 84.6678 C 53.7659 85.2603 51.322 85.4084 46.4342 85.4825 C 41.3983 86.3712 38.9544 86.2971 38.9544 86.2971 L 45.1752 77.4102 C 45.1752 77.4102 46.8045 76.5215 49.4706 72.078 C 52.1367 67.6346 56.8763 66.5977 59.2462 68.0789 C 61.3939 68.9675 62.5788 70.1525 63.1713 72.4483 C 63.0232 74.9662 62.5788 75.929 61.2458 74.2998 z "
     id="path610"
     sodipodi:nodetypes="cccccccccccc"
     transform="matrix(0.665098,0.000000,0.000000,0.665098,26.75834,4.099827)" />
  <path
     style="font-size:12;fill:#230000;fill-opacity:0.99899;fill-rule:evenodd;stroke-width:1pt;"
     d="M 37.9176 76.4474 C 40.1393 77.0399 37.5473 80.2243 36.1402 78.0026 C 35.0293 79.5578 35.5477 75.7809 35.5477 75.7809 L 30.808 85.7046 C 30.808 85.7046 38.9544 88.667 42.0648 84.3716 C 45.1752 80.0763 45.5456 77.8545 43.8423 76.0771 C 41.8426 73.3371 40.0652 74.4479 39.3247 74.8922 C 38.5841 75.3366 38.2879 75.6328 37.9176 76.4474 z "
     id="path609"
     sodipodi:nodetypes="cccccccc"
     transform="matrix(0.665098,0.000000,0.000000,0.665098,26.95536,4.099827)" />
  <path
     style="font-size:12;fill:#230000;fill-rule:evenodd;stroke-width:1pt;"
     d="M 36.1402 62.0062 C 36.1402 62.0062 37.0288 56.674 36.7326 53.8598 C 36.2883 47.787 23.5503 -3.31281 14.071 5.57413 C 3.11042 9.86949 16.1446 58.8957 17.7739 61.7099 C 19.4031 64.5241 21.773 66.5977 21.773 66.5977 C 21.773 66.5977 18.07 83.483 31.9189 85.8527 C 36.9549 76.5215 40.5087 72.8006 39.695 68.5973 C 39.2506 66.2275 38.6582 64.0057 36.1402 62.0062 z "
     id="path608"
     sodipodi:nodetypes="cccccccc"
     transform="matrix(0.665098,0.000000,0.000000,0.665098,26.75834,4.099827)" />
  <path
     style="font-size:12;fill:#f2962c;fill-rule:evenodd;stroke-width:1pt;"
     d="M 19.4031 58.3033 C 22.0692 55.0448 25.0315 52.6749 32.5854 53.4155 C 30.2156 40.2331 21.773 4.68543 15.7002 7.94398 C 8.88697 9.12891 15.2559 48.8239 19.4031 58.3033 z "
     id="path600"
     sodipodi:nodetypes="cccc"
     transform="matrix(0.665098,0.000000,0.000000,0.665098,26.75834,4.099827)" />
  <path
     style="font-size:12;fill:#8b8b8b;fill-rule:evenodd;stroke-width:1pt;"
     d="M 19.8475 59.6363 C 19.8475 59.6363 21.1805 63.9316 24.7353 64.2279 C 26.3646 61.7099 30.0675 61.2656 33.1779 61.4137 C 33.9185 58.5995 34.5109 55.1928 33.326 55.0447 C 31.8449 54.156 23.5504 52.5268 19.8475 59.6363 z "
     id="path601"
     sodipodi:nodetypes="ccccc"
     transform="matrix(0.665098,0.000000,0.000000,0.665098,26.75834,4.099827)" />
  <path
     style="font-size:12;fill:#65532d;fill-rule:evenodd;stroke-width:1pt;"
     d="M 24.8834 66.4496 C 25.624 63.1911 31.2524 60.9694 33.7703 63.6354 C 39.8431 67.0421 37.177 75.4847 34.5109 75.6328 C 33.7703 86.149 40.8799 80.3724 40.7318 78.1508 C 46.0639 77.4102 41.7686 84.9641 38.2138 84.5197 C 33.326 85.2603 20.2918 80.8169 24.8834 66.4496 z "
     id="path602"
     sodipodi:nodetypes="cccccc"
     transform="matrix(0.665098,0.000000,0.000000,0.665098,26.75834,4.099827)" />
  <path
     style="font-size:12;fill:#bc0000;fill-rule:evenodd;stroke-width:1pt;"
     d="M 44.5828 81.2612 C 44.7309 81.4093 46.6564 81.2612 47.6932 79.4838 C 48.73 77.7064 52.2848 70.4487 54.8028 70.3006 C 60.8755 68.0789 60.8755 72.2261 60.8755 72.2261 C 60.8755 72.2261 55.2471 70.1525 54.6546 73.7073 C 54.0622 77.2621 53.0254 79.3357 59.8386 82.1499 C 55.9877 83.4829 43.966 83.74 43.2253 83.74 C 42.4847 83.74 44.7309 81.1131 44.5828 81.2612 z "
     id="path603"
     sodipodi:nodetypes="cccccccc"
     transform="matrix(0.665098,0.000000,0.000000,0.665098,26.75834,4.099827)" />
  <path
     style="font-size:12;fill:#470000;fill-rule:evenodd;stroke-width:1pt;"
     d="M 46.6564 67.6346 C 48.4338 64.9685 54.5806 66.3015 57.3947 65.7091 C 60.8014 64.8204 59.02 58.5954 55.169 58.5955 C 52.5142 58.0648 46.9527 58.1551 46.6564 67.6346 z "
     id="path611"
     sodipodi:nodetypes="cccc"
     transform="matrix(0.665098,0.000000,0.000000,0.665098,26.75834,4.099827)" />
  <path
     style="font-size:12;fill:#bc0000;fill-rule:evenodd;stroke-width:1pt;"
     d="M 48.1376 64.8204 C 48.1376 64.8204 54.5065 64.2279 56.1358 64.2279 C 58.0613 64.6397 58.1915 61.7181 56.5801 60.6731 C 53.766 58.7476 49.9149 58.5995 48.1376 64.8204 z "
     id="path604"
     sodipodi:nodetypes="cccc"
     transform="matrix(0.665098,0.000000,0.000000,0.665098,26.75834,4.099827)" />
  <path
     style="font-size:12;fill:#bc0000;fill-rule:evenodd;stroke-width:1pt;"
     d="M 66.8001 66.5977 C 66.8001 67.7424 65.838 68.6714 64.6524 68.6714 C 63.4669 68.6714 62.5048 67.7424 62.5048 66.5977 C 62.5048 65.4531 63.4669 64.5241 64.6524 64.5241 C 65.838 64.5241 66.8001 65.4531 66.8001 66.5977 z "
     id="path606"
     transform="matrix(0.665098,0.000000,0.000000,0.665098,26.75834,4.099827)" />
  <path
     style="font-size:12;fill:url(#linearGradient617);fill-rule:evenodd;stroke-width:1pt;"
     d="M 19.4031 58.3033 C 22.0692 55.0448 25.0315 52.6749 32.5854 53.4155 C 30.2156 40.2331 21.773 4.68543 15.7002 7.94398 C 8.88697 9.12891 15.2559 48.8239 19.4031 58.3033 z "
     id="path621"
     sodipodi:nodetypes="cccc"
     transform="matrix(0.665098,0.000000,0.000000,0.665098,26.75834,4.099827)" />
  <path
     style="font-size:12;fill:#f2d0a8;fill-rule:evenodd;stroke-width:1pt;"
     d="M 28.4382 52.5267 C 25.1369 52.6775 14.6017 8.00417 18.6625 10.462 C 19.6179 11.1298 34.3749 52.522 28.4382 52.5267 z "
     id="path622"
     sodipodi:nodetypes="css"
     transform="matrix(0.665098,0.000000,0.000000,0.665098,26.75834,4.099827)" />
  <path
     style="font-size:12;fill:#f2f2f2;fill-rule:evenodd;stroke-width:1pt;"
     d="M 30.5118 54.4523 L 31.1043 61.2656 L 27.6976 62.0062 L 26.2165 54.6003 C 26.2165 54.6003 30.2156 54.1561 30.5118 54.4523 z "
     id="path623"
     sodipodi:nodetypes="ccccc"
     transform="matrix(0.665098,0.000000,0.000000,0.665098,26.75834,4.099827)" />
  <path
     style="font-size:12;fill:url(#linearGradient625);fill-rule:nonzero;stroke-width:1pt;"
     d="M 24.8834 66.4496 C 25.624 63.1911 31.2524 60.9694 33.7703 63.6354 C 39.8431 67.0421 37.177 75.4847 34.5109 75.6328 C 33.7703 86.149 40.8799 80.3724 40.7318 78.1508 C 46.0639 77.4102 41.7686 84.9641 38.2138 84.5197 C 33.326 85.2603 20.2918 80.8169 24.8834 66.4496 z "
     id="path624"
     sodipodi:nodetypes="cccccc"
     transform="matrix(0.665098,0.000000,0.000000,0.665098,26.75834,4.099827)" />
  <path
     transform="matrix(0.977032,0.213090,-0.213090,0.977032,0.000000,0.000000)"
     style="font-size:13;font-weight:bold;fill:#3d4e67;stroke-width:1pt;font-family:Kid Kosmic;"
     d="M 73.0705 54.7469 C 73.0027 55.0854 72.7869 55.3647 72.423 55.5848 C 72.0929 55.7963 71.7459 55.9021 71.382 55.9021 C 70.9249 55.9021 70.5822 55.6609 70.3537 55.1785 C 70.2098 54.7638 70.0617 54.3533 69.9093 53.9471 C 67.7427 53.9471 66.0838 54.493 64.9328 55.5848 C 63.7648 56.7104 63.1639 57.7937 63.13 58.8348 C 63.1046 59.8504 63.6378 60.5655 64.7296 60.9803 C 64.992 61.0818 65.284 61.1326 65.6056 61.1326 C 66.6805 61.1326 68.1277 60.6121 69.9474 59.5711 C 69.9728 59.4864 70.0024 59.368 70.0363 59.2156 C 69.7993 58.9871 69.4015 58.8728 68.8429 58.8728 C 67.8104 58.8728 66.8836 59.0844 66.0626 59.5076 C 65.5802 59.4653 65.2713 59.1987 65.1359 58.7078 C 65.1105 58.6147 65.0978 58.5258 65.0978 58.4412 C 65.0978 58.0688 65.2967 57.7387 65.6945 57.451 C 66.1938 56.8924 67.1164 56.6131 68.4621 56.6131 C 68.8683 56.6131 69.3804 56.6427 69.9982 56.7019 C 70.8107 56.7697 71.255 56.8077 71.3312 56.8162 C 72.2368 57.2732 72.6896 57.7853 72.6896 58.3523 C 72.6896 58.6232 72.6092 58.9998 72.4484 59.4822 C 72.2114 60.227 71.8729 60.7264 71.4328 60.9803 C 70.561 61.6404 69.5412 62.1736 68.3732 62.5799 C 67.1798 62.9946 66.0499 63.2019 64.9835 63.2019 C 63.4263 63.2019 62.2667 62.7111 61.505 61.7293 C 60.8533 60.8829 60.5275 59.9519 60.5275 58.9363 C 60.5275 58.4877 60.5867 58.0307 60.7052 57.5652 C 61.2469 55.4747 62.5926 53.8836 64.7423 52.7918 C 66.5705 51.8523 68.6567 51.408 71.0011 51.4588 C 71.7967 51.5688 72.3468 51.8439 72.6515 52.284 C 72.897 52.6479 73.0324 53.253 73.0578 54.0994 C 73.1085 54.3448 73.1128 54.5607 73.0705 54.7469 z M 47.7052 56.6639 C 47.7814 56.3169 47.9888 55.5044 48.3273 54.2264 C 48.6912 52.8553 48.8986 52.1486 48.9494 52.1062 C 49.0001 52.1739 49.0298 52.2163 49.0382 52.2332 L 49.1398 51.8777 L 49.2033 51.865 C 49.618 51.4588 50.1512 51.2557 50.8029 51.2557 C 51.0314 51.2557 51.2388 51.2895 51.4249 51.3572 C 52.9061 51.1118 54.3576 50.9933 55.7794 51.0017 C 57.2775 51.0102 58.145 51.2726 58.382 51.7889 C 59.0167 53.1938 59.3341 54.4083 59.3341 55.4324 C 59.3341 56.6935 58.8644 57.6668 57.9249 58.3523 C 56.5623 59.3341 54.4295 59.825 51.5265 59.825 C 50.8833 59.825 50.2062 59.8038 49.4953 59.7615 C 49.4022 60.6079 49.3768 61.4373 49.4191 62.2498 C 49.3514 62.6222 49.1863 62.9353 48.924 63.1892 C 48.6701 63.4347 48.3611 63.5574 47.9972 63.5574 C 47.6333 63.5574 47.2482 63.367 46.8419 62.9861 C 47.0027 60.7433 47.2905 58.6359 47.7052 56.6639 z M 49.8507 57.5525 C 50.4178 57.6202 51.1541 57.6541 52.0597 57.6541 C 54.3533 57.6372 55.8641 57.1505 56.5919 56.1941 C 56.7443 55.9995 56.8205 55.7625 56.8205 55.4832 C 56.8205 55.1023 56.6808 54.6495 56.4015 54.1248 C 55.8598 53.8201 55.2335 53.6678 54.5226 53.6678 C 53.7609 53.6678 52.576 53.837 50.9679 54.1756 C 50.4686 55.2674 50.0962 56.393 49.8507 57.5525 z M 43.2746 51.1414 C 44.1378 51.1414 45.0265 51.1837 45.9406 51.2683 C 46.3722 51.5223 46.588 51.92 46.588 52.4617 C 46.588 52.6479 46.5626 52.8553 46.5119 53.0838 C 46.3341 53.854 46.0041 54.2391 45.5216 54.2391 C 45.4285 54.2391 45.2677 54.2179 45.0392 54.1756 C 44.7514 54.1163 44.5779 54.0825 44.5187 54.074 C 44.4679 54.0655 44.4087 54.0571 44.341 54.0486 C 44.9757 55.132 45.2931 56.2788 45.2931 57.4891 C 45.2931 57.8953 45.255 58.3058 45.1789 58.7205 C 44.341 61.505 42.6271 63.0538 40.0373 63.367 C 35.7632 63.4601 33.6261 62.1948 33.6261 59.5711 C 33.6261 59.2241 33.6642 58.8559 33.7404 58.4666 C 33.825 58.035 34.062 57.6583 34.4513 57.3367 C 34.8406 57.0066 35.2511 56.8416 35.6828 56.8416 C 36.2075 56.8416 36.4699 57.0701 36.4699 57.5271 C 36.4699 57.6287 36.4572 57.7853 36.4318 57.9969 C 36.4149 58.2 36.4064 58.3523 36.4064 58.4539 C 36.4064 59.0887 36.5333 59.6557 36.7873 60.1551 C 37.0496 60.6544 37.8198 60.9041 39.0978 60.9041 C 39.3856 60.9041 39.6945 60.8914 40.0246 60.866 C 40.744 60.6883 41.2814 60.4132 41.6369 60.0408 C 42.0008 59.66 42.2335 59.1098 42.3351 58.3904 C 42.4705 57.9503 42.5382 57.5398 42.5382 57.159 C 42.5382 56.7104 42.4367 56.2999 42.2335 55.9275 C 41.8611 55.242 41.3999 54.5861 40.8498 53.9598 C 39.6141 54.0105 37.9975 54.1502 36.0001 54.3787 C 35.6447 54.421 35.3654 54.3533 35.1623 54.1756 C 34.9591 53.9894 34.8576 53.7397 34.8576 53.4266 C 34.8576 53.0118 35.0776 52.5421 35.5177 52.0174 C 38.3953 51.4334 40.9809 51.1414 43.2746 51.1414 z M 32.4328 61.1834 C 32.4328 61.6066 32.2296 61.979 31.8234 62.3006 C 31.4256 62.6222 30.9982 62.783 30.5412 62.783 C 30.3719 62.783 30.2153 62.7576 30.0714 62.7068 C 29.6483 62.5376 29.4367 62.2371 29.4367 61.8055 C 29.4367 61.5092 29.5425 61.2215 29.754 60.9422 C 30.1603 60.4259 30.6681 60.1678 31.2775 60.1678 C 31.4552 60.1678 31.6245 60.1974 31.7853 60.2566 C 32.2169 60.4174 32.4328 60.7264 32.4328 61.1834 z "
     id="path1011" />
</svg>
