<?xml version="1.0" encoding="UTF-8" standalone="no"?>
<!DOCTYPE svg PUBLIC "-//W3C//DTD SVG 20010904//EN"
"http://www.w3.org/TR/2001/REC-SVG-20010904/DTD/svg10.dtd">
<!-- Created with Inkscape (http://www.inkscape.org/) -->
<svg
   version="1"
   x="0.00000000"
   y="0.00000000"
   width="48pt"
   height="48pt"
   id="svg548"
   sodipodi:version="0.32"
   sodipodi:docname="stock_cdplayer-pause.svg"
   sodipodi:docbase="/root/Desktop"
   inkscape:version="0.38.1"
   xmlns="http://www.w3.org/2000/svg"
   xmlns:inkscape="http://www.inkscape.org/namespaces/inkscape"
   xmlns:sodipodi="http://sodipodi.sourceforge.net/DTD/sodipodi-0.dtd"
   xmlns:xlink="http://www.w3.org/1999/xlink">
  <sodipodi:namedview
     id="base"
     inkscape:zoom="9.6562500"
     inkscape:cx="16.000000"
     inkscape:cy="21.869545"
     inkscape:window-width="1014"
     inkscape:window-height="696"
     inkscape:window-x="0"
     inkscape:window-y="27"
     showguides="true"
     snaptoguides="true">
    <sodipodi:guide
       orientation="horizontal"
       position="40.491909"
       id="guide857" />
  </sodipodi:namedview>
  <defs
     id="defs550">
    <linearGradient
       x1="0.00000000"
       y1="0.00000000"
       x2="1.00000000"
       y2="0.00000000"
       id="linearGradient556"
       gradientUnits="objectBoundingBox"
       spreadMethod="pad">
      <stop
         style="stop-color:#ff8700;stop-opacity:1;"
         offset="0.00000000"
         id="stop557" />
      <stop
         style="stop-color:#ffff8d;stop-opacity:0;"
         offset="1.00000000"
         id="stop558" />
    </linearGradient>
    <linearGradient
       x1="0.00000000"
       y1="0.00000000"
       x2="1.00000000"
       y2="0.00000000"
       id="linearGradient559"
       xlink:href="#linearGradient556"
       gradientUnits="objectBoundingBox"
       spreadMethod="pad" />
    <sodipodi:namedview
       id="namedview852"
       inkscape:zoom="9.65625000"
       inkscape:cx="16.0000000"
       inkscape:cy="28.4271845"
       inkscape:window-width="1014"
       inkscape:window-height="696"
       inkscape:window-x="0"
       inkscape:window-y="0" />
    <defs
       id="defs853">
      <linearGradient
         x1="0.00000000"
         y1="0.00000000"
         x2="1.00000000"
         y2="0.00000000"
         id="linearGradient854"
         gradientUnits="objectBoundingBox"
         spreadMethod="pad">
        <stop
           style="stop-color:#ff8700;stop-opacity:1;"
           offset="0.00000000"
           id="stop855" />
        <stop
           style="stop-color:#ffff8d;stop-opacity:0;"
           offset="1.00000000"
           id="stop856" />
      </linearGradient>
      <linearGradient
         x1="0.00000000"
         y1="0.00000000"
         x2="1.00000000"
         y2="0.00000000"
         id="linearGradient857"
         xlink:href="#linearGradient556"
         gradientUnits="objectBoundingBox"
         spreadMethod="pad" />
    </defs>
  </defs>
  <path
     style="fill:#0d3c07;fill-rule:evenodd;stroke-width:1.0000000pt;"
     d="M 10.515780,10.263045 L 16.831182,9.7357915 C 19.965353,9.5952339 21.883008,9.5040489 26.044668,9.7717936 L 25.396266,53.628419 C 21.313611,54.486597 19.759676,54.737361 16.150363,54.273281 C 13.570552,53.735879 15.531130,54.209335 12.150736,53.296523 C 11.867917,53.804958 9.4853940,12.042523 10.515780,10.263045 z "
     id="path590"
     sodipodi:nodetypes="ccccccc" />
  <path
     style="fill:#2aaf18;fill-rule:evenodd;stroke-width:1.0000000pt;"
     d="M 13.669386,11.995559 C 15.044269,11.602261 16.417669,11.532023 17.791050,11.461785 C 19.164449,11.391547 20.390988,11.267300 21.909770,11.574133 L 21.722093,52.495186 C 20.518544,52.951505 19.316278,53.138599 18.114705,53.164163 C 16.913155,53.189705 16.226987,53.108168 14.512725,52.648560 L 13.669386,11.995559 z "
     id="path591"
     sodipodi:nodetypes="ccccccc" />
  <path
     style="fill:#208c11;fill-rule:evenodd;stroke-width:1.0000000pt;"
     d="M 21.123949,12.057838 L 21.073422,52.117553 C 21.073422,52.117553 19.723738,52.371791 18.366724,52.410629 C 17.009709,52.449479 15.645340,52.272943 15.612047,52.272905 C 15.545459,52.272830 15.348904,51.572625 16.285405,50.658345 C 17.345258,49.684309 19.135799,50.917909 19.151615,50.069311 L 19.858213,12.164094 C 19.862622,11.928048 21.124872,11.337619 21.123949,12.057838 z "
     id="path592"
     sodipodi:nodetypes="ccssssss" />
  <path
     style="fill:#ffffff;fill-rule:evenodd;stroke-width:1.0000000pt;"
     d="M 14.651303,12.740027 C 15.824446,11.734398 17.769356,12.312002 17.769029,12.383926 C 16.390909,15.619012 16.609155,31.730565 16.609155,31.730565 C 16.330126,32.413546 15.929210,34.604613 15.670725,34.642490 C 15.441993,34.675996 15.163808,32.575467 15.147501,31.944692 L 14.651303,12.740027 z "
     id="path577"
     sodipodi:nodetypes="ccsssc" />
  <path
     style="fill:#0d3c07;fill-rule:evenodd;stroke-width:1.0000000pt;"
     d="M 35.964350,10.048167 L 42.279752,9.5209123 C 45.413923,9.3803553 47.331578,9.2891703 51.493238,9.5569143 L 50.844836,53.413541 C 46.762181,54.271719 45.208246,54.522483 41.598933,54.058403 C 39.019122,53.521001 40.979700,53.994457 37.599306,53.081645 C 37.316487,53.590080 34.933964,11.827645 35.964350,10.048167 z "
     id="path853"
     sodipodi:nodetypes="ccccccc" />
  <path
     style="fill:#2aaf18;fill-rule:evenodd;stroke-width:1.0000000pt;"
     d="M 39.117956,11.780681 C 40.492839,11.387383 41.866239,11.317145 43.239620,11.246907 C 44.613019,11.176669 45.839558,11.052422 47.358340,11.359255 L 47.170663,52.280308 C 45.967114,52.736627 44.764848,52.923721 43.563275,52.949285 C 42.361725,52.974827 41.675557,52.893290 39.961295,52.433682 L 39.117956,11.780681 z "
     id="path854"
     sodipodi:nodetypes="ccccccc" />
  <path
     style="fill:#208c11;fill-rule:evenodd;stroke-width:1.0000000pt;"
     d="M 46.572519,11.842960 L 46.521992,51.902675 C 46.521992,51.902675 45.172308,52.156913 43.815294,52.195751 C 42.458279,52.234601 41.093910,52.058065 41.060617,52.058027 C 40.994029,52.057952 40.797474,51.357747 41.733975,50.443467 C 42.793828,49.469431 44.584369,50.703031 44.600185,49.854433 L 45.306783,11.949216 C 45.311192,11.713170 46.573442,11.122741 46.572519,11.842960 z "
     id="path855"
     sodipodi:nodetypes="ccssssss" />
  <path
     style="fill:#ffffff;fill-rule:evenodd;stroke-width:1.0000000pt;"
     d="M 40.099873,12.525149 C 41.273016,11.519520 43.217926,12.097124 43.217599,12.169048 C 41.839479,15.404134 42.057725,31.515687 42.057725,31.515687 C 41.778696,32.198668 41.377780,34.389735 41.119295,34.427612 C 40.890563,34.461118 40.612378,32.360589 40.596071,31.729814 L 40.099873,12.525149 z "
     id="path856"
     sodipodi:nodetypes="ccsssc" />
</svg>
