<?xml version="1.0" encoding="UTF-8" standalone="no"?>
<!DOCTYPE svg PUBLIC "-//W3C//DTD SVG 20010904//EN"
"http://www.w3.org/TR/2001/REC-SVG-20010904/DTD/svg10.dtd">
<!-- Created with Sodipodi ("http://www.sodipodi.com/") -->
<svg
   xmlns="http://www.w3.org/2000/svg"
   xmlns:xlink="http://www.w3.org/1999/xlink"
   version="1.0"
   x="0"
   y="0"
   width="90"
   height="90"
   id="svg602"
   xml:space="preserve"
   xmlns:sodipodi="http://sodipodi.sourceforge.net/DTD/sodipodi-0.dtd"
   sodipodi:version="0.34"
   sodipodi:docname="/home/zeus/gartoon-stock.0.1/stock_gtk-cut.svg"
   sodipodi:docbase="/home/zeus/gartoon-stock.0.1/"><sodipodi:namedview
   id="base" /><defs
   id="defs604"><linearGradient
   id="linearGradient659"><stop
   style="stop-color:#ffd056;stop-opacity:1;"
   offset="0"
   id="stop660" /><stop
   style="stop-color:#ff933d;stop-opacity:1;"
   offset="1"
   id="stop661" /></linearGradient><linearGradient
   id="linearGradient652"><stop
   style="stop-color:#ffffff;stop-opacity:0;"
   offset="0"
   id="stop653" /><stop
   style="stop-color:#ffffff;stop-opacity:1;"
   offset="1"
   id="stop654" /></linearGradient><linearGradient
   x1="108.462662"
   y1="6.6808219"
   x2="120.686676"
   y2="6.59777737"
   id="linearGradient655"
   xlink:href="#linearGradient652"
   gradientUnits="userSpaceOnUse"
   gradientTransform="scale(0.382188,2.616514)" /><linearGradient
   x1="37.602459"
   y1="17.1766357"
   x2="20.8047333"
   y2="13.1708326"
   id="linearGradient657"
   xlink:href="#linearGradient652"
   gradientUnits="userSpaceOnUse"
   gradientTransform="scale(1.005396,0.994633)" /><linearGradient
   x1="42.3279762"
   y1="33.3070946"
   x2="67.5505295"
   y2="59.4537506"
   id="linearGradient658"
   xlink:href="#linearGradient659"
   gradientUnits="userSpaceOnUse"
   gradientTransform="scale(0.899383,1.111874)" /></defs><path
   d="M 38.41568 58.66365 C 39.02064 56.42948 38.174 54.48564 38.77896 52.25146 C 37.10602 49.92806 36.49753 42.94144 33.56632 42.75039 C 23.96356 32.72654 20.09401 24.64605 14.32904 15.36337 C 14.29035 12.389 18.07091 8.121309 20.39947 8.838148 C 26.64939 14.52071 32.68552 19.31914 38.93543 25.0017 C 40.42591 16.7342 40.7481 10.71651 40.69144 2.317848 C 41.63242 -0.448818 47.18777 0.321712 49.41032 3.024149 C 51.61958 15.82137 53.70087 27.9221 55.73591 38.03257 C 57.34655 41.82587 59.9008 46.02058 58.64753 49.40879 C 57.25168 51.65901 55.85584 53.90923 54.45999 56.15945 C 53.27581 54.68777 51.66733 55.01062 50.61715 53.19605 C 50.03291 55.30287 50.53935 53.88871 49.74739 54.65263 C 49.04768 57.02419 46.74942 55.94203 49.2687 61.51606 C 44.65781 57.82162 38.46707 58.79266 38.41568 58.66365 z "
   style="font-size:12;fill-rule:evenodd;stroke-width:1;"
   id="path650"
   sodipodi:nodetypes="ccccccccccccccc" /><path
   d="M 40.53052 59.46563 C 40.53052 59.46563 42.62753 53.84665 42.08847 52.11804 C 41.54939 50.38939 39.77584 46.3122 39.37115 40.79278 C 42.78349 35.09834 43.54825 5.493789 43.54825 5.493789 L 46.17787 6.090719 C 46.17787 6.090719 52.16161 41.37857 49.98805 46.43007 C 47.81451 51.48156 45.6169 55.34672 46.1822 56.76592 C 46.74752 58.18515 49.75988 61.61941 50.27379 62.90958 C 45.84438 58.54489 40.5043 59.77505 40.53052 59.46563 z "
   style="font-size:12;fill:#ff933d;fill-rule:evenodd;stroke-width:1;"
   id="path647" /><path
   d="M 50.56017 70.91191 C 50.57958 78.27511 46.74863 84.25426 42.00349 84.26676 C 37.25835 84.2793 33.39589 78.32043 33.37646 70.95726 C 33.35703 63.59411 37.18799 57.61494 41.93315 57.60242 C 46.67829 57.5899 50.54073 63.54876 50.56017 70.91191 z "
   style="font-size:12;fill:none;fill-rule:evenodd;stroke:#000000;stroke-width:5.904516;"
   id="path641" /><path
   d="M 59.57258 51.73112 C 57.25347 50.41255 54.31767 47.54576 53.52055 45.91991 C 52.72343 44.29406 51.20792 40.11407 47.70681 35.82807 C 41.31372 34.03941 20.40336 13.06871 20.40336 13.06871 L 18.90437 15.31018 C 18.90437 15.31018 38.82215 45.04769 43.87363 47.22124 C 48.92511 49.39479 53.17843 50.69036 53.74373 52.10957 C 54.30904 53.52876 54.27095 62.06485 54.78487 63.35503 C 54.82621 52.57533 59.80437 51.93777 59.57258 51.73112 z "
   style="font-size:12;fill:url(#linearGradient658);fill-rule:evenodd;stroke-width:1;"
   id="path646" /><path
   d="M 73.38544 55.30751 C 77.79032 61.20784 78.2787 68.2922 74.47625 71.1309 C 70.67385 73.96958 64.02053 71.48764 59.61565 65.58731 C 55.2108 59.68701 54.72242 52.60265 58.52485 49.76397 C 62.32725 46.92527 68.98058 49.40721 73.38544 55.30751 z "
   style="font-size:12;fill:none;fill-rule:evenodd;stroke:#000000;stroke-width:5.773304;"
   id="path642" /><ellipse
   cx="45.7031326"
   cy="33.8281174"
   rx="3.359375"
   ry="3.35937595"
   transform="matrix(0.825719,-0.328908,0.328908,0.825719,-3.577553,29.04909)"
   style="font-size:12;fill:#7e0000;fill-rule:evenodd;stroke-width:1;"
   id="path648" /><ellipse
   cx="45.7031326"
   cy="33.8281174"
   rx="3.359375"
   ry="3.35937595"
   transform="matrix(0.556881,-0.221822,0.221822,0.556881,12.33174,33.24917)"
   style="font-size:12;fill:#ff1500;fill-rule:evenodd;stroke-width:1;"
   id="path649" /><path
   d="M 43.75 5.31249 L 45.3125 7.49999 L 44.0625 33.125 L 41.25 31.56249 L 43.75 5.31249 z "
   style="font-size:12;fill:url(#linearGradient655);fill-rule:evenodd;stroke-width:1;"
   id="path651" /><path
   d="M 20.15625 13.28124 L 20.78125 15.46874 C 20.78125 15.46874 41.09375 35.62499 43.28125 36.40624 C 45.46875 37.18749 35.15625 29.37499 36.40625 29.06249 L 20.15625 13.28124 z "
   style="font-size:12;fill:url(#linearGradient657);fill-rule:evenodd;stroke-width:1;"
   id="path656" /></svg>
