<?xml version="1.0" encoding="UTF-8" standalone="no"?>
<!DOCTYPE svg PUBLIC "-//W3C//DTD SVG 20010904//EN"
"http://www.w3.org/TR/2001/REC-SVG-20010904/DTD/svg10.dtd">
<!-- Created with Sodipodi ("http://www.sodipodi.com/") -->
<svg
   xmlns="http://www.w3.org/2000/svg"
   xmlns:sodipodi="http://sodipodi.sourceforge.net/DTD/sodipodi-0.dtd"
   xmlns:xlink="http://www.w3.org/1999/xlink"
   id="svg604"
   sodipodi:version="0.34"
   width="72pt"
   height="72pt"
   sodipodi:docbase="/home/zeus/.themes/Zeus-Test/gtk-2.0/"
   sodipodi:docname="/home/zeus/.themes/Zeus-Test/gtk-2.0/stock-center.svg">
  <defs
     id="defs606">
    <linearGradient
       id="linearGradient612">
      <stop
         style="stop-color:#7fa8e3;stop-opacity:0.741176;"
         offset="0.000000"
         id="stop613" />
      <stop
         style="stop-color:#ffffff;stop-opacity:0;"
         offset="1.000000"
         id="stop614" />
    </linearGradient>
    <linearGradient
       xlink:href="#linearGradient612"
       id="linearGradient615"
       x1="50.6438866"
       y1="5.36792946"
       x2="35.7520943"
       y2="68.0443573"
       gradientUnits="userSpaceOnUse"
       spreadMethod="pad" />
  </defs>
  <sodipodi:namedview
     id="base" />
  <path
     style="fill:#3d4e67;fill-rule:evenodd;stroke:none;stroke-opacity:1;stroke-width:1pt;stroke-linejoin:miter;stroke-linecap:butt;fill-opacity:1;"
     d="M 19.53942 89.72393 C 15.86902 89.67035 9.715649 87.43584 9.178363 81.43953 C 7.283671 75.38112 0.697146 18.11879 3.875435 14.13032 C 5.517683 10.99024 9.093812 8.685151 15.45639 7.886052 C 20.66247 7.091329 68.01776 0.880453 71.50964 1.844452 C 75.00164 2.808517 77.75236 3.623716 78.00356 8.458501 C 77.74529 11.08787 86.54097 64.71926 87.89034 67.88185 C 88.53421 71.58625 87.47728 76.76293 82.09273 78.46817 C 76.70826 80.1734 23.79002 89.00017 19.53942 89.72393 z "
     id="path609"
     sodipodi:nodetypes="ccccccccc" />
  <path
     style="fill:#ffffff;fill-rule:evenodd;stroke:none;stroke-opacity:1;stroke-width:1pt;stroke-linejoin:miter;stroke-linecap:butt;fill-opacity:1;"
     d="M 23.77981 83.37258 C 20.22131 83.84093 15.2784 84.82001 14.68799 79.96974 C 12.22944 68.48789 6.592399 22.98272 10.60904 15.58765 C 11.50617 13.84872 16.37695 11.48834 27.44125 10.50298 C 40.01471 9.242243 65.8135 7.325032 68.52837 7.449571 C 71.24311 7.574142 72.07364 7.2677 72.66414 12.1181 C 72.42432 17.27484 80.61422 57.61444 81.09804 64.75667 C 81.4745 69.82685 82.12238 71.98106 78.80056 73.20678 "
     id="path608"
     sodipodi:nodetypes="cccccccs" />
  <path
     style="fill:url(#linearGradient615);fill-rule:evenodd;stroke:none;stroke-opacity:1;stroke-width:1pt;stroke-linejoin:miter;stroke-linecap:butt;fill-opacity:1;"
     d="M 11.49931 22.45424 C 11.49931 22.45424 11.81934 15.57304 21.03162 14.20272 C 30.24386 12.83243 66.7284 8.161867 67.59771 10.54634 C 68.46698 12.93079 69.54322 28.42681 69.81163 29.6804 C 70.08006 30.93393 39.19533 41.65385 30.71453 51.8844 C 22.23372 62.11492 16.29423 70.3933 16.29423 70.3933 C 16.29423 70.3933 11.43785 34.31223 11.49931 22.45424 z "
     id="path636" />
  <path
     style="font-size:12;fill:none;fill-rule:evenodd;stroke:#4a5a71;stroke-width:4.170181;stroke-linecap:round;"
     d="M 17.49251 25.67627 L 65.61115 19.1487 "
     id="path706"
     sodipodi:nodetypes="cc" />
  <path
     style="font-size:12;fill:none;fill-rule:evenodd;stroke:#4a5a71;stroke-width:4.170181;stroke-linecap:round;"
     d="M 25.57645 36.55556 L 60.6068 30.96051 "
     id="path707"
     sodipodi:nodetypes="cc" />
  <path
     style="font-size:12;fill:none;fill-rule:evenodd;stroke:#4a5a71;stroke-width:4.170181;stroke-linecap:round;"
     d="M 20.57212 49.29988 L 67.92085 41.8398 "
     id="path708"
     sodipodi:nodetypes="cc" />
  <path
     style="font-size:12;fill:none;fill-rule:evenodd;stroke:#4a5a71;stroke-width:4.170181;stroke-linecap:round;"
     d="M 31.73563 59.55749 L 62.53155 54.27326 "
     id="path709"
     sodipodi:nodetypes="cc" />
  <path
     style="font-size:12;fill:none;fill-rule:evenodd;stroke:#4a5a71;stroke-width:4.170181;stroke-linecap:round;"
     d="M 24.4216 74.47766 L 72.54023 65.15256 "
     id="path710"
     sodipodi:nodetypes="cc" />
</svg>
