<?xml version="1.0" encoding="UTF-8" standalone="no"?>
<!DOCTYPE svg PUBLIC "-//W3C//DTD SVG 20010904//EN"
"http://www.w3.org/TR/2001/REC-SVG-20010904/DTD/svg10.dtd"
[
 <!ATTLIST svg
  xmlns:xlink CDATA #FIXED "http://www.w3.org/1999/xlink">
]>
<!-- Created with Sodipodi ("http://www.sodipodi.com/") -->
<svg
   id="svg548"
   sodipodi:version="0.32"
   xmlns="http://www.w3.org/2000/svg"
   xmlns:sodipodi="http://sodipodi.sourceforge.net/DTD/sodipodi-0.dtd"
   xmlns:xlink="http://www.w3.org/1999/xlink"
   width="72pt"
   height="72pt"
   sodipodi:docbase="/home/zeus/desktop/icons/gartoon/svg"
   sodipodi:docname="/home/zeus/desktop/icons/gartoon/svg/gnome-mime-x-gnome-app-info.svg">
  <defs
     id="defs550">
    <defs
       id="defs565" />
    <sodipodi:namedview
       id="namedview553" />
  </defs>
  <sodipodi:namedview
     id="base" />
  <path
     style="font-size:12;fill-opacity:0.3;fill-rule:evenodd;stroke-width:1pt;"
     d="M 31.993 58.1551 L 38.5463 61.7929 L 66.611 57.0861 L 57.964 14.0957 L 47.744 2.0983 L 23.2542 5.72222 L 31.993 58.1551 z "
     id="path574"
     sodipodi:nodetypes="ccccccc"
     transform="matrix(0.999531,-4.350444e-2,-4.580204e-2,-0.933916,5.049915,93.78141)" />
  <path
     style="font-size:12;fill:#2c0000;fill-rule:evenodd;stroke-width:1pt;"
     d="M 24.067 60.6553 L 40.8065 68.5578 L 69.0696 62.3067 L 56.2235 15.0484 L 47.192 3.91062 L 23.2542 5.72222 L 24.067 60.6553 z "
     id="path570"
     sodipodi:nodetypes="ccccccc"
     transform="matrix(0.964253,-4.196899e-2,-4.455004e-2,-0.908387,1.886696,94.23402)" />
  <path
     style="font-size:12;fill:none;fill-rule:evenodd;stroke-width:1pt;"
     d="M 50.0631 9.12888 L 55.3952 14.461 L 49.915 60.6731 L 42.0648 62.7467 L 37.0289 57.1183 L 46.8045 55.4891 L 50.0631 9.12888 z "
     id="path568"
     transform="matrix(0.964253,-4.196899e-2,-4.455004e-2,-0.908387,1.886696,94.23402)" />
  <path
     style="font-size:12;fill:#790000;fill-rule:evenodd;stroke-width:1pt;"
     d="M 43.7566 9.07639 L 53.55 52.3911 L 30.5892 57.0977 L 41.6205 62.3024 L 61.8671 58.2917 L 50.718 17.3708 L 43.7566 9.07639 z "
     id="path569"
     sodipodi:nodetypes="ccccccc"
     transform="matrix(0.964253,-4.196899e-2,-4.455004e-2,-0.908387,1.886696,94.23402)" />
  <path
     style="font-size:12;fill:#ff0000;fill-rule:evenodd;stroke-width:1pt;"
     d="M 28.7344 10.0176 L 29.9975 56.9733 L 54.6237 53.2852 L 44.0106 8.75624 L 28.7344 10.0176 z "
     id="path567"
     transform="matrix(0.964253,-4.196899e-2,-4.455004e-2,-0.908387,1.886696,94.23402)"
     sodipodi:nodetypes="ccccc" />
  <g
     id="g574"
     transform="matrix(1.354031,0.000000,0.000000,1.354031,-9.096871,1.496124)">
    <path
       sodipodi:type="arc"
       style="font-size:12;fill-opacity:0.3;fill-rule:evenodd;stroke-width:1pt;"
       id="path575"
       d="M 51.947845 68.739090 A 11.939625 10.997026 0 1 0 28.068596,68.739090 A 11.9396 10.997 0 1 0 51.9478 68.7391 L 40.008221 68.739090 z"
       sodipodi:cx="40.008221"
       sodipodi:cy="68.739090"
       sodipodi:rx="11.939625"
       sodipodi:ry="10.997026"
       transform="matrix(1.300677,-5.661182e-2,-6.134815e-2,-1.250905,-7.114015,102.8186)" />
    <path
       sodipodi:type="arc"
       style="font-size:12;fill:#2c0000;fill-rule:evenodd;stroke-width:1pt;"
       id="path558"
       d="M 51.947845 68.739090 A 11.939625 10.997026 0 1 0 28.068596,68.739090 A 11.9396 10.997 0 1 0 51.9478 68.7391 L 40.008221 68.739090 z"
       sodipodi:cx="40.008221"
       sodipodi:cy="68.739090"
       sodipodi:rx="11.939625"
       sodipodi:ry="10.997026"
       transform="matrix(1.169134,-5.088644e-2,-5.738911e-2,-1.170179,-3.650398,97.99664)" />
    <path
       style="font-size:12;fill:#790000;fill-rule:evenodd;stroke-width:1pt;"
       d="M 51.1099 70.2053 C 51.1099 74.7725 47.1217 78.4792 42.2077 78.4792 C 37.2935 78.4792 33.3053 74.7725 33.3053 70.2053 C 33.3053 65.6381 44.4154 68.4249 42.2077 61.9314 C 47.1217 61.9314 51.1099 65.6381 51.1099 70.2053 z "
       id="path562"
       transform="matrix(1.064011,-4.631098e-2,-5.344947e-2,-1.089849,-1.112124,93.29494)"
       sodipodi:nodetypes="ccccc" />
    <path
       transform="matrix(1.035310,-4.506177e-2,-5.498054e-2,-1.121068,0.514553,94.50278)"
       style="font-size:12;fill:#ff0000;fill-rule:evenodd;stroke-width:1pt;"
       d="M 47.549 68.2154 C 47.549 72.3779 43.7954 75.7562 39.1704 75.7562 C 34.5453 75.7562 30.7917 72.3779 30.7917 68.2154 C 30.7917 64.0529 34.5453 60.6746 39.1704 60.6746 C 43.7954 60.6746 47.549 64.0529 47.549 68.2154 z "
       id="path561" />
  </g>
</svg>
