<?xml version="1.0" encoding="UTF-8" standalone="no"?>
<!DOCTYPE svg PUBLIC "-//W3C//DTD SVG 20010904//EN"
"http://www.w3.org/TR/2001/REC-SVG-20010904/DTD/svg10.dtd">
<!-- Created with Sodipodi ("http://www.sodipodi.com/") -->
<svg
   xmlns="http://www.w3.org/2000/svg"
   xmlns:sodipodi="http://sodipodi.sourceforge.net/DTD/sodipodi-0.dtd"
   xmlns:xlink="http://www.w3.org/1999/xlink"
   id="svg704"
   sodipodi:version="0.34"
   width="72pt"
   height="72pt"
   sodipodi:docbase="/home/zeus/Project"
   sodipodi:docname="/home/zeus/Project/lock-screen.svg">
  <defs
     id="defs706">
    <linearGradient
       id="linearGradient734">
      <stop
         style="stop-color:#2a2535;stop-opacity:1;"
         offset="0.000000"
         id="stop735" />
      <stop
         style="stop-color:#e3e1cf;stop-opacity:1;"
         offset="1.000000"
         id="stop736" />
    </linearGradient>
    <linearGradient
       id="linearGradient724">
      <stop
         style="stop-color:#ffffff;stop-opacity:0.490196;"
         offset="0.000000"
         id="stop725" />
      <stop
         style="stop-color:#ffffff;stop-opacity:0.176471;"
         offset="1.000000"
         id="stop726" />
    </linearGradient>
    <linearGradient
       id="linearGradient718">
      <stop
         style="stop-color:#e3e1cf;stop-opacity:1;"
         offset="0.000000"
         id="stop719" />
      <stop
         style="stop-color:#ffffff;stop-opacity:1;"
         offset="1.000000"
         id="stop720" />
    </linearGradient>
    <linearGradient
       xlink:href="#linearGradient718"
       id="linearGradient721"
       x1="45.4330635"
       y1="41.9262352"
       x2="24.0375099"
       y2="27.2048512"
       gradientUnits="userSpaceOnUse"
       spreadMethod="pad"
       gradientTransform="scale(1.033999,0.967119)" />
    <linearGradient
       xlink:href="#linearGradient724"
       id="linearGradient723"
       x1="40.2607956"
       y1="39.8445053"
       x2="37.3197212"
       y2="68.6665039"
       gradientUnits="userSpaceOnUse"
       spreadMethod="pad"
       gradientTransform="scale(1.185464,0.843551)" />
    <linearGradient
       xlink:href="#linearGradient724"
       id="linearGradient732" />
    <radialGradient
       xlink:href="#linearGradient734"
       id="radialGradient733"
       cx="33.2134209"
       cy="118.190964"
       fx="33.2134209"
       fy="118.190964"
       r="14.8945398"
       gradientUnits="userSpaceOnUse"
       spreadMethod="pad"
       gradientTransform="scale(1.559286,0.641319)" />
    <radialGradient
       xlink:href="#linearGradient734"
       id="radialGradient738" />
  </defs>
  <sodipodi:namedview
     id="base" />
  <path
     transform="matrix(1.294779,0.170029,-0.144152,1.527193,-7.545008,-52.65128)"
     style="font-size:12;fill:#000000;fill-rule:evenodd;stroke-width:1pt;fill-opacity:0.3;"
     d="M 67.6563 79.6875 C 67.6563 84.0863 58.9763 87.6563 48.2813 87.6563 C 37.5863 87.6563 28.9063 84.0863 28.9063 79.6875 C 28.9063 75.2887 37.5863 71.7187 48.2813 71.7187 C 58.9763 71.7187 67.6563 75.2887 67.6563 79.6875 z "
     id="path744" />
  <path
     style="fill:#000000;fill-rule:evenodd;stroke:none;stroke-opacity:1;stroke-width:1pt;stroke-linejoin:miter;stroke-linecap:butt;fill-opacity:0.3;"
     d="M 11.9721 61.9975 C 10.1055 59.3328 1.05153 37.445 8.81341 5.71367 C 40.7348 -0.836156 68.3995 11.3724 82.7618 20.5532 C 85.6926 26.6343 80.6883 72.3183 69.9704 76.7947 C 62.7829 79.1385 25.173 78.4924 11.9721 61.9975 z "
     id="path743"
     sodipodi:nodetypes="ccccc"
     transform="matrix(0.977386,0.000000,0.000000,0.977386,0.996425,-2.493324)" />
  <path
     transform="matrix(1.197940,0.152153,-0.133371,1.366629,-5.606898,-40.31906)"
     style="font-size:12;fill:#211301;fill-rule:evenodd;stroke-width:1pt;"
     d="M 67.6563 79.6875 C 67.6563 84.0863 58.9763 87.6563 48.2813 87.6563 C 37.5863 87.6563 28.9063 84.0863 28.9063 79.6875 C 28.9063 75.2887 37.5863 71.7187 48.2813 71.7187 C 58.9763 71.7187 67.6563 75.2887 67.6563 79.6875 z "
     id="path739" />
  <path
     sodipodi:type="arc"
     style="fill-rule:evenodd;stroke:none;fill:url(#radialGradient733);fill-opacity:1;stroke-opacity:1;stroke-width:1pt;stroke-linejoin:miter;stroke-linecap:butt;"
     id="path731"
     d="M 67.65627 79.6875 A 19.375 7.968754 0 1 0 28.90626 79.6875 A 19.375 7.968754 0 1 0  67.65627 79.6875 z"
     sodipodi:cx="48.281261"
     sodipodi:cy="79.687500"
     sodipodi:rx="19.375004"
     sodipodi:ry="7.968754"
     transform="matrix(0.991094,0.120252,-0.110343,1.080091,2.544737,-17.20832)" />
  <path
     transform="matrix(1.086944,9.709767e-2,-0.117969,0.894643,1.616810,-1.036949)"
     style="font-size:12;fill:#211301;fill-rule:evenodd;stroke-width:1pt;fill-opacity:1;"
     d="M 58.9063 75.9375 C 58.9063 79.56 53.2713 82.5 46.3281 82.5 C 39.385 82.5 33.75 79.56 33.75 75.9375 C 33.75 72.315 39.385 69.375 46.3281 69.375 C 53.2713 69.375 58.9063 72.315 58.9063 75.9375 z "
     id="path730" />
  <path
     style="font-size:12;fill:#bebdae;fill-rule:evenodd;stroke-width:1pt;fill-opacity:1;"
     d="M 58.9063 75.9375 C 58.9063 79.56 53.2713 82.5 46.3281 82.5 C 39.385 82.5 33.75 79.56 33.75 75.9375 C 33.75 72.315 39.385 69.375 46.3281 69.375 C 53.2713 69.375 58.9063 72.315 58.9063 75.9375 z "
     id="path728"
     transform="matrix(0.945416,7.735090e-2,-0.102609,0.712697,7.007128,12.95145)" />
  <path
     style="fill:#211301;fill-rule:evenodd;stroke:none;stroke-opacity:1;stroke-width:1pt;stroke-linejoin:miter;stroke-linecap:butt;fill-opacity:1;"
     d="M 11.9721 61.9975 C 10.1055 59.3328 1.05153 37.445 8.81341 5.71367 C 40.7348 -0.836156 68.3995 11.3724 82.7618 20.5532 C 85.6926 26.6343 80.6883 72.3183 69.9704 76.7947 C 62.7829 79.1385 25.173 78.4924 11.9721 61.9975 z "
     id="path715"
     sodipodi:nodetypes="ccccc"
     transform="matrix(0.977386,0.000000,0.000000,0.977386,-3.422992,-2.272348)" />
  <path
     style="fill:url(#linearGradient721);fill-rule:evenodd;stroke:none;stroke-opacity:1;stroke-width:1pt;stroke-linejoin:miter;stroke-linecap:butt;fill-opacity:1;"
     d="M 15.4688 60.7812 C 13.9062 57.8125 5.15625 41.0937 11.0938 8.90623 C 44.6875 2.81248 67.0312 15.7812 80.9375 23.5937 C 82.5 29.2188 77.3437 71.4062 68.9062 73.9062 C 61.7187 76.25 25.7812 74.8437 15.4688 60.7812 z "
     id="path713"
     sodipodi:nodetypes="ccccc"
     transform="matrix(0.950968,0.000000,0.000000,0.950968,-2.230660,-1.187248)" />
  <path
     style="fill:#b5a794;fill-rule:evenodd;stroke:none;stroke-opacity:1;stroke-width:1pt;stroke-linejoin:miter;stroke-linecap:butt;fill-opacity:1;"
     d="M 19.0625 19.0625 L 16.5625 19.8437 C 16.25 22.1875 12.3438 41.25 16.0938 49.6875 C 20.4688 57.0312 22.5 58.4375 22.0313 57.6562 C 16.7187 48.75 15 35.1562 19.0625 19.0625 z "
     id="path717"
     sodipodi:nodetypes="ccccc"
     transform="matrix(0.950968,0.000000,0.000000,0.950968,-2.230660,-1.187248)" />
  <path
     style="fill:#000000;fill-rule:evenodd;stroke:none;stroke-opacity:1;stroke-width:1pt;stroke-linejoin:miter;stroke-linecap:butt;fill-opacity:1;"
     d="M 19.6875 19.5312 C 19.6875 19.5312 13.5938 41.7188 21.4063 55.1562 C 27.3438 63.4375 46.5625 70 62.3438 65.3125 C 65.3126 61.5625 72.0312 41.25 65.7813 30 C 63.4375 26.0937 35.1563 14.0625 19.6875 19.5312 z "
     id="path711"
     sodipodi:nodetypes="ccccc"
     transform="matrix(0.985977,0.000000,0.000000,0.985977,-3.732215,-2.675266)" />
  <path
     style="fill:#437caf;fill-rule:evenodd;stroke:none;stroke-opacity:1;stroke-width:1pt;stroke-linejoin:miter;stroke-linecap:butt;fill-opacity:1;"
     d="M 19.6875 19.5312 C 19.6875 19.5312 13.5938 41.7188 21.4063 55.1562 C 27.3438 63.4375 46.5625 70 62.3438 65.3125 C 65.3126 61.5625 72.0312 41.25 65.7813 30 C 63.4375 26.0937 35.1563 14.0625 19.6875 19.5312 z "
     id="path710"
     sodipodi:nodetypes="ccccc"
     transform="matrix(0.950968,0.000000,0.000000,0.950968,-2.230660,-1.187248)" />
  <path
     style="fill:url(#linearGradient723);fill-rule:evenodd;stroke:none;stroke-opacity:1;stroke-width:1pt;stroke-linejoin:miter;stroke-linecap:butt;fill-opacity:1;"
     d="M 17.6563 41.875 C 17.6563 41.875 30.625 24.2187 42.9687 35.4687 C 47.9688 52.1874 66.25 56.0937 66.25 56.0937 L 62.6563 65 C 49.0625 69.8438 22.9688 59.8437 21.7188 56.0937 C 20.4688 52.3437 21.4063 58.125 17.6563 41.875 z "
     id="path722"
     sodipodi:nodetypes="cccccc"
     transform="matrix(0.950968,0.000000,0.000000,0.950968,-2.230660,-1.187248)" />
  <path
     style="fill:#000000;fill-rule:evenodd;stroke:none;stroke-opacity:1;stroke-width:1pt;stroke-linejoin:miter;stroke-linecap:butt;fill-opacity:1;"
     d="M 24.3561 51.16 L 24.2188 58.7026 C 30.0285 66.1552 47.8599 69.6306 53.2718 67.1686 C 53.1156 65.9185 52.9593 63.125 52.6657 61.9508 C 48.8494 61.0701 31.0369 58.4659 24.3561 51.16 z "
     id="path709"
     sodipodi:nodetypes="ccccc"
     transform="matrix(1.012321,0.000000,0.000000,1.012321,-4.004139,-5.596647)" />
  <path
     style="fill:#b5a794;fill-rule:evenodd;stroke:none;stroke-opacity:1;stroke-width:1pt;stroke-linejoin:miter;stroke-linecap:butt;fill-opacity:1;"
     d="M 81.25 23.9062 C 81.25 23.9062 76.0938 24.0625 75.9376 24.0625 C 75.7812 24.0625 76.7188 37.3437 76.0938 42.1875 C 75.4688 47.0312 73.9063 58.4375 72.9688 61.4062 C 72.0313 64.375 66.5625 73.9062 66.0938 74.5312 C 65.625 75.1562 67.3438 74.3749 70 73.5937 C 77.1875 65.3124 80.7813 45.4688 81.25 23.9062 z "
     id="path716"
     sodipodi:nodetypes="ccccccc"
     transform="matrix(0.950968,0.000000,0.000000,0.950968,-2.230660,-1.187248)" />
  <path
     style="fill:#c7bda8;fill-rule:evenodd;stroke:none;stroke-opacity:1;stroke-width:1pt;stroke-linejoin:miter;stroke-linecap:butt;fill-opacity:1;"
     d="M 24.0625 52.1875 L 24.2188 57.9687 C 30.4688 64.6874 48.5938 68.7499 53.125 66.875 C 52.9688 65.6249 52.8125 63.125 52.8125 63.125 C 52.8125 63.125 30.1562 58.9062 24.0625 52.1875 z "
     id="path708"
     sodipodi:nodetypes="ccccc"
     transform="matrix(0.950968,0.000000,0.000000,0.950968,-1.636305,-1.930189)" />
  <path
     style="fill:#211301;fill-rule:evenodd;stroke:none;stroke-opacity:1;stroke-width:1pt;stroke-linejoin:miter;stroke-linecap:butt;fill-opacity:1;"
     d="M 65.7813 74.2187 C 65.7813 74.2187 77.9688 64.6875 74.8438 24.6875 C 72.1875 22.0312 68.125 19.0625 68.125 19.0625 C 68.125 19.0625 75.9375 22.8125 76.4063 24.0625 C 77.1875 25.7812 77.6562 67.1875 65.7813 74.2187 z "
     id="path712"
     sodipodi:nodetypes="ccccc"
     transform="matrix(0.950968,0.000000,0.000000,0.950968,-2.230660,-1.187248)" />
  <path
     style="fill:#fbfbfb;fill-rule:evenodd;stroke:none;stroke-opacity:1;stroke-width:1pt;stroke-linejoin:miter;stroke-linecap:butt;fill-opacity:1;"
     d="M 26.5625 78.5937 L 27.9688 77.5 C 32.9688 86.25 53.4375 87.1875 55 86.875 C 56.5625 86.5625 37.6562 92.5 26.5625 78.5937 z "
     id="path740"
     sodipodi:nodetypes="cccc"
     transform="matrix(0.950968,0.000000,0.000000,0.950968,-2.230660,-1.187248)" />
  <path
     style="fill:none;fill-rule:evenodd;stroke:black;stroke-opacity:1;stroke-width:0.875;stroke-linejoin:round;stroke-linecap:round;fill-opacity:1;stroke-dasharray:none;"
     d="M 27.5 54.5312 C 27.5 52.9687 27.5 59.2188 27.5 59.2188 "
     id="path741"
     sodipodi:nodetypes="cc"
     transform="matrix(0.950968,0.000000,0.000000,0.950968,-2.230660,-1.187248)" />
  <path
     style="fill:none;fill-rule:evenodd;stroke:black;stroke-opacity:1;stroke-width:0.875;stroke-linejoin:round;stroke-linecap:round;fill-opacity:1;stroke-dasharray:none;"
     d="M 27.5 54.5312 C 27.5 52.9687 27.5 59.2188 27.5 59.2188 "
     id="path742"
     sodipodi:nodetypes="cc"
     transform="matrix(0.950968,0.000000,0.000000,0.950968,16.78871,5.499249)" />
  <path
     style="font-size:12;fill:#000001;fill-rule:evenodd;"
     d="M 42.60484 38.6129 C 37.17653 38.6129 32.80645 43.17721 32.80645 48.84677 L 32.80645 69.31452 C 32.80645 74.98408 37.17653 79.54839 42.60484 79.54839 L 62.20161 79.54839 C 67.62992 79.54839 72 74.98408 72 69.31452 L 72 48.84677 C 72 43.17721 67.62992 38.6129 62.20161 38.6129 L 42.60484 38.6129 z "
     id="path867" />
  <path
     style="font-size:12;fill:#ff933d;fill-rule:evenodd;fill-opacity:1;"
     d="M 43.98388 62.12902 C 39.39997 62.12902 35.70968 64.58923 35.70968 67.64516 L 36.58065 71.12903 C 36.58065 74.18496 40.27094 76.64516 44.85484 76.64516 L 61.40323 76.64516 C 65.98713 76.64516 68.51613 74.18496 68.51613 71.12903 L 68.22581 67.64516 C 68.22581 64.58923 65.11616 62.12902 60.53226 62.12902 L 43.98388 62.12902 z "
     id="path850"
     sodipodi:nodetypes="ccccccccc" />
  <path
     style="fill:#ff933d;fill-rule:evenodd;stroke:none;stroke-opacity:1;stroke-width:1pt;stroke-linejoin:miter;stroke-linecap:butt;fill-opacity:1;"
     d="M 35.41935 47.32258 L 35.70968 68.22581 L 39.48387 73.45161 L 68.22581 72.87097 L 68.51614 53.12903 L 35.41935 47.32258 z "
     id="path851"
     sodipodi:nodetypes="cccccc" />
  <path
     style="font-size:12;fill:none;fill-rule:evenodd;stroke:#000001;stroke-width:12.5;stroke-dasharray:none;stroke-linecap:round;stroke-opacity:1;"
     d="M 63.00001 47.24999 L 63.00001 33.74999 C 63.00001 30.01049 59.76291 26.99999 55.74194 26.99999 L 50.80646 26.70967 C 46.78549 26.70967 43.54839 29.72017 43.54839 33.45967 L 43.54839 46.95967 "
     id="path868"
     sodipodi:nodetypes="cccccc" />
  <path
     style="font-size:12;fill:#ffd056;fill-rule:evenodd;fill-opacity:1;"
     d="M 43.98388 41.51612 C 39.39997 41.51612 35.70968 43.97633 35.70968 47.03226 L 36.58065 50.51613 C 36.58065 53.57206 40.27094 56.03226 44.85484 56.03226 L 61.40323 56.03226 C 65.98713 56.03226 68.80645 55.02367 68.80645 51.96774 L 68.80645 47.03226 C 68.80645 43.97633 65.11616 41.51612 60.53226 41.51612 L 43.98388 41.51612 z "
     id="path792"
     sodipodi:nodetypes="ccccccccc" />
  <path
     style="font-size:12;fill:#000001;fill-rule:evenodd;fill-opacity:1;"
     d="M 57.87097 63.43545 C 57.87097 66.24141 55.81292 68.51609 53.27419 68.51609 C 50.73545 68.51609 48.67742 66.24141 48.67742 63.43545 C 48.67742 60.6295 50.73545 58.35481 53.27419 58.35481 C 55.81292 58.35481 57.87097 60.6295 57.87097 63.43545 z "
     id="path859" />
  <path
     style="font-size:12;fill:#000001;fill-rule:evenodd;fill-opacity:1;"
     d="M 52.18548 66.19354 C 51.4215 66.19354 50.80645 67.06756 50.80645 68.15322 L 50.80645 72.07258 C 50.80645 73.15824 51.4215 74.03225 52.18548 74.03225 L 54.94355 74.03225 C 55.70753 74.03225 56.32258 73.15824 56.32258 72.07258 L 56.32258 68.15322 C 56.32258 67.06756 55.70753 66.19354 54.94355 66.19354 L 52.18548 66.19354 z "
     id="path860" />
  <path
     style="font-size:12;fill:#7e0000;fill-rule:evenodd;fill-opacity:1;"
     d="M 56.12904 63.57953 C 56.12904 66.23891 54.46094 68.39475 52.40323 68.39475 C 50.3455 68.39475 48.67741 66.23891 48.67741 63.57953 C 48.67741 60.92017 50.3455 58.76431 52.40323 58.76431 C 54.46094 58.76431 56.12904 60.92017 56.12904 63.57953 z "
     id="path861" />
  <path
     style="font-size:12;fill:#7e0000;fill-rule:evenodd;fill-opacity:1;"
     d="M 51.52079 66.19354 C 50.90156 66.19354 50.40305 67.02189 50.40305 68.05084 L 50.40305 71.76544 C 50.40305 72.79439 50.90156 73.62274 51.52079 73.62274 L 53.75628 73.62274 C 54.37551 73.62274 54.87403 72.79439 54.87403 71.76544 L 54.87403 68.05084 C 54.87403 67.02189 54.37551 66.19354 53.75628 66.19354 L 51.52079 66.19354 z "
     id="path862" />
  <path
     style="font-size:12;fill:none;fill-rule:evenodd;stroke:#955801;stroke-width:6.5;stroke-dasharray:none;stroke-linecap:round;stroke-opacity:1;"
     d="M 63.00001 47.24999 L 63.00001 33.74999 C 63.00001 30.01049 59.76291 26.99999 55.74194 26.99999 L 50.80646 26.70967 C 46.78549 26.70967 43.54839 29.72017 43.54839 33.45967 L 43.54839 46.95967 "
     id="path864"
     sodipodi:nodetypes="cccccc" />
  <path
     style="font-size:12;fill:none;fill-rule:evenodd;stroke:#e9a93d;stroke-width:1.875;stroke-dasharray:none;stroke-linecap:round;stroke-opacity:1;"
     d="M 62.12904 46.95967 L 62.12904 33.45967 C 62.12904 29.72017 58.89194 26.70967 54.87097 26.70967 L 49.93549 26.41935 C 45.91452 26.41935 42.67742 29.42985 42.67742 33.16935 L 42.67742 46.66935 "
     id="path865"
     sodipodi:nodetypes="cccccc" />
</svg>
