<?xml version="1.0" encoding="UTF-8" standalone="no"?>
<!DOCTYPE svg PUBLIC "-//W3C//DTD SVG 20010904//EN"
"http://www.w3.org/TR/2001/REC-SVG-20010904/DTD/svg10.dtd">
<!-- Created with Sodipodi ("http://www.sodipodi.com/") -->
<svg
   width="17.036pt"
   height="17.036pt"
   viewBox="0 0 17.036 17.036"
   xml:space="preserve"
   id="svg559"
   sodipodi:version="0.33"
   sodipodi:docname="/usr/share/themes/Debian-BR/metacity-1/wm-menu.svg"
   sodipodi:docbase="/usr/share/themes/Debian-BR/metacity-1/"
   xmlns="http://www.w3.org/2000/svg"
   xmlns:sodipodi="http://sodipodi.sourceforge.net/DTD/sodipodi-0.dtd"
   xmlns:xml="http://www.w3.org/XML/1998/namespace"
   xmlns:xlink="http://www.w3.org/1999/xlink"><defs
   id="defs587">
  <radialGradient
   id="aigrd1"
   cx="6.0088"
   cy="5.3652"
   r="10.6059"
   fx="6.0088"
   fy="5.3652"
   gradientUnits="userSpaceOnUse">
			<stop
   offset="0"
   style="stop-color:#2d47a7;stop-opacity:1.0000;"
   id="stop567" />


			<stop
   offset="1"
   style="stop-color:#ffffff;stop-opacity:1.0000;"
   id="stop569" />


			
		</radialGradient>

  <radialGradient
   xlink:href="#aigrd1"
   id="radialGradient1129"
   cx="8.714665"
   cy="8.660093"
   r="9.136143"
   fx="8.714665"
   fy="8.660093" />

<linearGradient
   xlink:href="#aigrd1"
   id="linearGradient608" />
</defs>

<sodipodi:namedview
   id="base" />


	
		<path
   style="font-size:12.000;fill:url(#linearGradient608);"
   d="M0,8.518c0,4.697,3.821,8.518,8.518,8.518c4.697,0,8.518-3.82,8.518-8.518C17.036,3.821,13.215,0,8.518,0C3.821,0,0,3.821,0,8.518z"
   id="path563" />


		
		<path
   style="font-size:12.000;fill:url(#radialGradient1129);fill-rule:evenodd;"
   d="M15.7,8.433c0,4.013-3.254,7.267-7.266,7.267c-4.014,0-7.268-3.254-7.268-7.267c0-4.013,3.253-7.267,7.268-7.267c4.012,0,7.266,3.253,7.266,7.267z"
   id="path574" />


		
	
<g
   id="menu"
   style="font-size:12.000;fill:#ffffff;fill-rule:evenodd;">
			<g
   style="fill:#000000;"
   id="g759">
				<path
   style="opacity:0.6;"
   d="M11.066,10.018H5.195c-0.702,0-1.272,0.568-1.272,1.271c0,0.701,0.57,1.271,1.272,1.271h5.871c0.702,0,1.272-0.57,1.272-1.271c0-0.703-0.57-1.271-1.272-1.271z"
   id="path761" />



				<path
   style="opacity:0.6;"
   d="M11.066,6.881H5.195c-0.702,0-1.272,0.569-1.272,1.271c0,0.703,0.57,1.272,1.272,1.272h5.871c0.702,0,1.272-0.569,1.272-1.272c0-0.702-0.57-1.271-1.272-1.271z"
   id="path763" />



				<path
   style="opacity:0.6;"
   d="M11.066,3.829H5.195c-0.702,0-1.272,0.569-1.272,1.271c0,0.703,0.57,1.272,1.272,1.272h5.871c0.702,0,1.272-0.569,1.272-1.272c0-0.702-0.57-1.271-1.272-1.271z"
   id="path765" />



			</g>



			<g
   id="g768">
				<path
   style="opacity:0.6;"
   d="M11.575,10.526H5.704c-0.703,0-1.271,0.57-1.271,1.271c0,0.703,0.569,1.271,1.271,1.271h5.871c0.703,0,1.271-0.568,1.271-1.271c0-0.701-0.568-1.271-1.271-1.271z"
   id="path770" />



				<path
   style="opacity:0.6;"
   d="M11.575,7.39H5.704c-0.703,0-1.271,0.569-1.271,1.271c0,0.703,0.569,1.271,1.271,1.271h5.871c0.703,0,1.271-0.568,1.271-1.271c0-0.702-0.568-1.271-1.271-1.271z"
   id="path772" />



				<path
   style="opacity:0.6;"
   d="M11.575,4.338H5.704c-0.703,0-1.271,0.569-1.271,1.271c0,0.703,0.569,1.272,1.271,1.272h5.871c0.703,0,1.271-0.569,1.271-1.272c0-0.702-0.568-1.271-1.271-1.271z"
   id="path774" />



			</g>



			<g
   id="g777">
				<path
   d="M11.321,10.272H5.45c-0.703,0-1.272,0.57-1.272,1.271c0,0.703,0.569,1.271,1.272,1.271h5.871c0.701,0,1.271-0.568,1.271-1.271c0-0.701-0.57-1.271-1.271-1.271z"
   id="path779" />



				<path
   d="M11.321,7.135H5.45c-0.703,0-1.272,0.569-1.272,1.272c0,0.702,0.569,1.271,1.272,1.271h5.871c0.701,0,1.271-0.569,1.271-1.271c0-0.703-0.57-1.272-1.271-1.272z"
   id="path781" />



				<path
   d="M11.321,4.083H5.45c-0.703,0-1.272,0.569-1.272,1.271S4.748,6.626,5.45,6.626h5.871c0.701,0,1.271-0.569,1.271-1.271s-0.57-1.271-1.271-1.271z"
   id="path783" />



			</g>



		</g>

</svg>
