<?xml version="1.0" encoding="UTF-8" standalone="no"?>
<!DOCTYPE svg PUBLIC "-//W3C//DTD SVG 20010904//EN"
"http://www.w3.org/TR/2001/REC-SVG-20010904/DTD/svg10.dtd">
<!-- Created with Sodipodi ("http://www.sodipodi.com/") -->
<svg
   xmlns="http://www.w3.org/2000/svg"
   xmlns:sodipodi="http://sodipodi.sourceforge.net/DTD/sodipodi-0.dtd"
   xmlns:xlink="http://www.w3.org/1999/xlink"
   xmlns:inkscape="http://www.inkscape.org/namespaces/inkscape"
   version="1"
   x="0.00000000"
   y="0.00000000"
   width="48pt"
   height="48pt"
   id="svg548"
   sodipodi:version="0.34"
   sodipodi:docname="/home/zeus/gartoon-stock.0.1/stock_goto-top.svg"
   sodipodi:docbase="/home/zeus/gartoon-stock.0.1/"
   inkscape:version="0.37">
  <sodipodi:namedview
     id="base"
     inkscape:zoom="9.65625000"
     inkscape:cx="16.0000000"
     inkscape:cy="28.4271845"
     inkscape:window-width="1014"
     inkscape:window-height="696"
     inkscape:window-x="0"
     inkscape:window-y="0" />
  <defs
     id="defs550">
    <linearGradient
       x1="0.00000000"
       y1="0.00000000"
       x2="1.00000000"
       y2="0.00000000"
       id="linearGradient556"
       gradientUnits="objectBoundingBox"
       spreadMethod="pad">
      <stop
         style="stop-color:#ff8700;stop-opacity:1;"
         offset="0.00000000"
         id="stop557" />
      <stop
         style="stop-color:#ffff8d;stop-opacity:0;"
         offset="1.00000000"
         id="stop558" />
    </linearGradient>
    <linearGradient
       x1="0.00000000"
       y1="0.00000000"
       x2="1.00000000"
       y2="0.00000000"
       id="linearGradient559"
       xlink:href="#linearGradient556"
       gradientUnits="objectBoundingBox"
       spreadMethod="pad" />
  </defs>
  <path
     d="M 29.62072 11.29075 C 24.65534 12.23105 5.779864 28.97427 7.850057 32.31872 C 10.08269 38.63563 17.37267 36.91355 18.84128 39.34392 C 19.7752 41.8528 17.2756 55.3662 20.42641 57.15069 C 27.25899 59.70675 40.0135 60.13422 43.3927 53.95676 C 45.41409 47.60354 41.43578 37.2041 45.07661 36.16431 C 48.71743 35.12454 50.72846 32.80812 50.31582 30.90127 C 49.90317 28.99442 34.77417 9.614502 29.62072 11.29075 z "
     style="font-size:12;fill:#0d3c07;fill-rule:evenodd;"
     id="path582" />
  <path
     d="M 29.66054 16.78647 C 25.91593 17.33523 12.83386 28.33416 14.60097 31.07121 C 16.36817 33.80839 22.1087 32.78005 22.9609 34.80854 C 23.8132 36.83715 23.00893 52.96544 25.9198 53.19422 C 28.83063 53.4232 38.72526 54.40759 38.99455 51.93388 C 39.26388 49.45997 36.57059 33.46981 39.29699 32.78937 C 42.02339 32.10893 45.078 32.50396 44.65742 30.97397 C 44.23686 29.44397 33.50839 15.66102 29.66054 16.78647 z "
     style="font-size:12;fill:#2aaf18;fill-rule:evenodd;"
     id="path581" />
  <path
     d="M 27.2774 53.3698 C 27.2774 53.3698 24.45877 53.59563 24.10094 50.74549 C 23.74308 47.89556 23.743 34.31944 22.58092 34.0216 C 19.13526 33.87112 13.42792 31.80499 13.93323 29.95193 C 14.69687 26.65679 27.03742 16.89002 29.17726 16.57641 C 31.31705 16.26299 19.94309 26.44968 22.19358 29.39692 C 24.44406 32.34415 28.97062 31.30637 29.23634 33.70181 C 29.50198 36.09714 31.41316 52.57659 29.95212 52.978 C 28.49122 53.37932 26.50637 52.8274 27.2774 53.3698 z "
     style="font-size:12;fill:#208c11;fill-rule:evenodd;"
     id="path583" />
  <path
     d="M 36.07995 52.04881 C 36.07995 52.04881 36.99853 34.31216 35.74411 33.5596 C 34.48978 32.80715 31.60857 47.92896 36.07995 52.04881 z "
     style="font-size:12;fill:#ffffff;fill-rule:evenodd;"
     id="path588" />
  <path
     d="M 32.34995 19.5446 C 32.34995 19.5446 40.33719 26.33259 40.90173 28.02887 C 41.46615 29.72506 37.64044 28.78767 37.64044 28.78767 C 37.64044 28.78767 33.7998 20.17478 32.34995 19.5446 z "
     style="font-size:12;fill:#ffffff;fill-rule:evenodd;"
     id="path589" />
  <path
     style="font-size:12;fill:#0d3c07;fill-rule:evenodd;stroke-width:1;"
     d="M 52.79693 11.62539 L 53.32026 7.342249 C 53.45751 5.217066 53.54671 3.916747 53.26944 1.096469 L 8.918044 1.69162 C 8.056554 4.462335 7.805387 5.516651 8.280363 7.961793 C 8.827878 9.708764 8.346001 8.381349 9.274423 10.66971 C 8.760682 10.86324 50.99894 12.33021 52.79693 11.62539 z "
     id="path590"
     sodipodi:nodetypes="ccccccc" />
  <path
     style="font-size:12;fill:#2aaf18;fill-rule:evenodd;stroke-width:1;"
     d="M 51.03822 8.767299 C 51.43401 7.914558 51.50308 7.06388 51.57214 6.213216 C 51.64121 5.362539 51.76511 4.602608 51.45262 3.663247 L 10.06925 3.924638 C 9.609496 4.67151 9.422005 5.416634 9.397869 6.160755 C 9.373757 6.904861 9.457196 7.329455 9.924453 8.38932 L 51.03822 8.767299 z "
     id="path591"
     sodipodi:nodetypes="ccccccc" />
  <path
     style="font-size:12;fill:#208c11;fill-rule:evenodd;stroke-width:1;"
     d="M 50.96459 4.151554 L 10.45208 4.324964 C 10.45208 4.324964 10.1969 5.161609 10.15956 6.002028 C 10.12221 6.842448 10.3027 7.686656 10.30278 7.707272 C 10.30295 7.748504 11.01135 7.867729 11.93462 7.284592 C 12.91815 6.62486 11.66805 5.520509 12.52622 5.507707 L 50.85894 4.935692 C 51.09764 4.932124 51.69294 4.148427 50.96459 4.151554 z "
     id="path592"
     sodipodi:nodetypes="ccssssss" />
  <path
     style="font-size:12;fill:#ffffff;fill-rule:evenodd;stroke-width:1;"
     d="M 50.28393 8.161923 C 51.29926 7.431929 50.71234 6.229664 50.63961 6.230123 C 47.36991 7.094951 31.07591 7.01697 31.07591 7.01697 C 30.38561 7.192171 28.17035 7.448197 28.13241 7.608389 C 28.09886 7.750141 30.22354 7.914945 30.86145 7.922804 L 50.28393 8.161923 z "
     id="path577"
     sodipodi:nodetypes="ccsssc" />
</svg>
