<?xml version="1.0" encoding="UTF-8" standalone="no"?>
<!DOCTYPE svg PUBLIC "-//W3C//DTD SVG 20010904//EN"
"http://www.w3.org/TR/2001/REC-SVG-20010904/DTD/svg10.dtd">
<!-- Created with Sodipodi ("http://www.sodipodi.com/") -->
<svg
   id="svg596"
   sodipodi:version="0.32"
   width="72pt"
   height="72pt"
   sodipodi:docbase="/home/zeus/desktop/icons/gartoon/svg"
   sodipodi:docname="/home/zeus/desktop/icons/gartoon/svg/gnome-mime-image-x-rgb.svg"
   xmlns="http://www.w3.org/2000/svg"
   xmlns:sodipodi="http://sodipodi.sourceforge.net/DTD/sodipodi-0.dtd"
   xmlns:xlink="http://www.w3.org/1999/xlink">
  <defs
     id="defs598">
    <linearGradient
       id="linearGradient612">
      <stop
         style="stop-color:#7fa8e3;stop-opacity:0.741176;"
         offset="0.000000"
         id="stop613" />
      <stop
         style="stop-color:#ffffff;stop-opacity:0;"
         offset="1.000000"
         id="stop614" />
    </linearGradient>
    <linearGradient
       id="linearGradient626">
      <stop
         style="stop-color:#ff0047;stop-opacity:1;"
         offset="0.000000"
         id="stop627" />
      <stop
         style="stop-color:#ab322d;stop-opacity:0;"
         offset="1.000000"
         id="stop628" />
    </linearGradient>
    <linearGradient
       id="linearGradient618">
      <stop
         style="stop-color:#956d47;stop-opacity:1;"
         offset="0.000000"
         id="stop619" />
      <stop
         style="stop-color:#ab322d;stop-opacity:0;"
         offset="1.000000"
         id="stop620" />
    </linearGradient>
    <linearGradient
       id="linearGradient614">
      <stop
         style="stop-color:#000;stop-opacity:1;"
         offset="0"
         id="stop615" />
      <stop
         style="stop-color:#fff;stop-opacity:1;"
         offset="1"
         id="stop616" />
    </linearGradient>
    <linearGradient
       xlink:href="#linearGradient618"
       id="linearGradient617"
       y2="0.52343726"
       x2="1.07843077"
       y1="0.57031226"
       x1="-0.19608469"
       spreadMethod="pad"
       gradientUnits="objectBoundingBox" />
    <linearGradient
       xlink:href="#linearGradient626"
       id="linearGradient625"
       x1="42.9995728"
       y1="77.3980103"
       x2="28.5382881"
       y2="63.0152588"
       gradientUnits="userSpaceOnUse"
       spreadMethod="pad"
       gradientTransform="matrix(0.934001,0.000000,0.000000,1.070663,-1.516226e-6,-1.716230e-7)" />
    <linearGradient
       xlink:href="#linearGradient612"
       id="linearGradient636"
       x1="16.4110699"
       y1="10.6072874"
       x2="24.6243172"
       y2="61.6665344"
       gradientUnits="userSpaceOnUse"
       spreadMethod="pad" />
  </defs>
  <sodipodi:namedview
     id="base" />
  <g
     id="g898"
     transform="translate(-1.146498,1.146498)">
    <path
       style="fill:#000000;fill-rule:evenodd;stroke:none;stroke-opacity:1;stroke-width:1pt;stroke-linejoin:miter;stroke-linecap:butt;fill-opacity:0.301471;"
       d="M 12.8163 74.753 C 10.3856 73.6481 7.07107 70.1126 8.83884 65.2512 C 9.72267 59.948 25.6326 13.1021 29.1682 10.8924 C 31.3778 8.90368 34.582 8.13026 39.1119 9.34561 C 42.8684 10.2295 76.6769 19.0684 78.6656 20.8361 C 80.6544 22.6039 82.2012 24.0402 80.6544 27.9072 C 79.5496 29.8959 66.4017 74.532 66.1808 77.4047 C 65.2969 80.4983 62.7558 84.2548 58.5573 84.0338 C 54.3589 83.8128 15.9099 75.4159 12.8163 74.753 z "
       id="path794"
       sodipodi:nodetypes="ccccccccc"
       transform="matrix(1.114903,0.000000,0.000000,1.114903,1.287023,-5.035753)" />
    <path
       style="fill:#3d4e67;fill-rule:evenodd;stroke:none;stroke-opacity:1;stroke-width:1pt;stroke-linejoin:miter;stroke-linecap:butt;fill-opacity:1;"
       d="M 12.8163 74.753 C 10.3856 73.6481 7.07107 70.1126 8.83884 65.2512 C 9.72267 59.948 25.6326 13.1021 29.1682 10.8924 C 31.3778 8.90368 34.582 8.13026 39.1119 9.34561 C 42.8684 10.2295 76.6769 19.0684 78.6656 20.8361 C 80.6544 22.6039 82.2012 24.0402 80.6544 27.9072 C 79.5496 29.8959 66.4017 74.532 66.1808 77.4047 C 65.2969 80.4983 62.7558 84.2548 58.5573 84.0338 C 54.3589 83.8128 15.9099 75.4159 12.8163 74.753 z "
       id="path895"
       sodipodi:nodetypes="ccccccccc"
       transform="matrix(1.114903,0.000000,0.000000,1.114903,-1.570116,-9.607182)" />
    <path
       style="fill:#ffffff;fill-rule:evenodd;stroke:none;stroke-opacity:1;stroke-width:1pt;stroke-linejoin:miter;stroke-linecap:butt;fill-opacity:1;"
       d="M 17.8987 70.9965 C 15.3576 70.3336 11.7114 69.6706 13.0373 65.6932 C 15.468 55.9705 27.8424 18.6264 33.1456 13.986 C 34.361 12.8811 38.4489 12.4392 46.1829 14.8699 C 55.0218 17.5215 72.9204 23.4877 74.6882 24.3716 C 76.4559 25.2555 77.1189 25.2555 75.793 29.233 C 73.8043 33.2105 64.9655 67.24 62.7557 72.9852 C 61.209 77.0732 60.8775 78.9514 58.2258 78.9514 "
       id="path896"
       sodipodi:nodetypes="cccccccs"
       transform="matrix(1.114903,0.000000,0.000000,1.114903,-1.570116,-9.607182)" />
    <path
       style="fill:url(#linearGradient636);fill-rule:evenodd;stroke:none;stroke-opacity:1;stroke-width:1pt;stroke-linejoin:miter;stroke-linecap:butt;fill-opacity:1;"
       d="M 28.75 13.75 C 28.75 13.75 31.875 7.49995 39.6875 9.37495 C 47.5 11.25 78.125 19.375 77.8125 21.875 C 77.5 24.375 71.875 39.0625 71.5625 40.3125 C 71.25 41.5625 42.5 40.9375 31.5625 47.5 C 20.625 54.0625 12.5 59.6875 12.5 59.6875 C 12.5 59.6875 23.75 24.6875 28.75 13.75 z "
       id="path636"
       transform="matrix(0.946780,0.000000,0.000000,0.946780,6.111789,-0.736980)" />
  </g>
  <path
     style="font-size:12;fill:#470000;fill-rule:evenodd;stroke-width:1pt;"
     d="M 67.911 66.4866 C 67.911 68.1832 66.4512 69.56 64.6525 69.56 C 62.8537 69.56 61.3939 68.1832 61.3939 66.4866 C 61.3939 64.7901 62.8537 63.4132 64.6525 63.4132 C 66.4512 63.4132 67.911 64.7901 67.911 66.4866 z "
     id="path613"
     transform="matrix(0.665098,0.000000,0.000000,0.665098,26.75834,4.099827)" />
  <path
     style="font-size:12;fill:#470000;fill-rule:evenodd;stroke-width:1pt;"
     d="M 61.2458 74.2998 C 59.6905 72.5223 57.1726 73.4851 56.3579 74.7441 C 55.4692 77.8545 56.8764 80.6687 60.5793 79.3357 C 64.2822 78.0026 65.6152 75.929 65.6152 76.0771 C 65.6152 76.2253 62.6529 84.0754 58.2094 84.6678 C 53.7659 85.2603 51.322 85.4084 46.4342 85.4825 C 41.3983 86.3712 38.9544 86.2971 38.9544 86.2971 L 45.1752 77.4102 C 45.1752 77.4102 46.8045 76.5215 49.4706 72.078 C 52.1367 67.6346 56.8763 66.5977 59.2462 68.0789 C 61.3939 68.9675 62.5788 70.1525 63.1713 72.4483 C 63.0232 74.9662 62.5788 75.929 61.2458 74.2998 z "
     id="path610"
     sodipodi:nodetypes="cccccccccccc"
     transform="matrix(0.665098,0.000000,0.000000,0.665098,26.75834,4.099827)" />
  <path
     style="font-size:12;fill:#230000;fill-opacity:0.99899;fill-rule:evenodd;stroke-width:1pt;"
     d="M 37.9176 76.4474 C 40.1393 77.0399 37.5473 80.2243 36.1402 78.0026 C 35.0293 79.5578 35.5477 75.7809 35.5477 75.7809 L 30.808 85.7046 C 30.808 85.7046 38.9544 88.667 42.0648 84.3716 C 45.1752 80.0763 45.5456 77.8545 43.8423 76.0771 C 41.8426 73.3371 40.0652 74.4479 39.3247 74.8922 C 38.5841 75.3366 38.2879 75.6328 37.9176 76.4474 z "
     id="path609"
     sodipodi:nodetypes="cccccccc"
     transform="matrix(0.665098,0.000000,0.000000,0.665098,26.95536,4.099827)" />
  <path
     style="font-size:12;fill:#230000;fill-rule:evenodd;stroke-width:1pt;"
     d="M 36.1402 62.0062 C 36.1402 62.0062 37.0288 56.674 36.7326 53.8598 C 36.2883 47.787 23.5503 -3.31281 14.071 5.57413 C 3.11042 9.86949 16.1446 58.8957 17.7739 61.7099 C 19.4031 64.5241 21.773 66.5977 21.773 66.5977 C 21.773 66.5977 18.07 83.483 31.9189 85.8527 C 36.9549 76.5215 40.5087 72.8006 39.695 68.5973 C 39.2506 66.2275 38.6582 64.0057 36.1402 62.0062 z "
     id="path608"
     sodipodi:nodetypes="cccccccc"
     transform="matrix(0.665098,0.000000,0.000000,0.665098,26.75834,4.099827)" />
  <path
     style="font-size:12;fill:#f2962c;fill-rule:evenodd;stroke-width:1pt;"
     d="M 19.4031 58.3033 C 22.0692 55.0448 25.0315 52.6749 32.5854 53.4155 C 30.2156 40.2331 21.773 4.68543 15.7002 7.94398 C 8.88697 9.12891 15.2559 48.8239 19.4031 58.3033 z "
     id="path600"
     sodipodi:nodetypes="cccc"
     transform="matrix(0.665098,0.000000,0.000000,0.665098,26.75834,4.099827)" />
  <path
     style="font-size:12;fill:#8b8b8b;fill-rule:evenodd;stroke-width:1pt;"
     d="M 19.8475 59.6363 C 19.8475 59.6363 21.1805 63.9316 24.7353 64.2279 C 26.3646 61.7099 30.0675 61.2656 33.1779 61.4137 C 33.9185 58.5995 34.5109 55.1928 33.326 55.0447 C 31.8449 54.156 23.5504 52.5268 19.8475 59.6363 z "
     id="path601"
     sodipodi:nodetypes="ccccc"
     transform="matrix(0.665098,0.000000,0.000000,0.665098,26.75834,4.099827)" />
  <path
     style="font-size:12;fill:#65532d;fill-rule:evenodd;stroke-width:1pt;"
     d="M 24.8834 66.4496 C 25.624 63.1911 31.2524 60.9694 33.7703 63.6354 C 39.8431 67.0421 37.177 75.4847 34.5109 75.6328 C 33.7703 86.149 40.8799 80.3724 40.7318 78.1508 C 46.0639 77.4102 41.7686 84.9641 38.2138 84.5197 C 33.326 85.2603 20.2918 80.8169 24.8834 66.4496 z "
     id="path602"
     sodipodi:nodetypes="cccccc"
     transform="matrix(0.665098,0.000000,0.000000,0.665098,26.75834,4.099827)" />
  <path
     style="font-size:12;fill:#bc0000;fill-rule:evenodd;stroke-width:1pt;"
     d="M 44.5828 81.2612 C 44.7309 81.4093 46.6564 81.2612 47.6932 79.4838 C 48.73 77.7064 52.2848 70.4487 54.8028 70.3006 C 60.8755 68.0789 60.8755 72.2261 60.8755 72.2261 C 60.8755 72.2261 55.2471 70.1525 54.6546 73.7073 C 54.0622 77.2621 53.0254 79.3357 59.8386 82.1499 C 55.9877 83.4829 43.966 83.74 43.2253 83.74 C 42.4847 83.74 44.7309 81.1131 44.5828 81.2612 z "
     id="path603"
     sodipodi:nodetypes="cccccccc"
     transform="matrix(0.665098,0.000000,0.000000,0.665098,26.75834,4.099827)" />
  <path
     style="font-size:12;fill:#470000;fill-rule:evenodd;stroke-width:1pt;"
     d="M 46.6564 67.6346 C 48.4338 64.9685 54.5806 66.3015 57.3947 65.7091 C 60.8014 64.8204 59.02 58.5954 55.169 58.5955 C 52.5142 58.0648 46.9527 58.1551 46.6564 67.6346 z "
     id="path611"
     sodipodi:nodetypes="cccc"
     transform="matrix(0.665098,0.000000,0.000000,0.665098,26.75834,4.099827)" />
  <path
     style="font-size:12;fill:#bc0000;fill-rule:evenodd;stroke-width:1pt;"
     d="M 48.1376 64.8204 C 48.1376 64.8204 54.5065 64.2279 56.1358 64.2279 C 58.0613 64.6397 58.1915 61.7181 56.5801 60.6731 C 53.766 58.7476 49.9149 58.5995 48.1376 64.8204 z "
     id="path604"
     sodipodi:nodetypes="cccc"
     transform="matrix(0.665098,0.000000,0.000000,0.665098,26.75834,4.099827)" />
  <path
     style="font-size:12;fill:#bc0000;fill-rule:evenodd;stroke-width:1pt;"
     d="M 66.8001 66.5977 C 66.8001 67.7424 65.838 68.6714 64.6524 68.6714 C 63.4669 68.6714 62.5048 67.7424 62.5048 66.5977 C 62.5048 65.4531 63.4669 64.5241 64.6524 64.5241 C 65.838 64.5241 66.8001 65.4531 66.8001 66.5977 z "
     id="path606"
     transform="matrix(0.665098,0.000000,0.000000,0.665098,26.75834,4.099827)" />
  <path
     style="font-size:12;fill:url(#linearGradient617);fill-rule:evenodd;stroke-width:1pt;"
     d="M 19.4031 58.3033 C 22.0692 55.0448 25.0315 52.6749 32.5854 53.4155 C 30.2156 40.2331 21.773 4.68543 15.7002 7.94398 C 8.88697 9.12891 15.2559 48.8239 19.4031 58.3033 z "
     id="path621"
     sodipodi:nodetypes="cccc"
     transform="matrix(0.665098,0.000000,0.000000,0.665098,26.75834,4.099827)" />
  <path
     style="font-size:12;fill:#f2d0a8;fill-rule:evenodd;stroke-width:1pt;"
     d="M 28.4382 52.5267 C 25.1369 52.6775 14.6017 8.00417 18.6625 10.462 C 19.6179 11.1298 34.3749 52.522 28.4382 52.5267 z "
     id="path622"
     sodipodi:nodetypes="css"
     transform="matrix(0.665098,0.000000,0.000000,0.665098,26.75834,4.099827)" />
  <path
     style="font-size:12;fill:#f2f2f2;fill-rule:evenodd;stroke-width:1pt;"
     d="M 30.5118 54.4523 L 31.1043 61.2656 L 27.6976 62.0062 L 26.2165 54.6003 C 26.2165 54.6003 30.2156 54.1561 30.5118 54.4523 z "
     id="path623"
     sodipodi:nodetypes="ccccc"
     transform="matrix(0.665098,0.000000,0.000000,0.665098,26.75834,4.099827)" />
  <path
     style="font-size:12;fill:url(#linearGradient625);fill-rule:nonzero;stroke-width:1pt;"
     d="M 24.8834 66.4496 C 25.624 63.1911 31.2524 60.9694 33.7703 63.6354 C 39.8431 67.0421 37.177 75.4847 34.5109 75.6328 C 33.7703 86.149 40.8799 80.3724 40.7318 78.1508 C 46.0639 77.4102 41.7686 84.9641 38.2138 84.5197 C 33.326 85.2603 20.2918 80.8169 24.8834 66.4496 z "
     id="path624"
     sodipodi:nodetypes="cccccc"
     transform="matrix(0.665098,0.000000,0.000000,0.665098,26.75834,4.099827)" />
  <path
     transform="matrix(0.978371,0.206859,-0.206859,0.978371,0.000000,0.000000)"
     style="font-size:13;font-weight:bold;fill:#3d4e67;stroke-width:1pt;font-family:Kid Kosmic;"
     d="M 62.1239 61.434 C 62.1155 61.5778 62.1155 61.6498 62.1239 61.6498 C 62.3017 61.6836 62.4836 61.709 62.6698 61.726 C 63.1607 61.8529 63.7489 61.9164 64.4345 61.9164 C 65.5009 61.9164 66.453 61.7386 67.2909 61.3832 C 68.3573 60.9261 69.0132 60.2533 69.2587 59.3646 C 69.3433 59.0599 68.9921 58.8145 68.205 58.6283 C 67.731 58.5183 67.2444 58.4506 66.745 58.4252 C 66.5757 58.4167 66.3557 58.4125 66.0849 58.4125 C 64.4768 58.4125 63.3554 58.6283 62.7206 59.0599 C 62.6952 59.2038 62.5809 59.5974 62.3778 60.2406 C 62.2255 60.7146 62.1408 61.1123 62.1239 61.434 z M 63.4569 56.3939 C 64.7265 56.2162 65.6024 56.0596 66.0849 55.9242 C 67.0751 55.6534 67.8495 55.2302 68.4081 54.6547 C 68.4081 54.6462 68.3489 54.6166 68.2304 54.5658 C 67.8072 54.3965 67.0709 54.3119 66.0214 54.3119 C 65.2004 54.3119 64.5106 54.3796 63.952 54.515 C 63.8336 55.099 63.6685 55.7253 63.4569 56.3939 z M 65.3485 51.8109 C 66.7281 51.7517 67.9638 51.849 69.0556 52.1029 C 70.7821 52.4922 71.5904 53.2116 71.4804 54.2611 C 71.3957 55.0905 70.7694 55.7592 69.6015 56.267 C 70.9387 56.6901 71.6073 57.6042 71.6073 59.0092 C 71.6073 59.4746 71.5354 59.9867 71.3915 60.5453 C 71.1714 61.3747 70.5494 62.0857 69.5253 62.6781 C 68.8905 63.0505 67.9892 63.4229 66.8212 63.7953 C 65.9325 63.8969 65.0862 63.9476 64.2821 63.9476 C 62.4709 63.9476 60.8163 63.6641 59.3183 63.097 C 59.6314 61.6159 60.0123 60.156 60.4608 58.7172 C 60.8755 57.3884 61.1633 56.0469 61.3241 54.6927 C 61.1633 54.3373 61.0829 54.0368 61.0829 53.7914 C 61.0829 53.4698 61.2479 53.1058 61.578 52.6996 C 62.8475 52.1579 64.1044 51.8617 65.3485 51.8109 z M 59.5849 55.4037 C 59.5171 55.7422 59.3013 56.0215 58.9374 56.2416 C 58.6073 56.4532 58.2603 56.559 57.8964 56.559 C 57.4393 56.559 57.0966 56.3177 56.8681 55.8353 C 56.7242 55.4206 56.5761 55.0101 56.4237 54.6039 C 54.2571 54.6039 52.5982 55.1498 51.4472 56.2416 C 50.2792 57.3672 49.6783 58.4506 49.6444 59.4916 C 49.619 60.5072 50.1522 61.2224 51.244 61.6371 C 51.5064 61.7386 51.7984 61.7894 52.12 61.7894 C 53.1949 61.7894 54.6421 61.2689 56.4618 60.2279 C 56.4872 60.1433 56.5168 60.0248 56.5507 59.8724 C 56.3137 59.6439 55.9159 59.5297 55.3573 59.5297 C 54.3248 59.5297 53.398 59.7413 52.577 60.1644 C 52.0946 60.1221 51.7857 59.8555 51.6503 59.3646 C 51.6249 59.2715 51.6122 59.1827 51.6122 59.098 C 51.6122 58.7256 51.8111 58.3955 52.2089 58.1078 C 52.7082 57.5492 53.6308 57.2699 54.9765 57.2699 C 55.3827 57.2699 55.8948 57.2995 56.5126 57.3588 C 57.3251 57.4265 57.7694 57.4646 57.8456 57.473 C 58.7512 57.9301 59.204 58.4421 59.204 59.0092 C 59.204 59.28 59.1236 59.6566 58.9628 60.139 C 58.7258 60.8838 58.3873 61.3832 57.9472 61.6371 C 57.0754 62.2972 56.0556 62.8304 54.8876 63.2367 C 53.6942 63.6514 52.5643 63.8588 51.4979 63.8588 C 49.9406 63.8588 48.7811 63.3679 48.0194 62.3861 C 47.3677 61.5398 47.0419 60.6088 47.0419 59.5931 C 47.0419 59.1446 47.1011 58.6875 47.2196 58.222 C 47.7613 56.1316 49.107 54.5404 51.2567 53.4486 C 53.0849 52.5092 55.1711 52.0648 57.5155 52.1156 C 58.3111 52.2256 58.8612 52.5007 59.1659 52.9408 C 59.4114 53.3047 59.5468 53.9099 59.5722 54.7562 C 59.6229 55.0017 59.6272 55.2175 59.5849 55.4037 z M 35.7811 52.7631 L 35.7431 52.6234 L 35.8319 52.5853 C 35.8996 52.5515 35.9504 52.5303 35.9843 52.5219 C 36.399 52.1156 36.9364 51.9125 37.5966 51.9125 C 37.8336 51.9125 38.0451 51.9463 38.2313 52.014 C 39.6955 51.7686 41.1386 51.6501 42.5604 51.6586 C 44.067 51.667 44.9345 51.9294 45.163 52.4457 C 45.8062 53.8506 46.1278 55.0567 46.1278 56.0638 C 46.1278 56.8933 45.9162 57.6 45.4931 58.184 C 44.6128 59.4027 42.9836 60.1348 40.6054 60.3802 C 41.0793 60.8204 41.7225 61.2054 42.535 61.5355 C 42.9836 61.7133 43.6988 61.9418 44.6806 62.2211 C 44.8244 62.4411 44.8964 62.6527 44.8964 62.8558 C 44.8964 63.2113 44.6975 63.5118 44.2997 63.7572 C 43.995 63.9434 43.6988 64.0365 43.411 64.0365 C 43.2418 64.0365 43.064 64.0069 42.8778 63.9476 C 40.3472 63.2621 38.1425 62.2041 36.2636 60.7738 C 36.1959 61.5355 36.1789 62.2422 36.2128 62.8939 C 36.1535 63.2748 35.9927 63.5922 35.7304 63.8461 C 35.468 64.0915 35.1506 64.2142 34.7782 64.2142 C 34.4143 64.2142 34.0334 64.0238 33.6356 63.6429 C 33.8895 59.809 34.6047 56.1823 35.7811 52.7631 z M 36.6444 58.2094 C 37.2115 58.2771 37.952 58.3109 38.8661 58.3109 C 41.1513 58.294 42.6578 57.8073 43.3856 56.851 C 43.538 56.6478 43.6142 56.4066 43.6142 56.1273 C 43.6142 55.7549 43.4745 55.3064 43.1952 54.7816 C 42.6451 54.4769 42.023 54.3246 41.329 54.3246 C 40.5757 54.3246 39.3824 54.4939 37.7489 54.8324 C 37.2834 55.8819 36.9153 57.0075 36.6444 58.2094 z M 32.8358 61.8402 C 32.8358 62.2634 32.6327 62.6358 32.2265 62.9574 C 31.8287 63.279 31.4013 63.4398 30.9442 63.4398 C 30.775 63.4398 30.6184 63.4144 30.4745 63.3636 C 30.0513 63.1944 29.8397 62.8939 29.8397 62.4623 C 29.8397 62.1661 29.9455 61.8783 30.1571 61.599 C 30.5634 61.0827 31.0712 60.8246 31.6806 60.8246 C 31.8583 60.8246 32.0276 60.8542 32.1884 60.9135 C 32.62 61.0743 32.8358 61.3832 32.8358 61.8402 z "
     id="path1089" />
</svg>
