/* XPM */
static char * frameITR_xpm[] = {
"24 24 29 1",
" 	c None",
".	c #808080",
"+	c #7B7B7B",
"@	c #FCFCFC",
"#	c #FBFBFB",
"$	c #F7F7F7",
"%	c #F3F3F3",
"&	c #F1F1F1",
"*	c #ECECEC",
"=	c #EBEBEB",
"-	c #EAEAEA",
";	c #E9E9E9",
">	c #E7E7E7",
",	c #E8E8E8",
"'	c #E6E6E6",
")	c #E5E5E5",
"!	c #E4E4E4",
"~	c #D9D9D9",
"{	c #DDDDDD",
"]	c #E2E2E2",
"^	c #E1E1E1",
"/	c #EDEDED",
"(	c #F2F2F2",
"_	c #F0F0F0",
":	c #F8F8F8",
"<	c #F5F5F5",
"[	c #FDFDFD",
"}	c #FAFAFA",
"|	c #747474",
".+..+.+..+.+..+.+..+.+..",
"@##@#@##@#@##@#@##@#@##.",
"$$$$$$$$$$$$$$$$$$$$$$$.",
"                     %&.",
"                     **.",
"                     ==.",
"                     -;.",
"                     >>.",
"                     ,>.",
"                     ''.",
"                     )!.",
"                     ~~.",
"                     {{.",
"                     ]^.",
"                     )!.",
"                     =>.",
"                     /*.",
"                     (_.",
"                     :<.",
"                     [}.",
"                     [[.",
"                     }}.",
"                     %%.",
"                     +|."};
