/* XPM */
static char * titleIB_xpm[] = {
"8 21 35 1",
" 	c None",
".	c #F1F1F1",
"+	c #F3F3F3",
"@	c #F2F2F2",
"#	c #ECECEC",
"$	c #EDEDED",
"%	c #EEEEEE",
"&	c #EBEBEB",
"*	c #E9E9E9",
"=	c #EAEAEA",
"-	c #E7E7E7",
";	c #E8E8E8",
">	c #E6E6E6",
",	c #E4E4E4",
"'	c #E5E5E5",
")	c #D9D9D9",
"!	c #DADADA",
"~	c #DBDBDB",
"{	c #DDDDDD",
"]	c #DEDEDE",
"^	c #E1E1E1",
"/	c #E2E2E2",
"(	c #E3E3E3",
"_	c #F0F0F0",
":	c #F5F5F5",
"<	c #F8F8F8",
"[	c #F7F7F7",
"}	c #FAFAFA",
"|	c #FDFDFD",
"1	c #FBFBFB",
"2	c #FCFCFC",
"3	c #747474",
"4	c #7B7B7B",
"5	c #808080",
"6	c #7C7C7C",
".+@@@@@@",
"##$%%$$$",
"&&&&&&&&",
"*====***",
"---;;;;;",
"-;->->>>",
">>>-->>>",
",'>''>>>",
"))!~~~~~",
"{{{]]]]]",
"^/(/////",
",',>>>>>",
"-&;=====",
"#$%_$%%%",
"_@@@.++@",
":<[[<[[[",
"}|12|222",
"||||||||",
"}}}}}}}}",
"++++++++",
"34545666"};
