<?xml version="1.0" encoding="UTF-8" standalone="no"?>
<!DOCTYPE svg PUBLIC "-//W3C//DTD SVG 20010904//EN"
"http://www.w3.org/TR/2001/REC-SVG-20010904/DTD/svg10.dtd">
<!-- Created with Sodipodi ("http://www.sodipodi.com/") -->
<svg
   width="17.036pt"
   height="17.036pt"
   viewBox="0 0 17.036 17.036"
   xml:space="preserve"
   id="svg559"
   sodipodi:version="0.33"
   sodipodi:docname="/usr/share/themes/Debian-BR/metacity-1/wm-max.svg"
   sodipodi:docbase="/usr/share/themes/Debian-BR/metacity-1/"
   xmlns="http://www.w3.org/2000/svg"
   xmlns:sodipodi="http://sodipodi.sourceforge.net/DTD/sodipodi-0.dtd"
   xmlns:xml="http://www.w3.org/XML/1998/namespace"
   xmlns:xlink="http://www.w3.org/1999/xlink"><defs
   id="defs587">
  <radialGradient
   id="aigrd1"
   cx="6.0088"
   cy="5.3652"
   r="10.6059"
   fx="6.0088"
   fy="5.3652"
   gradientUnits="userSpaceOnUse">
			<stop
   offset="0"
   style="stop-color:#2d47a7;stop-opacity:1.0000;"
   id="stop567" />


			<stop
   offset="1"
   style="stop-color:#ffffff;stop-opacity:1.0000;"
   id="stop569" />


			
		</radialGradient>

  <radialGradient
   xlink:href="#aigrd1"
   id="radialGradient1129"
   cx="8.714665"
   cy="8.660093"
   r="9.136143"
   fx="8.714665"
   fy="8.660093" />

<linearGradient
   xlink:href="#aigrd1"
   id="linearGradient600" />
</defs>

<sodipodi:namedview
   id="base" />


	
		<path
   style="font-size:12.000;fill:url(#linearGradient600);"
   d="M 0 8.518000 C 0 13.21500 3.821000 17.03600 8.518000 17.03600 C 13.21500 17.03600 17.03600 13.21600 17.03600 8.518000 C 17.03600 3.821000 13.21500 -0.000000 8.518000 -0.000000 C 3.821000 -0.000000 0 3.821000 0 8.518000 z "
   id="path563" />


		
		<path
   style="font-size:12.000;fill:url(#radialGradient1129);fill-rule:evenodd;"
   d="M15.7,8.433c0,4.013-3.254,7.267-7.266,7.267c-4.014,0-7.268-3.254-7.268-7.267c0-4.013,3.253-7.267,7.268-7.267c4.012,0,7.266,3.253,7.266,7.267z"
   id="path574" />


		
	
<g
   id="max"
   style="font-size:12.000;fill:none;stroke:#ffffff;stroke-width:2.544100;stroke-linecap:butt;stroke-linejoin:miter;">
			<g
   id="g630">
				<path
   style="opacity:0.5;stroke:#000000;"
   d="M5.058,11.268h6.382v-5.9H5.058v5.9z"
   id="path632" />




			</g>




			<g
   id="g635">
				<path
   style="opacity:0.6;"
   d="M5.566,11.778h6.381V5.877H5.566v5.901z"
   id="path637" />




				<path
   style="opacity:0.6;"
   d="M10.877,7.692H5.566"
   id="path639" />




			</g>




			<g
   id="g642">
				<path
   d="M5.312,11.524h6.382V5.623H5.312v5.901z"
   id="path644" />




				<path
   d="M11.694,7.438H5.312"
   id="path646" />




			</g>




		</g>

</svg>
