<?xml version="1.0" encoding="UTF-8" standalone="no"?>
<!DOCTYPE svg PUBLIC "-//W3C//DTD SVG 20010904//EN"
"http://www.w3.org/TR/2001/REC-SVG-20010904/DTD/svg10.dtd">
<!-- Created with Sodipodi ("http://www.sodipodi.com/") -->
<svg
   id="svg596"
   sodipodi:version="0.32"
   width="72pt"
   height="72pt"
   sodipodi:docbase="/home/zeus/desktop/icons/gartoon/svg"
   sodipodi:docname="/home/zeus/desktop/icons/gartoon/svg/gnome-mime-image-x-portable-graymap.svg"
   xmlns="http://www.w3.org/2000/svg"
   xmlns:sodipodi="http://sodipodi.sourceforge.net/DTD/sodipodi-0.dtd"
   xmlns:xlink="http://www.w3.org/1999/xlink">
  <defs
     id="defs598">
    <linearGradient
       id="linearGradient612">
      <stop
         style="stop-color:#7fa8e3;stop-opacity:0.741176;"
         offset="0.000000"
         id="stop613" />
      <stop
         style="stop-color:#ffffff;stop-opacity:0;"
         offset="1.000000"
         id="stop614" />
    </linearGradient>
    <linearGradient
       id="linearGradient626">
      <stop
         style="stop-color:#ff0047;stop-opacity:1;"
         offset="0.000000"
         id="stop627" />
      <stop
         style="stop-color:#ab322d;stop-opacity:0;"
         offset="1.000000"
         id="stop628" />
    </linearGradient>
    <linearGradient
       id="linearGradient618">
      <stop
         style="stop-color:#956d47;stop-opacity:1;"
         offset="0.000000"
         id="stop619" />
      <stop
         style="stop-color:#ab322d;stop-opacity:0;"
         offset="1.000000"
         id="stop620" />
    </linearGradient>
    <linearGradient
       id="linearGradient614">
      <stop
         style="stop-color:#000;stop-opacity:1;"
         offset="0"
         id="stop615" />
      <stop
         style="stop-color:#fff;stop-opacity:1;"
         offset="1"
         id="stop616" />
    </linearGradient>
    <linearGradient
       xlink:href="#linearGradient618"
       id="linearGradient617"
       x1="-0.19608469"
       y1="0.57031226"
       x2="1.07843077"
       y2="0.52343726"
       gradientUnits="objectBoundingBox"
       spreadMethod="pad" />
    <linearGradient
       xlink:href="#linearGradient626"
       id="linearGradient625"
       x1="42.9995728"
       y1="77.3980103"
       x2="28.5382881"
       y2="63.0152588"
       gradientUnits="userSpaceOnUse"
       spreadMethod="pad"
       gradientTransform="matrix(0.934001,0.000000,0.000000,1.070663,-1.516226e-6,-1.716230e-7)" />
    <linearGradient
       xlink:href="#linearGradient612"
       id="linearGradient636"
       x1="16.4110699"
       y1="10.6072874"
       x2="24.6243172"
       y2="61.6665344"
       gradientUnits="userSpaceOnUse"
       spreadMethod="pad" />
  </defs>
  <sodipodi:namedview
     id="base" />
  <g
     id="g898"
     transform="translate(-1.146498,1.146498)">
    <path
       style="fill:#000000;fill-rule:evenodd;stroke:none;stroke-opacity:1;stroke-width:1pt;stroke-linejoin:miter;stroke-linecap:butt;fill-opacity:0.301471;"
       d="M 12.8163 74.753 C 10.3856 73.6481 7.07107 70.1126 8.83884 65.2512 C 9.72267 59.948 25.6326 13.1021 29.1682 10.8924 C 31.3778 8.90368 34.582 8.13026 39.1119 9.34561 C 42.8684 10.2295 76.6769 19.0684 78.6656 20.8361 C 80.6544 22.6039 82.2012 24.0402 80.6544 27.9072 C 79.5496 29.8959 66.4017 74.532 66.1808 77.4047 C 65.2969 80.4983 62.7558 84.2548 58.5573 84.0338 C 54.3589 83.8128 15.9099 75.4159 12.8163 74.753 z "
       id="path794"
       sodipodi:nodetypes="ccccccccc"
       transform="matrix(1.114903,0.000000,0.000000,1.114903,1.287023,-5.035753)" />
    <path
       style="fill:#3d4e67;fill-rule:evenodd;stroke:none;stroke-opacity:1;stroke-width:1pt;stroke-linejoin:miter;stroke-linecap:butt;fill-opacity:1;"
       d="M 12.8163 74.753 C 10.3856 73.6481 7.07107 70.1126 8.83884 65.2512 C 9.72267 59.948 25.6326 13.1021 29.1682 10.8924 C 31.3778 8.90368 34.582 8.13026 39.1119 9.34561 C 42.8684 10.2295 76.6769 19.0684 78.6656 20.8361 C 80.6544 22.6039 82.2012 24.0402 80.6544 27.9072 C 79.5496 29.8959 66.4017 74.532 66.1808 77.4047 C 65.2969 80.4983 62.7558 84.2548 58.5573 84.0338 C 54.3589 83.8128 15.9099 75.4159 12.8163 74.753 z "
       id="path895"
       sodipodi:nodetypes="ccccccccc"
       transform="matrix(1.114903,0.000000,0.000000,1.114903,-1.570116,-9.607182)" />
    <path
       style="fill:#ffffff;fill-rule:evenodd;stroke:none;stroke-opacity:1;stroke-width:1pt;stroke-linejoin:miter;stroke-linecap:butt;fill-opacity:1;"
       d="M 17.8987 70.9965 C 15.3576 70.3336 11.7114 69.6706 13.0373 65.6932 C 15.468 55.9705 27.8424 18.6264 33.1456 13.986 C 34.361 12.8811 38.4489 12.4392 46.1829 14.8699 C 55.0218 17.5215 72.9204 23.4877 74.6882 24.3716 C 76.4559 25.2555 77.1189 25.2555 75.793 29.233 C 73.8043 33.2105 64.9655 67.24 62.7557 72.9852 C 61.209 77.0732 60.8775 78.9514 58.2258 78.9514 "
       id="path896"
       sodipodi:nodetypes="cccccccs"
       transform="matrix(1.114903,0.000000,0.000000,1.114903,-1.570116,-9.607182)" />
    <path
       style="fill:url(#linearGradient636);fill-rule:evenodd;stroke:none;stroke-opacity:1;stroke-width:1pt;stroke-linejoin:miter;stroke-linecap:butt;fill-opacity:1;"
       d="M 28.75 13.75 C 28.75 13.75 31.875 7.49995 39.6875 9.37495 C 47.5 11.25 78.125 19.375 77.8125 21.875 C 77.5 24.375 71.875 39.0625 71.5625 40.3125 C 71.25 41.5625 42.5 40.9375 31.5625 47.5 C 20.625 54.0625 12.5 59.6875 12.5 59.6875 C 12.5 59.6875 23.75 24.6875 28.75 13.75 z "
       id="path636"
       transform="matrix(0.946780,0.000000,0.000000,0.946780,6.111789,-0.736980)" />
  </g>
  <path
     style="font-size:12;fill:#470000;fill-rule:evenodd;stroke-width:1pt;"
     d="M 67.911 66.4866 C 67.911 68.1832 66.4512 69.56 64.6525 69.56 C 62.8537 69.56 61.3939 68.1832 61.3939 66.4866 C 61.3939 64.7901 62.8537 63.4132 64.6525 63.4132 C 66.4512 63.4132 67.911 64.7901 67.911 66.4866 z "
     id="path613"
     transform="matrix(0.665098,0.000000,0.000000,0.665098,26.75834,4.099827)" />
  <path
     style="font-size:12;fill:#470000;fill-rule:evenodd;stroke-width:1pt;"
     d="M 61.2458 74.2998 C 59.6905 72.5223 57.1726 73.4851 56.3579 74.7441 C 55.4692 77.8545 56.8764 80.6687 60.5793 79.3357 C 64.2822 78.0026 65.6152 75.929 65.6152 76.0771 C 65.6152 76.2253 62.6529 84.0754 58.2094 84.6678 C 53.7659 85.2603 51.322 85.4084 46.4342 85.4825 C 41.3983 86.3712 38.9544 86.2971 38.9544 86.2971 L 45.1752 77.4102 C 45.1752 77.4102 46.8045 76.5215 49.4706 72.078 C 52.1367 67.6346 56.8763 66.5977 59.2462 68.0789 C 61.3939 68.9675 62.5788 70.1525 63.1713 72.4483 C 63.0232 74.9662 62.5788 75.929 61.2458 74.2998 z "
     id="path610"
     sodipodi:nodetypes="cccccccccccc"
     transform="matrix(0.665098,0.000000,0.000000,0.665098,26.75834,4.099827)" />
  <path
     style="font-size:12;fill:#230000;fill-opacity:0.99899;fill-rule:evenodd;stroke-width:1pt;"
     d="M 37.9176 76.4474 C 40.1393 77.0399 37.5473 80.2243 36.1402 78.0026 C 35.0293 79.5578 35.5477 75.7809 35.5477 75.7809 L 30.808 85.7046 C 30.808 85.7046 38.9544 88.667 42.0648 84.3716 C 45.1752 80.0763 45.5456 77.8545 43.8423 76.0771 C 41.8426 73.3371 40.0652 74.4479 39.3247 74.8922 C 38.5841 75.3366 38.2879 75.6328 37.9176 76.4474 z "
     id="path609"
     sodipodi:nodetypes="cccccccc"
     transform="matrix(0.665098,0.000000,0.000000,0.665098,26.95536,4.099827)" />
  <path
     style="font-size:12;fill:#230000;fill-rule:evenodd;stroke-width:1pt;"
     d="M 36.1402 62.0062 C 36.1402 62.0062 37.0288 56.674 36.7326 53.8598 C 36.2883 47.787 23.5503 -3.31281 14.071 5.57413 C 3.11042 9.86949 16.1446 58.8957 17.7739 61.7099 C 19.4031 64.5241 21.773 66.5977 21.773 66.5977 C 21.773 66.5977 18.07 83.483 31.9189 85.8527 C 36.9549 76.5215 40.5087 72.8006 39.695 68.5973 C 39.2506 66.2275 38.6582 64.0057 36.1402 62.0062 z "
     id="path608"
     sodipodi:nodetypes="cccccccc"
     transform="matrix(0.665098,0.000000,0.000000,0.665098,26.75834,4.099827)" />
  <path
     style="font-size:12;fill:#f2962c;fill-rule:evenodd;stroke-width:1pt;"
     d="M 19.4031 58.3033 C 22.0692 55.0448 25.0315 52.6749 32.5854 53.4155 C 30.2156 40.2331 21.773 4.68543 15.7002 7.94398 C 8.88697 9.12891 15.2559 48.8239 19.4031 58.3033 z "
     id="path600"
     sodipodi:nodetypes="cccc"
     transform="matrix(0.665098,0.000000,0.000000,0.665098,26.75834,4.099827)" />
  <path
     style="font-size:12;fill:#8b8b8b;fill-rule:evenodd;stroke-width:1pt;"
     d="M 19.8475 59.6363 C 19.8475 59.6363 21.1805 63.9316 24.7353 64.2279 C 26.3646 61.7099 30.0675 61.2656 33.1779 61.4137 C 33.9185 58.5995 34.5109 55.1928 33.326 55.0447 C 31.8449 54.156 23.5504 52.5268 19.8475 59.6363 z "
     id="path601"
     sodipodi:nodetypes="ccccc"
     transform="matrix(0.665098,0.000000,0.000000,0.665098,26.75834,4.099827)" />
  <path
     style="font-size:12;fill:#65532d;fill-rule:evenodd;stroke-width:1pt;"
     d="M 24.8834 66.4496 C 25.624 63.1911 31.2524 60.9694 33.7703 63.6354 C 39.8431 67.0421 37.177 75.4847 34.5109 75.6328 C 33.7703 86.149 40.8799 80.3724 40.7318 78.1508 C 46.0639 77.4102 41.7686 84.9641 38.2138 84.5197 C 33.326 85.2603 20.2918 80.8169 24.8834 66.4496 z "
     id="path602"
     sodipodi:nodetypes="cccccc"
     transform="matrix(0.665098,0.000000,0.000000,0.665098,26.75834,4.099827)" />
  <path
     style="font-size:12;fill:#bc0000;fill-rule:evenodd;stroke-width:1pt;"
     d="M 44.5828 81.2612 C 44.7309 81.4093 46.6564 81.2612 47.6932 79.4838 C 48.73 77.7064 52.2848 70.4487 54.8028 70.3006 C 60.8755 68.0789 60.8755 72.2261 60.8755 72.2261 C 60.8755 72.2261 55.2471 70.1525 54.6546 73.7073 C 54.0622 77.2621 53.0254 79.3357 59.8386 82.1499 C 55.9877 83.4829 43.966 83.74 43.2253 83.74 C 42.4847 83.74 44.7309 81.1131 44.5828 81.2612 z "
     id="path603"
     sodipodi:nodetypes="cccccccc"
     transform="matrix(0.665098,0.000000,0.000000,0.665098,26.75834,4.099827)" />
  <path
     style="font-size:12;fill:#470000;fill-rule:evenodd;stroke-width:1pt;"
     d="M 46.6564 67.6346 C 48.4338 64.9685 54.5806 66.3015 57.3947 65.7091 C 60.8014 64.8204 59.02 58.5954 55.169 58.5955 C 52.5142 58.0648 46.9527 58.1551 46.6564 67.6346 z "
     id="path611"
     sodipodi:nodetypes="cccc"
     transform="matrix(0.665098,0.000000,0.000000,0.665098,26.75834,4.099827)" />
  <path
     style="font-size:12;fill:#bc0000;fill-rule:evenodd;stroke-width:1pt;"
     d="M 48.1376 64.8204 C 48.1376 64.8204 54.5065 64.2279 56.1358 64.2279 C 58.0613 64.6397 58.1915 61.7181 56.5801 60.6731 C 53.766 58.7476 49.9149 58.5995 48.1376 64.8204 z "
     id="path604"
     sodipodi:nodetypes="cccc"
     transform="matrix(0.665098,0.000000,0.000000,0.665098,26.75834,4.099827)" />
  <path
     style="font-size:12;fill:#bc0000;fill-rule:evenodd;stroke-width:1pt;"
     d="M 66.8001 66.5977 C 66.8001 67.7424 65.838 68.6714 64.6524 68.6714 C 63.4669 68.6714 62.5048 67.7424 62.5048 66.5977 C 62.5048 65.4531 63.4669 64.5241 64.6524 64.5241 C 65.838 64.5241 66.8001 65.4531 66.8001 66.5977 z "
     id="path606"
     transform="matrix(0.665098,0.000000,0.000000,0.665098,26.75834,4.099827)" />
  <path
     style="font-size:12;fill:url(#linearGradient617);fill-rule:evenodd;stroke-width:1pt;"
     d="M 19.4031 58.3033 C 22.0692 55.0448 25.0315 52.6749 32.5854 53.4155 C 30.2156 40.2331 21.773 4.68543 15.7002 7.94398 C 8.88697 9.12891 15.2559 48.8239 19.4031 58.3033 z "
     id="path621"
     sodipodi:nodetypes="cccc"
     transform="matrix(0.665098,0.000000,0.000000,0.665098,26.75834,4.099827)" />
  <path
     style="font-size:12;fill:#f2d0a8;fill-rule:evenodd;stroke-width:1pt;"
     d="M 28.4382 52.5267 C 25.1369 52.6775 14.6017 8.00417 18.6625 10.462 C 19.6179 11.1298 34.3749 52.522 28.4382 52.5267 z "
     id="path622"
     sodipodi:nodetypes="css"
     transform="matrix(0.665098,0.000000,0.000000,0.665098,26.75834,4.099827)" />
  <path
     style="font-size:12;fill:#f2f2f2;fill-rule:evenodd;stroke-width:1pt;"
     d="M 30.5118 54.4523 L 31.1043 61.2656 L 27.6976 62.0062 L 26.2165 54.6003 C 26.2165 54.6003 30.2156 54.1561 30.5118 54.4523 z "
     id="path623"
     sodipodi:nodetypes="ccccc"
     transform="matrix(0.665098,0.000000,0.000000,0.665098,26.75834,4.099827)" />
  <path
     style="font-size:12;fill:url(#linearGradient625);fill-rule:nonzero;stroke-width:1pt;"
     d="M 24.8834 66.4496 C 25.624 63.1911 31.2524 60.9694 33.7703 63.6354 C 39.8431 67.0421 37.177 75.4847 34.5109 75.6328 C 33.7703 86.149 40.8799 80.3724 40.7318 78.1508 C 46.0639 77.4102 41.7686 84.9641 38.2138 84.5197 C 33.326 85.2603 20.2918 80.8169 24.8834 66.4496 z "
     id="path624"
     sodipodi:nodetypes="cccccc"
     transform="matrix(0.665098,0.000000,0.000000,0.665098,26.75834,4.099827)" />
  <path
     transform="matrix(0.981115,0.193426,-0.193426,0.981115,0.000000,0.000000)"
     style="font-size:13;font-weight:bold;stroke-width:1pt;font-family:Kid Kosmic;fill:#3d4e67;fill-opacity:0.998774;"
     d="M 69.9227 52.0493 C 69.9142 52.0239 69.9185 51.9858 69.9354 51.9351 C 70.367 51.3765 70.9002 51.0972 71.535 51.0972 C 72.339 51.0972 72.7411 51.3426 72.7411 51.8335 C 72.7411 51.9435 72.7114 52.0662 72.6522 52.2017 C 72.1529 53.4035 71.7424 54.9142 71.4208 56.7339 C 71.1499 58.2404 70.8876 60.0304 70.6336 62.104 C 70.5913 62.4679 70.4348 62.7768 70.1639 63.0308 C 69.8931 63.2762 69.5799 63.3989 69.2245 63.3989 C 68.8521 63.3989 68.4627 63.2043 68.0565 62.8149 C 68.395 61.3761 68.759 59.4803 69.1483 57.1274 C 68.1242 58.2192 67.1043 59.1545 66.0887 59.9331 C 65.7671 60.4748 65.3016 60.7583 64.6922 60.7837 C 64.0236 60.8175 63.6174 60.589 63.4735 60.0981 C 62.8895 58.8625 62.4494 57.4914 62.1532 55.9849 C 61.6115 57.7368 61.3407 59.5395 61.3407 61.3931 C 61.3407 61.63 61.3449 61.8628 61.3534 62.0913 C 61.2857 62.4637 61.1206 62.7768 60.8583 63.0308 C 60.5959 63.2762 60.2827 63.3989 59.9188 63.3989 C 59.5549 63.3989 59.174 63.2085 58.7762 62.8276 C 59.0555 58.9175 59.7749 55.2824 60.9344 51.9224 C 61.3999 51.3045 62.0516 51.0295 62.8895 51.0972 C 63.592 51.1564 63.9432 51.3976 63.9432 51.8208 C 63.9432 51.9224 63.9221 52.0239 63.8797 52.1255 C 64.1506 54.4191 64.688 56.0906 65.492 57.1401 C 66.8462 56.4123 68.3231 54.7153 69.9227 52.0493 z M 58.7127 54.7788 C 58.645 55.1173 58.4292 55.3966 58.0653 55.6167 C 57.7352 55.8283 57.3882 55.9341 57.0243 55.9341 C 56.5672 55.9341 56.2245 55.6929 55.9959 55.2104 C 55.8521 54.7957 55.704 54.3852 55.5516 53.979 C 53.3849 53.979 51.7261 54.5249 50.5751 55.6167 C 49.4071 56.7423 48.8062 57.8257 48.7723 58.8667 C 48.7469 59.8823 49.2801 60.5975 50.3719 61.0122 C 50.6343 61.1138 50.9263 61.1645 51.2479 61.1645 C 52.3228 61.1645 53.77 60.644 55.5897 59.603 C 55.6151 59.5184 55.6447 59.3999 55.6786 59.2476 C 55.4416 59.019 55.0438 58.9048 54.4852 58.9048 C 53.4527 58.9048 52.5259 59.1164 51.7049 59.5395 C 51.2225 59.4972 50.9136 59.2306 50.7782 58.7397 C 50.7528 58.6466 50.7401 58.5578 50.7401 58.4731 C 50.7401 58.1007 50.939 57.7707 51.3368 57.4829 C 51.8361 56.9243 52.7586 56.645 54.1043 56.645 C 54.5106 56.645 55.0226 56.6746 55.6405 56.7339 C 56.453 56.8016 56.8973 56.8397 56.9735 56.8481 C 57.8791 57.3052 58.3319 57.8172 58.3319 58.3843 C 58.3319 58.6551 58.2515 59.0317 58.0907 59.5142 C 57.8537 60.2589 57.5152 60.7583 57.0751 61.0122 C 56.2033 61.6724 55.1834 62.2056 54.0155 62.6118 C 52.8221 63.0265 51.6922 63.2339 50.6258 63.2339 C 49.0685 63.2339 47.909 62.743 47.1473 61.7612 C 46.4956 60.9149 46.1698 59.9839 46.1698 58.9683 C 46.1698 58.5197 46.229 58.0627 46.3475 57.5972 C 46.8892 55.5067 48.2349 53.9155 50.3846 52.8237 C 52.2127 51.8843 54.299 51.4399 56.6434 51.4907 C 57.439 51.6007 57.9891 51.8758 58.2938 52.3159 C 58.5392 52.6798 58.6747 53.285 58.7001 54.1313 C 58.7508 54.3768 58.7551 54.5926 58.7127 54.7788 z M 33.3475 56.6958 C 33.4237 56.3488 33.631 55.5363 33.9696 54.2583 C 34.3335 52.8872 34.5409 52.1805 34.5917 52.1382 C 34.6424 52.2059 34.6721 52.2482 34.6805 52.2651 L 34.7821 51.9097 L 34.8456 51.897 C 35.2603 51.4907 35.7935 51.2876 36.4452 51.2876 C 36.6737 51.2876 36.881 51.3214 37.0672 51.3892 C 38.5484 51.1437 39.9999 51.0252 41.4217 51.0337 C 42.9198 51.0421 43.7873 51.3045 44.0243 51.8208 C 44.659 53.2257 44.9764 54.4403 44.9764 55.4643 C 44.9764 56.7254 44.5067 57.6987 43.5672 58.3843 C 42.2046 59.366 40.0718 59.8569 37.1688 59.8569 C 36.5256 59.8569 35.8485 59.8358 35.1376 59.7934 C 35.0445 60.6398 35.0191 61.4692 35.0614 62.2817 C 34.9937 62.6541 34.8286 62.9673 34.5663 63.2212 C 34.3124 63.4666 34.0034 63.5893 33.6395 63.5893 C 33.2756 63.5893 32.8905 63.3989 32.4842 63.0181 C 32.645 60.7752 32.9328 58.6678 33.3475 56.6958 z M 35.493 57.5845 C 36.0601 57.6522 36.7964 57.686 37.702 57.686 C 39.9956 57.6691 41.5064 57.1824 42.2342 56.2261 C 42.3866 56.0314 42.4627 55.7944 42.4627 55.5151 C 42.4627 55.1343 42.3231 54.6815 42.0438 54.1567 C 41.5021 53.852 40.8758 53.6997 40.1649 53.6997 C 39.4032 53.6997 38.2183 53.869 36.6102 54.2075 C 36.1109 55.2993 35.7385 56.425 35.493 57.5845 z M 31.6844 61.2153 C 31.6844 61.6385 31.4813 62.0109 31.0751 62.3325 C 30.6773 62.6541 30.2499 62.8149 29.7928 62.8149 C 29.6236 62.8149 29.467 62.7895 29.3231 62.7388 C 28.8999 62.5695 28.6883 62.269 28.6883 61.8374 C 28.6883 61.5412 28.7941 61.2534 29.0057 60.9741 C 29.412 60.4578 29.9198 60.1997 30.5292 60.1997 C 30.7069 60.1997 30.8762 60.2293 31.037 60.2886 C 31.4686 60.4494 31.6844 60.7583 31.6844 61.2153 z "
     id="path1031" />
</svg>
