/* XPM */
static char * xchat_16x16_xpm[] = {
"16 16 90 1",
" 	c None",
".	c #595000",
"+	c #827500",
"@	c #685D00",
"#	c #332B00",
"$	c #FBD600",
"%	c #FED800",
"&	c #947D00",
"*	c #453A00",
"=	c #050400",
"-	c #BB9400",
";	c #FEC800",
">	c #947300",
",	c #8A6C00",
"'	c #BE9700",
")	c #100D00",
"!	c #0E0A00",
"~	c #BE8B00",
"{	c #FEB800",
"]	c #946A00",
"^	c #775500",
"/	c #BE7F00",
"(	c #FEA900",
"_	c #915F00",
":	c #744C00",
"<	c #0E0900",
"[	c #BE7300",
"}	c #FE9900",
"|	c #6D6E73",
"1	c #D87500",
"2	c #FE8900",
"3	c #E87D00",
"4	c #0B0600",
"5	c #787E87",
"6	c #969AA1",
"7	c #999CA2",
"8	c #9B9EA4",
"9	c #717478",
"0	c #A2A6AD",
"a	c #D4AC85",
"b	c #D6AD87",
"c	c #E49D5A",
"d	c #DAB189",
"e	c #94908E",
"f	c #A4A5A7",
"g	c #96989C",
"h	c #B4B6B9",
"i	c #8D8E8E",
"j	c #000000",
"k	c #6D5647",
"l	c #90908E",
"m	c #542100",
"n	c #785B47",
"o	c #91918D",
"p	c #DBDAD3",
"q	c #381600",
"r	c #421900",
"s	c #93928B",
"t	c #95938B",
"u	c #989588",
"v	c #989688",
"w	c #BB825A",
"x	c #66645A",
"y	c #D14A00",
"z	c #514132",
"A	c #676559",
"B	c #9C9986",
"C	c #9C9885",
"D	c #686658",
"E	c #6B685B",
"F	c #7B2200",
"G	c #A92F00",
"H	c #C63800",
"I	c #7A2200",
"J	c #1C0900",
"K	c #681D00",
"L	c #772100",
"M	c #450F00",
"N	c #FE3A00",
"O	c #D13000",
"P	c #1C0700",
"Q	c #0E0300",
"R	c #BE2C00",
"S	c #050100",
"T	c #A51B00",
"U	c #CE2200",
"V	c #1C0500",
"W	c #0E0200",
"X	c #BB1F00",
"Y	c #100200",
"                ",
"  .+        +@  ",
" #$%&      &%%* ",
" =-;;>    ,;;') ",
"  !~{{]  ^{{~!  ",
"   !/((_:((/!   ",
"    <[}}}}[<    ",
"     |12234   5 ",
" 67890abcdefg h ",
" ijjklmnopqrs t ",
" uvvwxyzABCCD E ",
" jFGHIJ  jKGGLj ",
" MNNOP    QRNNM ",
" STUV      WXXY ",
"                ",
"                "};
