<?xml version="1.0" encoding="UTF-8" standalone="no"?>
<!DOCTYPE svg PUBLIC "-//W3C//DTD SVG 20010904//EN"
"http://www.w3.org/TR/2001/REC-SVG-20010904/DTD/svg10.dtd">
<!-- Created with Sodipodi ("http://www.sodipodi.com/") -->
<svg
   id="svg604"
   sodipodi:version="0.32"
   width="72pt"
   height="72pt"
   sodipodi:docbase="/home/zeus/.icons/gartoon/scalable/mimetypes/"
   sodipodi:docname="/home/zeus/.icons/gartoon/scalable/mimetypes/gnome-mime-x-ms-wmv.svg"
   xmlns="http://www.w3.org/2000/svg"
   xmlns:sodipodi="http://sodipodi.sourceforge.net/DTD/sodipodi-0.dtd"
   xmlns:xlink="http://www.w3.org/1999/xlink">
  <defs
     id="defs606">
    <linearGradient
       id="linearGradient575">
      <stop
         style="stop-color:#de8a17;stop-opacity:0.741176;"
         offset="0.000000"
         id="stop576" />
      <stop
         style="stop-color:#1ac5aa;stop-opacity:0.929412;"
         offset="1.000000"
         id="stop577" />
    </linearGradient>
    <linearGradient
       id="linearGradient612">
      <stop
         style="stop-color:#7fa8e3;stop-opacity:0.741176;"
         offset="0.000000"
         id="stop613" />
      <stop
         style="stop-color:#ffffff;stop-opacity:0;"
         offset="1.000000"
         id="stop614" />
    </linearGradient>
    <linearGradient
       xlink:href="#linearGradient612"
       id="linearGradient615"
       x1="50.6438866"
       y1="5.36792946"
       x2="35.7520943"
       y2="68.0443573"
       gradientUnits="userSpaceOnUse"
       spreadMethod="pad" />
    <linearGradient
       xlink:href="#linearGradient575"
       id="linearGradient574"
       x1="38.7992325"
       y1="47.4790993"
       x2="23.6706333"
       y2="51.0043793"
       gradientUnits="userSpaceOnUse"
       spreadMethod="pad"
       gradientTransform="scale(1.044094,0.957768)" />
    <linearGradient
       xlink:href="#linearGradient575"
       id="linearGradient578"
       x1="1.32557678"
       y1="0.18749924"
       x2="0.82945710"
       y2="0.34375003"
       gradientUnits="objectBoundingBox"
       spreadMethod="pad" />
  </defs>
  <sodipodi:namedview
     id="base" />
  <path
     style="fill:#000000;fill-rule:evenodd;stroke:none;stroke-opacity:1;stroke-width:1pt;stroke-linejoin:miter;stroke-linecap:butt;fill-opacity:0.301471;"
     d="M 12.8163 74.753 C 10.3856 73.6481 7.07107 70.1126 8.83884 65.2512 C 9.72267 59.948 25.6326 13.1021 29.1682 10.8924 C 31.3778 8.90368 34.582 8.13026 39.1119 9.34561 C 42.8684 10.2295 76.6769 19.0684 78.6656 20.8361 C 80.6544 22.6039 82.2012 24.0402 80.6544 27.9072 C 79.5496 29.8959 66.4017 74.532 66.1808 77.4047 C 65.2969 80.4983 62.7558 84.2548 58.5573 84.0338 C 54.3589 83.8128 15.9099 75.4159 12.8163 74.753 z "
     id="path794"
     sodipodi:nodetypes="ccccccccc"
     transform="matrix(1.114903,0.000000,0.000000,1.114903,-5.305332,-3.889256)" />
  <path
     style="fill:#3d4e67;fill-rule:evenodd;stroke:none;stroke-opacity:1;stroke-width:1pt;stroke-linejoin:miter;stroke-linecap:butt;fill-opacity:1;"
     d="M 12.8163 74.753 C 10.3856 73.6481 7.07107 70.1126 8.83884 65.2512 C 9.72267 59.948 25.6326 13.1021 29.1682 10.8924 C 31.3778 8.90368 34.582 8.13026 39.1119 9.34561 C 42.8684 10.2295 76.6769 19.0684 78.6656 20.8361 C 80.6544 22.6039 82.2012 24.0402 80.6544 27.9072 C 79.5496 29.8959 66.4017 74.532 66.1808 77.4047 C 65.2969 80.4983 62.7558 84.2548 58.5573 84.0338 C 54.3589 83.8128 15.9099 75.4159 12.8163 74.753 z "
     id="path609"
     sodipodi:nodetypes="ccccccccc"
     transform="matrix(1.114903,0.000000,0.000000,1.114903,-8.162471,-8.460684)" />
  <path
     style="fill:#ffffff;fill-rule:evenodd;stroke:none;stroke-opacity:1;stroke-width:1pt;stroke-linejoin:miter;stroke-linecap:butt;fill-opacity:1;"
     d="M 17.8987 70.9965 C 15.3576 70.3336 11.7114 69.6706 13.0373 65.6932 C 15.468 55.9705 27.8424 18.6264 33.1456 13.986 C 34.361 12.8811 38.4489 12.4392 46.1829 14.8699 C 55.0218 17.5215 72.9204 23.4877 74.6882 24.3716 C 76.4559 25.2555 77.1189 25.2555 75.793 29.233 C 73.8043 33.2105 64.9655 67.24 62.7557 72.9852 C 61.209 77.0732 60.8775 78.9514 58.2258 78.9514 "
     id="path608"
     sodipodi:nodetypes="cccccccs"
     transform="matrix(1.114903,0.000000,0.000000,1.114903,-8.162471,-8.460684)" />
  <path
     style="fill:url(#linearGradient615);fill-rule:evenodd;stroke:none;stroke-opacity:1;stroke-width:1pt;stroke-linejoin:miter;stroke-linecap:butt;fill-opacity:1;"
     d="M 28.75 13.75 C 28.75 13.75 31.875 7.49995 39.6875 9.37495 C 47.5 11.25 78.125 19.375 77.8125 21.875 C 77.5 24.375 71.875 39.0625 71.5625 40.3125 C 71.25 41.5625 42.5 40.9375 31.5625 47.5 C 20.625 54.0625 12.5 59.6875 12.5 59.6875 C 12.5 59.6875 23.75 24.6875 28.75 13.75 z "
     id="path636"
     transform="matrix(0.946780,0.000000,0.000000,0.946780,-0.480566,0.409517)" />
  <path
     style="font-size:12;fill-rule:evenodd;stroke-width:1pt;"
     d="M 67.7143 20.8571 C 67.9048 22 69.5094 24.7591 69.6999 25.9019 C 67.8904 26.5686 66.6869 27.5383 64.8774 28.205 C 66.4012 34.9669 67.319 38.7993 68.8428 45.5612 C 70.9612 45.2034 72.2713 44.0374 73.7836 42.6695 C 74.0693 44.2886 74.7591 46.6147 75.0448 48.2338 C 60.0003 57.6914 35.2584 67.149 12.2338 67.2122 C 11.7576 65.7836 12.1905 63.1428 11.7143 61.7143 C 13.9221 61.7489 14.6147 61.5816 16.5195 61.3132 C 15.3766 55.5989 14.6377 49.1776 13.4949 43.4633 C 11.2929 43.6307 10.404 43.4949 8.10106 43.5612 C 7.72009 41.5612 7.52382 40.2857 7.14286 38.2857 C 30.4762 36.1905 49.5238 30.9523 67.7143 20.8571 z "
     id="path559"
     sodipodi:nodetypes="ccccccccccccc"
     transform="translate(5.142860,-12.00001)" />
  <path
     style="font-size:12;fill:#f1e36c;fill-rule:evenodd;stroke-width:1pt;fill-opacity:1;"
     d="M 20.9102 59.3924 C 27.3752 59.7628 33.5371 57.9108 39.295 56.0588 C 38.0491 49.4591 37.0053 46.3951 35.7594 39.7954 C 30.3383 42.0851 24.21 43.2636 17.8797 43.533 "
     id="path560"
     sodipodi:nodetypes="cccc"
     transform="translate(5.142860,-12.00001)" />
  <path
     style="font-size:12;fill:#f1e36c;fill-rule:evenodd;stroke-width:1pt;fill-opacity:1;"
     d="M 22.2234 60.6046 C 30.4056 59.6618 35.6583 56.0926 40.8102 53.2304 C 39.5643 46.6307 38.2174 44.6778 36.9715 38.0781 C 31.2474 40.9739 24.4122 43.9706 18.2839 44.7451 "
     id="path561"
     sodipodi:nodetypes="cccc"
     transform="translate(27.97231,-18.06092)" />
  <path
     transform="matrix(0.989443,-0.144927,0.146771,0.989170,0.147348,-9.823467)"
     style="font-size:12;fill:#ffffff;fill-rule:evenodd;stroke-width:1pt;"
     d="M 17.3956 62.593 C 17.3956 63.8494 17.5098 64.9108 17.5098 66.1672 C 19.3789 66.1672 21.1337 66.3623 23.0229 66.0599 C 23.0229 64.8035 23.0027 63.8494 23.0027 62.593 C 21.2076 63.0027 19.2445 62.8954 17.3956 62.593 z "
     id="path563"
     sodipodi:nodetypes="ccccc" />
  <path
     transform="matrix(0.965794,-0.259313,0.261113,0.965308,3.265204,-8.097851)"
     style="font-size:12;fill:#ffffff;fill-rule:evenodd;stroke-width:1pt;"
     d="M 17.3956 62.593 C 17.3956 63.8494 17.5098 64.9108 17.5098 66.1672 C 19.3789 66.1672 21.1337 66.3623 23.0229 66.0599 C 23.0229 64.8035 23.0027 63.8494 23.0027 62.593 C 21.2076 63.0027 19.2445 62.8954 17.3956 62.593 z "
     id="path564"
     sodipodi:nodetypes="ccccc" />
  <path
     transform="matrix(0.965794,-0.259313,0.261113,0.965308,12.35658,-10.52221)"
     style="font-size:12;fill:#ffffff;fill-rule:evenodd;stroke-width:1pt;"
     d="M 17.3956 62.593 C 17.3956 63.8494 17.5098 64.9108 17.5098 66.1672 C 19.3789 66.1672 21.1337 66.3623 23.0229 66.0599 C 23.0229 64.8035 23.0027 63.8494 23.0027 62.593 C 21.2076 63.0027 19.2445 62.8954 17.3956 62.593 z "
     id="path565"
     sodipodi:nodetypes="ccccc" />
  <path
     transform="matrix(0.965794,-0.259313,0.261113,0.965308,21.44796,-13.24963)"
     style="font-size:12;fill:#ffffff;fill-rule:evenodd;stroke-width:1pt;"
     d="M 17.3956 62.593 C 17.3956 63.8494 17.5098 64.9108 17.5098 66.1672 C 19.3789 66.1672 21.1337 66.3623 23.0229 66.0599 C 23.0229 64.8035 23.0027 63.8494 23.0027 62.593 C 21.2076 63.0027 19.2445 62.8954 17.3956 62.593 z "
     id="path566"
     sodipodi:nodetypes="ccccc" />
  <path
     transform="matrix(0.965794,-0.259313,0.261113,0.965308,21.44796,-13.24963)"
     style="font-size:12;fill:#ffffff;fill-rule:evenodd;stroke-width:1pt;"
     d="M 17.3956 62.593 C 17.3956 63.8494 17.5098 64.9108 17.5098 66.1672 C 19.3789 66.1672 21.1337 66.3623 23.0229 66.0599 C 23.0229 64.8035 23.0027 63.8494 23.0027 62.593 C 21.2076 63.0027 19.2445 62.8954 17.3956 62.593 z "
     id="path567"
     sodipodi:nodetypes="ccccc" />
  <path
     transform="matrix(0.965794,-0.259313,0.261113,0.965308,30.03426,-16.78517)"
     style="font-size:12;fill:#ffffff;fill-rule:evenodd;stroke-width:1pt;"
     d="M 17.3956 62.593 C 17.3956 63.8494 17.5098 64.9108 17.5098 66.1672 C 19.3789 66.1672 21.1337 66.3623 23.0229 66.0599 C 23.0229 64.8035 23.0027 63.8494 23.0027 62.593 C 21.2076 63.0027 19.2445 62.8954 17.3956 62.593 z "
     id="path568"
     sodipodi:nodetypes="ccccc" />
  <path
     transform="matrix(0.989443,-0.144927,0.146771,0.989170,-4.297325,-32.65293)"
     style="font-size:12;fill:#ffffff;fill-rule:evenodd;stroke-width:1pt;"
     d="M 17.3956 62.593 C 17.3956 63.8494 17.5098 64.9108 17.5098 66.1672 C 19.3789 66.1672 21.1337 66.3623 23.0229 66.0599 C 23.0229 64.8035 23.0027 63.8494 23.0027 62.593 C 21.2076 63.0027 19.2445 62.8954 17.3956 62.593 z "
     id="path569"
     sodipodi:nodetypes="ccccc" />
  <path
     transform="matrix(0.965794,-0.259313,0.261113,0.965308,-1.179469,-30.92732)"
     style="font-size:12;fill:#ffffff;fill-rule:evenodd;stroke-width:1pt;"
     d="M 17.3956 62.593 C 17.3956 63.8494 17.5098 64.9108 17.5098 66.1672 C 19.3789 66.1672 21.1337 66.3623 23.0229 66.0599 C 23.0229 64.8035 23.0027 63.8494 23.0027 62.593 C 21.2076 63.0027 19.2445 62.8954 17.3956 62.593 z "
     id="path570"
     sodipodi:nodetypes="ccccc" />
  <path
     transform="matrix(0.965794,-0.259313,0.261113,0.965308,7.911911,-33.35167)"
     style="font-size:12;fill:#ffffff;fill-rule:evenodd;stroke-width:1pt;"
     d="M 17.3956 62.593 C 17.3956 63.8494 17.5098 64.9108 17.5098 66.1672 C 19.3789 66.1672 21.1337 66.3623 23.0229 66.0599 C 23.0229 64.8035 23.0027 63.8494 23.0027 62.593 C 21.2076 63.0027 19.2445 62.8954 17.3956 62.593 z "
     id="path571"
     sodipodi:nodetypes="ccccc" />
  <path
     transform="matrix(0.965794,-0.259313,0.261113,0.965308,17.00329,-36.07908)"
     style="font-size:12;fill:#ffffff;fill-rule:evenodd;stroke-width:1pt;"
     d="M 17.3956 62.593 C 17.3956 63.8494 17.5098 64.9108 17.5098 66.1672 C 19.3789 66.1672 21.1337 66.3623 23.0229 66.0599 C 23.0229 64.8035 23.0027 63.8494 23.0027 62.593 C 21.2076 63.0027 19.2445 62.8954 17.3956 62.593 z "
     id="path572"
     sodipodi:nodetypes="ccccc" />
  <path
     transform="matrix(0.965794,-0.259313,0.261113,0.965308,25.58959,-39.61462)"
     style="font-size:12;fill:#ffffff;fill-rule:evenodd;stroke-width:1pt;"
     d="M 17.3956 62.593 C 17.3956 63.8494 17.5098 64.9108 17.5098 66.1672 C 19.3789 66.1672 21.1337 66.3623 23.0229 66.0599 C 23.0229 64.8035 23.0027 63.8494 23.0027 62.593 C 21.2076 63.0027 19.2445 62.8954 17.3956 62.593 z "
     id="path573"
     sodipodi:nodetypes="ccccc" />
  <path
     transform="matrix(0.976669,0.214749,-0.214749,0.976669,0.000000,0.000000)"
     style="font-size:12;font-weight:bold;fill:#3d4e67;stroke-width:1pt;font-family:Kid Kosmic;"
     d="M 59.2149 51.8027 C 59.6602 51.8027 59.9414 52.0214 60.0586 52.4589 C 60.0586 54.4199 60.1094 55.8105 60.211 56.6308 C 60.4375 58.4277 60.8985 59.4628 61.5938 59.7363 C 62.3516 59.4003 63.2969 58.2792 64.4297 56.373 C 64.9141 55.5605 65.6368 54.1972 66.5977 52.2831 C 66.8477 52.0488 67.0977 51.9316 67.3477 51.9316 C 67.6211 51.9316 67.8672 52.0292 68.086 52.2245 C 68.3047 52.412 68.4141 52.6386 68.4141 52.9042 C 68.4141 53.1074 68.3282 53.3339 68.1563 53.5839 C 66.9297 56.2558 64.9844 59.1738 62.3204 62.3378 C 61.8672 62.7363 61.4493 62.9355 61.0664 62.9355 C 60.7227 62.9355 60.4063 62.7792 60.1172 62.4667 C 58.6641 60.2558 57.8399 57.205 57.6446 53.3144 C 57.5899 52.9316 57.7461 52.58 58.1133 52.2597 C 58.4493 51.955 58.8164 51.8027 59.2149 51.8027 z M 54.0586 52.5761 C 54.0508 52.5527 54.0547 52.5175 54.0704 52.4706 C 54.4688 51.955 54.961 51.6972 55.5469 51.6972 C 56.2891 51.6972 56.6602 51.9238 56.6602 52.3769 C 56.6602 52.4784 56.6329 52.5917 56.5782 52.7167 C 56.1172 53.8261 55.7383 55.2206 55.4414 56.9003 C 55.1914 58.2909 54.9493 59.9433 54.7149 61.8574 C 54.6758 62.1933 54.5313 62.4784 54.2813 62.7128 C 54.0313 62.9394 53.7422 63.0527 53.4141 63.0527 C 53.0704 63.0527 52.711 62.873 52.336 62.5136 C 52.6485 61.1855 52.9844 59.4355 53.3438 57.2636 C 52.3985 58.2714 51.4571 59.1347 50.5196 59.8534 C 50.2227 60.3534 49.793 60.6152 49.2305 60.6386 C 48.6133 60.6699 48.2383 60.4589 48.1055 60.0058 C 47.5664 58.8652 47.1602 57.5995 46.8868 56.2089 C 46.3868 57.8261 46.1368 59.4902 46.1368 61.2011 C 46.1368 61.4199 46.1407 61.6347 46.1485 61.8456 C 46.086 62.1894 45.9336 62.4784 45.6914 62.7128 C 45.4493 62.9394 45.1602 63.0527 44.8243 63.0527 C 44.4883 63.0527 44.1368 62.8769 43.7696 62.5253 C 44.0274 58.9159 44.6914 55.5605 45.7618 52.4589 C 46.1914 51.8886 46.793 51.6347 47.5664 51.6972 C 48.2149 51.7519 48.5391 51.9745 48.5391 52.3652 C 48.5391 52.4589 48.5196 52.5527 48.4805 52.6464 C 48.7305 54.7636 49.2266 56.3066 49.9688 57.2753 C 51.2188 56.6034 52.5821 55.037 54.0586 52.5761 z M 43.1016 57.1464 C 42.7266 58.787 42.2461 60.4941 41.6602 62.2675 C 41.2539 62.8066 40.711 63.0683 40.0313 63.0527 C 39.3047 63.0449 38.9258 62.8261 38.8946 62.3964 C 38.2774 61.0761 37.7618 59.5566 37.3477 57.8378 C 36.3789 59.4706 35.0235 61.0019 33.2813 62.4316 C 32.8594 62.9863 32.3047 63.2324 31.6172 63.1699 C 31.0313 63.1152 30.7383 62.9003 30.7383 62.5253 C 30.7383 62.4159 30.7657 62.2988 30.8204 62.1738 C 31.2735 61.0409 31.6329 59.6425 31.8985 57.9784 C 32.1641 56.3066 32.3789 54.6581 32.543 53.0331 C 32.5899 52.6269 32.7852 52.3066 33.1289 52.0722 C 33.4414 51.8613 33.8008 51.7558 34.2071 51.7558 C 34.5508 51.7558 34.836 51.8378 35.0625 52.0019 C 35.2969 52.1659 35.3985 52.3925 35.3672 52.6816 C 35.0469 54.0097 34.5899 56.0097 33.9961 58.6816 C 34.9414 57.7363 35.8672 56.5097 36.7735 55.0019 C 37.0782 54.4863 37.5079 54.2089 38.0625 54.1699 C 38.6719 54.123 39.0547 54.3339 39.211 54.8027 L 39.6094 57.7324 C 39.7266 58.5683 39.9766 59.3066 40.3594 59.9472 C 40.8985 58.5644 41.168 56.7324 41.168 54.4511 C 41.168 53.9667 41.1563 53.455 41.1329 52.9159 C 41.1875 52.5409 41.3672 52.2402 41.6719 52.0136 C 41.961 51.8105 42.2969 51.7089 42.6797 51.7089 C 43.0547 51.7089 43.4297 51.8691 43.8047 52.1894 C 43.711 53.8456 43.4766 55.498 43.1016 57.1464 z M 30.2579 61.037 C 30.2579 61.4277 30.0704 61.7714 29.6954 62.0683 C 29.3282 62.3652 28.9336 62.5136 28.5118 62.5136 C 28.3555 62.5136 28.211 62.4902 28.0782 62.4433 C 27.6875 62.287 27.4922 62.0097 27.4922 61.6113 C 27.4922 61.3378 27.5899 61.0722 27.7852 60.8144 C 28.1602 60.3378 28.6289 60.0995 29.1914 60.0995 C 29.3555 60.0995 29.5118 60.1269 29.6602 60.1816 C 30.0586 60.33 30.2579 60.6152 30.2579 61.037 z "
     id="path629" />
</svg>
