/* XPM */
static char * menuButtonA_xpm[] = {
"26 42 133 2",
"  	c None",
". 	c #B8D4F0",
"+ 	c #A9CBEC",
"@ 	c #A3C7EC",
"# 	c #A0C6EC",
"$ 	c #97BFEB",
"% 	c #737373",
"& 	c #5A5A52",
"* 	c #4A4A4A",
"= 	c #525252",
"- 	c #5A5A5A",
"; 	c #7B7B7B",
"> 	c #96C0EB",
", 	c #6B6B6B",
"' 	c #949494",
") 	c #D6D6D6",
"! 	c #EFEFEF",
"~ 	c #F7F7F7",
"{ 	c #DEDEDE",
"] 	c #636363",
"^ 	c #91BDEB",
"/ 	c #848484",
"( 	c #CECECE",
"_ 	c #FFFFFF",
": 	c #90BEEB",
"< 	c #ADADAD",
"[ 	c #C6C6C6",
"} 	c #68A7E6",
"| 	c #BDBDBD",
"1 	c #B5B5B5",
"2 	c #8C8C8C",
"3 	c #71ACEB",
"4 	c #E7E7E7",
"5 	c #79B3EF",
"6 	c #7DB6F1",
"7 	c #84BDF7",
"8 	c #8AC2FE",
"9 	c #424242",
"0 	c #393939",
"a 	c #93CAFF",
"b 	c #99D0FF",
"c 	c #9FD7FF",
"d 	c #A4DAFD",
"e 	c #A6DDFA",
"f 	c #A8DEF3",
"g 	c #0852B5",
"h 	c #6B6BA5",
"i 	c #292984",
"j 	c #000084",
"k 	c #00088C",
"l 	c #00008C",
"m 	c #29298C",
"n 	c #6B6BAD",
"o 	c #393994",
"p 	c #2942AD",
"q 	c #738CCE",
"r 	c #ADB5E7",
"s 	c #B5C6E7",
"t 	c #B5CEEF",
"u 	c #ADBDE7",
"v 	c #B5BDE7",
"w 	c #ADB5DE",
"x 	c #7B94D6",
"y 	c #294AB5",
"z 	c #31398C",
"A 	c #4A4A8C",
"B 	c #0031A5",
"C 	c #4A8CCE",
"D 	c #8CB5DE",
"E 	c #9CBDE7",
"F 	c #94BDDE",
"G 	c #94BDE7",
"H 	c #9CBDEF",
"I 	c #94B5DE",
"J 	c #528CCE",
"K 	c #0029A5",
"L 	c #97BFE7",
"M 	c #183994",
"N 	c #216BC6",
"O 	c #639CD6",
"P 	c #7BADDE",
"Q 	c #84ADE7",
"R 	c #73A5DE",
"S 	c #84ADDE",
"T 	c #103994",
"U 	c #0842AD",
"V 	c #397BCE",
"W 	c #4284CE",
"X 	c #4A8CD6",
"Y 	c #4A94DE",
"Z 	c #428CD6",
"` 	c #4A8CDE",
" .	c #317BCE",
"..	c #0039A5",
"+.	c #215AA5",
"@.	c #5294DE",
"#.	c #5A9CE7",
"$.	c #5AA5E7",
"%.	c #63A5EF",
"&.	c #63A5F7",
"*.	c #5AA5EF",
"=.	c #63ADF7",
"-.	c #5294E7",
";.	c #5A9CDE",
">.	c #18529C",
",.	c #39638C",
"'.	c #5294D6",
").	c #63A5E7",
"!.	c #6BADEF",
"~.	c #7BBDFF",
"{.	c #73BDFF",
"].	c #7BC6FF",
"^.	c #73C6FF",
"/.	c #73B5F7",
"(.	c #639CDE",
"_.	c #42638C",
":.	c #6B737B",
"<.	c #426B9C",
"[.	c #8CCEFF",
"}.	c #8CD6FF",
"|.	c #94DEFF",
"1.	c #94D6FF",
"2.	c #63737B",
"3.	c #5A6B73",
"4.	c #426B8C",
"5.	c #639CC6",
"6.	c #84CEF7",
"7.	c #94E7FF",
"8.	c #9CEFFF",
"9.	c #9CE7FF",
"0.	c #94EFFF",
"a.	c #639CBD",
"b.	c #5A6373",
". . . . . . . . . . . . . . . . . . . . . . . . . . ",
"+ + + + + + + + + + + + + + + + + + + + + + + + + + ",
"@ @ @ @ @ @ @ @ @ @ @ @ @ @ @ @ @ @ @ @ @ @ @ @ @ @ ",
"# # # # # # # # # # # # # # # # # # # # # # # # # # ",
"$ $ $ $ $ % & * = = = - = = * - = = * = ; $ $ $ $ $ ",
"> > > > , ' ) ! ~ ~ ~ ~ ~ ~ ~ ~ ~ ~ ! { ' ] > > > > ",
"^ ^ ^ , / ( ! ~ ~ ! ~ ! ~ ! _ ! ! ~ ~ ! ( / , ^ ^ ^ ",
": : : % < ( ) ) ) { { ) ) { ) ) { ) { ) [ < % : : : ",
"} } } ' | [ [ ( ( ( ( [ ( [ [ ( [ ( ( [ [ 1 2 } } } ",
"3 3 3 2 ( ( ) { { 4 { { { { 4 { { { ) ) ) ( 2 3 3 3 ",
"5 5 5 ; [ { 4 ~ _ ~ ~ _ ~ ~ ~ ~ ~ ~ ~ 4 ) ( / 5 5 5 ",
"6 6 6 ; ' { ! _ _ _ _ _ _ _ _ _ _ _ _ ! { ' ; 6 6 6 ",
"7 7 7 7 , / [ ~ _ _ _ _ _ _ _ _ _ _ ~ | / , 7 7 7 7 ",
"8 8 8 8 8 % = 9 0 0 0 0 0 0 0 0 0 0 9 * % 8 8 8 8 8 ",
"a a a a a a a a a a a a a a a a a a a a a a a a a a ",
"b b b b b b b b b b b b b b b b b b b b b b b b b b ",
"c c c c c c c c c c c c c c c c c c c c c c c c c c ",
"d d d d d d d d d d d d d d d d d d d d d d d d d d ",
"e e e e e e e e e e e e e e e e e e e e e e e e e e ",
"f f f f f f f f f f f f f f f f f f f f f f f f f f ",
"g g g g g g g g g g g g g g g g g g g g g g g g g g ",
". . . . . . . . . . . . . . . . . . . . . . . . . . ",
"+ + + + + + + + + + + + + + + + + + + + + + + + + + ",
"@ @ @ @ @ @ @ @ @ @ @ @ @ @ @ @ @ @ @ @ @ @ @ @ @ @ ",
"# # # # # # # # # # # # # # # # # # # # # # # # # # ",
"$ $ $ $ $ $ $ $ $ $ $ $ $ $ $ $ $ $ $ $ $ $ $ $ $ $ ",
"> > > > > h i j j j j k j j j l j l j m n > > > > > ",
"^ ^ ^ ^ o p q r s t s u s s v s s s w x y z ^ ^ ^ ^ ",
": : : A B C D E E F G E E F H I E E G D J K A L : : ",
"} } } M N O P P P P Q R P S R P P P P R O N T } } } ",
"3 3 3 U V W W X Y X X X X Z Z ` X X X W W  ...3 3 3 ",
"5 5 5 +.X @.#.$.%.&.*.%.=.*.&.%.*.%.-.;.;.X >.5 5 5 ",
"6 6 6 ,.'.).!.~.~.{.].].{.^.~.~.~.].{./.(.'._.6 6 6 ",
"7 7 7 :.<.!.~.[.}.|.|.}.}.}.}.}.|.[.1.~.!.<.2.7 7 7 ",
"8 8 8 8 3.4.5.6.7.8.|.9.8.7.7.7.7.0.6.a.4.b.8 8 8 8 ",
"a a a a a % = 9 0 0 0 0 0 0 0 0 0 0 9 * % a a a a a ",
"b b b b b b b b b b b b b b b b b b b b b b b b b b ",
"c c c c c c c c c c c c c c c c c c c c c c c c c c ",
"d d d d d d d d d d d d d d d d d d d d d d d d d d ",
"e e e e e e e e e e e e e e e e e e e e e e e e e e ",
"f f f f f f f f f f f f f f f f f f f f f f f f f f ",
"g g g g g g g g g g g g g g g g g g g g g g g g g g "};
