<?xml version="1.0" encoding="UTF-8" standalone="no"?>
<!DOCTYPE svg PUBLIC "-//W3C//DTD SVG 20010904//EN"
"http://www.w3.org/TR/2001/REC-SVG-20010904/DTD/svg10.dtd">
<!-- Created with Inkscape (http://www.inkscape.org/) -->
<svg
   version="1"
   x="0.00000000"
   y="0.00000000"
   width="48pt"
   height="48pt"
   id="svg548"
   sodipodi:version="0.32"
   sodipodi:docname="stock_cdplayer-next.svg"
   sodipodi:docbase="/root/Desktop"
   inkscape:version="0.38.1"
   xmlns="http://www.w3.org/2000/svg"
   xmlns:inkscape="http://www.inkscape.org/namespaces/inkscape"
   xmlns:sodipodi="http://sodipodi.sourceforge.net/DTD/sodipodi-0.dtd"
   xmlns:xlink="http://www.w3.org/1999/xlink">
  <sodipodi:namedview
     id="base"
     inkscape:zoom="9.6562500"
     inkscape:cx="16.000000"
     inkscape:cy="24.105924"
     inkscape:window-width="1014"
     inkscape:window-height="696"
     inkscape:window-x="0"
     inkscape:window-y="27"
     showguides="true"
     snaptoguides="true" />
  <defs
     id="defs550">
    <linearGradient
       x1="0.00000000"
       y1="0.00000000"
       x2="1.00000000"
       y2="0.00000000"
       id="linearGradient556"
       gradientUnits="objectBoundingBox"
       spreadMethod="pad">
      <stop
         style="stop-color:#ff8700;stop-opacity:1;"
         offset="0.00000000"
         id="stop557" />
      <stop
         style="stop-color:#ffff8d;stop-opacity:0;"
         offset="1.00000000"
         id="stop558" />
    </linearGradient>
    <linearGradient
       x1="0.00000000"
       y1="0.00000000"
       x2="1.00000000"
       y2="0.00000000"
       id="linearGradient559"
       xlink:href="#linearGradient556"
       gradientUnits="objectBoundingBox"
       spreadMethod="pad" />
    <sodipodi:namedview
       id="namedview852"
       inkscape:zoom="9.65625000"
       inkscape:cx="16.0000000"
       inkscape:cy="28.4271845"
       inkscape:window-width="1014"
       inkscape:window-height="696"
       inkscape:window-x="0"
       inkscape:window-y="0" />
    <defs
       id="defs853">
      <linearGradient
         x1="0.00000000"
         y1="0.00000000"
         x2="1.00000000"
         y2="0.00000000"
         id="linearGradient854"
         gradientUnits="objectBoundingBox"
         spreadMethod="pad">
        <stop
           style="stop-color:#ff8700;stop-opacity:1;"
           offset="0.00000000"
           id="stop855" />
        <stop
           style="stop-color:#ffff8d;stop-opacity:0;"
           offset="1.00000000"
           id="stop856" />
      </linearGradient>
      <linearGradient
         x1="0.00000000"
         y1="0.00000000"
         x2="1.00000000"
         y2="0.00000000"
         id="linearGradient857"
         xlink:href="#linearGradient556"
         gradientUnits="objectBoundingBox"
         spreadMethod="pad" />
    </defs>
  </defs>
  <g
     transform="matrix(-1.048427,1.439171,1.439171,1.048427,31.38843,-82.64666)"
     style="font-size:12.000000;"
     id="g584">
    <path
       d="M 51.966500,36.048600 C 53.960200,37.045400 65.472400,34.771300 65.757200,32.635300 C 66.172581,27.312501 55.630700,20.715100 54.064200,20.145500 C 52.497700,19.575900 51.112100,20.063400 50.684900,21.060200 C 50.257700,22.057000 49.688100,35.336500 51.966500,36.048600 z "
       transform="matrix(1.369638,0.000000,0.000000,1.207417,-21.85404,-4.997635)"
       style="fill:#0d3c07;fill-rule:evenodd;stroke-width:1pt;"
       id="path582"
       sodipodi:nodetypes="ccscc" />
    <path
       d="M 51.550600,35.458900 C 53.544300,36.455700 64.224700,34.889200 64.509500,32.753200 C 64.794300,30.617100 60.955464,29.668153 61.382664,28.244153 C 57.018216,23.149473 50.696200,21.360800 50.269000,22.357600 C 49.841800,23.354400 49.272200,34.746800 51.550600,35.458900 z "
       style="fill:#2aaf18;fill-rule:evenodd;stroke-width:1pt;"
       id="path581"
       sodipodi:nodetypes="ccccc" />
    <path
       d="M 61.946200,28.338600 C 63.512600,29.620200 65.363900,32.753100 64.367100,33.607600 C 62.658300,35.174000 52.832300,36.313300 51.693000,35.743700 C 50.553800,35.174000 60.094900,33.465200 60.237300,31.044300 C 60.379700,28.623400 57.458082,27.995128 58.312482,26.571028 C 59.166882,25.147028 61.519000,27.769000 61.946200,28.338600 z "
       style="fill:#208c11;fill-rule:evenodd;stroke-width:1pt;"
       id="path583"
       sodipodi:nodetypes="cccccc" />
  </g>
  <path
     d="M 24.969605,25.926778 C 24.969605,25.926778 16.587275,17.624343 14.499729,17.044699 C 12.412317,16.465173 13.583497,20.455473 13.583497,20.455473 C 13.583497,20.455473 24.187876,24.416174 24.969605,25.926778 z "
     style="font-size:12.000000;fill:#ffffff;fill-rule:evenodd;stroke-width:1.0000000pt;"
     id="path589" />
  <path
     style="fill:#0d3c07;fill-rule:evenodd;stroke-width:1.0000000pt;"
     d="M 50.058121,7.7630450 L 45.141014,7.2357915 C 42.700781,7.0952339 41.207714,7.0040489 37.967489,7.2717936 L 38.472328,51.128419 C 41.651041,51.986597 42.860919,52.237361 45.671093,51.773281 C 47.679707,51.235879 46.153221,51.709335 48.785161,50.796523 C 49.005361,51.304958 50.860369,9.5425225 50.058121,7.7630450 z "
     id="path590"
     sodipodi:nodetypes="ccccccc" />
  <path
     style="fill:#2aaf18;fill-rule:evenodd;stroke-width:1.0000000pt;"
     d="M 47.602756,9.4955586 C 46.532286,9.1022612 45.462971,9.0320233 44.393671,8.9617851 C 43.324356,8.8915471 42.369386,8.7673000 41.186878,9.0741326 L 41.333001,49.995186 C 42.270072,50.451505 43.206144,50.638599 44.141676,50.664163 C 45.077191,50.689705 45.611434,50.608168 46.946141,50.148560 L 47.602756,9.4955586 z "
     id="path591"
     sodipodi:nodetypes="ccccccc" />
  <path
     style="fill:#208c11;fill-rule:evenodd;stroke-width:1.0000000pt;"
     d="M 41.798710,9.5578376 L 41.838050,49.617553 C 41.838050,49.617553 42.888900,49.871791 43.945457,49.910629 C 45.002015,49.949479 46.064298,49.772943 46.090220,49.772905 C 46.142065,49.772830 46.295100,49.072625 45.565950,48.158345 C 44.740760,47.184309 43.346663,48.417909 43.334349,47.569311 L 42.784199,9.6640936 C 42.780766,9.4280476 41.797991,8.8376191 41.798710,9.5578376 z "
     id="path592"
     sodipodi:nodetypes="ccssssss" />
  <path
     style="fill:#ffffff;fill-rule:evenodd;stroke-width:1.0000000pt;"
     d="M 46.838245,10.240027 C 45.924848,9.2343978 44.410561,9.8120015 44.410816,9.8839263 C 45.483806,13.119012 45.313882,29.230565 45.313882,29.230565 C 45.531131,29.913546 45.843280,32.104613 46.044534,32.142490 C 46.222622,32.175996 46.439214,30.075467 46.451911,29.444692 L 46.838245,10.240027 z "
     id="path577"
     sodipodi:nodetypes="ccsssc" />
</svg>
