<?xml version="1.0" encoding="UTF-8" standalone="no"?>
<!DOCTYPE svg PUBLIC "-//W3C//DTD SVG 20010904//EN"
"http://www.w3.org/TR/2001/REC-SVG-20010904/DTD/svg10.dtd">
<!-- Created with Sodipodi ("http://www.sodipodi.com/") -->
<svg
   id="svg596"
   sodipodi:version="0.32"
   width="72pt"
   height="72pt"
   sodipodi:docbase="/home/zeus/desktop/icons/gartoon/svg"
   sodipodi:docname="/home/zeus/desktop/icons/gartoon/svg/gnome-mime-image-svg.svg"
   xmlns="http://www.w3.org/2000/svg"
   xmlns:sodipodi="http://sodipodi.sourceforge.net/DTD/sodipodi-0.dtd"
   xmlns:xlink="http://www.w3.org/1999/xlink">
  <defs
     id="defs598">
    <linearGradient
       id="linearGradient612">
      <stop
         style="stop-color:#7fa8e3;stop-opacity:0.741176;"
         offset="0.000000"
         id="stop613" />
      <stop
         style="stop-color:#ffffff;stop-opacity:0;"
         offset="1.000000"
         id="stop614" />
    </linearGradient>
    <linearGradient
       id="linearGradient626">
      <stop
         style="stop-color:#ff0047;stop-opacity:1;"
         offset="0.000000"
         id="stop627" />
      <stop
         style="stop-color:#ab322d;stop-opacity:0;"
         offset="1.000000"
         id="stop628" />
    </linearGradient>
    <linearGradient
       id="linearGradient618">
      <stop
         style="stop-color:#956d47;stop-opacity:1;"
         offset="0.000000"
         id="stop619" />
      <stop
         style="stop-color:#ab322d;stop-opacity:0;"
         offset="1.000000"
         id="stop620" />
    </linearGradient>
    <linearGradient
       id="linearGradient614">
      <stop
         style="stop-color:#000;stop-opacity:1;"
         offset="0"
         id="stop615" />
      <stop
         style="stop-color:#fff;stop-opacity:1;"
         offset="1"
         id="stop616" />
    </linearGradient>
    <linearGradient
       xlink:href="#linearGradient618"
       id="linearGradient617"
       y2="0.52343726"
       x2="1.07843077"
       y1="0.57031226"
       x1="-0.19608469"
       spreadMethod="pad"
       gradientUnits="objectBoundingBox" />
    <linearGradient
       xlink:href="#linearGradient626"
       id="linearGradient625"
       x1="42.9995728"
       y1="77.3980103"
       x2="28.5382881"
       y2="63.0152588"
       gradientUnits="userSpaceOnUse"
       spreadMethod="pad"
       gradientTransform="matrix(0.934001,0.000000,0.000000,1.070663,-1.516226e-6,-1.716230e-7)" />
    <linearGradient
       xlink:href="#linearGradient612"
       id="linearGradient636"
       x1="16.4110699"
       y1="10.6072874"
       x2="24.6243172"
       y2="61.6665344"
       gradientUnits="userSpaceOnUse"
       spreadMethod="pad" />
  </defs>
  <sodipodi:namedview
     id="base" />
  <g
     id="g898"
     transform="translate(-1.146498,1.146498)">
    <path
       style="fill:#000000;fill-rule:evenodd;stroke:none;stroke-opacity:1;stroke-width:1pt;stroke-linejoin:miter;stroke-linecap:butt;fill-opacity:0.301471;"
       d="M 12.8163 74.753 C 10.3856 73.6481 7.07107 70.1126 8.83884 65.2512 C 9.72267 59.948 25.6326 13.1021 29.1682 10.8924 C 31.3778 8.90368 34.582 8.13026 39.1119 9.34561 C 42.8684 10.2295 76.6769 19.0684 78.6656 20.8361 C 80.6544 22.6039 82.2012 24.0402 80.6544 27.9072 C 79.5496 29.8959 66.4017 74.532 66.1808 77.4047 C 65.2969 80.4983 62.7558 84.2548 58.5573 84.0338 C 54.3589 83.8128 15.9099 75.4159 12.8163 74.753 z "
       id="path794"
       sodipodi:nodetypes="ccccccccc"
       transform="matrix(1.114903,0.000000,0.000000,1.114903,1.287023,-5.035753)" />
    <path
       style="fill:#3d4e67;fill-rule:evenodd;stroke:none;stroke-opacity:1;stroke-width:1pt;stroke-linejoin:miter;stroke-linecap:butt;fill-opacity:1;"
       d="M 12.8163 74.753 C 10.3856 73.6481 7.07107 70.1126 8.83884 65.2512 C 9.72267 59.948 25.6326 13.1021 29.1682 10.8924 C 31.3778 8.90368 34.582 8.13026 39.1119 9.34561 C 42.8684 10.2295 76.6769 19.0684 78.6656 20.8361 C 80.6544 22.6039 82.2012 24.0402 80.6544 27.9072 C 79.5496 29.8959 66.4017 74.532 66.1808 77.4047 C 65.2969 80.4983 62.7558 84.2548 58.5573 84.0338 C 54.3589 83.8128 15.9099 75.4159 12.8163 74.753 z "
       id="path895"
       sodipodi:nodetypes="ccccccccc"
       transform="matrix(1.114903,0.000000,0.000000,1.114903,-1.570116,-9.607182)" />
    <path
       style="fill:#ffffff;fill-rule:evenodd;stroke:none;stroke-opacity:1;stroke-width:1pt;stroke-linejoin:miter;stroke-linecap:butt;fill-opacity:1;"
       d="M 17.8987 70.9965 C 15.3576 70.3336 11.7114 69.6706 13.0373 65.6932 C 15.468 55.9705 27.8424 18.6264 33.1456 13.986 C 34.361 12.8811 38.4489 12.4392 46.1829 14.8699 C 55.0218 17.5215 72.9204 23.4877 74.6882 24.3716 C 76.4559 25.2555 77.1189 25.2555 75.793 29.233 C 73.8043 33.2105 64.9655 67.24 62.7557 72.9852 C 61.209 77.0732 60.8775 78.9514 58.2258 78.9514 "
       id="path896"
       sodipodi:nodetypes="cccccccs"
       transform="matrix(1.114903,0.000000,0.000000,1.114903,-1.570116,-9.607182)" />
    <path
       style="fill:url(#linearGradient636);fill-rule:evenodd;stroke:none;stroke-opacity:1;stroke-width:1pt;stroke-linejoin:miter;stroke-linecap:butt;fill-opacity:1;"
       d="M 28.75 13.75 C 28.75 13.75 31.875 7.49995 39.6875 9.37495 C 47.5 11.25 78.125 19.375 77.8125 21.875 C 77.5 24.375 71.875 39.0625 71.5625 40.3125 C 71.25 41.5625 42.5 40.9375 31.5625 47.5 C 20.625 54.0625 12.5 59.6875 12.5 59.6875 C 12.5 59.6875 23.75 24.6875 28.75 13.75 z "
       id="path636"
       transform="matrix(0.946780,0.000000,0.000000,0.946780,6.111789,-0.736980)" />
  </g>
  <path
     style="font-size:12;fill:#470000;fill-rule:evenodd;stroke-width:1pt;"
     d="M 67.911 66.4866 C 67.911 68.1832 66.4512 69.56 64.6525 69.56 C 62.8537 69.56 61.3939 68.1832 61.3939 66.4866 C 61.3939 64.7901 62.8537 63.4132 64.6525 63.4132 C 66.4512 63.4132 67.911 64.7901 67.911 66.4866 z "
     id="path613"
     transform="matrix(0.665098,0.000000,0.000000,0.665098,26.75834,4.099827)" />
  <path
     style="font-size:12;fill:#470000;fill-rule:evenodd;stroke-width:1pt;"
     d="M 61.2458 74.2998 C 59.6905 72.5223 57.1726 73.4851 56.3579 74.7441 C 55.4692 77.8545 56.8764 80.6687 60.5793 79.3357 C 64.2822 78.0026 65.6152 75.929 65.6152 76.0771 C 65.6152 76.2253 62.6529 84.0754 58.2094 84.6678 C 53.7659 85.2603 51.322 85.4084 46.4342 85.4825 C 41.3983 86.3712 38.9544 86.2971 38.9544 86.2971 L 45.1752 77.4102 C 45.1752 77.4102 46.8045 76.5215 49.4706 72.078 C 52.1367 67.6346 56.8763 66.5977 59.2462 68.0789 C 61.3939 68.9675 62.5788 70.1525 63.1713 72.4483 C 63.0232 74.9662 62.5788 75.929 61.2458 74.2998 z "
     id="path610"
     sodipodi:nodetypes="cccccccccccc"
     transform="matrix(0.665098,0.000000,0.000000,0.665098,26.75834,4.099827)" />
  <path
     style="font-size:12;fill:#230000;fill-opacity:0.99899;fill-rule:evenodd;stroke-width:1pt;"
     d="M 37.9176 76.4474 C 40.1393 77.0399 37.5473 80.2243 36.1402 78.0026 C 35.0293 79.5578 35.5477 75.7809 35.5477 75.7809 L 30.808 85.7046 C 30.808 85.7046 38.9544 88.667 42.0648 84.3716 C 45.1752 80.0763 45.5456 77.8545 43.8423 76.0771 C 41.8426 73.3371 40.0652 74.4479 39.3247 74.8922 C 38.5841 75.3366 38.2879 75.6328 37.9176 76.4474 z "
     id="path609"
     sodipodi:nodetypes="cccccccc"
     transform="matrix(0.665098,0.000000,0.000000,0.665098,26.95536,4.099827)" />
  <path
     style="font-size:12;fill:#230000;fill-rule:evenodd;stroke-width:1pt;"
     d="M 36.1402 62.0062 C 36.1402 62.0062 37.0288 56.674 36.7326 53.8598 C 36.2883 47.787 23.5503 -3.31281 14.071 5.57413 C 3.11042 9.86949 16.1446 58.8957 17.7739 61.7099 C 19.4031 64.5241 21.773 66.5977 21.773 66.5977 C 21.773 66.5977 18.07 83.483 31.9189 85.8527 C 36.9549 76.5215 40.5087 72.8006 39.695 68.5973 C 39.2506 66.2275 38.6582 64.0057 36.1402 62.0062 z "
     id="path608"
     sodipodi:nodetypes="cccccccc"
     transform="matrix(0.665098,0.000000,0.000000,0.665098,26.75834,4.099827)" />
  <path
     style="font-size:12;fill:#f2962c;fill-rule:evenodd;stroke-width:1pt;"
     d="M 19.4031 58.3033 C 22.0692 55.0448 25.0315 52.6749 32.5854 53.4155 C 30.2156 40.2331 21.773 4.68543 15.7002 7.94398 C 8.88697 9.12891 15.2559 48.8239 19.4031 58.3033 z "
     id="path600"
     sodipodi:nodetypes="cccc"
     transform="matrix(0.665098,0.000000,0.000000,0.665098,26.75834,4.099827)" />
  <path
     style="font-size:12;fill:#8b8b8b;fill-rule:evenodd;stroke-width:1pt;"
     d="M 19.8475 59.6363 C 19.8475 59.6363 21.1805 63.9316 24.7353 64.2279 C 26.3646 61.7099 30.0675 61.2656 33.1779 61.4137 C 33.9185 58.5995 34.5109 55.1928 33.326 55.0447 C 31.8449 54.156 23.5504 52.5268 19.8475 59.6363 z "
     id="path601"
     sodipodi:nodetypes="ccccc"
     transform="matrix(0.665098,0.000000,0.000000,0.665098,26.75834,4.099827)" />
  <path
     style="font-size:12;fill:#65532d;fill-rule:evenodd;stroke-width:1pt;"
     d="M 24.8834 66.4496 C 25.624 63.1911 31.2524 60.9694 33.7703 63.6354 C 39.8431 67.0421 37.177 75.4847 34.5109 75.6328 C 33.7703 86.149 40.8799 80.3724 40.7318 78.1508 C 46.0639 77.4102 41.7686 84.9641 38.2138 84.5197 C 33.326 85.2603 20.2918 80.8169 24.8834 66.4496 z "
     id="path602"
     sodipodi:nodetypes="cccccc"
     transform="matrix(0.665098,0.000000,0.000000,0.665098,26.75834,4.099827)" />
  <path
     style="font-size:12;fill:#bc0000;fill-rule:evenodd;stroke-width:1pt;"
     d="M 44.5828 81.2612 C 44.7309 81.4093 46.6564 81.2612 47.6932 79.4838 C 48.73 77.7064 52.2848 70.4487 54.8028 70.3006 C 60.8755 68.0789 60.8755 72.2261 60.8755 72.2261 C 60.8755 72.2261 55.2471 70.1525 54.6546 73.7073 C 54.0622 77.2621 53.0254 79.3357 59.8386 82.1499 C 55.9877 83.4829 43.966 83.74 43.2253 83.74 C 42.4847 83.74 44.7309 81.1131 44.5828 81.2612 z "
     id="path603"
     sodipodi:nodetypes="cccccccc"
     transform="matrix(0.665098,0.000000,0.000000,0.665098,26.75834,4.099827)" />
  <path
     style="font-size:12;fill:#470000;fill-rule:evenodd;stroke-width:1pt;"
     d="M 46.6564 67.6346 C 48.4338 64.9685 54.5806 66.3015 57.3947 65.7091 C 60.8014 64.8204 59.02 58.5954 55.169 58.5955 C 52.5142 58.0648 46.9527 58.1551 46.6564 67.6346 z "
     id="path611"
     sodipodi:nodetypes="cccc"
     transform="matrix(0.665098,0.000000,0.000000,0.665098,26.75834,4.099827)" />
  <path
     style="font-size:12;fill:#bc0000;fill-rule:evenodd;stroke-width:1pt;"
     d="M 48.1376 64.8204 C 48.1376 64.8204 54.5065 64.2279 56.1358 64.2279 C 58.0613 64.6397 58.1915 61.7181 56.5801 60.6731 C 53.766 58.7476 49.9149 58.5995 48.1376 64.8204 z "
     id="path604"
     sodipodi:nodetypes="cccc"
     transform="matrix(0.665098,0.000000,0.000000,0.665098,26.75834,4.099827)" />
  <path
     style="font-size:12;fill:#bc0000;fill-rule:evenodd;stroke-width:1pt;"
     d="M 66.8001 66.5977 C 66.8001 67.7424 65.838 68.6714 64.6524 68.6714 C 63.4669 68.6714 62.5048 67.7424 62.5048 66.5977 C 62.5048 65.4531 63.4669 64.5241 64.6524 64.5241 C 65.838 64.5241 66.8001 65.4531 66.8001 66.5977 z "
     id="path606"
     transform="matrix(0.665098,0.000000,0.000000,0.665098,26.75834,4.099827)" />
  <path
     style="font-size:12;fill:url(#linearGradient617);fill-rule:evenodd;stroke-width:1pt;"
     d="M 19.4031 58.3033 C 22.0692 55.0448 25.0315 52.6749 32.5854 53.4155 C 30.2156 40.2331 21.773 4.68543 15.7002 7.94398 C 8.88697 9.12891 15.2559 48.8239 19.4031 58.3033 z "
     id="path621"
     sodipodi:nodetypes="cccc"
     transform="matrix(0.665098,0.000000,0.000000,0.665098,26.75834,4.099827)" />
  <path
     style="font-size:12;fill:#f2d0a8;fill-rule:evenodd;stroke-width:1pt;"
     d="M 28.4382 52.5267 C 25.1369 52.6775 14.6017 8.00417 18.6625 10.462 C 19.6179 11.1298 34.3749 52.522 28.4382 52.5267 z "
     id="path622"
     sodipodi:nodetypes="css"
     transform="matrix(0.665098,0.000000,0.000000,0.665098,26.75834,4.099827)" />
  <path
     style="font-size:12;fill:#f2f2f2;fill-rule:evenodd;stroke-width:1pt;"
     d="M 30.5118 54.4523 L 31.1043 61.2656 L 27.6976 62.0062 L 26.2165 54.6003 C 26.2165 54.6003 30.2156 54.1561 30.5118 54.4523 z "
     id="path623"
     sodipodi:nodetypes="ccccc"
     transform="matrix(0.665098,0.000000,0.000000,0.665098,26.75834,4.099827)" />
  <path
     style="font-size:12;fill:url(#linearGradient625);fill-rule:nonzero;stroke-width:1pt;"
     d="M 24.8834 66.4496 C 25.624 63.1911 31.2524 60.9694 33.7703 63.6354 C 39.8431 67.0421 37.177 75.4847 34.5109 75.6328 C 33.7703 86.149 40.8799 80.3724 40.7318 78.1508 C 46.0639 77.4102 41.7686 84.9641 38.2138 84.5197 C 33.326 85.2603 20.2918 80.8169 24.8834 66.4496 z "
     id="path624"
     sodipodi:nodetypes="cccccc"
     transform="matrix(0.665098,0.000000,0.000000,0.665098,26.75834,4.099827)" />
  <path
     style="font-size:12;fill:none;fill-rule:evenodd;stroke:#3d4e67;stroke-width:1.3625;stroke-linejoin:round;stroke-opacity:1;"
     d="M 31.8153 50.4459 L 31.8153 55.6051 L 36.9745 55.6051 L 36.9745 50.4459 L 31.8153 50.4459 z "
     id="path1064" />
  <path
     style="font-size:12;fill:none;fill-rule:evenodd;stroke:#3d4e67;stroke-width:1.3625;stroke-linejoin:round;stroke-opacity:1;"
     d="M 31.8153 50.4459 L 31.8153 55.6051 L 36.9745 55.6051 L 36.9745 50.4459 L 31.8153 50.4459 z "
     id="path1065"
     transform="translate(-4.299364,-21.21019)" />
  <path
     style="font-size:12;fill:none;fill-rule:evenodd;stroke:#3d4e67;stroke-width:1pt;stroke-opacity:1;"
     d="M 32.3885 32.6752 L 38.4076 42.9936 L 34.1083 50.1592 "
     id="path1066" />
  <path
     style="font-size:12;fill:none;fill-rule:evenodd;stroke:#3d4e67;stroke-width:1.3625;stroke-linejoin:round;stroke-opacity:1;"
     d="M 31.8153 50.4459 L 31.8153 55.6051 L 36.9745 55.6051 L 36.9745 50.4459 L 31.8153 50.4459 z "
     id="path1072"
     transform="matrix(-0.977600,0.424534,0.398324,0.917245,70.71647,-27.10711)" />
  <path
     style="font-size:12;fill:none;fill-rule:evenodd;stroke:#3d4e67;stroke-width:1.3625;stroke-linejoin:round;stroke-opacity:1;"
     d="M 31.8153 50.4459 L 31.8153 55.6051 L 36.9745 55.6051 L 36.9745 50.4459 L 31.8153 50.4459 z "
     id="path1073"
     transform="matrix(-0.977600,0.424534,0.398324,0.917245,64.75126,-47.52740)" />
  <path
     style="font-size:12;fill:none;fill-rule:evenodd;stroke:#3d4e67;stroke-width:1pt;stroke-opacity:1;"
     d="M 32.3885 32.6752 L 38.4076 42.9936 L 34.1083 50.1592 "
     id="path1074"
     transform="matrix(-0.977600,0.424534,0.398324,0.917245,68.99673,-26.24723)" />
  <path
     transform="matrix(0.973572,0.228380,-0.228380,0.973572,15.89407,-4.962664)"
     style="font-size:13;font-weight:bold;fill:#3d4e67;stroke-width:1pt;font-family:Kid Kosmic;"
     d="M 58.7691 62.8191 C 58.7014 63.1577 58.4855 63.437 58.1216 63.657 C 57.7915 63.8686 57.4445 63.9744 57.0806 63.9744 C 56.6236 63.9744 56.2808 63.7332 56.0523 63.2508 C 55.9084 62.8361 55.7603 62.4256 55.6079 62.0193 C 53.4413 62.0193 51.7824 62.5652 50.6314 63.657 C 49.4634 64.7827 48.8625 65.866 48.8286 66.907 C 48.8032 67.9227 49.3364 68.6378 50.4282 69.0525 C 50.6906 69.1541 50.9826 69.2049 51.3042 69.2049 C 52.3791 69.2049 53.8264 68.6844 55.646 67.6434 C 55.6714 67.5587 55.701 67.4402 55.7349 67.2879 C 55.4979 67.0594 55.1001 66.9451 54.5415 66.9451 C 53.509 66.9451 52.5822 67.1567 51.7612 67.5799 C 51.2788 67.5376 50.9699 67.271 50.8345 66.7801 C 50.8091 66.687 50.7964 66.5981 50.7964 66.5135 C 50.7964 66.1411 50.9953 65.811 51.3931 65.5232 C 51.8924 64.9647 52.815 64.6854 54.1607 64.6854 C 54.5669 64.6854 55.079 64.715 55.6968 64.7742 C 56.5093 64.8419 56.9536 64.88 57.0298 64.8885 C 57.9354 65.3455 58.3882 65.8576 58.3882 66.4246 C 58.3882 66.6954 58.3078 67.0721 58.147 67.5545 C 57.91 68.2993 57.5715 68.7986 57.1314 69.0525 C 56.2596 69.7127 55.2398 70.2459 54.0718 70.6522 C 52.8784 71.0669 51.7486 71.2742 50.6821 71.2742 C 49.1249 71.2742 47.9653 70.7833 47.2036 69.8016 C 46.5519 68.9552 46.2261 68.0242 46.2261 67.0086 C 46.2261 66.56 46.2853 66.103 46.4038 65.6375 C 46.9455 63.547 48.2912 61.9559 50.4409 60.8641 C 52.2691 59.9246 54.3553 59.4803 56.6997 59.5311 C 57.4953 59.6411 58.0454 59.9162 58.3501 60.3563 C 58.5956 60.7202 58.731 61.3253 58.7564 62.1717 C 58.8071 62.4171 58.8114 62.6329 58.7691 62.8191 z M 36.5903 59.2518 C 37.0728 59.2518 37.3775 59.4887 37.5044 59.9627 C 37.5044 62.087 37.5594 63.5936 37.6694 64.4822 C 37.9149 66.4288 38.4142 67.5503 39.1675 67.8465 C 39.9885 67.4826 41.0125 66.268 42.2398 64.2029 C 42.7645 63.3227 43.5474 61.8458 44.5884 59.7723 C 44.8592 59.5184 45.1301 59.3914 45.4009 59.3914 C 45.6971 59.3914 45.9637 59.4972 46.2007 59.7088 C 46.4377 59.9119 46.5562 60.1574 46.5562 60.4451 C 46.5562 60.6652 46.4631 60.9106 46.2769 61.1814 C 44.9481 64.076 42.8407 67.2371 39.9546 70.6648 C 39.4637 71.0965 39.0109 71.3123 38.5962 71.3123 C 38.2238 71.3123 37.881 71.143 37.5679 70.8045 C 35.9937 68.4093 35.1008 65.1043 34.8892 60.8895 C 34.8299 60.4747 34.9992 60.0939 35.397 59.7469 C 35.7609 59.4168 36.1587 59.2518 36.5903 59.2518 z M 32.8325 61.4734 C 32.7648 61.7612 32.5956 62.0405 32.3247 62.3113 C 32.037 62.6076 31.7492 62.7557 31.4614 62.7557 C 31.2245 62.7557 31.0298 62.6414 30.8775 62.4129 C 29.4217 62.0236 27.9999 61.8543 26.6118 61.9051 C 25.2577 61.9474 24.5298 62.1421 24.4282 62.4891 C 24.4028 62.5229 24.3859 62.5483 24.3775 62.5652 C 24.3521 62.6837 24.551 62.798 24.9741 62.908 C 25.1011 62.9503 25.7232 63.09 26.8403 63.327 C 27.3228 63.4285 28.0464 63.5936 29.0112 63.8221 C 29.9761 64.0506 30.6489 64.3045 31.0298 64.5838 C 31.673 65.3032 31.9566 65.9422 31.8804 66.5008 C 31.8127 67.0171 31.6011 67.618 31.2456 68.3035 C 30.5939 69.1329 29.8364 69.7592 28.9732 70.1824 C 27.5597 70.8764 26.0871 71.2234 24.5552 71.2234 C 22.6763 71.2234 21.0978 70.6606 19.8198 69.535 C 19.6844 69.3657 19.6167 69.1795 19.6167 68.9764 C 19.6167 68.7479 19.7056 68.4939 19.8833 68.2147 C 20.1372 67.8253 20.4292 67.6307 20.7593 67.6307 C 20.8609 67.6307 20.9751 67.6518 21.1021 67.6941 C 21.7199 68.2273 22.4435 68.659 23.273 68.9891 C 23.5777 69.1076 23.9458 69.1668 24.3775 69.1668 C 25.1222 69.1668 26.0575 68.9975 27.1831 68.659 C 28.3003 68.1596 28.8885 67.7619 28.9478 67.4656 C 28.9985 67.2371 28.8293 66.9197 28.44 66.5135 C 27.9406 66.1749 27.1747 65.921 26.1421 65.7518 C 25.5497 65.6671 24.6694 65.5275 23.5015 65.3328 C 22.6467 65.172 21.94 64.8504 21.3814 64.368 C 21.0428 64.0802 20.8735 63.6782 20.8735 63.1619 C 20.8735 62.798 20.9582 62.3833 21.1275 61.9178 C 21.5591 61.0122 22.4943 60.3309 23.9331 59.8738 C 25.0334 59.5353 26.231 59.366 27.5259 59.366 C 30.0226 59.366 31.7957 59.9035 32.8452 60.9783 C 32.8622 61.173 32.8579 61.338 32.8325 61.4734 z M 18.7407 69.2557 C 18.7407 69.6788 18.5376 70.0512 18.1314 70.3729 C 17.7336 70.6945 17.3062 70.8553 16.8491 70.8553 C 16.6799 70.8553 16.5233 70.8299 16.3794 70.7791 C 15.9562 70.6098 15.7446 70.3094 15.7446 69.8777 C 15.7446 69.5815 15.8504 69.2938 16.062 69.0145 C 16.4683 68.4982 16.9761 68.24 17.5855 68.24 C 17.7632 68.24 17.9325 68.2697 18.0933 68.3289 C 18.5249 68.4897 18.7407 68.7986 18.7407 69.2557 z "
     id="path1085" />
</svg>
