/* XPM */
static char * gaim_16x16_xpm[] = {
"16 16 79 1",
" 	c None",
".	c #D9C22F",
"+	c #F1D22A",
"@	c #D2AC12",
"#	c #533D02",
"$	c #EBD847",
"%	c #F7EC8A",
"&	c #F6E876",
"*	c #F1D028",
"=	c #DA9805",
"-	c #140A00",
";	c #F6E563",
">	c #F8F0AD",
",	c #F6E981",
"'	c #F0CE26",
")	c #E19604",
"!	c #5A2D00",
"~	c #F1D637",
"{	c #F3E05B",
"]	c #F0D539",
"^	c #E6AF0F",
"/	c #D47502",
"(	c #421D00",
"_	c #C89E13",
":	c #E3B114",
"<	c #DD9E0B",
"[	c #CF7603",
"}	c #964200",
"|	c #000000",
"1	c #746E4E",
"2	c #9A7424",
"3	c #AB6F14",
"4	c #996312",
"5	c #755D15",
"6	c #4F3707",
"7	c #F4ECB5",
"8	c #EDD958",
"9	c #E8C72C",
"0	c #E5BB1D",
"a	c #DFAB16",
"b	c #C67806",
"c	c #341900",
"d	c #F6EB9C",
"e	c #F0D83B",
"f	c #ECC314",
"g	c #E9B40A",
"h	c #DF9804",
"i	c #9C5701",
"j	c #843E00",
"k	c #5D2800",
"l	c #F6E98C",
"m	c #F2D830",
"n	c #EFC40F",
"o	c #EAB206",
"p	c #DE8F03",
"q	c #5F3101",
"r	c #F5E473",
"s	c #F0CE1E",
"t	c #ECB509",
"u	c #E69F03",
"v	c #D77C02",
"w	c #632E01",
"x	c #E3CD43",
"y	c #E9B30B",
"z	c #DE9103",
"A	c #D67A01",
"B	c #CD6501",
"C	c #7D3300",
"D	c #C19F1A",
"E	c #DB8B03",
"F	c #A55101",
"G	c #582A01",
"H	c #7E3500",
"I	c #9F3A00",
"J	c #99730C",
"K	c #B16403",
"L	c #050200",
"M	c #511B00",
"N	c #311000",
"                ",
"      .+@#      ",
"     $%&*=-     ",
"     ;>,')!     ",
"     ~{]^/(     ",
"     _:<[}|     ",
"     123456     ",
"     7890abc    ",
"     defghijk   ",
"     lmnopq     ",
"     rstuvw     ",
"     xyzABC     ",
"     DEFGHI|    ",
"     JKL  MN    ",
"                ",
"                "};
