<?xml version="1.0" encoding="UTF-8" standalone="no"?>
<!DOCTYPE svg PUBLIC "-//W3C//DTD SVG 20010904//EN"
"http://www.w3.org/TR/2001/REC-SVG-20010904/DTD/svg10.dtd">
<!-- Created with Sodipodi ("http://www.sodipodi.com/") -->
<svg
   xmlns="http://www.w3.org/2000/svg"
   xmlns:sodipodi="http://sodipodi.sourceforge.net/DTD/sodipodi-0.dtd"
   xmlns:xlink="http://www.w3.org/1999/xlink"
   id="svg652"
   sodipodi:version="0.34"
   width="72pt"
   height="72pt"
   sodipodi:docbase="/home/zeus"
   sodipodi:docname="/home/zeus/stock_book.svg">
  <defs
     id="defs654">
    <linearGradient
       id="linearGradient666">
      <stop
         style="stop-color:#a6d7ff;stop-opacity:1;"
         offset="0.000000"
         id="stop667" />
      <stop
         style="stop-color:#ffffff;stop-opacity:0.396078;"
         offset="1.000000"
         id="stop668" />
    </linearGradient>
    <linearGradient
       id="linearGradient660">
      <stop
         style="stop-color:#3882d2;stop-opacity:1;"
         offset="0.000000"
         id="stop661" />
      <stop
         style="stop-color:#ffffff;stop-opacity:1;"
         offset="1.000000"
         id="stop662" />
    </linearGradient>
    <linearGradient
       xlink:href="#linearGradient660"
       id="linearGradient663"
       x1="24.8720913"
       y1="97.8506012"
       x2="54.9295425"
       y2="95.5566864"
       gradientUnits="userSpaceOnUse"
       gradientTransform="scale(1.203807,0.830698)"
       spreadMethod="pad" />
    <linearGradient
       xlink:href="#linearGradient666"
       id="linearGradient665"
       x1="77.3604736"
       y1="65.4081421"
       x2="55.6024742"
       y2="83.4317398"
       gradientUnits="userSpaceOnUse"
       gradientTransform="scale(1.203807,0.830698)"
       spreadMethod="pad" />
  </defs>
  <sodipodi:namedview
     id="base" />
  <path
     style="fill:#00043b;fill-rule:evenodd;stroke:none;stroke-opacity:1;stroke-width:1pt;stroke-linejoin:miter;stroke-linecap:butt;fill-opacity:1;"
     d="M 64.35844 87.02254 C 60.20327 92.23177 39.51419 90.12933 34.77094 88.93105 L 3.480781 49.88946 L 24.31355 8.860979 L 28.15248 2.869492 L 33.69474 10.52719 L 56.81343 8.944235 C 57.71221 9.992847 75.84582 44.81009 77.64333 47.35651 C 76.59473 50.20252 64.80778 85.52467 64.35844 87.02254 z "
     id="path690"
     sodipodi:nodetypes="ccccccccc" />
  <path
     style="font-size:12;fill:#a55800;fill-rule:evenodd;stroke-width:1pt;fill-opacity:1;"
     d="M 8.584878 48.91909 L 12.06658 52.19819 L 30.35473 14.54179 L 34.44779 18.14952 L 28.71021 7.029858 L 8.584878 48.91909 z "
     id="path680"
     sodipodi:nodetypes="cccccc" />
  <path
     style="font-size:12;fill:url(#linearGradient663);fill-rule:evenodd;stroke-width:1pt;"
     d="M 37.32447 53.79697 L 15.62513 56.05262 L 11.49967 51.41137 L 29.83902 15.44521 L 53.24782 14.95998 L 37.32447 53.79697 z "
     id="path681"
     sodipodi:nodetypes="cccccc" />
  <path
     style="font-size:12;fill:url(#linearGradient665);fill-rule:evenodd;stroke-width:1pt;"
     d="M 37.32447 52.92601 L 15.62513 56.05262 L 11.49967 51.41137 L 29.5487 14.86456 L 53.53815 14.37934 L 37.32447 52.92601 z "
     id="path682"
     sodipodi:nodetypes="cccccc" />
  <path
     style="font-size:12;fill:#ff8900;fill-rule:evenodd;stroke-width:1pt;fill-opacity:1;"
     d="M 62.04699 86.09239 L 36.26258 50.76779 L 53.2803 12.34908 L 73.90784 46.9001 L 62.04699 86.09239 z "
     id="path683"
     sodipodi:nodetypes="ccccc" />
  <path
     style="font-size:12;fill:#a45800;fill-rule:evenodd;stroke-width:1pt;fill-opacity:1;"
     d="M 62.33731 85.25391 C 56.57883 88.43398 40.20628 88.71281 35.47912 84.9311 L 10.46827 50.89575 C 15.0235 53.0444 32.35293 53.96891 37.68173 50.18715 L 62.33731 85.25391 z "
     id="path684"
     sodipodi:nodetypes="ccccc" />
  <path
     style="font-size:12;fill:none;fill-rule:evenodd;stroke:#000008;stroke-width:1.014511;stroke-opacity:1;"
     d="M 20.6539 51.76518 L 33.23606 23.00583 "
     id="path685" />
  <path
     style="font-size:12;fill:none;fill-rule:evenodd;stroke:#000000;stroke-width:1.014511;stroke-opacity:1;"
     d="M 16.75939 52.06466 L 28.7424 23.90458 "
     id="path686" />
</svg>
