<?xml version="1.0" encoding="UTF-8" standalone="no"?>
<!DOCTYPE svg PUBLIC "-//W3C//DTD SVG 20010904//EN"
"http://www.w3.org/TR/2001/REC-SVG-20010904/DTD/svg10.dtd">
<!-- Created with Sodipodi ("http://www.sodipodi.com/") -->
<svg
   xmlns="http://www.w3.org/2000/svg"
   xmlns:sodipodi="http://sodipodi.sourceforge.net/DTD/sodipodi-0.dtd"
   xmlns:xlink="http://www.w3.org/1999/xlink"
   xmlns:inkscape="http://www.inkscape.org/namespaces/inkscape"
   version="1"
   x="0.00000000"
   y="0.00000000"
   width="48pt"
   height="48pt"
   id="svg548"
   sodipodi:version="0.34"
   sodipodi:docname="/home/zeus/gartoon-stock.0.1/stock_goto-last.svg"
   sodipodi:docbase="/home/zeus/gartoon-stock.0.1/"
   inkscape:version="0.37">
  <sodipodi:namedview
     id="base"
     inkscape:zoom="9.65625000"
     inkscape:cx="16.0000000"
     inkscape:cy="20.1423948"
     inkscape:window-width="1014"
     inkscape:window-height="696"
     inkscape:window-x="0"
     inkscape:window-y="0" />
  <defs
     id="defs550">
    <linearGradient
       x1="0.00000000"
       y1="0.00000000"
       x2="1.00000000"
       y2="0.00000000"
       id="linearGradient556"
       gradientUnits="objectBoundingBox"
       spreadMethod="pad">
      <stop
         style="stop-color:#ff8700;stop-opacity:1;"
         offset="0.00000000"
         id="stop557" />
      <stop
         style="stop-color:#ffff8d;stop-opacity:0;"
         offset="1.00000000"
         id="stop558" />
    </linearGradient>
    <linearGradient
       x1="0.00000000"
       y1="0.00000000"
       x2="1.00000000"
       y2="0.00000000"
       id="linearGradient559"
       xlink:href="#linearGradient556"
       gradientUnits="objectBoundingBox"
       spreadMethod="pad" />
  </defs>
  <path
     d="M 49.2855 29.05426 C 48.3452 24.08888 31.60198 5.213396 28.25753 7.283586 C 21.94062 9.516226 23.6627 16.80621 21.23233 18.27482 C 18.72345 19.20874 5.210056 16.70914 3.425566 19.85995 C 0.869506 26.69253 0.442036 39.44704 6.619496 42.82624 C 12.97271 44.84763 23.37215 40.86932 24.41194 44.51015 C 25.45171 48.15097 27.76813 50.16199 29.67498 49.74936 C 31.58183 49.33671 50.96174 34.20771 49.2855 29.05426 z "
     style="font-size:12;fill:#0d3c07;fill-rule:evenodd;"
     id="path582" />
  <path
     d="M 43.78978 29.09408 C 43.24102 25.34947 32.24209 12.2674 29.50504 14.03451 C 26.76786 15.80171 27.7962 21.54224 25.76771 22.39444 C 23.7391 23.24674 7.610816 22.44247 7.382036 25.35334 C 7.153056 28.26417 6.168666 38.1588 8.642376 38.42809 C 11.11628 38.69742 27.10644 36.00413 27.78688 38.73053 C 28.46732 41.45693 28.07229 44.51154 29.60228 44.09096 C 31.13228 43.6704 44.91523 32.94193 43.78978 29.09408 z "
     style="font-size:12;fill:#2aaf18;fill-rule:evenodd;"
     id="path581" />
  <path
     d="M 7.206456 26.71094 C 7.206456 26.71094 6.980626 23.89231 9.830766 23.53448 C 12.68069 23.17662 26.25681 23.17654 26.55465 22.01446 C 26.70513 18.5688 28.77126 12.86146 30.62432 13.36677 C 33.91946 14.13041 43.68623 26.47096 43.99984 28.6108 C 44.31326 30.75059 34.12657 19.37663 31.17933 21.62712 C 28.2321 23.8776 29.26988 28.40416 26.87444 28.66988 C 24.47911 28.93552 7.999666 30.8467 7.598256 29.38566 C 7.196936 27.92476 7.748856 25.93991 7.206456 26.71094 z "
     style="font-size:12;fill:#208c11;fill-rule:evenodd;"
     id="path583" />
  <path
     d="M 8.527446 35.51349 C 8.527446 35.51349 26.26409 36.43207 27.01665 35.17765 C 27.7691 33.92332 12.64729 31.04211 8.527446 35.51349 z "
     style="font-size:12;fill:#ffffff;fill-rule:evenodd;"
     id="path588" />
  <path
     d="M 41.03165 31.78349 C 41.03165 31.78349 34.24366 39.77073 32.54738 40.33527 C 30.85119 40.89969 31.78858 37.07398 31.78858 37.07398 C 31.78858 37.07398 40.40147 33.23334 41.03165 31.78349 z "
     style="font-size:12;fill:#ffffff;fill-rule:evenodd;"
     id="path589" />
  <path
     style="font-size:12;fill:#0d3c07;fill-rule:evenodd;stroke-width:1;"
     d="M 48.95086 52.23046 L 53.234 52.75379 C 55.35918 52.89104 56.6595 52.98024 59.47978 52.70297 L 58.88463 8.351576 C 56.11392 7.490086 55.0596 7.238916 52.61446 7.713896 C 50.86748 8.261406 52.1949 7.779536 49.90654 8.707956 C 49.71301 8.194216 48.24604 50.43247 48.95086 52.23046 z "
     id="path590"
     sodipodi:nodetypes="ccccccc" />
  <path
     style="font-size:12;fill:#2aaf18;fill-rule:evenodd;stroke-width:1;"
     d="M 51.80895 50.47175 C 52.66169 50.86754 53.51237 50.93661 54.36303 51.00567 C 55.21371 51.07474 55.97364 51.19864 56.913 50.88615 L 56.65161 9.502786 C 55.90474 9.043026 55.15962 8.855536 54.4155 8.831406 C 53.67139 8.807286 53.2468 8.890726 52.18693 9.357986 L 51.80895 50.47175 z "
     id="path591"
     sodipodi:nodetypes="ccccccc" />
  <path
     style="font-size:12;fill:#208c11;fill-rule:evenodd;stroke-width:1;"
     d="M 56.4247 50.39812 L 56.25129 9.885616 C 56.25129 9.885616 55.41464 9.630436 54.57422 9.593096 C 53.7338 9.555746 52.88959 9.736236 52.86898 9.736316 C 52.82775 9.736486 52.70852 10.44489 53.29166 11.36816 C 53.95139 12.35169 55.05574 11.10159 55.06854 11.95976 L 55.64056 50.29247 C 55.64413 50.53117 56.42782 51.12647 56.4247 50.39812 z "
     id="path592"
     sodipodi:nodetypes="ccssssss" />
  <path
     style="font-size:12;fill:#ffffff;fill-rule:evenodd;stroke-width:1;"
     d="M 52.41433 49.71747 C 53.14432 50.73279 54.34659 50.14587 54.34613 50.07314 C 53.4813 46.80345 53.55928 30.50945 53.55928 30.50945 C 53.38408 29.81915 53.12805 27.60389 52.96786 27.56595 C 52.82611 27.5324 52.66131 29.65708 52.65345 30.29499 L 52.41433 49.71747 z "
     id="path577"
     sodipodi:nodetypes="ccsssc" />
</svg>
