/* XPM */
static char * closeA_xpm[] = {
"17 42 82 1",
" 	c None",
".	c #B8D4F0",
"+	c #A9CBEC",
"@	c #A3C7EC",
"#	c #A5A5A5",
"$	c #5A5A5A",
"%	c #212121",
"&	c #101010",
"*	c #292929",
"=	c #A0C6EC",
"-	c #736B73",
";	c #4A4A42",
">	c #999999",
",	c #BDBDC6",
"'	c #D6D6D6",
")	c #CCCCCC",
"!	c #948C8C",
"~	c #97BFEB",
"{	c #634A4A",
"]	c #A5948C",
"^	c #FFD6CE",
"/	c #EFE7E7",
"(	c #EFE7EF",
"_	c #666666",
":	c #96C0EB",
"<	c #632121",
"[	c #8C524A",
"}	c #C67373",
"|	c #DEA59C",
"1	c #FF9999",
"2	c #D2928C",
"3	c #392931",
"4	c #91BDEB",
"5	c #842929",
"6	c #AD3939",
"7	c #C64242",
"8	c #D65A52",
"9	c #9C5252",
"0	c #D65242",
"a	c #A53931",
"b	c #942921",
"c	c #90BEEB",
"d	c #AF2925",
"e	c #C7382B",
"f	c #E75242",
"g	c #68A7E6",
"h	c #68100E",
"i	c #E76352",
"j	c #E76B63",
"k	c #71ACEB",
"l	c #F78473",
"m	c #FF8C84",
"n	c #FF948C",
"o	c #E77B6B",
"p	c #79B3EF",
"q	c #FFB59C",
"r	c #7DB6F1",
"s	c #FF7B6B",
"t	c #84BDF7",
"u	c #F7C6A5",
"v	c #848484",
"w	c #8AC2FE",
"x	c #7B5A52",
"y	c #ADADAD",
"z	c #93CAFF",
"A	c #B5B5BD",
"B	c #8C8C8C",
"C	c #77352D",
"D	c #6B634A",
"E	c #BDBDBD",
"F	c #99D0FF",
"G	c #9FD7FF",
"H	c #84847B",
"I	c #7B7B7B",
"J	c #7B8484",
"K	c #A4DAFD",
"L	c #BDBDB5",
"M	c #DEDED6",
"N	c #A6DDFA",
"O	c #A8DEF3",
"P	c #0852B5",
"Q	c #A4B0B7",
".................",
"+++++++++++++++++",
"@@@@@#$%&*$#@@@@@",
"====-;>,')!;-====",
"~~~-{]^/(/^>{_~~~",
"::]<[}||1|2}[3>::",
"44{56678890a6b{44",
"cc<ade088f0ed65cc",
"gghd00ijjjiff6hgg",
"kk57filmlnoi87hkk",
"pp57jlmnqmnli7bpp",
"rr[6sl1q1qnms69rr",
"tt!a8nq1uqqniavtt",
"ww#x[j1quu1o6$yww",
"zzAB{{9}m}9CDvEzz",
"FFFA!_{;;;$_vEFFF",
"GGGG)#BHIJB#)GGGG",
"KKKKK))ALA,MKKKKK",
"NNNNNNNNNNNNNNNNN",
"OOOOOOOOOOOOOOOOO",
"PPPPPPPPPPPPPPPPP",
".................",
"+++++++++++++++++",
"@@@@@@@@@@@@@@@@@",
"=====#$%&*$#=====",
"~~~~-;>,')!;-~~~~",
":::-{]^/(/^>{_:::",
"44]<[}||1|2}[3>44",
"cc{56678890a6b{cc",
"gg<ade088f0ed65gg",
"kkhd00ijjjiff6hkk",
"pp57filmlnoi87hpp",
"rr57jlmnqmnli7brr",
"tt[6sl1q1qnms69tt",
"ww!a8nq1uqqniavww",
"zz#x[j1quu1o6$yzz",
"FFFB{{9}m}9CDvFFF",
"GGGG!_{;;;$_vGGGG",
"KKKKKQBHIJBQKKKKK",
"NNNNNNNNNNNNNNNNN",
"OOOOOOOOOOOOOOOOO",
"PPPPPPPPPPPPPPPPP"};
