<?xml version="1.0" encoding="UTF-8" standalone="no"?>
<!DOCTYPE svg PUBLIC "-//W3C//DTD SVG 20010904//EN"
"http://www.w3.org/TR/2001/REC-SVG-20010904/DTD/svg10.dtd">
<!-- Created with Sodipodi ("http://www.sodipodi.com/") -->
<svg
   xmlns="http://www.w3.org/2000/svg"
   xmlns:sodipodi="http://sodipodi.sourceforge.net/DTD/sodipodi-0.dtd"
   xmlns:xlink="http://www.w3.org/1999/xlink"
   id="svg604"
   sodipodi:version="0.34"
   width="72pt"
   height="72pt"
   sodipodi:docbase="/home/zeus/.themes/Zeus-Test/gtk-2.0/"
   sodipodi:docname="/home/zeus/.themes/Zeus-Test/gtk-2.0/stock-left.svg">
  <defs
     id="defs606">
    <linearGradient
       id="linearGradient612">
      <stop
         style="stop-color:#7fa8e3;stop-opacity:0.741176;"
         offset="0.000000"
         id="stop613" />
      <stop
         style="stop-color:#ffffff;stop-opacity:0;"
         offset="1.000000"
         id="stop614" />
    </linearGradient>
    <linearGradient
       xlink:href="#linearGradient612"
       id="linearGradient615"
       x1="50.6438866"
       y1="5.36792946"
       x2="35.7520943"
       y2="68.0443573"
       gradientUnits="userSpaceOnUse"
       spreadMethod="pad" />
  </defs>
  <sodipodi:namedview
     id="base" />
  <path
     style="fill:#3d4e67;fill-rule:evenodd;stroke:none;stroke-opacity:1;stroke-width:1pt;stroke-linejoin:miter;stroke-linecap:butt;fill-opacity:1;"
     d="M 19.41827 89.14328 C 15.71028 89.08954 9.493881 86.84765 8.951102 80.83155 C 7.03699 74.75315 0.383012 17.30186 3.593848 13.30023 C 5.252922 10.1498 8.865681 7.837098 15.29343 7.035363 C 20.55284 6.238018 68.39315 0.006647 71.9208 0.973828 C 75.44856 1.941073 78.22746 2.758962 78.48123 7.609701 C 78.22032 10.24775 87.10608 64.0561 88.46928 67.22913 C 89.11973 70.94575 88.05199 76.13951 82.61229 77.8504 C 77.17267 79.56124 23.7124 88.41715 19.41827 89.14328 z "
     id="path609"
     sodipodi:nodetypes="ccccccccc" />
  <path
     style="fill:#ffffff;fill-rule:evenodd;stroke:none;stroke-opacity:1;stroke-width:1pt;stroke-linejoin:miter;stroke-linecap:butt;fill-opacity:1;"
     d="M 23.7021 82.77098 C 20.10716 83.24088 15.11361 84.2232 14.51715 79.35691 C 12.03342 67.83718 6.338649 22.18184 10.39644 14.76237 C 11.30274 13.0177 16.22341 10.64955 27.40105 9.660932 C 40.10328 8.396027 66.16631 6.472491 68.90899 6.597442 C 71.65154 6.722424 72.49058 6.414971 73.08712 11.28137 C 72.84486 16.45514 81.11863 56.92784 81.60741 64.09364 C 81.98772 69.18055 82.64223 71.34186 79.2864 72.57163 "
     id="path608"
     sodipodi:nodetypes="cccccccs" />
  <path
     style="fill:url(#linearGradient615);fill-rule:evenodd;stroke:none;stroke-opacity:1;stroke-width:1pt;stroke-linejoin:miter;stroke-linecap:butt;fill-opacity:1;"
     d="M 11.29581 21.65162 C 11.29581 21.65162 11.61913 14.74771 20.92576 13.37287 C 30.23236 11.99807 67.09058 7.312089 67.9688 9.704426 C 68.84697 12.09675 69.93423 27.6439 70.20541 28.90162 C 70.47657 30.15929 39.27552 40.9146 30.70784 51.1789 C 22.14017 61.44317 16.13984 69.74887 16.13984 69.74887 C 16.13984 69.74887 11.23372 33.54875 11.29581 21.65162 z "
     id="path636" />
  <path
     style="font-size:12;fill:none;fill-rule:evenodd;stroke:#4a5a71;stroke-width:4.198394;stroke-linecap:round;"
     d="M 17.3504 24.88429 L 65.9619 18.33518 "
     id="path706"
     sodipodi:nodetypes="cc" />
  <path
     style="font-size:12;fill:none;fill-rule:evenodd;stroke:#4a5a71;stroke-width:4.198394;stroke-linecap:round;"
     d="M 20.85043 36.73506 L 40.68392 33.92831 "
     id="path707"
     sodipodi:nodetypes="cc" />
  <path
     style="font-size:12;fill:none;fill-rule:evenodd;stroke:#4a5a71;stroke-width:4.198394;stroke-linecap:round;"
     d="M 20.46155 48.58585 L 59.35074 42.66046 "
     id="path708"
     sodipodi:nodetypes="cc" />
  <path
     style="font-size:12;fill:none;fill-rule:evenodd;stroke:#4a5a71;stroke-width:4.198394;stroke-linecap:round;"
     d="M 22.01712 62.61966 L 45.7395 58.56544 "
     id="path709"
     sodipodi:nodetypes="cc" />
  <path
     style="font-size:12;fill:none;fill-rule:evenodd;stroke:#4a5a71;stroke-width:4.198394;stroke-linecap:round;"
     d="M 24.35046 73.84671 L 72.96194 64.49084 "
     id="path710"
     sodipodi:nodetypes="cc" />
</svg>
