<?xml version="1.0" encoding="UTF-8" standalone="no"?>
<!DOCTYPE svg PUBLIC "-//W3C//DTD SVG 20010904//EN"
"http://www.w3.org/TR/2001/REC-SVG-20010904/DTD/svg10.dtd">
<!-- Created with Sodipodi ("http://www.sodipodi.com/") -->
<svg
   id="svg596"
   sodipodi:version="0.32"
   width="72pt"
   height="72pt"
   sodipodi:docbase="/home/zeus/desktop/icons/gartoon/svg"
   sodipodi:docname="/home/zeus/desktop/icons/gartoon/svg/gnome-mime-image-x-3ds.svg"
   xmlns="http://www.w3.org/2000/svg"
   xmlns:sodipodi="http://sodipodi.sourceforge.net/DTD/sodipodi-0.dtd"
   xmlns:xlink="http://www.w3.org/1999/xlink">
  <defs
     id="defs598">
    <linearGradient
       id="linearGradient612">
      <stop
         style="stop-color:#7fa8e3;stop-opacity:0.741176;"
         offset="0.000000"
         id="stop613" />
      <stop
         style="stop-color:#ffffff;stop-opacity:0;"
         offset="1.000000"
         id="stop614" />
    </linearGradient>
    <linearGradient
       id="linearGradient626">
      <stop
         style="stop-color:#ff0047;stop-opacity:1;"
         offset="0.000000"
         id="stop627" />
      <stop
         style="stop-color:#ab322d;stop-opacity:0;"
         offset="1.000000"
         id="stop628" />
    </linearGradient>
    <linearGradient
       id="linearGradient618">
      <stop
         style="stop-color:#956d47;stop-opacity:1;"
         offset="0.000000"
         id="stop619" />
      <stop
         style="stop-color:#ab322d;stop-opacity:0;"
         offset="1.000000"
         id="stop620" />
    </linearGradient>
    <linearGradient
       id="linearGradient614">
      <stop
         style="stop-color:#000;stop-opacity:1;"
         offset="0"
         id="stop615" />
      <stop
         style="stop-color:#fff;stop-opacity:1;"
         offset="1"
         id="stop616" />
    </linearGradient>
    <linearGradient
       xlink:href="#linearGradient618"
       id="linearGradient617"
       y2="0.52343726"
       x2="1.07843077"
       y1="0.57031226"
       x1="-0.19608469"
       spreadMethod="pad"
       gradientUnits="objectBoundingBox" />
    <linearGradient
       xlink:href="#linearGradient626"
       id="linearGradient625"
       x1="42.9995728"
       y1="77.3980103"
       x2="28.5382881"
       y2="63.0152588"
       gradientUnits="userSpaceOnUse"
       spreadMethod="pad"
       gradientTransform="matrix(0.934001,0.000000,0.000000,1.070663,-1.516226e-6,-1.716230e-7)" />
    <linearGradient
       xlink:href="#linearGradient612"
       id="linearGradient636"
       x1="16.4110699"
       y1="10.6072874"
       x2="24.6243172"
       y2="61.6665344"
       gradientUnits="userSpaceOnUse"
       spreadMethod="pad" />
  </defs>
  <sodipodi:namedview
     id="base" />
  <g
     id="g898"
     transform="translate(-1.146498,1.146498)">
    <path
       style="fill:#000000;fill-rule:evenodd;stroke:none;stroke-opacity:1;stroke-width:1pt;stroke-linejoin:miter;stroke-linecap:butt;fill-opacity:0.301471;"
       d="M 12.8163 74.753 C 10.3856 73.6481 7.07107 70.1126 8.83884 65.2512 C 9.72267 59.948 25.6326 13.1021 29.1682 10.8924 C 31.3778 8.90368 34.582 8.13026 39.1119 9.34561 C 42.8684 10.2295 76.6769 19.0684 78.6656 20.8361 C 80.6544 22.6039 82.2012 24.0402 80.6544 27.9072 C 79.5496 29.8959 66.4017 74.532 66.1808 77.4047 C 65.2969 80.4983 62.7558 84.2548 58.5573 84.0338 C 54.3589 83.8128 15.9099 75.4159 12.8163 74.753 z "
       id="path794"
       sodipodi:nodetypes="ccccccccc"
       transform="matrix(1.114903,0.000000,0.000000,1.114903,1.287023,-5.035753)" />
    <path
       style="fill:#3d4e67;fill-rule:evenodd;stroke:none;stroke-opacity:1;stroke-width:1pt;stroke-linejoin:miter;stroke-linecap:butt;fill-opacity:1;"
       d="M 12.8163 74.753 C 10.3856 73.6481 7.07107 70.1126 8.83884 65.2512 C 9.72267 59.948 25.6326 13.1021 29.1682 10.8924 C 31.3778 8.90368 34.582 8.13026 39.1119 9.34561 C 42.8684 10.2295 76.6769 19.0684 78.6656 20.8361 C 80.6544 22.6039 82.2012 24.0402 80.6544 27.9072 C 79.5496 29.8959 66.4017 74.532 66.1808 77.4047 C 65.2969 80.4983 62.7558 84.2548 58.5573 84.0338 C 54.3589 83.8128 15.9099 75.4159 12.8163 74.753 z "
       id="path895"
       sodipodi:nodetypes="ccccccccc"
       transform="matrix(1.114903,0.000000,0.000000,1.114903,-1.570116,-9.607182)" />
    <path
       style="fill:#ffffff;fill-rule:evenodd;stroke:none;stroke-opacity:1;stroke-width:1pt;stroke-linejoin:miter;stroke-linecap:butt;fill-opacity:1;"
       d="M 17.8987 70.9965 C 15.3576 70.3336 11.7114 69.6706 13.0373 65.6932 C 15.468 55.9705 27.8424 18.6264 33.1456 13.986 C 34.361 12.8811 38.4489 12.4392 46.1829 14.8699 C 55.0218 17.5215 72.9204 23.4877 74.6882 24.3716 C 76.4559 25.2555 77.1189 25.2555 75.793 29.233 C 73.8043 33.2105 64.9655 67.24 62.7557 72.9852 C 61.209 77.0732 60.8775 78.9514 58.2258 78.9514 "
       id="path896"
       sodipodi:nodetypes="cccccccs"
       transform="matrix(1.114903,0.000000,0.000000,1.114903,-1.570116,-9.607182)" />
    <path
       style="fill:url(#linearGradient636);fill-rule:evenodd;stroke:none;stroke-opacity:1;stroke-width:1pt;stroke-linejoin:miter;stroke-linecap:butt;fill-opacity:1;"
       d="M 28.75 13.75 C 28.75 13.75 31.875 7.49995 39.6875 9.37495 C 47.5 11.25 78.125 19.375 77.8125 21.875 C 77.5 24.375 71.875 39.0625 71.5625 40.3125 C 71.25 41.5625 42.5 40.9375 31.5625 47.5 C 20.625 54.0625 12.5 59.6875 12.5 59.6875 C 12.5 59.6875 23.75 24.6875 28.75 13.75 z "
       id="path636"
       transform="matrix(0.946780,0.000000,0.000000,0.946780,6.111789,-0.736980)" />
  </g>
  <polygon
     sodipodi:type="star"
     style="font-size:12;fill:#f17419;fill-rule:evenodd;stroke-width:1pt;fill-opacity:1;"
     id="polygon1234"
     sodipodi:sides="6"
     sodipodi:cx="31.5286617"
     sodipodi:cy="26.0828018"
     sodipodi:r1="18.4711456"
     sodipodi:r2="15.9964809"
     sodipodi:arg1="0.73050851"
     sodipodi:arg2="1.25410736"
     points="45.2866,38.4076 36.5103,41.2838 27.734,44.16 20.855,37.9975 13.9761,31.8351 15.8734,22.7965 17.7707,13.758 26.547,10.8818 35.3233,8.00564 42.2023,14.1681 49.0813,20.3305 47.1839,29.3691 45.2866,38.4076 "
     transform="matrix(1.244941,0.000000,0.000000,1.244941,10.33465,2.496595)" />
  <path
     style="fill:#8f450e;fill-rule:evenodd;stroke:none;stroke-opacity:1;stroke-width:1pt;stroke-linejoin:miter;stroke-linecap:butt;fill-opacity:1;"
     d="M 49.0127 34.3949 L 45 57.0382 L 66.2102 49.8726 L 70.2229 27.5159 L 49.0127 34.3949 z "
     id="path1271" />
  <path
     style="fill:#f1e36c;fill-rule:evenodd;stroke:none;stroke-opacity:1;stroke-width:1pt;stroke-linejoin:miter;stroke-linecap:butt;fill-opacity:1;"
     d="M 49.0127 34.6815 L 44.7134 56.465 L 28.0892 41.5605 L 33.8217 18.9172 C 33.5351 20.3503 48.4395 35.2548 49.0127 34.6815 z "
     id="path1270"
     sodipodi:nodetypes="ccccc" />
  <path
     style="fill:none;fill-rule:evenodd;stroke:#00ff00;stroke-opacity:1;stroke-width:1pt;stroke-linejoin:miter;stroke-linecap:butt;fill-opacity:1;"
     d="M 32.9618 20.0637 L 49.2994 34.9682 L 70.7962 27.8025 "
     id="path1237" />
  <path
     style="fill:none;fill-rule:evenodd;stroke:#00ff00;stroke-opacity:1;stroke-width:1pt;stroke-linejoin:miter;stroke-linecap:butt;fill-opacity:1;"
     d="M 49.2994 34.9682 L 44.7134 57.0382 "
     id="path1238" />
  <path
     style="fill:none;fill-rule:evenodd;stroke:#00ff00;stroke-opacity:1;stroke-width:1pt;stroke-linejoin:miter;stroke-linecap:butt;fill-opacity:1;"
     d="M 32.9618 20.0637 L 28.0892 42.1338 L 45 57.0382 L 65.9236 50.4459 L 70.7962 28.0892 L 54.172 12.8981 L 32.9618 20.0637 z "
     id="path1239"
     sodipodi:nodetypes="ccccccc" />
  <path
     style="fill:none;fill-rule:evenodd;stroke:#00ff00;stroke-opacity:1;stroke-width:1pt;stroke-linejoin:miter;stroke-linecap:butt;fill-opacity:1;"
     d="M 41.8471 27.8025 L 61.9108 20.9236 "
     id="path1241" />
  <path
     style="fill:none;fill-rule:evenodd;stroke:#00ff00;stroke-opacity:1;stroke-width:1pt;stroke-linejoin:miter;stroke-linecap:butt;fill-opacity:1;"
     d="M 41.2739 28.0892 L 36.6879 49.2994 "
     id="path1242"
     sodipodi:nodetypes="cc" />
  <path
     style="fill:none;fill-rule:evenodd;stroke:#00ff00;stroke-opacity:1;stroke-width:1pt;stroke-linejoin:miter;stroke-linecap:butt;fill-opacity:1;"
     d="M 61.3376 31.5287 L 56.465 53.5987 "
     id="path1243" />
  <path
     style="fill:none;fill-rule:evenodd;stroke:#00ff00;stroke-opacity:1;stroke-width:1pt;stroke-linejoin:miter;stroke-linecap:butt;fill-opacity:1;"
     d="M 43.2803 16.3375 C 44.4268 17.1974 60.4777 31.8153 60.4777 31.8153 "
     id="path1244"
     sodipodi:nodetypes="cc" />
  <path
     style="fill:none;fill-rule:evenodd;stroke:#00ff00;stroke-opacity:1;stroke-width:1pt;stroke-linejoin:miter;stroke-linecap:butt;fill-opacity:1;"
     d="M 30.0955 30.9554 L 47.2929 45.8599 L 68.5032 38.4076 "
     id="path1245"
     sodipodi:nodetypes="ccc" />
  <path
     transform="matrix(0.984710,0.174200,-0.174200,0.984710,0.000000,0.000000)"
     style="font-size:13;font-weight:bold;fill:#3d4e67;stroke-width:1pt;font-family:Kid Kosmic;"
     d="M 70.6695 54.706 C 70.6018 54.9937 70.4325 55.273 70.1617 55.5439 C 69.8739 55.8401 69.5861 55.9882 69.2984 55.9882 C 69.0614 55.9882 68.8667 55.874 68.7144 55.6454 C 67.2587 55.2561 65.8368 55.0868 64.4488 55.1376 C 63.0946 55.1799 62.3667 55.3746 62.2652 55.7216 C 62.2398 55.7555 62.2229 55.7809 62.2144 55.7978 C 62.189 55.9163 62.3879 56.0305 62.8111 56.1406 C 62.938 56.1829 63.5601 56.3225 64.6773 56.5595 C 65.1597 56.6611 65.8833 56.8261 66.8482 57.0546 C 67.813 57.2831 68.4859 57.537 68.8667 57.8163 C 69.51 58.5357 69.7935 59.1747 69.7173 59.7333 C 69.6496 60.2496 69.438 60.8505 69.0826 61.5361 C 68.4309 62.3655 67.6734 62.9918 66.8101 63.415 C 65.3967 64.109 63.924 64.456 62.3921 64.456 C 60.5132 64.456 58.9348 63.8932 57.6568 62.7675 C 57.5214 62.5982 57.4537 62.412 57.4537 62.2089 C 57.4537 61.9804 57.5425 61.7265 57.7203 61.4472 C 57.9742 61.0579 58.2662 60.8632 58.5962 60.8632 C 58.6978 60.8632 58.8121 60.8844 58.939 60.9267 C 59.5568 61.4599 60.2805 61.8915 61.1099 62.2216 C 61.4146 62.3401 61.7828 62.3993 62.2144 62.3993 C 62.9592 62.3993 63.8944 62.2301 65.0201 61.8915 C 66.1373 61.3922 66.7255 60.9944 66.7847 60.6982 C 66.8355 60.4697 66.6662 60.1523 66.2769 59.746 C 65.7776 59.4075 65.0116 59.1536 63.979 58.9843 C 63.3866 58.8997 62.5064 58.76 61.3384 58.5654 C 60.4836 58.4046 59.7769 58.0829 59.2183 57.6005 C 58.8798 57.3128 58.7105 56.9107 58.7105 56.3945 C 58.7105 56.0305 58.7951 55.6158 58.9644 55.1503 C 59.396 54.2447 60.3313 53.5634 61.7701 53.1064 C 62.8703 52.7678 64.0679 52.5986 65.3628 52.5986 C 67.8596 52.5986 69.6327 53.136 70.6822 54.2109 C 70.6991 54.4055 70.6949 54.5706 70.6695 54.706 z M 51.9439 52.7636 C 53.6874 52.7636 55.0077 53.1868 55.9048 54.0331 C 56.8104 54.871 57.3775 56.204 57.606 58.0322 C 57.5806 60.4443 56.5142 62.1454 54.4068 63.1357 C 52.6802 63.9566 50.1031 64.3544 46.6753 64.329 C 46.2014 64.2444 45.9136 64.1598 45.8121 64.0751 C 45.702 63.9905 45.5624 63.7239 45.3931 63.2753 C 45.3931 60.5839 45.647 58.121 46.1548 55.8866 C 46.1802 55.7936 46.1929 55.7005 46.1929 55.6074 C 46.1929 55.4889 46.1675 55.3365 46.1167 55.1503 C 46.0575 54.9557 46.0279 54.816 46.0279 54.7314 C 46.0279 54.359 46.2902 54.0247 46.815 53.7284 C 48.7531 53.0852 50.4628 52.7636 51.9439 52.7636 z M 47.9068 58.997 C 47.8221 59.7333 47.7798 60.3596 47.7798 60.8759 C 47.7798 61.3414 47.8137 61.718 47.8814 62.0058 C 48.33 62.0396 48.7912 62.0566 49.2652 62.0566 C 50.8733 62.0566 52.1724 61.8577 53.1626 61.4599 C 54.593 60.8844 55.3082 59.9111 55.3082 58.54 C 55.0289 56.3733 53.6578 55.29 51.1949 55.29 C 50.3401 55.29 49.426 55.4381 48.4527 55.7343 C 48.2157 56.8176 48.0337 57.9052 47.9068 58.997 z M 45.1519 55.1249 L 45.1646 55.163 C 43.6242 56.1448 42.1727 56.9277 40.8101 57.5116 C 42.9937 58.8489 44.0855 60.1734 44.0855 61.4853 C 44.0855 61.6546 44.0686 61.8196 44.0347 61.9804 C 43.8485 62.8606 43.1714 63.4996 42.0035 63.8974 C 41.1994 64.1682 40.2177 64.3206 39.0582 64.3544 C 37.2046 64.3967 35.0337 63.9736 32.5455 63.0849 C 32.4439 62.7294 32.4185 62.429 32.4693 62.1835 C 32.6132 61.5064 32.9771 61.1679 33.5611 61.1679 C 33.6711 61.1679 33.7938 61.1848 33.9292 61.2187 C 36.1975 61.7773 37.9029 62.0608 39.0455 62.0693 C 40.205 62.0862 40.8186 61.9339 40.8863 61.6122 C 40.9624 61.2398 40.497 60.6855 39.4898 59.9491 C 38.872 59.5006 38.1906 59.0689 37.4458 58.6542 C 37.3951 58.6627 37.3443 58.6669 37.2935 58.6669 C 36.7434 58.6669 36.4683 58.413 36.4683 57.9052 C 36.4683 57.8121 36.4768 57.7105 36.4937 57.6005 C 36.6037 57.1096 37.0354 56.7922 37.7886 56.6484 C 38.7704 56.1744 39.6845 55.6497 40.5308 55.0741 C 39.2105 55.108 37.4035 55.235 35.1099 55.455 C 34.5344 55.5058 34.1662 55.3111 34.0054 54.871 C 33.9631 54.7695 33.9419 54.6679 33.9419 54.5663 C 33.9419 54.2363 34.1578 53.8554 34.5894 53.4238 C 37.3993 52.9413 39.9764 52.7001 42.3208 52.7001 C 43.1672 52.7001 44.0389 52.7297 44.9361 52.789 C 45.4016 53.0175 45.6343 53.3772 45.6343 53.8681 C 45.6343 54.4267 45.4735 54.8456 45.1519 55.1249 z M 31.4537 62.4882 C 31.4537 62.9114 31.2505 63.2838 30.8443 63.6054 C 30.4465 63.927 30.0191 64.0878 29.5621 64.0878 C 29.3928 64.0878 29.2362 64.0624 29.0923 64.0117 C 28.6692 63.8424 28.4576 63.5419 28.4576 63.1103 C 28.4576 62.8141 28.5634 62.5263 28.7749 62.247 C 29.1812 61.7307 29.689 61.4726 30.2984 61.4726 C 30.4761 61.4726 30.6454 61.5022 30.8062 61.5615 C 31.2378 61.7223 31.4537 62.0312 31.4537 62.4882 z "
     id="path1275" />
</svg>
