<?xml version="1.0" encoding="UTF-8" standalone="no"?>
<!DOCTYPE svg PUBLIC "-//W3C//DTD SVG 20010904//EN"
"http://www.w3.org/TR/2001/REC-SVG-20010904/DTD/svg10.dtd">
<!-- Created with Inkscape (http://www.inkscape.org/) -->
<svg
   version="1"
   x="0.00000000"
   y="0.00000000"
   width="48pt"
   height="48pt"
   id="svg548"
   sodipodi:version="0.32"
   sodipodi:docname="stock_cdplayer-prev.svg"
   sodipodi:docbase="/root/Desktop"
   inkscape:version="0.38.1"
   xmlns="http://www.w3.org/2000/svg"
   xmlns:inkscape="http://www.inkscape.org/namespaces/inkscape"
   xmlns:sodipodi="http://sodipodi.sourceforge.net/DTD/sodipodi-0.dtd"
   xmlns:xlink="http://www.w3.org/1999/xlink">
  <sodipodi:namedview
     id="base"
     inkscape:zoom="9.6562500"
     inkscape:cx="16.000000"
     inkscape:cy="35.905321"
     inkscape:window-width="1014"
     inkscape:window-height="696"
     inkscape:window-x="0"
     inkscape:window-y="27"
     showguides="true"
     snaptoguides="true" />
  <defs
     id="defs550">
    <linearGradient
       x1="0.00000000"
       y1="0.00000000"
       x2="1.00000000"
       y2="0.00000000"
       id="linearGradient556"
       gradientUnits="objectBoundingBox"
       spreadMethod="pad">
      <stop
         style="stop-color:#ff8700;stop-opacity:1;"
         offset="0.00000000"
         id="stop557" />
      <stop
         style="stop-color:#ffff8d;stop-opacity:0;"
         offset="1.00000000"
         id="stop558" />
    </linearGradient>
    <linearGradient
       x1="0.00000000"
       y1="0.00000000"
       x2="1.00000000"
       y2="0.00000000"
       id="linearGradient559"
       xlink:href="#linearGradient556"
       gradientUnits="objectBoundingBox"
       spreadMethod="pad" />
    <sodipodi:namedview
       id="namedview852"
       inkscape:zoom="9.65625000"
       inkscape:cx="16.0000000"
       inkscape:cy="28.4271845"
       inkscape:window-width="1014"
       inkscape:window-height="696"
       inkscape:window-x="0"
       inkscape:window-y="0" />
    <defs
       id="defs853">
      <linearGradient
         x1="0.00000000"
         y1="0.00000000"
         x2="1.00000000"
         y2="0.00000000"
         id="linearGradient854"
         gradientUnits="objectBoundingBox"
         spreadMethod="pad">
        <stop
           style="stop-color:#ff8700;stop-opacity:1;"
           offset="0.00000000"
           id="stop855" />
        <stop
           style="stop-color:#ffff8d;stop-opacity:0;"
           offset="1.00000000"
           id="stop856" />
      </linearGradient>
      <linearGradient
         x1="0.00000000"
         y1="0.00000000"
         x2="1.00000000"
         y2="0.00000000"
         id="linearGradient857"
         xlink:href="#linearGradient556"
         gradientUnits="objectBoundingBox"
         spreadMethod="pad" />
    </defs>
  </defs>
  <g
     transform="matrix(1.048427,1.439171,-1.439171,1.048427,21.62858,-82.64666)"
     style="font-size:12.000000;"
     id="g584">
    <path
       d="M 51.966500,36.048600 C 53.960200,37.045400 65.472400,34.771300 65.757200,32.635300 C 66.172581,27.312501 55.630700,20.715100 54.064200,20.145500 C 52.497700,19.575900 51.112100,20.063400 50.684900,21.060200 C 50.257700,22.057000 49.688100,35.336500 51.966500,36.048600 z "
       transform="matrix(1.369638,0.000000,0.000000,1.207417,-21.85404,-4.997635)"
       style="fill:#0d3c07;fill-rule:evenodd;stroke-width:1pt;"
       id="path582"
       sodipodi:nodetypes="ccscc" />
    <path
       d="M 51.550600,35.458900 C 53.544300,36.455700 64.224700,34.889200 64.509500,32.753200 C 64.794300,30.617100 60.955464,29.668153 61.382664,28.244153 C 57.018216,23.149473 50.696200,21.360800 50.269000,22.357600 C 49.841800,23.354400 49.272200,34.746800 51.550600,35.458900 z "
       style="fill:#2aaf18;fill-rule:evenodd;stroke-width:1pt;"
       id="path581"
       sodipodi:nodetypes="ccccc" />
    <path
       d="M 61.946200,28.338600 C 63.512600,29.620200 65.363900,32.753100 64.367100,33.607600 C 62.658300,35.174000 52.832300,36.313300 51.693000,35.743700 C 50.553800,35.174000 60.094900,33.465200 60.237300,31.044300 C 60.379700,28.623400 57.458082,27.995128 58.312482,26.571028 C 59.166882,25.147028 61.519000,27.769000 61.946200,28.338600 z "
       style="fill:#208c11;fill-rule:evenodd;stroke-width:1pt;"
       id="path583"
       sodipodi:nodetypes="cccccc" />
  </g>
  <path
     d="M 28.047406,25.926778 C 28.047406,25.926778 36.429736,17.624343 38.517282,17.044699 C 40.604694,16.465173 39.433514,20.455473 39.433514,20.455473 C 39.433514,20.455473 28.829135,24.416174 28.047406,25.926778 z "
     style="font-size:12.000000;fill:#ffffff;fill-rule:evenodd;stroke-width:1.0000000pt;"
     id="path589" />
  <path
     style="fill:#0d3c07;fill-rule:evenodd;stroke-width:1.0000000pt;"
     d="M 2.9588900,7.7630450 L 7.8759970,7.2357915 C 10.316230,7.0952339 11.809297,7.0040489 15.049522,7.2717936 L 14.544683,51.128419 C 11.365970,51.986597 10.156092,52.237361 7.3459180,51.773281 C 5.3373040,51.235879 6.8637900,51.709335 4.2318500,50.796523 C 4.0116500,51.304958 2.1566420,9.5425225 2.9588900,7.7630450 z "
     id="path590"
     sodipodi:nodetypes="ccccccc" />
  <path
     style="fill:#2aaf18;fill-rule:evenodd;stroke-width:1.0000000pt;"
     d="M 5.4142550,9.4955586 C 6.4847250,9.1022612 7.5540400,9.0320233 8.6233400,8.9617851 C 9.6926550,8.8915471 10.647625,8.7673000 11.830133,9.0741326 L 11.684010,49.995186 C 10.746939,50.451505 9.8108670,50.638599 8.8753350,50.664163 C 7.9398200,50.689705 7.4055770,50.608168 6.0708700,50.148560 L 5.4142550,9.4955586 z "
     id="path591"
     sodipodi:nodetypes="ccccccc" />
  <path
     style="fill:#208c11;fill-rule:evenodd;stroke-width:1.0000000pt;"
     d="M 11.218301,9.5578376 L 11.178961,49.617553 C 11.178961,49.617553 10.128111,49.871791 9.0715540,49.910629 C 8.0149960,49.949479 6.9527130,49.772943 6.9267910,49.772905 C 6.8749460,49.772830 6.7219110,49.072625 7.4510610,48.158345 C 8.2762510,47.184309 9.6703480,48.417909 9.6826620,47.569311 L 10.232812,9.6640936 C 10.236245,9.4280476 11.219020,8.8376191 11.218301,9.5578376 z "
     id="path592"
     sodipodi:nodetypes="ccssssss" />
  <path
     style="fill:#ffffff;fill-rule:evenodd;stroke-width:1.0000000pt;"
     d="M 6.1787660,10.240027 C 7.0921630,9.2343978 8.6064500,9.8120015 8.6061950,9.8839263 C 7.5332050,13.119012 7.7031290,29.230565 7.7031290,29.230565 C 7.4858800,29.913546 7.1737310,32.104613 6.9724770,32.142490 C 6.7943890,32.175996 6.5777970,30.075467 6.5651000,29.444692 L 6.1787660,10.240027 z "
     id="path577"
     sodipodi:nodetypes="ccsssc" />
</svg>
