<?xml version="1.0" encoding="UTF-8" standalone="no"?>
<!DOCTYPE svg PUBLIC "-//W3C//DTD SVG 20010904//EN"
"http://www.w3.org/TR/2001/REC-SVG-20010904/DTD/svg10.dtd">
<!-- Created with Sodipodi ("http://www.sodipodi.com/") -->
<svg
   xmlns="http://www.w3.org/2000/svg"
   xmlns:xlink="http://www.w3.org/1999/xlink"
   xmlns:sodipodi="http://sodipodi.sourceforge.net/DTD/sodipodi-0.dtd"
   version="1.0"
   x="0"
   y="0"
   width="90"
   height="90"
   id="svg604"
   sodipodi:version="0.34"
   sodipodi:docname="/home/zeus/.themes/Zeus-Test/gtk-2.0/stock_text-unindent.svg"
   sodipodi:docbase="/home/zeus/.themes/Zeus-Test/gtk-2.0/">
  <sodipodi:namedview
     id="base" />
  <defs
     id="defs606">
    <linearGradient
       id="linearGradient612">
      <stop
         style="stop-color:#7fa8e3;stop-opacity:0.7412;"
         offset="0"
         id="stop613" />
      <stop
         style="stop-color:#ffffff;stop-opacity:0;"
         offset="1"
         id="stop614" />
    </linearGradient>
    <linearGradient
       x1="50.6438866"
       y1="5.36792946"
       x2="35.7520943"
       y2="68.0443573"
       id="linearGradient615"
       xlink:href="#linearGradient612"
       gradientUnits="userSpaceOnUse"
       spreadMethod="pad" />
  </defs>
  <path
     d="M 20.42712 88.85296 C 16.88203 88.79957 10.93874 86.57242 10.4198 80.59589 C 8.58979 74.55748 2.228139 17.48411 5.297914 13.50879 C 6.884098 10.37908 10.33813 8.081595 16.48349 7.285135 C 21.51183 6.493034 67.25037 0.302652 70.62303 1.263471 C 73.99581 2.224354 76.6526 3.036863 76.89523 7.855695 C 76.64579 10.4764 85.14116 63.9308 86.44447 67.08296 C 87.06635 70.77513 86.04552 75.93472 80.84479 77.63435 C 75.64416 79.33395 24.5326 88.13159 20.42712 88.85296 z "
     style="font-size:12;fill:#3d4e67;fill-rule:evenodd;"
     id="path609" />
  <path
     d="M 24.52273 82.52256 C 21.08573 82.98937 16.31157 83.96523 15.74132 79.13095 C 13.3667 67.68701 7.922129 22.33199 11.80164 14.96131 C 12.66813 13.22812 17.37262 10.87554 28.05917 9.893436 C 40.20335 8.636844 65.12135 6.725966 67.74353 6.850093 C 70.3656 6.974254 71.16777 6.668823 71.7381 11.50321 C 71.50647 16.64294 79.41676 56.84944 79.88407 63.96809 C 80.24767 69.02153 80.87343 71.16863 77.66502 72.39031 "
     style="font-size:12;fill:#ffffff;fill-rule:evenodd;"
     id="path608" />
  <path
     d="M 12.6615 21.80525 C 12.6615 21.80525 12.97062 14.94675 21.86837 13.58095 C 30.7661 12.21519 66.00502 7.56004 66.84465 9.936641 C 67.68423 12.31323 68.72373 27.75811 68.98298 29.00756 C 69.24225 30.25696 39.41196 40.94151 31.22069 51.1383 C 23.02944 61.33506 17.29271 69.58612 17.29271 69.58612 C 17.29271 69.58612 12.60215 33.62411 12.6615 21.80525 z "
     style="font-size:12;fill:url(#linearGradient615);fill-rule:evenodd;"
     id="path636" />
  <path
     d="M 18.45009 25.01665 L 64.92591 18.51062 "
     style="font-size:12;fill:none;fill-rule:evenodd;stroke:#4a5a71;stroke-width:4.091609;stroke-linecap:round;"
     id="path706" />
  <path
     d="M 38.52766 34.00118 L 66.04133 29.66382 "
     style="font-size:12;fill:none;fill-rule:evenodd;stroke:#4a5a71;stroke-width:4.091609;stroke-linecap:round;"
     id="path707" />
  <path
     d="M 41.87391 45.77401 L 67.15675 41.12684 "
     style="font-size:12;fill:none;fill-rule:evenodd;stroke:#4a5a71;stroke-width:4.091609;stroke-linecap:round;"
     id="path708" />
  <path
     d="M 43.36113 57.54682 L 69.01577 52.89965 "
     style="font-size:12;fill:none;fill-rule:evenodd;stroke:#4a5a71;stroke-width:4.091609;stroke-linecap:round;"
     id="path709" />
  <path
     d="M 25.14262 73.657 L 71.61842 64.36268 "
     style="font-size:12;fill:none;fill-rule:evenodd;stroke:#4a5a71;stroke-width:4.091609;stroke-linecap:round;"
     id="path710" />
  <g
     transform="matrix(-0.19288,-0.50448,-0.438784,7.803596e-2,43.18252,53.63988)"
     style="font-size:12;"
     id="g682">
    <defs
       id="defs550">
      <linearGradient
         x1="0"
         y1="0"
         x2="1"
         y2="0"
         id="linearGradient556"
         gradientUnits="objectBoundingBox"
         spreadMethod="pad">
        <stop
           style="stop-color:#ff8700;stop-opacity:1;"
           offset="0"
           id="stop557" />
        <stop
           style="stop-color:#ffff8d;stop-opacity:0;"
           offset="1"
           id="stop558" />
      </linearGradient>
      <linearGradient
         x1="0"
         y1="0"
         x2="1"
         y2="0"
         id="linearGradient559"
         xlink:href="#linearGradient556"
         gradientUnits="objectBoundingBox"
         spreadMethod="pad" />
    </defs>
    <path
       d="M 51.9665 36.0486 C 53.9602 37.0454 65.20482 39.65023 65.48962 37.51422 C 64.34288 34.42199 61.38139 32.17381 61.60069 30.63191 C 62.02789 29.20781 68.41024 19.72011 67.85634 17.99121 C 66.26284 14.84691 62.38818 11.19485 59.61133 13.25934 C 57.04183 16.39958 53.88892 24.26578 52.32242 23.69618 C 50.71228 24.31008 47.40281 21.10238 46.97561 22.09918 C 46.54842 23.09598 49.6881 35.3365 51.9665 36.0486 z "
       transform="matrix(1.081451,-1.441644,0.694035,1.745769,-68.11286,71.5964)"
       style="fill:#0d3c07;fill-rule:evenodd;"
       id="path582" />
    <path
       d="M 49.79802 37.52962 C 51.79172 38.52642 63.60147 40.45933 63.88628 38.32334 C 64.17108 36.18724 59.17928 33.27601 59.60648 31.85201 C 60.03367 30.42791 69.4937 17.6582 68.212 16.519 C 66.9304 15.3797 62.6582 11.3924 61.519 12.674 C 60.3797 13.9557 52.62867 27.86461 51.06217 27.29501 C 49.49567 26.72541 46.13126 23.92755 45.70406 24.92435 C 45.27686 25.92115 47.51962 36.81752 49.79802 37.52962 z "
       transform="matrix(0.789589,-1.052573,0.57481,1.445871,-47.98446,55.81936)"
       style="fill:#2aaf18;fill-rule:evenodd;"
       id="path581" />
    <path
       d="M 67.6424 15.9494 C 67.6424 15.9494 69.0665 16.8038 68.0696 18.5127 C 67.0728 20.2215 58.84579 32.11449 59.27299 32.68409 C 60.83939 33.96569 64.54568 37.24423 63.54887 38.09873 C 61.84007 39.66513 51.71666 37.50908 50.57737 36.93948 C 49.43816 36.36978 62.15273 37.3728 57.39603 32.59019 C 57.53843 30.16929 58.7778 28.32641 59.6322 26.90231 C 60.4866 25.47831 65.3639 14.9525 66.2184 15.2373 C 67.0728 15.5221 67.7848 16.519 67.6424 15.9494 z "
       transform="matrix(0.789589,-1.052573,0.57481,1.445871,-47.98446,55.81936)"
       style="fill:#208c11;fill-rule:evenodd;"
       id="path583" />
    <path
       d="M 16.9462 4.6519 C 16.9462 4.6519 9.25633 14.193 9.54114 15.0475 C 9.82595 15.9019 17.3734 8.49683 16.9462 4.6519 z "
       transform="matrix(0.789589,-1.052573,0.57481,1.445871,-6.508902,20.37594)"
       style="fill:#ffffff;fill-rule:evenodd;"
       id="path588" />
    <path
       d="M 6.584837 20.72351 C 2.612252 18.09925 0.675687 18.22699 1.102897 17.08769 C 1.530117 15.94849 3.27656 18.7037 5.706755 18.73263 C 7.218279 21.70708 7.979783 19.72312 6.584837 20.72351 z "
       transform="matrix(0.789589,-1.052573,0.57481,1.445871,-6.508902,20.37594)"
       style="fill:#ffffff;fill-rule:evenodd;"
       id="path589" />
  </g>
</svg>
