/* XPM */
static char * xchat_32x32_xpm[] = {
"32 32 231 2",
"  	c None",
". 	c #030200",
"+ 	c #2F2A00",
"@ 	c #484200",
"# 	c #0F0E00",
"$ 	c #322D00",
"% 	c #060500",
"& 	c #000000",
"* 	c #413A00",
"= 	c #D2BD00",
"- 	c #F2DA00",
"; 	c #938400",
"> 	c #DCC500",
", 	c #655A00",
"' 	c #322B00",
") 	c #F2D100",
"! 	c #FEDC00",
"~ 	c #978200",
"{ 	c #121000",
"] 	c #524600",
"^ 	c #645400",
"/ 	c #FED500",
"( 	c #F5CD00",
"_ 	c #977D00",
": 	c #776300",
"< 	c #0C0A00",
"[ 	c #CCA400",
"} 	c #FECC00",
"| 	c #977800",
"1 	c #120E00",
"2 	c #D9AF00",
"3 	c #261F00",
"4 	c #423300",
"5 	c #D9A800",
"6 	c #FEC500",
"7 	c #F5BE00",
"8 	c #977400",
"9 	c #715700",
"0 	c #261C00",
"a 	c #D9A100",
"b 	c #FEBC00",
"c 	c #976F00",
"d 	c #120D00",
"e 	c #090600",
"f 	c #684C00",
"g 	c #422F00",
"h 	c #D99A00",
"i 	c #FEB500",
"j 	c #F5AE00",
"k 	c #976A00",
"l 	c #684900",
"m 	c #ECA700",
"n 	c #261A00",
"o 	c #D99400",
"p 	c #FEAD00",
"q 	c #976600",
"r 	c #120C00",
"s 	c #684600",
"t 	c #422B00",
"u 	c #D98D00",
"v 	c #FEA500",
"w 	c #F59F00",
"x 	c #976100",
"y 	c #674200",
"z 	c #EC9900",
"A 	c #261700",
"B 	c #D98600",
"C 	c #FE9D00",
"D 	c #422700",
"E 	c #D97F00",
"F 	c #FE9500",
"G 	c #626772",
"H 	c #939BAB",
"I 	c #574839",
"J 	c #D97800",
"K 	c #FE8D00",
"L 	c #E57F00",
"M 	c #251400",
"N 	c #979FAD",
"O 	c #646973",
"P 	c #323539",
"Q 	c #8D4A00",
"R 	c #FE8500",
"S 	c #BF6400",
"T 	c #A4AAB6",
"U 	c #36393C",
"V 	c #70737B",
"W 	c #A8AEB9",
"X 	c #606368",
"Y 	c #E69240",
"Z 	c #E79341",
"` 	c #E89441",
" .	c #F78415",
"..	c #E99542",
"+.	c #665443",
"@.	c #404143",
"#.	c #414244",
"$.	c #B9BDC4",
"%.	c #BEC2C8",
"&.	c #6D6F71",
"*.	c #777A80",
"=.	c #B4B9C1",
"-.	c #B5BAC2",
";.	c #B8BBC3",
">.	c #BABEC5",
",.	c #BCBFC6",
"'.	c #7E8084",
").	c #7F8185",
"!.	c #C0C3C9",
"~.	c #C1C4C9",
"{.	c #C2C5CA",
"].	c #C3C6CB",
"^.	c #C5C7CC",
"/.	c #C6C8CD",
"(.	c #C7CACE",
"_.	c #EC9244",
":.	c #CACCD0",
"<.	c #CBCDD0",
"[.	c #CCCED1",
"}.	c #CDCFD2",
"|.	c #CED0D2",
"1.	c #CFD0D3",
"2.	c #D0D1D4",
"3.	c #454546",
"4.	c #D2D3D5",
"5.	c #D2D4D5",
"6.	c #D3D4D5",
"7.	c #8D8D8E",
"8.	c #8A8B8D",
"9.	c #D0D2D4",
"0.	c #454646",
"a.	c #8D8E8F",
"b.	c #D5D6D6",
"c.	c #474747",
"d.	c #8F8F8F",
"e.	c #D6D7D7",
"f.	c #D7D7D6",
"g.	c #D8D9D5",
"h.	c #484847",
"i.	c #DADAD4",
"j.	c #494846",
"k.	c #8F908F",
"l.	c #D7D8D6",
"m.	c #474847",
"n.	c #5E2400",
"o.	c #CAA78D",
"p.	c #484846",
"q.	c #A94200",
"r.	c #973B00",
"s.	c #B9A18C",
"t.	c #DDDCD1",
"u.	c #4A4945",
"v.	c #DFDDD0",
"w.	c #381600",
"x.	c #E2DFCE",
"y.	c #4B4A44",
"z.	c #E3E0CD",
"A.	c #4C4A44",
"B.	c #96948A",
"C.	c #E3DFCE",
"D.	c #E3E0CE",
"E.	c #E4E0CD",
"F.	c #E4E1CC",
"G.	c #EDB588",
"H.	c #EEB588",
"I.	c #E6E2CB",
"J.	c #4C4B43",
"K.	c #FE5D00",
"L.	c #EC5600",
"M.	c #4B1C00",
"N.	c #9B9787",
"O.	c #E8E3C9",
"P.	c #4D4B43",
"Q.	c #E9E3C9",
"R.	c #E9E4C9",
"S.	c #EAE4C8",
"T.	c #EAE5C8",
"U.	c #4E4C42",
"V.	c #EBE5C7",
"W.	c #503C2C",
"X.	c #C1612C",
"Y.	c #4D4C42",
"Z.	c #191916",
"`.	c #EC4F00",
" +	c #672300",
".+	c #1A1916",
"++	c #120500",
"@+	c #4B1500",
"#+	c #541800",
"$+	c #C63B00",
"%+	c #421300",
"&+	c #4B1700",
"*+	c #2F0D00",
"=+	c #681E00",
"-+	c #090200",
";+	c #972900",
">+	c #F54300",
",+	c #FE4600",
"'+	c #EC4100",
")+	c #671D00",
"!+	c #421200",
"~+	c #D93C00",
"{+	c #681C00",
"]+	c #581400",
"^+	c #FE3D00",
"/+	c #EC3800",
"(+	c #4B1200",
"_+	c #260900",
":+	c #D93400",
"<+	c #4B1100",
"[+	c #711700",
"}+	c #FE3600",
"|+	c #EC3200",
"1+	c #671600",
"2+	c #420E00",
"3+	c #D92E00",
"4+	c #7D1A00",
"5+	c #0C0200",
"6+	c #BC2100",
"7+	c #FB2C00",
"8+	c #FE2D00",
"9+	c #EC2A00",
"0+	c #4B0D00",
"a+	c #260600",
"b+	c #D92700",
"c+	c #250500",
"d+	c #B01A00",
"e+	c #E52200",
"f+	c #610F00",
"g+	c #420A00",
"h+	c #CC1E00",
"                                                                ",
"                                                                ",
"        . + @ #                                 # @ $ %         ",
"      & * = - ; &                             & ; - > , &       ",
"      ' ) ! ! ! ~ {                         { ~ ! ! ! ! ]       ",
"      ^ / / / / ( _ &                     & _ ( / / / / :       ",
"      < [ } } } } } | 1                 1 | } } } } } 2 3       ",
"      & 4 5 6 6 6 6 7 8 &             & 9 7 6 6 6 6 5 4 &       ",
"        & 0 a b b b b b c d         e f b b b b b a 0 &         ",
"          & g h i i i i j k &     & l m i i i i h g &           ",
"            & n o p p p p p q r e s p p p p p o n &             ",
"              & t u v v v v w x y z v v v v u t &               ",
"                & A B C C C C C C C C C C B A &                 ",
"                  & D E F F F F F F F F E D &                   ",
"                  G H I J K K K K K K L M &             N       ",
"                  O N P Q R R R R R R S & &             T U     ",
"                  V W X Y Y Z Z `  .....+.@.#.  $.      %.&.    ",
"  *.=.-.;.$.>.,.'.).!.~.{.].^./.(._.:.<.[.}.|.1.2.3.  4.5.6.7.  ",
"  8.9.0.& & & & & a.b.c.& & & d.e.c.f.f.& & & & g.h.  & i.j.&   ",
"  k.l.m.    & & n.o.i.p.q.q.r.s.t.u.v.v.w.q.q.n.x.y.    z.A.    ",
"  B.x.C.D.z.E.F.G.H.I.J.K.L.M.N.O.P.Q.R.S.S.S.T.T.U.    V.U.    ",
"    J.P.P.P.P.P.W.X.Y.Z.`. +&   U..+U.U.U.U.U.U.U..+&   U..+    ",
"    & & ++@+#+#+#+$+#+%+&+&     & & & & *+#+#+#+#+#+=+-+& &     ",
"      & ;+>+,+,+,+,+'+)+&             & !+~+,+,+,+,+'+{+&       ",
"      ]+^+^+^+^+^+/+(+&                 & _+:+^+^+^+^+^+<+      ",
"      [+}+}+}+}+|+1+&                     & 2+3+}+}+}+}+4+      ",
"      5+6+7+8+9+0+&                         & a+b+8+8+b+a+      ",
"      & c+d+e+f+&                             & g+h+h+g+&       ",
"          & &                                     & &           ",
"                                                                ",
"                                                                ",
"                                                                "};
