/* XPM */
static char * frameATL_xpm[] = {
"24 24 25 1",
" 	c None",
".	c #0024B3",
"+	c #68A7E6",
"@	c #E2ECF9",
"#	c #CCDFF4",
"$	c #B8D4F0",
"%	c #A9CBEC",
"&	c #A3C7EC",
"*	c #A0C6EC",
"=	c #97BFEB",
"-	c #96C0EB",
";	c #91BDEB",
">	c #90BEEB",
",	c #71ACEB",
"'	c #79B3EF",
")	c #7DB6F1",
"!	c #84BDF7",
"~	c #8AC2FE",
"{	c #93CAFF",
"]	c #99D0FF",
"^	c #9FD7FF",
"/	c #A4DAFD",
"(	c #A6DDFA",
"_	c #A8DEF3",
":	c #0852B5",
"........................",
"+@@@@@@@@@@@@@@@@@@@@@@@",
"+#######################",
"+$$                     ",
"+%%                     ",
"+&&                     ",
"+**                     ",
"+==                     ",
"+--                     ",
"+;;                     ",
"+>>                     ",
"+++                     ",
"+,,                     ",
"+''                     ",
"+))                     ",
"+!!                     ",
"+~~                     ",
"+{{                     ",
"+]]                     ",
"+^^                     ",
"+//                     ",
"+((                     ",
"+__                     ",
":::                     "};
