/* XPM */
static char * gaim_32x32_xpm[] = {
"32 32 300 2",
"  	c None",
". 	c #99861E",
"+ 	c #D3B921",
"@ 	c #EECC1F",
"# 	c #EDC819",
"$ 	c #CEAA11",
"% 	c #8C700B",
"& 	c #251C01",
"* 	c #C1AE27",
"= 	c #F2DA37",
"- 	c #F4DE40",
"; 	c #F4DC3E",
"> 	c #F3D831",
", 	c #F0CC1C",
"' 	c #EBBC0E",
") 	c #AD8004",
"! 	c #291C01",
"~ 	c #CDB92E",
"{ 	c #F4E147",
"] 	c #F6E86D",
"^ 	c #F6E97C",
"/ 	c #F6E875",
"( 	c #F5E359",
"_ 	c #F2D630",
": 	c #EFC718",
"< 	c #E9AD07",
"[ 	c #B27402",
"} 	c #010100",
"| 	c #635A1C",
"1 	c #F2DC3D",
"2 	c #F5E768",
"3 	c #F7EE99",
"4 	c #F8EFA6",
"5 	c #F6EC96",
"6 	c #F6E772",
"7 	c #F3DA3B",
"8 	c #EFCA1C",
"9 	c #E9AE09",
"0 	c #DF8F03",
"a 	c #3A1C00",
"b 	c #AF9B1F",
"c 	c #F5E24D",
"d 	c #F7EA80",
"e 	c #F8F1B1",
"f 	c #F8F1B9",
"g 	c #F7EEA0",
"h 	c #F6E876",
"i 	c #F3D939",
"j 	c #EEC71B",
"k 	c #E6A908",
"l 	c #DF8C02",
"m 	c #854400",
"n 	c #000000",
"o 	c #C1A91C",
"p 	c #F4E047",
"q 	c #F6E977",
"r 	c #F7EEA2",
"s 	c #F7EFA7",
"t 	c #F6EB8E",
"u 	c #F5E461",
"v 	c #F1D42F",
"w 	c #ECC214",
"x 	c #E3A005",
"y 	c #DC8201",
"z 	c #9A4C00",
"A 	c #B49B16",
"B 	c #F2D834",
"C 	c #F4E152",
"D 	c #F5E672",
"E 	c #F5E674",
"F 	c #F4E158",
"G 	c #F1D839",
"H 	c #ECC61B",
"I 	c #E6AF0C",
"J 	c #DC8C03",
"K 	c #D46F01",
"L 	c #873D00",
"M 	c #897513",
"N 	c #EECC22",
"O 	c #F0D533",
"P 	c #F1D942",
"Q 	c #F1D943",
"R 	c #EFD331",
"S 	c #EBC721",
"T 	c #E6B20F",
"U 	c #DE9506",
"V 	c #D37702",
"W 	c #CD6300",
"X 	c #4F1F00",
"Y 	c #D4AA14",
"Z 	c #E9BD19",
"` 	c #E8C01D",
" .	c #E7BE1A",
"..	c #E5B514",
"+.	c #E1A70C",
"@.	c #D88D06",
"#.	c #D17902",
"$.	c #C55D01",
"%.	c #A14400",
"&.	c #6E580E",
"*.	c #D5A10F",
"=.	c #DFA60D",
"-.	c #DDA10B",
";.	c #D99508",
">.	c #D58805",
",.	c #CD7002",
"'.	c #C56201",
").	c #A74900",
"!.	c #391600",
"~.	c #41350F",
"{.	c #AE7A0C",
"].	c #C48109",
"^.	c #CD7905",
"/.	c #CA7304",
"(.	c #B46105",
"_.	c #914605",
":.	c #221204",
"<.	c #2B230A",
"[.	c #362403",
"}.	c #B6B083",
"|.	c #948F70",
"1.	c #6D664F",
"2.	c #7B6939",
"3.	c #886829",
"4.	c #846424",
"5.	c #927520",
"6.	c #8B731E",
"7.	c #A98919",
"8.	c #BF9F26",
"9.	c #B28212",
"0.	c #271701",
"a.	c #F6F1D2",
"b.	c #F3E8A7",
"c.	c #EFDF75",
"d.	c #EBD756",
"e.	c #E8CD3B",
"f.	c #E6C831",
"g.	c #E5C229",
"h.	c #E4BE22",
"i.	c #E1B61D",
"j.	c #E1B823",
"k.	c #D89911",
"l.	c #9B5402",
"m.	c #0E0600",
"n.	c #F6F0C7",
"o.	c #F3E793",
"p.	c #EEDC5A",
"q.	c #EBD23B",
"r.	c #E8C726",
"s.	c #E8C11E",
"t.	c #E6B917",
"u.	c #E4B211",
"v.	c #E0A50D",
"w.	c #DB9A0A",
"x.	c #D38104",
"y.	c #CE7101",
"z.	c #844001",
"A.	c #180900",
"B.	c #F7EFB9",
"C.	c #F4E782",
"D.	c #F1DD4D",
"E.	c #EED32E",
"F.	c #EBC519",
"G.	c #EABF12",
"H.	c #E9B80C",
"I.	c #E6AF09",
"J.	c #E1A006",
"K.	c #DB9004",
"L.	c #CE7802",
"M.	c #A65B01",
"N.	c #B65801",
"O.	c #AE5100",
"P.	c #3A1A00",
"Q.	c #050100",
"R.	c #F7EFB5",
"S.	c #F5E87E",
"T.	c #F3DD46",
"U.	c #F0D42B",
"V.	c #EEC716",
"W.	c #EDC20F",
"X.	c #EBB90A",
"Y.	c #E9B007",
"Z.	c #E4A005",
"`.	c #DC8E03",
" +	c #B56401",
".+	c #2F1500",
"++	c #351800",
"@+	c #642C00",
"#+	c #9E4500",
"$+	c #712E00",
"%+	c #F7EEAE",
"&+	c #F6E775",
"*+	c #F4DD3E",
"=+	c #F2D325",
"-+	c #F0C813",
";+	c #EEC20D",
">+	c #EDB808",
",+	c #E9B006",
"'+	c #E39C04",
")+	c #DB8902",
"!+	c #9E5401",
"~+	c #240C00",
"{+	c #3E1500",
"]+	c #F7ECA3",
"^+	c #F5E469",
"/+	c #F3DC3A",
"(+	c #F1D221",
"_+	c #EFC610",
":+	c #EEBF0B",
"<+	c #EBB507",
"[+	c #E8AB05",
"}+	c #E19603",
"|+	c #D78002",
"1+	c #954C01",
"2+	c #040100",
"3+	c #F7ECA7",
"4+	c #F4E15B",
"5+	c #F2D62C",
"6+	c #F0CD1A",
"7+	c #EEBE0C",
"8+	c #ECB608",
"9+	c #EAAB05",
"0+	c #E6A003",
"a+	c #DF8E02",
"b+	c #D37601",
"c+	c #984901",
"d+	c #F6E781",
"e+	c #F3DC48",
"f+	c #F1D021",
"g+	c #EEC312",
"h+	c #EBB409",
"i+	c #E9AB06",
"j+	c #E59E03",
"k+	c #E19402",
"l+	c #D98002",
"m+	c #D06D01",
"n+	c #9D4801",
"o+	c #1B0A00",
"p+	c #DECF5F",
"q+	c #F2D93B",
"r+	c #EDC212",
"s+	c #EAB50A",
"t+	c #E5A205",
"u+	c #E19803",
"v+	c #DD8B02",
"w+	c #DA8001",
"x+	c #D57201",
"y+	c #CB6201",
"z+	c #AB4700",
"A+	c #331300",
"B+	c #C7B64D",
"C+	c #F1D22B",
"D+	c #EAB30A",
"E+	c #E4A206",
"F+	c #DC8D03",
"G+	c #D67E02",
"H+	c #D27201",
"I+	c #D06C01",
"J+	c #CD6601",
"K+	c #C85B00",
"L+	c #B64A00",
"M+	c #461B00",
"N+	c #A08C2E",
"O+	c #EDC51B",
"P+	c #E29E05",
"Q+	c #DA8702",
"R+	c #CD6D01",
"S+	c #BB5A01",
"T+	c #924601",
"U+	c #914401",
"V+	c #A24700",
"W+	c #BE5100",
"X+	c #B84600",
"Y+	c #632300",
"Z+	c #6B580B",
"`+	c #E4B512",
" @	c #DE9405",
".@	c #D17201",
"+@	c #AD5101",
"@@	c #522300",
"#@	c #080300",
"$@	c #1F0C00",
"%@	c #5B2400",
"&@	c #BB4600",
"*@	c #A13500",
"=@	c #D09D0E",
"-@	c #D98906",
";@	c #B15201",
">@	c #110600",
",@	c #321100",
"'@	c #9E3600",
")@	c #2A0D00",
"!@	c #B4810A",
"~@	c #CE8105",
"{@	c #562500",
"]@	c #371200",
"^@	c #702500",
"/@	c #72580D",
"(@	c #8D5F06",
"_@	c #210A00",
"                                                                ",
"                                                                ",
"                        . + @ # $ % &                           ",
"                      * = - ; > , ' ) !                         ",
"                    ~ { ] ^ / ( _ : < [ }                       ",
"                  | 1 2 3 4 5 6 7 8 9 0 a                       ",
"                  b c d e f g h i j k l m n                     ",
"                  o p q r s t u v w x y z n                     ",
"                  A B C D E F G H I J K L n                     ",
"                  M N O P Q R S T U V W X n                     ",
"                    Y Z `  ...+.@.#.$.%.n                       ",
"                    &.*.=.-.;.>.,.'.).!.n                       ",
"                      ~.{.].^./.(._.:.<.[.}                     ",
"                    }.|.1.2.3.4.5.6.7.8.9.0.                    ",
"                    a.b.c.d.e.f.g.h.i.j.k.l.m.                  ",
"                    n.o.p.q.r.s.t.u.v.w.x.y.z.A.                ",
"                    B.C.D.E.F.G.H.I.J.K.L.M.N.O.P.Q.            ",
"                    R.S.T.U.V.W.X.Y.Z.`. +.+++@+#+$+n           ",
"                    %+&+*+=+-+;+>+,+'+)+!+m.  n n ~+{+          ",
"                    ]+^+/+(+_+:+<+[+}+|+1+2+                    ",
"                    3+4+5+6+7+8+9+0+a+b+c+m.                    ",
"                    d+e+f+g+h+i+j+k+l+m+n+o+                    ",
"                    p+q+r+s+t+u+v+w+x+y+z+A+                    ",
"                    B+C+D+E+F+G+H+I+J+K+L+M+                    ",
"                    N+O+P+Q+R+S+T+U+V+W+X+Y+n                   ",
"                    Z+`+ @.@+@@@#@n $@%@&@*@n                   ",
"                      =@-@;@>@n       n ,@'@)@                  ",
"                      !@~@{@n             ]@^@                  ",
"                      /@(@                  _@                  ",
"                                                                ",
"                                                                ",
"                                                                "};
