<?xml version="1.0" encoding="UTF-8" standalone="no"?>
<!DOCTYPE svg PUBLIC "-//W3C//DTD SVG 20010904//EN"
"http://www.w3.org/TR/2001/REC-SVG-20010904/DTD/svg10.dtd">
<!-- Created with Sodipodi ("http://www.sodipodi.com/") -->
<svg
   xmlns="http://www.w3.org/2000/svg"
   xmlns:inkscape="http://www.inkscape.org/namespaces/inkscape"
   xmlns:sodipodi="http://sodipodi.sourceforge.net/DTD/sodipodi-0.dtd"
   xmlns:xlink="http://www.w3.org/1999/xlink"
   id="svg604"
   sodipodi:version="0.34"
   width="48pt"
   height="48pt"
   sodipodi:docbase="/home/zeus/Project/"
   sodipodi:docname="/home/zeus/Project/luv-transparent.svg"
   inkscape:version="0.37">
  <defs
     id="defs606">
    <linearGradient
       id="linearGradient621">
      <stop
         offset="0.00000000"
         style="stop-color:#666565;stop-opacity:1;"
         id="stop623" />
      <stop
         offset="1.00000000"
         style="stop-color:#ffffff;stop-opacity:1;"
         id="stop622" />
    </linearGradient>
    <linearGradient
       id="linearGradient610">
      <stop
         offset="0.00000000"
         style="stop-color:#666565;stop-opacity:1;"
         id="stop612" />
      <stop
         offset="1.00000000"
         style="stop-color:#ffffff;stop-opacity:1;"
         id="stop611" />
    </linearGradient>
    <linearGradient
       id="linearGradient612">
      <stop
         style="stop-color:#7fa8e3;stop-opacity:0.741176;"
         offset="0.000000"
         id="stop613" />
      <stop
         style="stop-color:#ffffff;stop-opacity:0;"
         offset="1.000000"
         id="stop614" />
    </linearGradient>
    <linearGradient
       xlink:href="#linearGradient610"
       id="linearGradient615"
       x1="0.00768350"
       y1="0.96245670"
       x2="1.02190578"
       y2="0.07761747"
       gradientUnits="objectBoundingBox"
       gradientTransform="scale(0.993504,1.006539)" />
    <defs
       id="defs550">
      <linearGradient
         id="linearGradient554"
         x1="0.00000000"
         y1="0.00000000"
         x2="1.00000000"
         y2="0.00000000"
         gradientUnits="objectBoundingBox"
         spreadMethod="pad"
         xlink:href="#linearGradient610" />
      <linearGradient
         xlink:href="#linearGradient554"
         id="linearGradient557"
         x1="12.9236002"
         y1="79.9603500"
         x2="8.33575153"
         y2="72.2902298"
         gradientUnits="userSpaceOnUse"
         spreadMethod="pad"
         gradientTransform="scale(1.122498,0.890870)" />
      <linearGradient
         xlink:href="#linearGradient554"
         id="linearGradient559"
         x1="7.79836702"
         y1="68.6560287"
         x2="12.9945765"
         y2="78.4289169"
         gradientUnits="userSpaceOnUse"
         spreadMethod="pad"
         gradientTransform="scale(1.122498,0.890870)" />
      <linearGradient
         xlink:href="#linearGradient554"
         id="linearGradient563" />
    </defs>
    <sodipodi:namedview
       id="namedview578" />
    <defs
       id="defs573">
      <linearGradient
         id="linearGradient604"
         x1="0.00000000"
         y1="0.00000000"
         x2="1.00000000"
         y2="0.00000000"
         gradientUnits="objectBoundingBox"
         spreadMethod="pad"
         xlink:href="#linearGradient621" />
      <linearGradient
         id="linearGradient600">
        <stop
           style="stop-color:#000;stop-opacity:1;"
           offset="0"
           id="stop601" />
        <stop
           style="stop-color:#fff;stop-opacity:1;"
           offset="1"
           id="stop602" />
      </linearGradient>
      <linearGradient
         xlink:href="#linearGradient604"
         id="linearGradient603"
         x1="61.0468903"
         y1="28.6572132"
         x2="79.6281509"
         y2="14.1547699"
         gradientUnits="userSpaceOnUse"
         spreadMethod="pad"
         gradientTransform="scale(0.994399,1.005632)" />
    </defs>
    <sodipodi:namedview
       id="namedview799" />
    <linearGradient
       xlink:href="#linearGradient610"
       id="linearGradient613"
       x1="26.44122696"
       y1="54.83988953"
       x2="29.67018700"
       y2="59.91422272"
       gradientUnits="userSpaceOnUse"
       gradientTransform="scale(1.122498,0.890870)" />
    <radialGradient
       xlink:href="#linearGradient612"
       id="radialGradient614"
       cx="0.06201551"
       cy="0.11718750"
       r="0.76277786"
       fx="0.06201551"
       fy="0.11718750"
       spreadMethod="repeat" />
  </defs>
  <sodipodi:namedview
     id="base"
     inkscape:zoom="8.21907646"
     inkscape:cx="40.4150619"
     inkscape:cy="24.1659914"
     inkscape:window-width="1014"
     inkscape:window-height="696"
     inkscape:window-x="0"
     inkscape:window-y="0"
     showgrid="true"
     snaptogrid="true"
     gridspacingx="0mm"
     gridspacingy="0mm" />
  <path
     style="font-size:12;fill:none;fill-rule:evenodd;stroke:#000000;stroke-width:4.303581;"
     d="M 48.81122 55.61913 L 39.40311 47.06217 C 39.31588 46.98283 30.45357 50.30231 26.40083 50.26261 C 16.98036 50.16918 3.817009 44.17875 2.741079 27.77976 C 1.890729 14.71088 10.51725 2.547793 26.23738 2.522773 C 39.15413 2.502398 51.08589 11.9679 49.8154 27.53133 C 49.2088 35.19649 45.52692 39.62464 46.16072 40.3028 L 56.47282 51.3366 C 58.14851 53.12956 56.23386 62.37024 48.81122 55.61913 z "
     id="path634"
     sodipodi:nodetypes="cssssssss" />
  <path
     style="font-size:12;fill:none;fill-opacity:1;fill-rule:evenodd;stroke-width:3.25;stroke:#efe16b;stroke-opacity:1;stroke-dasharray:none;"
     d="M 47.76238 26.53993 C 47.76238 29.56168 47.14928 32.4411 46.04075 35.0605 C 45.48649 36.3702 44.33538 39.63087 43.44048 40.71535 L 51.74308 51.79601 L 50.95623 52.97853 L 39.84752 43.34056 C 38.76304 44.23546 35.69592 46.16077 34.38622 46.71503 C 31.76682 47.82355 28.8874 48.43666 25.86565 48.43666 C 13.77866 48.43666 3.96892 38.62693 3.96892 26.53993 C 3.96892 14.45294 13.77866 4.643197 25.86565 4.643197 C 37.95265 4.643197 47.76238 14.45294 47.76238 26.53993 z "
     id="path620"
     sodipodi:nodetypes="csccccscccc" />
  <path
     style="font-size:12;fill:#ffc83d;fill-rule:evenodd;"
     d="M 44.24797 38.76775 L 56.16631 52.07056 C 58.09472 54.81711 55.00181 58.26591 51.79444 56.59352 L 38.14389 44.66903 C 38.40459 41.90319 42.24014 39.26021 44.24797 38.76775 z "
     id="path562"
     sodipodi:nodetypes="ccccc" />
  <path
     style="font-size:12;fill:#ff933d;fill-rule:evenodd;"
     d="M 43.86792 39.16621 L 55.76294 52.28287 C 56.59703 54.39949 55.22832 50.8399 53.46932 54.52194 L 41.29443 41.50412 C 41.31622 40.64899 41.77651 39.58382 43.86792 39.16621 z "
     id="path567"
     sodipodi:nodetypes="ccccc" />
  <path
     style="font-size:12;fill:#ffffff;fill-rule:evenodd;"
     d="M 40.04615 42.27535 L 52.69942 54.75552 C 53.21655 54.90327 52.09318 55.15765 52.27966 56.45686 C 51.83815 55.8353 38.85772 43.95679 38.85772 43.95679 L 40.04615 42.27535 z "
     id="path568"
     sodipodi:nodetypes="ccccc" />
  <path
     sodipodi:type="arc"
     style="font-size:12;fill:#bae6ff;fill-opacity:0.431;fill-rule:evenodd;stroke:none;stroke-width:1pt;"
     id="path611"
     sodipodi:cx="29.49961090"
     sodipodi:cy="28.95359230"
     sodipodi:rx="18.45106697"
     sodipodi:ry="18.45106697"
     d="M 47.95068 28.95359 A 18.45107 18.45107 0 1 0 11.04854 28.95359 A 18.45107 18.45107 0 1 0  47.95068 28.95359 z"
     transform="matrix(1.106369,0,0,1.106369,-7.012474,-6.130595)" />
  <path
     style="font-size:12;fill:#437caf;fill-rule:evenodd;stroke-width:1pt;fill-opacity:0.3448;"
     d="M 38.94959 11.01917 C 43.20293 14.05451 46.29916 18.71129 47.22781 24.26841 C 48.15645 29.82553 46.74254 35.23599 43.7072 39.48933 C 40.67185 43.74268 36.01507 46.8389 30.45795 47.76754 C 24.90084 48.69619 21.24509 47.57473 15.23703 44.24694 M 15.23703 44.24694 C 44.45383 35.45371 37.26953 28.31205 38.94959 11.01917 "
     id="path610"
     sodipodi:nodetypes="ccscscs" />
  <path
     style="fill:#ff0000;fill-rule:evenodd;stroke:none;stroke-opacity:1;stroke-width:1pt;stroke-linejoin:miter;stroke-linecap:butt;fill-opacity:1;"
     d="M 44.19708 38.5588 C 42.15218 39.32844 42.78075 39.21299 40.90227 40.42642 C 40.79773 40.59741 39.66772 40.4856 38.19462 44.74621 L 41.327 47.55289 C 42.17657 46.42622 43.42179 44.37761 44.16041 43.86114 C 45.23143 43.06687 45.76148 42.6609 47.33176 42.03305 L 44.19708 38.5588 z "
     id="path651"
     sodipodi:nodetypes="ccccccc" />
  <path
     style="fill:#ffffff;fill-rule:evenodd;stroke:none;stroke-opacity:1;stroke-width:1pt;stroke-linejoin:miter;stroke-linecap:butt;fill-opacity:1;"
     d="M 41.76381 44.43223 L 40.77906 45.83967 L 38.88567 44.26536 L 39.77322 42.87855 L 41.76381 44.43223 z "
     id="path652"
     sodipodi:nodetypes="ccccc" />
</svg>
