/* XPM */
static char * xcalc_16x16_xpm[] = {
"16 16 7 1",
" 	c None",
".	c #DCDCDC",
"+	c #000000",
"@	c #808080",
"#	c #C3C3C3",
"$	c #FFFFFF",
"%	c #C0C0FF",
" ++++++++++++++ ",
"+$$$$$$$$$$$$$@ ",
"+$..+++++++++.@ ",
"+$..+$$$$$$$%.@ ",
"+$..+$$$$$$$%.@ ",
"+$..@@@@@@@@@.@ ",
"+$............@ ",
"+$@@.@@.@@.@@.@ ",
"+$++.++.++.++.@ ",
"+$@@.@@.@@.@@.@ ",
"+$++.++.++.++.@ ",
"+$@@.@@.@@.@@.@ ",
"+$@@.@@.@@.@@.@ ",
"+$............@ ",
"+$############@ ",
" ++++++++++++++ "};
