<?xml version="1.0" encoding="UTF-8" standalone="no"?>
<!DOCTYPE svg PUBLIC "-//W3C//DTD SVG 20010904//EN"
"http://www.w3.org/TR/2001/REC-SVG-20010904/DTD/svg10.dtd">
<!-- Created with Sodipodi ("http://www.sodipodi.com/") -->
<svg
   id="svg604"
   sodipodi:version="0.32"
   width="72pt"
   height="72pt"
   sodipodi:docbase="/home/zeus/desktop/icons/gartoon/svg"
   sodipodi:docname="/home/zeus/desktop/icons/gartoon/svg/gnome-mime-audio-ac3.svg"
   xmlns="http://www.w3.org/2000/svg"
   xmlns:sodipodi="http://sodipodi.sourceforge.net/DTD/sodipodi-0.dtd"
   xmlns:xlink="http://www.w3.org/1999/xlink">
  <defs
     id="defs606">
    <linearGradient
       id="linearGradient705">
      <stop
         style="stop-color:#7fa8e3;stop-opacity:0.741176;"
         offset="0.000000"
         id="stop706" />
      <stop
         style="stop-color:#ffffff;stop-opacity:0;"
         offset="1.000000"
         id="stop707" />
    </linearGradient>
    <linearGradient
       id="linearGradient612">
      <stop
         style="stop-color:#ffffff;stop-opacity:1;"
         offset="0.000000"
         id="stop613" />
      <stop
         style="stop-color:#ffffff;stop-opacity:0;"
         offset="1.000000"
         id="stop614" />
    </linearGradient>
    <linearGradient
       xlink:href="#linearGradient705"
       id="linearGradient615"
       x1="50.6438866"
       y1="5.36792946"
       x2="35.7520943"
       y2="68.0443573"
       gradientUnits="userSpaceOnUse"
       spreadMethod="pad" />
    <radialGradient
       xlink:href="#linearGradient612"
       id="radialGradient704"
       cx="8.17300129"
       cy="62.0631676"
       fx="8.17300129"
       fy="62.0631676"
       r="4.03522396"
       gradientUnits="userSpaceOnUse"
       spreadMethod="pad"
       gradientTransform="matrix(1.111950,0.000000,0.000000,0.899321,3.428790e-7,-1.512959e-6)" />
    <radialGradient
       xlink:href="#linearGradient612"
       id="radialGradient708"
       cx="0.05366803"
       cy="0.10153580"
       fx="0.05366803"
       fy="0.10153580"
       r="0.75628221"
       gradientUnits="objectBoundingBox"
       spreadMethod="pad" />
  </defs>
  <sodipodi:namedview
     id="base" />
  <path
     style="fill:#000000;fill-rule:evenodd;stroke:none;stroke-opacity:1;stroke-width:1pt;stroke-linejoin:miter;stroke-linecap:butt;fill-opacity:0.301471;"
     d="M 12.8163 74.753 C 10.3856 73.6481 7.07107 70.1126 8.83884 65.2512 C 9.72267 59.948 25.6326 13.1021 29.1682 10.8924 C 31.3778 8.90368 34.582 8.13026 39.1119 9.34561 C 42.8684 10.2295 76.6769 19.0684 78.6656 20.8361 C 80.6544 22.6039 82.2012 24.0402 80.6544 27.9072 C 79.5496 29.8959 66.4017 74.532 66.1808 77.4047 C 65.2969 80.4983 62.7558 84.2548 58.5573 84.0338 C 54.3589 83.8128 15.9099 75.4159 12.8163 74.753 z "
     id="path794"
     sodipodi:nodetypes="ccccccccc"
     transform="matrix(1.114903,0.000000,0.000000,1.114903,-5.305332,-3.889256)" />
  <path
     style="fill:#143c69;fill-rule:evenodd;stroke:none;stroke-opacity:1;stroke-width:1pt;stroke-linejoin:miter;stroke-linecap:butt;fill-opacity:1;"
     d="M 12.8163 74.753 C 10.3856 73.6481 7.07107 70.1126 8.83884 65.2512 C 9.72267 59.948 25.6326 13.1021 29.1682 10.8924 C 31.3778 8.90368 34.582 8.13026 39.1119 9.34561 C 42.8684 10.2295 76.6769 19.0684 78.6656 20.8361 C 80.6544 22.6039 82.2012 24.0402 80.6544 27.9072 C 79.5496 29.8959 66.4017 74.532 66.1808 77.4047 C 65.2969 80.4983 62.7558 84.2548 58.5573 84.0338 C 54.3589 83.8128 15.9099 75.4159 12.8163 74.753 z "
     id="path609"
     sodipodi:nodetypes="ccccccccc"
     transform="matrix(1.114903,0.000000,0.000000,1.114903,-8.162471,-8.460684)" />
  <path
     style="fill:#ffffff;fill-rule:evenodd;stroke:none;stroke-opacity:1;stroke-width:1pt;stroke-linejoin:miter;stroke-linecap:butt;fill-opacity:1;"
     d="M 17.8987 70.9965 C 15.3576 70.3336 11.7114 69.6706 13.0373 65.6932 C 15.468 55.9705 27.8424 18.6264 33.1456 13.986 C 34.361 12.8811 38.4489 12.4392 46.1829 14.8699 C 55.0218 17.5215 72.9204 23.4877 74.6882 24.3716 C 76.4559 25.2555 77.1189 25.2555 75.793 29.233 C 73.8043 33.2105 64.9655 67.24 62.7557 72.9852 C 61.209 77.0732 60.8775 78.9514 58.2258 78.9514 "
     id="path608"
     sodipodi:nodetypes="cccccccs"
     transform="matrix(1.114903,0.000000,0.000000,1.114903,-8.162471,-8.460684)" />
  <path
     style="fill:url(#linearGradient615);fill-rule:evenodd;stroke:none;stroke-opacity:1;stroke-width:1pt;stroke-linejoin:miter;stroke-linecap:butt;fill-opacity:1;"
     d="M 28.75 13.75 C 28.75 13.75 31.875 7.49995 39.6875 9.37495 C 47.5 11.25 78.125 19.375 77.8125 21.875 C 77.5 24.375 71.875 39.0625 71.5625 40.3125 C 71.25 41.5625 42.5 40.9375 31.5625 47.5 C 20.625 54.0625 12.5 59.6875 12.5 59.6875 C 12.5 59.6875 23.75 24.6875 28.75 13.75 z "
     id="path636"
     transform="matrix(0.946780,0.000000,0.000000,0.946780,-0.480566,0.409517)" />
  <path
     style="font-size:12;fill:#0d0000;fill-opacity:0.301471;fill-rule:evenodd;stroke-width:1pt;"
     d="M 7.73398 34.2049 L 12.0429 51.3301 C 5.08232 51.2196 4.19844 55.9705 4.64039 59.1746 C 6.73961 68.2343 17.4567 65.6933 24.5277 62.7102 C 23.6438 59.506 20.3293 44.3696 19.8874 41.7178 C 23.7543 40.7235 31.8198 38.4033 31.8198 38.4033 C 31.8198 38.4033 34.6924 45.5849 35.1343 47.0212 C 26.0745 46.6897 25.4117 52.3244 26.1851 54.8656 C 27.6214 61.9367 34.0295 61.8262 37.5651 60.8318 C 40.8796 60.2795 45.52 58.2907 48.0612 57.1859 C 47.0668 53.3189 38.3384 29.233 37.2336 26.1394 C 32.9246 27.6862 7.62349 34.4258 7.73398 34.2049 z "
     id="path635"
     sodipodi:nodetypes="cccccccccccc"
     transform="matrix(1.035546,0.000000,0.000000,1.035546,15.56160,-11.72637)" />
  <path
     style="font-size:12;fill:#0d3c07;fill-rule:evenodd;stroke-width:1pt;"
     d="M 7.73398 34.2049 L 12.0429 51.3301 C 5.08232 51.2196 4.19844 55.9705 4.64039 59.1746 C 6.73961 68.2343 17.4567 65.6933 24.5277 62.7102 C 23.6438 59.506 20.3293 44.3696 19.8874 41.7178 C 23.7543 40.7235 31.8198 38.4033 31.8198 38.4033 C 31.8198 38.4033 34.6924 45.5849 35.1343 47.0212 C 26.0745 46.6897 25.4117 52.3244 26.1851 54.8656 C 27.6214 61.9367 34.0295 61.8262 37.5651 60.8318 C 40.8796 60.2795 45.52 58.2907 48.0612 57.1859 C 47.0668 53.3189 38.3384 29.233 37.2336 26.1394 C 32.9246 27.6862 7.62349 34.4258 7.73398 34.2049 z "
     id="path616"
     sodipodi:nodetypes="cccccccccccc"
     transform="translate(14.83929,-11.42410)" />
  <path
     style="font-size:12;fill:#2aaf18;fill-rule:evenodd;stroke-width:1pt;"
     d="M 15.7994 54.2027 L 11.159 35.9726 L 35.7973 29.1225 L 44.7466 54.9761 C 44.7466 54.9761 33.3666 59.506 31.7093 57.5173 C 28.9471 57.4067 26.7375 51.2197 33.4771 50.0043 C 37.1231 49.8938 38.5594 49.6728 39.5538 50.0042 L 33.3666 34.0944 L 15.247 39.3977 L 20.3293 60.0584 C 20.3293 60.0584 13.7002 64.9198 7.95495 60.1689 C 6.73961 59.0641 6.62912 56.0809 8.61786 54.9761 C 10.2751 52.8769 15.6889 54.4237 15.7994 54.2027 z "
     id="path574"
     sodipodi:nodetypes="ccccccccccccc"
     transform="translate(14.83929,-11.42410)" />
  <path
     transform="matrix(1.488889,0.000000,0.000000,1.488889,8.836250,-40.12308)"
     style="font-size:12;fill-rule:evenodd;stroke-width:1pt;fill:url(#radialGradient704);"
     d="M 14.4736 57.5725 C 12.6184 56.7928 11.9994 58.2032 11.601 60.0584 C 10.0153 60.0584 8.87676 59.2416 8.87676 57.8693 C 8.87676 56.4971 9.94109 55.5318 11.5268 55.5318 C 13.1125 55.5318 14.4736 56.2003 14.4736 57.5725 z "
     id="path623"
     sodipodi:nodetypes="ccccc" />
  <path
     style="font-size:12;fill-rule:evenodd;stroke-width:1pt;fill:url(#radialGradient708);"
     d="M 37.3441 53.6503 C 33.3666 51.8834 34.4706 54.4237 33.6428 56.8544 C 31.5997 56.8544 29.9416 55.4189 29.9416 53.6503 C 29.9416 51.8816 31.5997 50.4462 33.6428 50.4462 C 35.6859 50.4462 37.3441 51.8816 37.3441 53.6503 z "
     id="path625"
     sodipodi:nodetypes="ccccc"
     transform="translate(14.83929,-11.42410)" />
  <path
     style="font-size:12;fill:#34674b;fill-rule:evenodd;stroke-width:1pt;"
     d="M 15.3575 39.5082 L 33.3666 34.2049 L 33.8085 32.5476 L 15.7994 37.7404 L 15.3575 39.5082 z "
     id="path630"
     sodipodi:nodetypes="ccccc"
     transform="translate(14.83929,-11.42410)" />
  <path
     style="font-size:12;fill:#cbff87;fill-rule:evenodd;stroke-width:1pt;"
     d="M 11.159 35.9726 L 13.3687 36.5251 L 36.1287 30.2274 L 35.6868 29.1225 L 11.159 35.9726 z "
     id="path631"
     transform="translate(14.83929,-11.42410)" />
  <path
     style="font-size:12;fill:#cbff87;fill-rule:evenodd;stroke-width:1pt;"
     d="M 33.6981 32.879 L 39.6643 49.8938 L 33.2561 34.2049 L 33.6981 32.879 z "
     id="path633"
     transform="translate(14.83929,-11.42410)" />
  <path
     style="font-size:12;fill:#cbff87;fill-rule:evenodd;stroke-width:1pt;"
     d="M 13.1478 36.1936 C 13.1478 36.1936 16.1309 54.3132 16.0204 54.3132 C 15.9099 54.3132 11.2695 36.0831 11.2695 36.0831 L 13.1478 36.1936 z "
     id="path634"
     transform="translate(14.83929,-11.42410)" />
  <path
     style="font-size:13;font-weight:bold;fill:#143c69;stroke-width:1pt;font-family:Kid Kosmic;"
     d="M 60.2818 54.6313 L 60.2945 54.6694 C 58.7541 55.6511 57.3026 56.434 55.94 57.018 C 58.1236 58.3552 59.2154 59.6798 59.2154 60.9916 C 59.2154 61.1609 59.1985 61.3259 59.1646 61.4867 C 58.9784 62.367 58.3013 63.006 57.1334 63.4037 C 56.3293 63.6746 55.3476 63.8269 54.1881 63.8608 C 52.3345 63.9031 50.1636 63.4799 47.6754 62.5912 C 47.5738 62.2358 47.5484 61.9353 47.5992 61.6899 C 47.7431 61.0128 48.107 60.6742 48.691 60.6742 C 48.801 60.6742 48.9237 60.6912 49.0592 60.725 C 51.3274 61.2836 53.0328 61.5672 54.1754 61.5756 C 55.3349 61.5925 55.9485 61.4402 56.0162 61.1186 C 56.0924 60.7462 55.6269 60.1918 54.6197 59.4555 C 54.0019 59.0069 53.3205 58.5753 52.5758 58.1606 C 52.525 58.169 52.4742 58.1733 52.4234 58.1733 C 51.8733 58.1733 51.5982 57.9194 51.5982 57.4116 C 51.5982 57.3185 51.6067 57.2169 51.6236 57.1069 C 51.7336 56.616 52.1653 56.2986 52.9185 56.1547 C 53.9003 55.6808 54.8144 55.156 55.6607 54.5805 C 54.3404 54.6144 52.5334 54.7413 50.2398 54.9614 C 49.6643 55.0121 49.2961 54.8175 49.1353 54.3774 C 49.093 54.2758 49.0718 54.1742 49.0718 54.0727 C 49.0718 53.7426 49.2877 53.3617 49.7193 52.9301 C 52.5292 52.4477 55.1064 52.2065 57.4508 52.2065 C 58.2971 52.2065 59.1689 52.2361 60.066 52.2953 C 60.5315 52.5239 60.7642 52.8836 60.7642 53.3744 C 60.7642 53.933 60.6034 54.352 60.2818 54.6313 z M 47.4468 55.4819 C 47.3707 55.8204 47.1506 56.0997 46.7867 56.3198 C 46.4566 56.5313 46.1096 56.6371 45.7457 56.6371 C 45.2886 56.6371 44.9501 56.4002 44.73 55.9262 C 44.5777 55.5115 44.4296 55.0968 44.2857 54.6821 C 42.2037 54.6821 40.511 55.2533 39.2076 56.3959 C 38.3274 57.1661 37.7857 58.0336 37.5826 58.9985 C 37.5318 59.2354 37.5064 59.4597 37.5064 59.6713 C 37.5064 60.323 37.7138 60.8393 38.1285 61.2201 C 38.5517 61.601 39.1272 61.7914 39.855 61.7914 C 41.3023 61.7914 43.0797 61.1186 45.1871 59.7729 C 45.5172 59.6544 45.7838 59.5951 45.9869 59.5951 C 46.4439 59.5951 46.6724 59.8237 46.6724 60.2807 C 46.6724 60.8901 46.3847 61.364 45.8092 61.7026 C 44.9543 62.3543 43.9345 62.8875 42.7496 63.3022 C 41.5393 63.7254 40.4052 63.9369 39.3472 63.9369 C 37.7899 63.9369 36.6347 63.4461 35.8814 62.4643 C 35.2128 61.6095 34.8785 60.67 34.8785 59.6459 C 34.8785 59.2143 34.942 58.7657 35.0689 58.3002 C 35.6106 56.2097 36.9563 54.6186 39.106 53.5268 C 40.9426 52.5873 43.0331 52.143 45.3775 52.1938 C 46.1731 52.3038 46.719 52.5789 47.0152 53.019 C 47.2606 53.3829 47.4003 53.988 47.4342 54.8344 C 47.4765 55.0798 47.4807 55.2957 47.4468 55.4819 z M 25.2301 53.311 C 25.6955 52.8878 26.7281 52.5492 28.3277 52.2953 C 29.6649 52.0838 30.8371 51.9907 31.8443 52.016 C 32.6653 52.0414 33.245 52.2149 33.5836 52.5366 C 33.6259 53.3067 33.647 54.0811 33.647 54.8598 C 33.647 57.3481 33.4397 59.9083 33.025 62.5405 C 32.9149 63.2429 32.551 63.7042 31.9332 63.9242 C 31.7047 64.0004 31.51 64.0385 31.3492 64.0385 C 31.0107 64.0385 30.7864 63.8692 30.6763 63.5307 C 31.0318 62.3373 31.2688 61.2244 31.3873 60.1918 L 24.3922 61.3725 C 24.2567 61.6349 24.0071 62.1554 23.6431 62.934 C 23.4823 63.628 23.0676 64.0385 22.399 64.1655 C 22.2297 64.1993 22.107 64.2162 22.0308 64.2162 C 21.6246 64.2162 21.4215 64.0554 21.4215 63.7338 C 21.4215 63.6407 21.4426 63.5434 21.4849 63.4418 C 23.093 59.8956 24.3414 56.5186 25.2301 53.311 z M 31.0318 54.9994 C 30.9049 54.7032 30.5071 54.5551 29.8384 54.5551 C 29.3983 54.5551 28.8567 54.6355 28.2134 54.7963 C 27.4856 54.9825 27.0032 55.1941 26.7662 55.4311 C 26.4615 56.4721 26.0722 57.5512 25.5982 58.6684 L 31.4634 57.4116 C 31.3873 56.6075 31.2434 55.8035 31.0318 54.9994 z M 21.0152 61.9946 C 21.0152 62.4177 20.8121 62.7901 20.4058 63.1117 C 20.008 63.4334 19.5806 63.5942 19.1236 63.5942 C 18.9543 63.5942 18.7978 63.5688 18.6539 63.518 C 18.2307 63.3487 18.0191 63.0483 18.0191 62.6166 C 18.0191 62.3204 18.1249 62.0326 18.3365 61.7533 C 18.7427 61.2371 19.2506 60.9789 19.8599 60.9789 C 20.0377 60.9789 20.2069 61.0086 20.3677 61.0678 C 20.7994 61.2286 21.0152 61.5375 21.0152 61.9946 z "
     id="path582"
     transform="matrix(0.971587,0.236685,-0.236685,0.971587,8.222436,0.335960)" />
</svg>
