<?xml version="1.0" encoding="UTF-8" standalone="no"?>
<!DOCTYPE svg PUBLIC "-//W3C//DTD SVG 20010904//EN"
"http://www.w3.org/TR/2001/REC-SVG-20010904/DTD/svg10.dtd">
<!-- Created with Sodipodi ("http://www.sodipodi.com/") -->
<svg
   xmlns="http://www.w3.org/2000/svg"
   xmlns:inkscape="http://www.inkscape.org/namespaces/inkscape"
   xmlns:sodipodi="http://sodipodi.sourceforge.net/DTD/sodipodi-0.dtd"
   xmlns:xlink="http://www.w3.org/1999/xlink"
   version="1.0"
   x="0"
   y="0"
   width="60.0000000"
   height="60.0000000"
   id="svg548"
   sodipodi:version="0.34"
   inkscape:version="0.37"
   sodipodi:docname="/home/zeus/.themes/Zeus-Test/gtk-2.0/stock_jump-to.svg"
   sodipodi:docbase="/home/zeus/.themes/Zeus-Test/gtk-2.0/">
  <sodipodi:namedview
     id="base"
     pagecolor="#ffffff"
     bordercolor="#666666"
     borderopacity="1.0"
     inkscape:pageopacity="0.0"
     inkscape:pageshadow="2"
     inkscape:zoom="39.3913528"
     inkscape:cx="34.5969690"
     inkscape:cy="31.9722468"
     inkscape:window-width="1014"
     inkscape:window-height="693"
     inkscape:window-x="0"
     inkscape:window-y="0" />
  <defs
     id="defs550">
    <linearGradient
       x1="0.00000000"
       y1="0.00000000"
       x2="1.00000000"
       y2="0.00000000"
       id="linearGradient556"
       gradientUnits="objectBoundingBox"
       spreadMethod="pad">
      <stop
         style="stop-color:#ffff00;stop-opacity:1;"
         offset="0"
         id="stop557" />
      <stop
         style="stop-color:#ffd300;stop-opacity:1;"
         offset="1"
         id="stop558" />
    </linearGradient>
    <linearGradient
       x1="0.00000000"
       y1="0.00000000"
       x2="1.00000000"
       y2="0.00000000"
       id="linearGradient559"
       xlink:href="#linearGradient556"
       gradientUnits="objectBoundingBox"
       spreadMethod="pad" />
    <radialGradient
       cx="46.67118073"
       cy="26.60194206"
       r="6.84199047"
       fx="47.14081192"
       fy="26.36529160"
       id="radialGradient586"
       xlink:href="#linearGradient556"
       gradientUnits="userSpaceOnUse"
       spreadMethod="reflect" />
  </defs>
  <ellipse
     cx="46.08414078"
     cy="26.60194206"
     rx="15.14563084"
     ry="15.14563084"
     transform="translate(-3.754045,1.423948)"
     style="font-size:12;fill:#ffd056;fill-rule:evenodd;stroke:#7e0000;stroke-width:3.125;stroke-opacity:1;fill-opacity:1;"
     id="path585" />
  <g
     transform="matrix(-0.699893,0.960739,0.960739,0.699893,6.905514,-2.350769)"
     style="font-size:12;"
     id="g572">
    <g
       transform="matrix(1.008714,0.000000,0.000000,1.008714,-45.46822,-0.252175)"
       id="g584">
      <path
         d="M 51.9665 36.0486 C 53.9602 37.0454 65.4724 34.7713 65.7572 32.6353 C 66.8738 29.0839 63.8447 27.7777 64.064 26.2358 C 64.4912 24.8117 69.3897 19.3094 68.8358 17.5805 C 67.2423 14.4362 62.9702 10.5668 59.9594 12.4381 C 57.3645 14.7813 55.6307 20.7151 54.0642 20.1455 C 52.4977 19.5759 51.1121 20.0634 50.6849 21.0602 C 50.2577 22.057 49.6881 35.3365 51.9665 36.0486 z "
         transform="matrix(1.369638,0.000000,0.000000,1.207417,-21.85404,-4.997635)"
         style="fill:#0d3c07;fill-rule:evenodd;stroke-width:1pt;"
         id="path582" />
      <path
         d="M 51.5506 35.4589 C 53.5443 36.4557 64.2247 34.8892 64.5095 32.7532 C 64.7943 30.6171 61.6614 29.193 62.0886 27.769 C 62.5158 26.3449 69.4937 17.6582 68.212 16.519 C 66.9304 15.3797 62.6582 11.3924 61.519 12.674 C 60.3797 13.9557 55.1108 23.7816 53.5443 23.212 C 51.9778 22.6424 50.6962 21.3608 50.269 22.3576 C 49.8418 23.3544 49.2722 34.7468 51.5506 35.4589 z "
         style="fill:#2aaf18;fill-rule:evenodd;stroke-width:1pt;"
         id="path581" />
      <path
         d="M 67.6424 15.9494 C 67.6424 15.9494 69.0665 16.8038 68.0696 18.5127 C 67.0728 20.2215 61.519 27.769 61.9462 28.3386 C 63.5126 29.6202 65.3639 32.7531 64.3671 33.6076 C 62.6583 35.174 52.8323 36.3133 51.693 35.7437 C 50.5538 35.174 60.0949 33.4652 60.2373 31.0443 C 60.3797 28.6234 57.8165 27.6266 58.6709 26.2025 C 59.5253 24.7785 65.3639 14.9525 66.2184 15.2373 C 67.0728 15.5221 67.7848 16.519 67.6424 15.9494 z "
         style="fill:#208c11;fill-rule:evenodd;stroke-width:1pt;"
         id="path583" />
    </g>
    <path
       d="M 16.9462 4.6519 C 16.9462 4.6519 9.25633 14.193 9.54114 15.0475 C 9.82595 15.9019 17.3734 8.49683 16.9462 4.6519 z "
       transform="matrix(1.008714,0.000000,0.000000,1.008714,0.929487,8.797523)"
       style="fill:#ffffff;fill-rule:evenodd;stroke-width:1pt;"
       id="path588" />
    <path
       d="M 5.41139 24.019 C 5.41139 24.019 4.41456 17.4684 4.84177 16.3291 C 5.26899 15.1899 6.69304 17.0411 6.69304 17.0411 C 6.69304 17.0411 4.98418 23.1646 5.41139 24.019 z "
       transform="matrix(1.008714,0.000000,0.000000,1.008714,0.929487,8.797523)"
       style="fill:#ffffff;fill-rule:evenodd;stroke-width:1pt;"
       id="path589" />
  </g>
  <path
     d="M 38.489415 15.093499 C 48.494172 15.331782 56.890362 17.96158 54.006272 31.714456 C 53.978155 31.847913 52.95114 24.598965 48.72653 20.700642 C 44.720484 17.064185 38.362211 15.089842 38.489415 15.093499 z "
     style="font-size:12;fill:#ffffff;fill-rule:evenodd;stroke-width:1pt;"
     id="path590"
     sodipodi:nodetypes="cssc" />
</svg>
