<?xml version="1.0" encoding="UTF-8" standalone="no"?>
<!DOCTYPE svg PUBLIC "-//W3C//DTD SVG 20010904//EN"
"http://www.w3.org/TR/2001/REC-SVG-20010904/DTD/svg10.dtd">
<!-- Created with Sodipodi ("http://www.sodipodi.com/") -->
<svg
   xmlns="http://www.w3.org/2000/svg"
   xmlns:inkscape="http://www.inkscape.org/namespaces/inkscape"
   xmlns:sodipodi="http://sodipodi.sourceforge.net/DTD/sodipodi-0.dtd"
   xmlns:xlink="http://www.w3.org/1999/xlink"
   id="svg666"
   sodipodi:version="0.34"
   width="48pt"
   height="48pt"
   sodipodi:docbase="/home/zeus/.themes/Zeus-Test/gtk-2.0/"
   sodipodi:docname="/home/zeus/.themes/Zeus-Test/gtk-2.0/stock_revert-to-saved.svg"
   inkscape:version="0.37">
  <defs
     id="defs668">
    <linearGradient
       id="linearGradient689">
      <stop
         style="stop-color:#ffb700;stop-opacity:1;"
         offset="0.000000"
         id="stop690" />
      <stop
         style="stop-color:#fdffff;stop-opacity:0;"
         offset="1.000000"
         id="stop691" />
    </linearGradient>
    <linearGradient
       id="linearGradient684">
      <stop
         style="stop-color:#ffffff;stop-opacity:0.647059;"
         offset="0.000000"
         id="stop685" />
      <stop
         style="stop-color:#fdffff;stop-opacity:0;"
         offset="1.000000"
         id="stop686" />
    </linearGradient>
    <linearGradient
       id="linearGradient677">
      <stop
         style="stop-color:#000000;stop-opacity:1;"
         offset="0.000000"
         id="stop678" />
      <stop
         style="stop-color:#6a6762;stop-opacity:1;"
         offset="1.000000"
         id="stop679" />
    </linearGradient>
    <linearGradient
       xlink:href="#linearGradient677"
       id="linearGradient680"
       x1="68.3116760"
       y1="71.2960510"
       x2="52.5783653"
       y2="39.5797806"
       gradientUnits="userSpaceOnUse"
       spreadMethod="pad"
       gradientTransform="scale(1.011562,0.988570)" />
    <linearGradient
       xlink:href="#linearGradient684"
       id="linearGradient683"
       x1="49.0257645"
       y1="44.3401871"
       x2="56.4553261"
       y2="53.1827507"
       gradientUnits="userSpaceOnUse"
       spreadMethod="pad"
       gradientTransform="scale(1.017548,0.982755)" />
    <linearGradient
       xlink:href="#linearGradient689"
       id="linearGradient688"
       x1="26.2959213"
       y1="98.9529343"
       x2="31.7159863"
       y2="102.827583"
       gradientUnits="userSpaceOnUse"
       spreadMethod="pad"
       gradientTransform="scale(1.326975,0.753594)" />
    <linearGradient
       xlink:href="#linearGradient689"
       id="linearGradient693"
       x1="33.5794411"
       y1="53.8219566"
       x2="-14.0691185"
       y2="26.5526485"
       gradientUnits="userSpaceOnUse"
       spreadMethod="pad"
       gradientTransform="scale(0.780786,1.280761)" />
    <linearGradient
       xlink:href="#linearGradient689"
       id="linearGradient698" />
  </defs>
  <sodipodi:namedview
     id="base"
     inkscape:zoom="4.29166667"
     inkscape:cx="36.0000000"
     inkscape:cy="36.0000000"
     inkscape:window-width="1014"
     inkscape:window-height="696"
     inkscape:window-x="0"
     inkscape:window-y="0" />
  <path
     style="fill:#000000;fill-rule:evenodd;stroke:none;stroke-opacity:1;stroke-width:1pt;stroke-linejoin:miter;stroke-linecap:butt;fill-opacity:0.298246;"
     d="M 1.2420588 33.462632 C 1.2420588 33.462632 10.483043 45.451408 18.16261 55.324789 C 19.59961 56.380478 28.72553 60.117353 30.853006 59.216439 C 32.75025 58.215977 58.434337 41.097854 58.894654 39.067211 C 59.619378 36.777907 58.728277 35.293986 58.084422 34.149398 C 57.555683 33.004746 40.370748 9.997988 39.709806 9.4256812 C 39.048864 8.853368 37.198168 8.0521372 34.950935 8.7389092 C 29.232468 11.596375 11.237301 21.344525 2.0865459 29.530549 C 0.89682079 30.675201 1.1098704 32.31798 1.2420588 33.462632 z "
     id="path699"
     sodipodi:nodetypes="ccccccccc" />
  <path
     style="font-size:12;fill:none;fill-rule:evenodd;stroke:#000000;stroke-width:0.657025pt;"
     d="M 6.1683475 24.989012 C 6.1683475 25.028302 6.1683475 25.067592 6.1683475 25.106948 "
     id="path671" />
  <path
     style="fill:#261d14;fill-rule:evenodd;stroke:none;stroke-opacity:1;stroke-width:1pt;stroke-linejoin:miter;stroke-linecap:butt;fill-opacity:1;"
     d="M 1.3333896 28.880573 C 1.3333896 28.880573 9.577107 41.232191 16.427911 51.40439 C 17.709833 52.492029 25.850903 56.342001 27.748787 55.413821 C 29.441284 54.38308 52.3536 36.746876 52.764241 34.654775 C 53.410754 32.296185 52.615819 30.767353 52.041447 29.588124 C 51.569769 28.408829 36.239395 4.7057704 35.64978 4.1161426 C 35.060166 3.5265083 33.409192 2.7010282 31.404476 3.4085854 C 26.303134 6.3525323 10.249967 16.395711 2.0867415 24.829486 C 1.0254089 26.008781 1.2154667 27.701278 1.3333896 28.880573 z "
     id="path676"
     sodipodi:nodetypes="ccccccccc" />
  <path
     style="fill:#f1e36c;fill-rule:evenodd;stroke:none;stroke-opacity:1;stroke-width:1pt;stroke-linejoin:miter;stroke-linecap:butt;fill-opacity:1;"
     d="M 6.0504246 25.106948 C 6.0504246 25.106948 18.314691 44.328817 18.786369 45.154304 C 19.258113 45.979791 20.319472 47.159086 22.442124 47.7487 C 25.626135 49.045865 28.692144 50.225095 28.928016 50.225095 C 29.163888 50.225095 30.696926 48.809993 30.696926 48.809993 L 23.73929 40.083513 L 39.659278 26.168241 L 46.381042 35.95608 L 50.036731 33.007941 C 50.036731 33.007941 33.527128 6.1208782 33.291256 6.1208782 C 33.05545 6.1208782 29.163888 8.4794089 29.163888 8.4794089 L 37.41869 20.979514 C 37.41869 20.979514 21.262829 32.890071 19.847728 34.0693 C 18.550563 34.0693 9.2344026 22.394616 9.2344026 22.394616 L 6.0504246 25.106948 z "
     id="path672"
     sodipodi:nodetypes="ccccccccccccccc" />
  <path
     style="fill:#ffffff;fill-rule:evenodd;stroke:none;stroke-opacity:1;stroke-width:1pt;stroke-linejoin:miter;stroke-linecap:butt;fill-opacity:1;"
     d="M 10.177825 21.805001 L 19.847728 32.772135 L 36.003588 20.625772 L 28.220466 8.8331514 L 10.177825 21.805001 z "
     id="path673"
     sodipodi:nodetypes="ccccc" />
  <path
     style="fill:url(#linearGradient680);fill-rule:evenodd;stroke:none;stroke-opacity:1;stroke-width:1pt;stroke-linejoin:miter;stroke-linecap:butt;fill-opacity:1;"
     d="M 25.036455 40.201449 L 31.28654 47.984507 L 32.819578 46.805277 L 27.394979 40.083513 C 27.394979 40.083513 29.163888 38.078732 30.343118 37.960861 C 32.229963 39.729705 36.003588 44.446753 36.003588 44.446753 L 45.791427 37.017439 L 39.30547 27.701278 L 25.036455 40.201449 z "
     id="path674"
     sodipodi:nodetypes="ccccccccc" />
  <path
     style="fill:#f1e36c;fill-rule:evenodd;stroke:none;stroke-opacity:1;stroke-width:1pt;stroke-linejoin:miter;stroke-linecap:butt;fill-opacity:1;"
     d="M 5.5939825 25.727114 C 5.1222843 25.609178 19.37605 47.630698 19.729858 47.630698 C 20.0836 47.630698 27.630851 50.814775 27.630851 50.814775 L 27.159172 52.347747 L 19.258113 50.107224 L 3.9430222 27.511267 L 5.5939825 25.727114 z "
     id="path675"
     sodipodi:nodetypes="ccccccc" />
  <path
     style="fill:#f1e36c;fill-rule:evenodd;stroke:none;stroke-opacity:1;stroke-width:1pt;stroke-linejoin:miter;stroke-linecap:butt;fill-opacity:1;"
     d="M 28.220466 39.965577 L 33.05545 46.215663 L 35.178102 44.446753 L 30.107311 38.314604 L 28.220466 39.965577 z "
     id="path681" />
  <path
     style="fill:url(#linearGradient683);fill-rule:evenodd;stroke:none;stroke-opacity:1;stroke-width:1pt;stroke-linejoin:miter;stroke-linecap:butt;fill-opacity:1;"
     d="M 39.195549 28.332548 L 30.058823 36.340045 C 30.845873 38.666967 33.480808 40.480619 34.575872 41.781004 C 36.252667 29.187995 39.777345 30.248829 43.302024 34.800109 L 39.195549 28.332548 z "
     id="path682"
     sodipodi:nodetypes="ccccc" />
  <path
     style="fill:url(#linearGradient688);fill-rule:evenodd;stroke:none;stroke-opacity:1;stroke-width:1pt;stroke-linejoin:miter;stroke-linecap:butt;fill-opacity:1;"
     d="M 27.492284 50.815103 L 27.081643 52.35504 L 19.176839 50.301835 L 19.484787 47.63267 L 27.492284 50.815103 z "
     id="path687" />
  <path
     style="fill:url(#linearGradient693);fill-rule:evenodd;stroke:none;stroke-opacity:1;stroke-width:1pt;stroke-linejoin:miter;stroke-linecap:butt;fill-opacity:1;"
     d="M 19.176839 50.199142 L 19.690108 47.83799 L 8.602804 31.001714 L 7.9868427 33.260239 L 19.176839 50.199142 z "
     id="path692" />
  <path
     style="fill:#bae6ff;fill-rule:evenodd;stroke:none;stroke-opacity:1;stroke-width:1pt;stroke-linejoin:miter;stroke-linecap:butt;fill-opacity:1;"
     d="M 10.14274 21.762294 L 14.249149 26.381971 L 31.804079 14.062745 L 28.210939 8.8271067 L 10.14274 21.762294 z "
     id="path697"
     sodipodi:nodetypes="ccccc" />
  <g
     id="g652"
     transform="matrix(-0.420018,0.550428,0.551248,0.419394,31.52628,-11.21918)">
    <sodipodi:namedview
       id="namedview653"
       inkscape:zoom="9.65625000"
       inkscape:cx="16.0000000"
       inkscape:cy="20.1423948"
       inkscape:window-width="1014"
       inkscape:window-height="696"
       inkscape:window-x="0"
       inkscape:window-y="0" />
    <defs
       id="defs550">
      <linearGradient
         x1="0.00000000"
         y1="0.00000000"
         x2="1.00000000"
         y2="0.00000000"
         id="linearGradient556"
         gradientUnits="objectBoundingBox"
         spreadMethod="pad">
        <stop
           style="stop-color:#ff0000;stop-opacity:1.0000;"
           offset="0"
           id="stop557" />
        <stop
           style="stop-color:#ffff8d;stop-opacity:0;"
           offset="1"
           id="stop558" />
      </linearGradient>
      <linearGradient
         id="linearGradient559"
         xlink:href="#linearGradient556"
         x1="0.984508"
         y1="0.968756"
         x2="-0.573643"
         y2="-0.171875" />
    </defs>
    <path
       d="M 60.01725 23.99648 C 59.53549 18.42523 39.28151 -0.155997 34.6921 1.525979 C 26.26824 2.875133 27.80318 12.48977 24.47333 13.67308 C 21.12074 14.2603 -7.972638 17.44191 5.187324 48.65893 C 7.581571 54.25087 9.102327 55.29983 11.60488 57.13311 C 14.0401 58.78143 17.95009 58.8779 21.12059 55.3124 C 24.01675 51.00947 22.76623 46.76743 21.42301 43.20362 C 17.19612 32.53529 24.99563 32.40727 29.30969 30.15509 C 30.31799 33.8884 32.17592 42.69868 34.68069 42.57612 C 37.18548 42.45358 60.64089 35.12471 60.01725 23.99648 z "
       style="font-size:12;fill:#0d3c07;fill-rule:evenodd;"
       id="path582"
       sodipodi:nodetypes="cccsscsccc" />
    <path
       d="M 56.43394 23.6407 C 56.27621 19.46667 39.11294 4.640965 35.3464 6.096892 C 31.57967 7.552896 33.49308 12.85851 31.87806 15.80547 C -4.80765 16.56439 4.758002 57.5538 16.64254 52.80007 C 23.15131 50.27578 12.05925 39.66178 17.21876 32.46884 C 21.59482 26.19341 33.14937 25.01374 33.38684 26.55734 C 33.86179 29.64459 34.44591 38.87531 36.46869 38.67948 C 38.4915 38.48365 57.31595 28.02613 56.43394 23.6407 z "
       style="font-size:12;fill:#2aaf18;fill-rule:evenodd;"
       id="path581"
       sodipodi:nodetypes="ccccsccc" />
    <path
       d="M 6.835245 41.70574 C 8.271465 32.53362 10.38564 27.15574 15.38294 23.37504 C 20.88176 19.00195 30.21643 18.33108 30.49849 17.5357 C 30.78051 16.74034 23.72856 18.85646 18.28161 20.48563 C 8.069523 23.49743 5.940525 35.37665 6.835245 41.70574 z "
       style="font-size:12;fill:#ffffff;fill-rule:evenodd;"
       id="path588"
       sodipodi:nodetypes="cscsc" />
    <path
       d="M 48.10932 19.7236 C 46.94802 18.36876 38.77247 11.53838 36.54244 11.06304 C 34.31254 10.58784 35.79821 14.70468 35.79821 14.70468 C 35.79821 14.70468 47.19147 18.18673 48.10932 19.7236 z "
       style="font-size:12;fill:#ffffff;fill-rule:evenodd;"
       id="path589"
       sodipodi:nodetypes="cccc" />
    <path
       style="font-size:12;fill:none;fill-rule:evenodd;stroke-width:1pt;"
       d="M 48.89974 35.68601 C 48.89974 35.68601 58.05552 31.86359 58.04005 31.98362 C 58.02458 32.10363 56.33631 30.05579 56.33631 30.05579 L 53.96308 30.48197 L 48.70187 32.48812 L 48.89974 35.68601 z "
       id="path576" />
    <path
       style="fill:#1f8b10;fill-rule:evenodd;stroke:none;stroke-opacity:1;stroke-width:1pt;stroke-linejoin:miter;stroke-linecap:butt;fill-opacity:0.9899;"
       d="M 56.32258 23.6129 C 57.29033 29.41935 36.19355 39.09677 36.19355 39.09677 C 34.25806 37.54839 33.09677 27.09678 31.16129 25.74193 C 27.67742 27.29032 16.83871 30.38709 16.25807 34.45161 C 15.67741 38.51613 18.58065 46.64516 18.96775 48.58064 C 19.74194 51.48388 17.22581 54.19355 14.70968 53.03226 C 12.19355 51.87097 11.80645 49.54838 11.80645 49.54838 C 11.80645 49.54838 14.51613 49.54839 14.90323 47.41935 C 15.29032 45.29032 9.67742 34.83871 12.58065 30.77419 C 15.48387 26.70968 27.09677 21.09678 34.25806 21.67742 L 37.16129 33.67741 C 37.16129 33.67741 40.06451 33.48388 56.32258 23.6129 z "
       id="path615"
       sodipodi:nodetypes="cccccccccccc" />
  </g>
</svg>
