<?xml version="1.0" encoding="UTF-8" standalone="no"?>
<!DOCTYPE svg PUBLIC "-//W3C//DTD SVG 20010904//EN"
"http://www.w3.org/TR/2001/REC-SVG-20010904/DTD/svg10.dtd">
<!-- Created with Sodipodi ("http://www.sodipodi.com/") -->
<svg
   id="svg548"
   sodipodi:version="0.32"
   width="72pt"
   height="72pt"
   sodipodi:docbase="/usr/share/icons/Gartoon/scalable/apps"
   sodipodi:docname="gnome-main-menu.svg"
   inkscape:version="0.38.1"
   xmlns="http://www.w3.org/2000/svg"
   xmlns:inkscape="http://www.inkscape.org/namespaces/inkscape"
   xmlns:sodipodi="http://sodipodi.sourceforge.net/DTD/sodipodi-0.dtd"
   xmlns:xlink="http://www.w3.org/1999/xlink">
  <defs
     id="defs550">
    <linearGradient
       id="linearGradient589">
      <stop
         style="stop-color:#ffffff;stop-opacity:1;"
         offset="0.000000"
         id="stop590" />
      <stop
         style="stop-color:#ffffff;stop-opacity:0;"
         offset="1.000000"
         id="stop591" />
    </linearGradient>
    <linearGradient
       xlink:href="#linearGradient589"
       id="linearGradient592"
       x1="38.4874878"
       y1="25.5889244"
       x2="50.0719948"
       y2="48.2551422"
       gradientUnits="userSpaceOnUse"
       gradientTransform="scale(0.608808,1.642555)"
       spreadMethod="pad" />
    <linearGradient
       xlink:href="#linearGradient589"
       id="linearGradient594"
       x1="-0.12901177"
       y1="0.02343532"
       x2="0.70967788"
       y2="0.96093744"
       gradientUnits="objectBoundingBox"
       spreadMethod="pad" />
    <linearGradient
       xlink:href="#linearGradient589"
       id="linearGradient596" />
    <linearGradient
       xlink:href="#linearGradient589"
       id="linearGradient629" />
    <linearGradient
       xlink:href="#linearGradient589"
       id="linearGradient631" />
  </defs>
  <sodipodi:namedview
     id="base"
     inkscape:zoom="5.0416667"
     inkscape:cx="36.000000"
     inkscape:cy="32.366873"
     inkscape:window-width="640"
     inkscape:window-height="499"
     inkscape:window-x="50"
     inkscape:window-y="33" />
  <g
     id="g1279"
     transform="matrix(0.419057,0.000000,0.000000,0.388339,-130.2088,-170.3251)"
     style="fill:none;stroke:#000000;stroke-opacity:0.13218386;">
    <path
       style="fill:none;stroke-width:3.0000000pt;fill-opacity:1.0000000;stroke:#000000;stroke-opacity:0.13218391;"
       d="M 331.24981,281.18960 C 334.67942,273.73086 354.72962,277.94320 360.14619,278.47812 C 399.83388,283.48426 437.27685,297.44133 472.80118,316.07794 C 491.94486,326.86971 510.04754,338.86185 527.34700,352.59672 L 521.10116,355.97476 C 504.66209,342.37195 487.28477,330.75018 468.81234,320.32906 C 434.99189,302.65120 399.06842,289.38796 361.14488,285.70897 C 356.57152,285.40450 352.00192,285.11380 347.41640,285.33996 C 345.46079,285.43640 343.59709,285.94029 341.68519,286.13329 C 340.85036,286.21753 343.48202,283.40032 343.45036,284.26929 L 331.24981,281.18960 z "
       id="path1123"
       transform="translate(-20.39467,309.0094)" />
    <path
       style="fill:none;stroke-width:3.0000000pt;fill-opacity:1.0000000;stroke:#000000;stroke-opacity:0.13218391;"
       d="M 357.57803,139.32288 C 366.51775,141.12622 375.26342,150.34130 382.78023,154.90022 C 417.40514,175.05469 454.52258,189.63527 494.23568,197.37777 C 505.77443,199.22706 517.19136,200.52913 528.86558,201.19030 L 528.35470,205.94560 C 516.18771,205.05629 504.26320,203.56187 492.24279,201.52587 C 451.34830,193.24651 413.28032,178.18920 376.87157,158.63941 C 374.06675,157.09022 347.95371,144.22771 357.30147,146.07583 L 357.57803,139.32288 z "
       id="path1124"
       transform="translate(-20.39467,309.0094)" />
    <path
       style="fill:none;stroke-width:3.0000000pt;fill-opacity:1.0000000;stroke:#000000;stroke-opacity:0.13218391;"
       d="M 354.66203,136.35953 C 362.74933,149.49305 364.98114,167.45099 367.40534,181.80011 C 372.24327,218.38435 367.06756,252.87655 353.57294,287.12827 L 348.00470,285.91337 C 362.81248,252.37295 367.62766,217.85338 361.21464,181.67128 C 358.79145,170.76491 355.89161,160.00662 351.18229,149.64810 C 349.43436,145.80336 342.86877,134.79195 345.03038,138.46881 L 354.66203,136.35953 z "
       id="path1125"
       transform="translate(-20.39467,309.0094)" />
    <path
       style="fill:none;stroke-width:3.0000000pt;fill-opacity:1.0000000;stroke:#000000;stroke-opacity:0.13218391;"
       d="M 547.97429,202.68626 C 545.01023,208.75160 538.91178,214.13998 535.54799,220.21749 C 527.20162,235.29739 523.97308,251.35483 521.52093,267.53961 C 518.69605,297.36611 520.85413,326.81689 525.63011,356.61936 L 519.51038,356.62169 C 515.31371,326.75405 512.57470,297.02941 513.40342,267.08355 C 514.60641,250.62621 516.36173,234.19897 522.66987,218.40215 C 525.66290,210.90710 531.79987,199.09455 530.69983,201.97880 L 547.97429,202.68626 z "
       id="path1126"
       transform="translate(-20.39467,309.0094)" />
    <path
       style="fill:none;stroke-width:3.0000000pt;fill-opacity:1.0000000;stroke:#000000;stroke-opacity:0.13218391;"
       d="M 356.55847,136.22248 C 365.49819,138.02582 374.24386,147.24090 381.76067,151.79982 C 416.38558,171.95429 453.50302,186.53487 493.21612,194.27737 C 504.75487,196.12666 516.17180,197.42873 527.84602,198.08990 L 527.33514,202.84520 C 515.16815,201.95589 503.24364,200.46147 491.22323,198.42547 C 450.32874,190.14611 412.26076,175.08880 375.85201,155.53901 C 373.04719,153.98982 346.93415,141.12731 356.28191,142.97543 L 356.55847,136.22248 z "
       id="path1127"
       transform="translate(-20.39467,309.0094)" />
    <path
       style="fill:none;stroke-width:3.0000000pt;fill-opacity:1.0000000;stroke:#000000;stroke-opacity:0.13218391;"
       d="M 329.61223,285.50542 C 333.04184,278.04668 353.09204,282.25902 358.50861,282.79394 C 398.19630,287.80008 435.63927,301.75715 471.16360,320.39376 C 490.30728,331.18553 508.40996,343.17767 525.70942,356.91254 L 519.46358,360.29058 C 503.02451,346.68777 485.64719,335.06600 467.17476,324.64488 C 433.35431,306.96702 397.43084,293.70378 359.50730,290.02479 C 354.93394,289.72032 350.36434,289.42962 345.77882,289.65578 C 343.82321,289.75222 341.95951,290.25611 340.04761,290.44911 C 339.21278,290.53335 341.84444,287.71614 341.81278,288.58511 L 329.61223,285.50542 z "
       id="path1128"
       transform="translate(-20.39467,309.0094)" />
    <path
       style="fill:none;stroke-width:3.0000000pt;fill-opacity:1.0000000;stroke:#000000;stroke-opacity:0.13218391;"
       d="M 351.78841,135.11319 C 359.87571,148.24671 362.10752,166.20465 364.53172,180.55377 C 369.36965,217.13801 364.19394,251.63021 350.69932,285.88193 L 345.13108,284.66703 C 359.93886,251.12661 364.75404,216.60704 358.34102,180.42494 C 355.91783,169.51857 353.01799,158.76028 348.30867,148.40176 C 346.56074,144.55702 339.99515,133.54561 342.15676,137.22247 L 351.78841,135.11319 z "
       id="path1129"
       transform="translate(-20.39467,309.0094)" />
    <path
       style="fill:none;stroke-width:3.0000000pt;fill-opacity:1.0000000;stroke:#000000;stroke-opacity:0.13218391;"
       d="M 545.10067,202.05793 C 542.13661,208.12327 536.03816,213.51165 532.67437,219.58916 C 524.32800,234.66906 521.09946,250.72650 518.64731,266.91128 C 515.82243,296.73778 517.98051,326.18856 522.75649,355.99103 L 516.63676,355.99336 C 512.44009,326.12572 509.70108,296.40108 510.52980,266.45522 C 511.73279,249.99788 513.48811,233.57064 519.79625,217.77382 C 522.78928,210.27877 528.92625,198.46622 527.82621,201.35047 L 545.10067,202.05793 z "
       id="path1130"
       transform="translate(-20.39467,309.0094)" />
    <path
       style="fill:none;fill-rule:evenodd;stroke-width:1.0000000pt;fill-opacity:1.0000000;stroke:#000000;stroke-opacity:0.13218391;"
       d="M 435.82401,226.06802 C 419.13360,239.41501 444.60932,248.49780 454.21630,237.75358 C 466.20866,223.66578 457.28663,202.65911 432.53791,203.01868 C 400.52559,200.44498 383.09374,259.76524 437.05833,276.97828 C 450.06964,280.08753 460.51419,280.27139 460.93649,270.56521 C 461.08959,266.19129 446.26653,257.53949 447.57148,245.79045 C 430.89052,250.03196 420.19184,237.28373 425.70516,226.05262 C 431.37841,216.15335 443.70139,216.32809 446.73538,229.65643 C 446.22410,235.28765 428.97603,234.61412 435.82401,226.06802 z "
       id="path1131"
       transform="translate(-20.39467,309.0094)" />
    <path
       style="fill:none;stroke-width:3.0000000pt;fill-opacity:1.0000000;stroke:#000000;stroke-opacity:0.13218391;"
       d="M 427.95418,299.24507 C 428.24283,298.08958 422.97631,290.55351 421.49956,288.46581 C 405.54968,267.07217 384.59828,250.32182 362.32216,235.92278 C 354.49413,231.12044 358.39991,233.45553 350.60770,228.91276 L 354.66922,226.18628 C 362.46769,230.90396 358.55248,228.48879 366.41238,233.43570 C 389.32169,248.44780 410.60821,265.54259 428.30987,286.54553 C 431.11751,290.00663 436.35128,294.91564 437.12473,299.62064 L 427.95418,299.24507 z "
       id="path1132"
       transform="translate(-20.39467,309.0094)" />
    <path
       style="fill:none;stroke-width:3.0000000pt;fill-opacity:1.0000000;stroke:#000000;stroke-opacity:0.13218391;"
       d="M 422.75467,298.38721 C 423.04332,297.23172 417.77680,289.69565 416.30005,287.60795 C 400.35017,266.21431 379.39877,249.46396 357.12265,235.06492 C 349.29462,230.26258 353.20040,232.59767 345.40819,228.05490 L 349.46971,225.32842 C 357.26818,230.04610 353.35297,227.63093 361.21287,232.57784 C 384.12218,247.58994 405.40870,264.68473 423.11036,285.68767 C 425.91800,289.14877 431.15177,294.05778 431.92522,298.76278 L 422.75467,298.38721 z "
       id="path1133"
       transform="translate(-20.39467,309.0094)" />
    <path
       style="fill:none;stroke-width:3.0000000pt;fill-opacity:1.0000000;stroke:#000000;stroke-opacity:0.13218391;"
       d="M 518.72811,265.42446 C 511.86571,269.68602 502.44460,272.47386 494.88418,276.12175 C 479.26639,284.05796 463.30328,293.41207 451.33885,306.44109 C 450.94709,306.91034 450.55530,307.37959 450.16356,307.84882 L 443.08031,305.20405 C 443.56225,304.70201 444.04418,304.20001 444.52612,303.69794 C 457.78837,290.85256 474.08511,281.18813 490.26384,272.51552 C 493.15400,271.02236 513.02917,260.81107 511.09134,262.03729 L 518.72811,265.42446 z "
       id="path1134"
       transform="translate(-20.39467,309.0094)" />
    <path
       style="fill:none;stroke-width:3.0000000pt;fill-opacity:1.0000000;stroke:#000000;stroke-opacity:0.13218391;"
       d="M 514.76464,264.56660 C 507.90224,268.82816 498.48113,271.61600 490.92071,275.26389 C 475.30292,283.20010 459.33981,292.55421 447.37538,305.58323 C 446.98362,306.05248 446.59183,306.52173 446.20009,306.99096 L 439.11684,304.34619 C 439.59878,303.84415 440.08071,303.34215 440.56265,302.84008 C 453.82490,289.99470 470.12164,280.33027 486.30037,271.65766 C 489.19053,270.16450 509.06570,259.95321 507.12787,261.17943 L 514.76464,264.56660 z "
       id="path1135"
       transform="translate(-20.39467,309.0094)" />
    <path
       style="fill:none;stroke-width:3.0000000pt;fill-opacity:1.0000000;stroke:#000000;stroke-opacity:0.13218391;"
       d="M 449.03638,183.46541 C 455.74006,185.33069 457.98622,194.75278 461.57750,200.31474 C 473.29029,217.07903 488.10926,230.61378 504.20423,243.10015 L 499.63451,245.35676 C 483.35062,232.29977 468.15958,218.33899 455.14297,201.97475 C 450.66434,196.05289 439.89499,186.78535 448.80016,189.23324 L 449.03638,183.46541 z "
       id="path1136"
       transform="translate(-20.39467,309.0094)" />
    <path
       style="fill:none;stroke-width:3.0000000pt;fill-opacity:1.0000000;stroke:#000000;stroke-opacity:0.13218391;"
       d="M 446.92697,186.31567 C 453.63065,188.18095 455.87681,197.60304 459.46809,203.16500 C 471.18088,219.92929 485.99985,233.46403 502.09482,245.95040 L 497.52510,248.20701 C 481.24121,235.15002 466.05017,221.18925 453.03356,204.82501 C 448.55493,198.90315 437.78558,189.63561 446.69075,192.08350 L 446.92697,186.31567 z "
       id="path1137"
       transform="translate(-20.39467,309.0094)" />
    <path
       style="fill:none;stroke-width:3.0000000pt;fill-opacity:1.0000000;stroke:#000000;stroke-opacity:0.13218391;"
       d="M 371.52344,218.76785 C 366.63001,219.35743 377.74229,216.19592 379.78710,215.20056 C 395.23294,207.10849 409.27343,196.56566 422.22599,184.94214 C 424.33958,182.97027 426.41548,180.97742 428.44908,178.92334 L 434.98617,181.70532 C 432.76570,183.75190 430.51467,185.75600 428.24141,187.74384 C 414.68462,199.28351 400.45253,210.19958 385.04458,219.16801 C 380.27138,221.78318 375.00889,224.07209 371.28722,224.53569 L 371.52344,218.76785 z "
       id="path1138"
       transform="translate(-20.39467,309.0094)" />
    <path
       style="fill:none;stroke-width:3.0000000pt;fill-opacity:1.0000000;stroke:#000000;stroke-opacity:0.13218391;"
       d="M 370.03204,216.05594 C 365.13861,216.64552 376.25089,213.48401 378.29570,212.48865 C 393.74154,204.39658 407.78203,193.85375 420.73459,182.23023 C 422.84818,180.25836 424.92408,178.26551 426.95768,176.21143 L 433.49477,178.99341 C 431.27430,181.03999 429.02327,183.04409 426.75001,185.03193 C 413.19322,196.57160 398.96113,207.48767 383.55318,216.45610 C 378.77998,219.07127 373.51749,221.36018 369.79582,221.82377 L 370.03204,216.05594 z "
       id="path1139"
       transform="translate(-20.39467,309.0094)" />
    <path
       style="fill:none;fill-rule:evenodd;stroke-width:1.0000000pt;fill-opacity:1.0000000;stroke:#000000;stroke-opacity:0.13218391;"
       d="M 435.82820,226.01108 C 419.15896,238.26343 452.42330,242.02812 455.79893,228.01606 C 459.69280,209.92959 444.97439,196.88361 421.49320,204.59784 C 393.49139,216.28976 405.30957,280.99936 460.99256,270.61332 C 461.87213,261.26911 445.23184,255.77264 448.02764,245.53260 C 436.85041,248.29906 428.39724,242.23821 427.93652,229.73532 C 426.82393,217.18799 442.58307,210.90790 447.11333,224.34918 C 448.96247,229.59162 423.91128,237.42192 435.82820,226.01108 z "
       id="path1140"
       transform="translate(-20.39467,309.0094)" />
  </g>
  <path
     style="fill:#005f00;stroke-width:3.0000000pt;"
     d="M 0.12760373,58.608003 C 1.5648055,55.711479 9.9669760,57.347300 12.236826,57.555030 C 28.868222,59.499108 44.558942,64.919195 59.445654,72.156528 C 67.467945,76.347399 75.053988,81.004420 82.303441,86.338212 L 79.686080,87.650030 C 72.797177,82.367525 65.515105,77.854329 57.774099,73.807402 C 43.601420,66.942397 28.547447,61.791754 12.655334,60.363053 C 10.738836,60.244824 8.8239150,60.131927 6.9023211,60.219751 C 6.0828095,60.257210 5.3018148,60.452886 4.5006201,60.527838 C 4.1507798,60.560550 5.2535941,59.466515 5.2403270,59.803970 L 0.12760373,58.608003 z "
     id="path978" />
  <path
     style="fill:#005f00;stroke-width:3.0000000pt;"
     d="M 11.160622,3.5155553 C 14.906873,4.2158619 18.571803,7.7944408 21.721772,9.5648496 C 36.231575,17.391626 51.785885,23.053841 68.427921,26.060560 C 73.263311,26.778712 78.047652,27.284356 82.939812,27.541113 L 82.725726,29.387786 C 77.627071,29.042431 72.630026,28.462090 67.592784,27.671435 C 50.455678,24.456230 34.503042,18.608881 19.245709,11.016924 C 18.070329,10.415314 7.1274842,5.4202937 11.044728,6.1379914 L 11.160622,3.5155553 z "
     id="path977" />
  <path
     style="fill:#005f00;stroke-width:3.0000000pt;"
     d="M 9.9386520,2.3647686 C 13.327690,7.4650338 14.262945,14.438810 15.278821,20.011144 C 17.306188,34.218244 15.137273,47.612932 9.4822600,60.914223 L 7.1488517,60.442431 C 13.354153,47.417357 15.371985,34.012049 12.684567,19.961110 C 11.669114,15.725736 10.453915,11.547867 8.4804430,7.5252447 C 7.7479616,6.0321807 4.9966079,1.7560146 5.9024445,3.1838850 L 9.9386520,2.3647686 z "
     id="path976" />
  <path
     style="fill:#005f00;stroke-width:3.0000000pt;"
     d="M 90.947445,28.122057 C 89.705332,30.477467 87.149738,32.569993 85.740121,34.930129 C 82.242514,40.786244 80.889586,47.021987 79.861990,53.307178 C 78.678206,64.889985 79.582564,76.326879 81.583976,87.900356 L 79.019454,87.901265 C 77.260811,76.302478 76.113022,64.759226 76.460288,53.130067 C 76.964417,46.739038 77.699988,40.359687 80.343456,34.225162 C 81.597714,31.314536 84.169447,26.727254 83.708467,27.847323 L 90.947445,28.122057 z "
     id="path975" />
  <path
     style="fill:#008800;stroke-width:3.0000000pt;"
     d="M 10.733368,2.3115461 C 14.479618,3.0118540 18.144549,6.5904341 21.294520,8.3608419 C 35.804322,16.187621 51.358632,21.849834 68.000667,24.856554 C 72.836059,25.574705 77.620401,26.080348 82.512559,26.337105 L 82.298473,28.183780 C 77.199818,27.838423 72.202773,27.258083 67.165532,26.467427 C 50.028426,23.252224 34.075789,17.404873 18.818455,9.8129172 C 17.643076,9.2113054 6.7002312,4.2162858 10.617474,4.9339834 L 10.733368,2.3115461 z "
     id="path974" />
  <path
     style="fill:#008800;stroke-width:3.0000000pt;"
     d="M -0.55863493,60.284012 C 0.87856573,57.387481 9.2807380,59.023299 11.550587,59.231037 C 28.181985,61.175116 43.872706,66.595196 58.759417,73.832528 C 66.781706,78.023398 74.367751,82.680420 81.617205,88.014212 L 78.999842,89.326038 C 72.110941,84.043531 64.828856,79.530344 57.087863,75.483410 C 42.915173,68.618397 27.861210,63.467754 11.969095,62.039054 C 10.052596,61.920822 8.1376750,61.807928 6.2160824,61.895756 C 5.3965723,61.933209 4.6155761,62.128887 3.8143814,62.203837 C 3.4645399,62.236550 4.5673543,61.142515 4.5540883,61.479976 L -0.55863493,60.284012 z "
     id="path973" />
  <path
     style="fill:#008800;stroke-width:3.0000000pt;"
     d="M 8.7344430,1.8807657 C 12.123479,6.9810291 13.058734,13.954807 14.074612,19.527137 C 16.101979,33.734245 13.933063,47.128925 8.2780520,60.430223 L 5.9446430,59.958431 C 12.149943,46.933359 14.167776,33.528042 11.480359,19.477110 C 10.464904,15.241733 9.2497060,11.063864 7.2762336,7.0412411 C 6.5437510,5.5481779 3.7923976,1.2720123 4.6982347,2.6998820 L 8.7344430,1.8807657 z "
     id="path972" />
  <path
     style="fill:#008800;stroke-width:3.0000000pt;"
     d="M 89.743240,27.878054 C 88.501127,30.233462 85.945534,32.325980 84.535915,34.686123 C 81.038310,40.542239 79.685371,46.777981 78.657786,53.063166 C 77.474002,64.645972 78.378361,76.082875 80.379761,87.656350 L 77.815251,87.657260 C 76.056607,76.058473 74.908805,64.515227 75.256083,52.886061 C 75.760202,46.495025 76.495784,40.115682 79.139251,33.981157 C 80.393498,31.070531 82.965242,26.483249 82.504262,27.603318 L 89.743240,27.878054 z "
     id="path971" />
  <path
     style="fill:#008dc8;fill-rule:evenodd;stroke-width:1.0000000pt;"
     d="M 43.950125,37.202120 C 36.955898,42.385282 47.631663,45.912493 51.657537,41.740082 C 56.683009,36.269233 52.944184,28.111512 42.573061,28.251149 C 29.158088,27.251683 21.853151,50.288080 44.467374,56.972588 C 49.919844,58.180024 54.296712,58.251426 54.473675,54.482132 C 54.537832,52.783566 48.326129,49.423732 48.872980,44.861113 C 41.882711,46.508269 37.399353,41.557618 39.709747,37.196136 C 42.087162,33.351861 47.251192,33.419715 48.522605,38.595641 C 48.308354,40.782466 41.080429,40.520909 43.950125,37.202120 z "
     id="path970" />
  <path
     style="fill:#ffd200;stroke-width:3.0000000pt;"
     d="M 40.652212,65.619660 C 40.773180,65.170936 38.566203,62.244383 37.947364,61.433648 C 31.263467,53.125653 22.483637,46.620827 13.148680,41.029109 C 9.8682910,39.164176 11.505036,40.070977 8.2396570,38.306842 L 9.9416630,37.248041 C 13.209667,39.080104 11.568972,38.142199 14.862715,40.063278 C 24.463014,45.893076 33.383270,52.531660 40.801266,60.687925 C 41.977828,62.032002 44.171080,63.938368 44.495195,65.765506 L 40.652212,65.619660 z "
     id="path968" />
  <path
     style="fill:#ffe900;stroke-width:3.0000000pt;"
     d="M 38.473330,65.286514 C 38.594288,64.837789 36.387321,61.911245 35.768472,61.100502 C 29.084574,52.792507 20.304749,46.287690 10.969791,40.695969 C 7.6894021,38.831032 9.3261460,39.737839 6.0607672,37.973703 L 7.7627747,36.914901 C 11.030777,38.746965 9.3900820,37.809062 12.683826,39.730140 C 22.284125,45.559931 31.204387,52.198512 38.622384,60.354779 C 39.798947,61.698865 41.992187,63.605228 42.316312,65.432365 L 38.473330,65.286514 z "
     id="path967" />
  <path
     style="fill:#ffd200;stroke-width:3.0000000pt;"
     d="M 78.691645,52.485776 C 75.815908,54.140707 71.867931,55.223345 68.699681,56.639957 C 62.154948,59.721902 55.465498,63.354472 50.451717,68.414156 C 50.287553,68.596380 50.123366,68.778613 49.959213,68.960837 L 46.990923,67.933771 C 47.192885,67.738799 47.394836,67.543853 47.596798,67.348883 C 53.154430,62.360513 59.983687,58.607432 66.763500,55.239518 C 67.974641,54.659668 76.303468,50.694220 75.491405,51.170410 L 78.691645,52.485776 z "
     id="path966" />
  <path
     style="fill:#ffe900;stroke-width:3.0000000pt;"
     d="M 77.030720,52.152638 C 74.154982,53.807569 70.207005,54.890198 67.038766,56.306817 C 60.494023,59.388763 53.804573,63.021333 48.790804,68.081017 C 48.626629,68.263249 48.462453,68.445474 48.298288,68.627691 L 45.330010,67.600624 C 45.531960,67.405661 45.733923,67.210714 45.935883,67.015745 C 51.493516,62.027374 58.322773,58.274292 65.102574,54.906380 C 66.313726,54.326522 74.642543,50.361075 73.830481,50.837265 L 77.030720,52.152638 z "
     id="path965" />
  <path
     style="fill:#ffd200;stroke-width:3.0000000pt;"
     d="M 49.486852,20.657842 C 52.296076,21.382200 53.237349,25.041172 54.742294,27.201102 C 59.650614,33.711341 65.860601,38.967416 72.605315,43.816367 L 70.690339,44.692700 C 63.866470,39.622157 57.500556,34.200632 52.045864,27.845751 C 50.169061,25.546054 45.656092,21.947105 49.387862,22.897718 L 49.486852,20.657842 z "
     id="path964" />
  <path
     style="fill:#ffe900;stroke-width:3.0000000pt;"
     d="M 48.602889,21.764709 C 51.412115,22.489069 52.353386,26.148041 53.858331,28.307972 C 58.766651,34.818210 64.976639,40.074279 71.721353,44.923229 L 69.806377,45.799561 C 62.982508,40.729017 56.616596,35.307502 51.161902,28.952620 C 49.285101,26.652923 44.772130,23.053975 48.503901,24.004585 L 48.602889,21.764709 z "
     id="path963" />
  <path
     style="fill:#ffd200;stroke-width:3.0000000pt;"
     d="M 17.004540,34.367175 C 14.953913,34.596132 19.610590,33.368393 20.467480,32.981853 C 26.940160,29.839387 32.823920,25.745183 38.251779,21.231319 C 39.137499,20.465562 40.007412,19.691661 40.859605,18.893975 L 43.599020,19.974332 C 42.668522,20.769095 41.725204,21.547365 40.772584,22.319321 C 35.091515,26.800631 29.127471,31.039779 22.670667,34.522569 C 20.670422,35.538142 18.465139,36.427018 16.905550,36.607051 L 17.004540,34.367175 z "
     id="path962" />
  <path
     style="fill:#ffe900;stroke-width:3.0000000pt;"
     d="M 16.379558,33.314029 C 14.328934,33.542986 18.985610,32.315247 19.842501,31.928713 C 26.315182,28.786241 32.198943,24.692044 37.626801,20.178173 C 38.512510,19.412415 39.382434,18.638516 40.234627,17.840836 L 42.974043,18.921189 C 42.043535,19.715958 41.100227,20.494227 40.147607,21.266184 C 34.466538,25.747494 28.502482,29.986632 22.045682,33.469430 C 20.045440,34.485004 17.840157,35.373880 16.280568,35.553906 L 16.379558,33.314029 z "
     id="path961" />
  <path
     style="fill:#4dd3ff;fill-rule:evenodd;stroke-width:1.0000000pt;"
     d="M 43.951885,37.180007 C 36.966527,41.938078 50.906170,43.400058 52.320742,37.958618 C 53.952499,30.934925 47.784657,25.868661 37.944699,28.864404 C 26.210351,33.404832 31.162839,58.534127 54.497170,54.500818 C 54.865762,50.872095 47.892539,48.737599 49.064135,44.760987 C 44.380243,45.835315 40.837881,43.481642 40.644811,38.626274 C 40.178578,33.753653 46.782556,31.314843 48.680985,36.534627 C 49.455879,38.570473 38.958014,41.611283 43.951885,37.180007 z "
     id="path969" />
</svg>
