<?xml version="1.0" encoding="UTF-8" standalone="no"?>
<!DOCTYPE svg PUBLIC "-//W3C//DTD SVG 1.0//EN"
"http://www.w3.org/TR/2001/REC-SVG-20010904/DTD/svg10.dtd">
<!-- Created with Sodipodi ("http://www.sodipodi.com/") -->
<svg
   xmlns="http://www.w3.org/2000/svg"
   xmlns:xlink="http://www.w3.org/1999/xlink"
   version="1.0"
   x="0"
   y="0"
   width="90"
   height="90"
   id="svg1316"
   xml:space="preserve"><defs
   id="defs1318" /><path
   d="M 54.72229 24.889 L 29.45899 13.63105 "
   style="font-size:12;fill:none;fill-rule:evenodd;stroke:#000000;stroke-width:12.48628;stroke-linecap:round;"
   id="path703" /><path
   d="M 43.59899 29.92024 L 13.56315 27.87546 "
   style="font-size:12;fill:none;fill-rule:evenodd;stroke:#000000;stroke-width:11.75502;stroke-linecap:round;"
   id="path704" /><path
   d="M 41.25351 33.96571 L 8.230652 49.34976 "
   style="font-size:12;fill:none;fill-rule:evenodd;stroke:#000000;stroke-width:12.12064;stroke-linecap:round;"
   id="path705" /><path
   d="M 68.96105 50.63957 C 68.96105 56.50582 64.11227 61.26134 58.13098 61.26134 C 52.1497 61.26134 47.30092 56.50582 47.30092 50.63957 C 47.30092 44.77331 52.1497 40.01777 58.13098 40.01777 C 64.11227 40.01777 68.96105 44.77331 68.96105 50.63957 z "
   style="font-size:12;fill:#00105f;fill-rule:evenodd;"
   id="path694" /><path
   d="M 83.12341 51.14548 C 83.12341 65.07568 72.71341 75.11871 59.35819 75.11871 C 46.00299 75.11871 34.7599 65.07568 34.7599 51.14548 C 34.7599 37.21529 43.9203 25.08954 57.27548 25.08954 C 70.6307 25.08954 83.12341 37.21529 83.12341 51.14548 z "
   style="font-size:12;fill:none;fill-rule:evenodd;stroke:#000000;stroke-width:10.51187;stroke-linecap:round;stroke-linejoin:bevel;"
   id="path702" /><g
   transform="matrix(1.462522,0,0,1.462522,-11.43136,-22.46338)"
   style="font-size:12;"
   id="g696"><path
   d="M 58.67089 49.55696 C 58.67089 59.30933 50.76503 67.21519 41.01266 67.21519 C 31.26029 67.21519 23.35443 59.30933 23.35443 49.55696 C 23.35443 39.80459 31.26029 31.89873 41.01266 31.89873 C 50.76503 31.89873 58.67089 39.80459 58.67089 49.55696 z "
   transform="matrix(0.854838,0,0,0.854838,12.50409,7.478571)"
   style="fill:none;fill-rule:evenodd;stroke:#fc8600;stroke-width:7.2506;"
   id="path695" /><path
   d="M 53.24995 35.62394 L 30.19941 25.89507 "
   style="fill:none;fill-rule:evenodd;stroke:#fc8600;stroke-width:5.625;stroke-linecap:round;"
   id="path687" /><path
   d="M 43.96632 35.64354 L 18.9767 34.4198 "
   style="fill:none;fill-rule:evenodd;stroke:#fc8600;stroke-width:5.625;stroke-linecap:round;"
   id="path691" /><path
   d="M 37.82191 38.31388 L 14.86796 48.2685 "
   style="fill:none;fill-rule:evenodd;stroke:#fc8600;stroke-width:5.625;stroke-linecap:round;"
   id="path692" /></g></svg>
