<?xml version="1.0" encoding="UTF-8" standalone="no"?>
<!DOCTYPE svg PUBLIC "-//W3C//DTD SVG 1.0//EN"
"http://www.w3.org/TR/2001/REC-SVG-20010904/DTD/svg10.dtd">
<!-- Created with Sodipodi ("http://www.sodipodi.com/") -->
<svg
   xmlns="http://www.w3.org/2000/svg"
   xmlns:xlink="http://www.w3.org/1999/xlink"
   version="1.0"
   x="0"
   y="0"
   width="90"
   height="90"
   id="svg661"
   xml:space="preserve"><defs
   id="defs663" /><path
   d="M 12.44908 38.95874 C 12.44908 38.95874 10.16676 27.75456 25.10565 18.62524 C 37.55474 13.02315 50.62627 22.15248 55.6059 32.7342 C 56.64333 22.56745 45.64664 8.665972 34.23498 10.74082 C 22.82332 12.81567 12.86405 15.92793 11.82663 22.15248 C 10.78921 28.37702 9.751784 37.09137 9.959269 37.50635 C 10.16675 37.92132 12.65657 39.78868 12.44908 38.95874 z "
   style="font-size:12;fill:#532c25;fill-rule:evenodd;stroke-width:1;"
   id="path703" /><path
   d="M 10.58172 33.97912 C 10.58172 33.97912 8.506877 23.81236 23.44577 14.68304 C 35.89486 9.080944 47.09903 16.13544 53.32357 24.22734 C 51.45621 18.0028 43.77928 3.686342 32.36762 5.761194 C 20.95596 7.836046 10.99669 10.94831 9.959268 17.17286 C 8.921844 23.3974 7.88442 32.11175 8.091905 32.52673 C 8.299389 32.9417 10.78921 34.80906 10.58172 33.97912 z "
   style="font-size:12;fill:#a15a1a;fill-rule:evenodd;stroke-width:1;"
   id="path702" /><path
   d="M 4.107987 31.6079 C 4.107987 31.6079 4.694843 43.63842 6.748837 48.62669 C 8.802831 53.61497 13.20424 58.89667 18.48594 61.83095 C 25.23478 64.76523 25.82164 65.35207 30.8099 65.6455 C 35.50474 65.35208 41.37329 64.76522 43.42729 63.29808 L 74.82404 89.70657 C 78.93204 91.17371 92.13627 88.23943 87.73486 75.91547 C 73.94376 59.77696 60.73952 44.81213 60.73952 44.81213 C 63.96723 37.57426 63.22323 25.06943 57.06125 17.53813 L 54.28411 16.6431 L 55.45783 25.73935 C 55.45783 25.73935 52.52355 36.8896 52.23012 38.94359 C 51.93669 40.99758 45.48128 50.97412 42.25358 52.14783 C 39.02588 53.32155 24.06107 55.66897 23.18079 55.08211 C 22.3005 54.49526 13.7911 48.92013 12.03053 45.69242 C 10.26997 42.46472 3.521132 32.19475 4.107987 31.6079 z "
   style="font-size:12;fill:#532c25;fill-rule:evenodd;stroke-width:1;"
   id="path701" /><path
   d="M 59.56581 29.26048 L 58.97896 43.05159 C 56.3381 49.21357 51.05641 58.01639 41.07987 60.65724 C 29.92962 63.59152 19.07279 63.00466 10.26997 50.97413 C 5.575124 41.291 5.575125 33.66189 5.868553 35.12903 L 15.55166 48.6267 C 15.55166 48.6267 25.52821 52.14783 28.16905 52.73469 C 30.8099 53.32155 46.94842 49.80041 46.94842 49.80041 L 57.80524 25.15249 L 59.56581 29.26048 z "
   style="font-size:12;fill:#a15a1a;fill-rule:evenodd;stroke-width:1;"
   id="path700" /><ellipse
   cx="36.3850288"
   cy="38.9435921"
   rx="26.7019176"
   ry="26.7019176"
   transform="matrix(0.923077,0,0,0.923077,-1.602564,-6.68745)"
   style="font-size:12;fill:none;fill-rule:evenodd;stroke:#532c25;stroke-width:6.375;stroke-opacity:0.998;"
   id="path664" /><path
   d="M 56.92495 45.69242 L 85.97429 76.20891 C 88.32172 82.17527 83.04002 89.31535 76.58462 87.06573 L 44.60101 58.89667 C 48.8068 56.35363 54.77316 51.16974 56.92495 45.69242 z "
   style="font-size:12;fill:#e07d25;fill-rule:evenodd;stroke-width:1;"
   id="path665" /><path
   d="M 46.36156 56.84268 L 76.87804 85.01173 C 76.29118 85.01173 76.29119 81.19717 76.58462 79.43661 C 67.78179 72.39435 55.45782 62.4178 51.05641 54.20183 C 48.12214 55.08211 48.41555 56.54925 46.36156 56.84268 z "
   style="font-size:12;fill:#a15a1a;fill-rule:evenodd;stroke-width:1;"
   id="path696" /><path
   d="M 55.75125 50.09384 L 81.27946 74.44834 L 78.05175 76.50233 L 53.1104 51.85441 L 55.75125 50.09384 z "
   style="font-size:12;fill:#fff7dc;fill-rule:evenodd;stroke-width:1;"
   id="path697" /><path
   d="M 83.04002 78.40961 C 82.15973 81.56969 78.7177 84.42488 75.55761 84.42488 C 72.39753 84.42488 71.59634 81.56969 71.59634 78.40961 C 71.59634 75.24952 76.2121 71.22063 79.37218 71.22063 C 82.53226 71.22063 83.04002 75.24952 83.04002 78.40961 z "
   transform="translate(3.521137,3.227701)"
   style="font-size:12;fill:#a15a1a;fill-rule:evenodd;"
   id="path699" /><path
   d="M 24.48321 8.873454 L 51.66371 37.50636 L 49.79635 41.86354 L 20.541 10.53333 L 24.48321 8.873454 z "
   style="font-size:12;fill:#ffffff;fill-opacity:0.6296;fill-rule:evenodd;stroke-width:1;"
   id="path704" /><path
   d="M 18.05118 12.60818 L 34.44247 32.11176 L 32.36763 33.35667 L 15.97633 14.68302 L 18.05118 12.60818 z "
   style="font-size:12;fill:#ffffff;fill-opacity:0.6296;fill-rule:evenodd;stroke-width:1;"
   id="path705" /></svg>
