/* XPM */
static char * closeI_xpm[] = {
"17 42 53 1",
" 	c None",
".	c #F1F1F1",
"+	c #F3F3F3",
"@	c #F2F2F2",
"#	c #ECECEC",
"$	c #EDEDED",
"%	c #EEEEEE",
"&	c #EBEBEB",
"*	c #A5A5A5",
"=	c #666666",
"-	c #292929",
";	c #101010",
">	c #333333",
",	c #5A5A5A",
"'	c #E9E9E9",
")	c #EAEAEA",
"!	c #CCCCCC",
"~	c #DEDEDE",
"{	c #525252",
"]	c #E7E7E7",
"^	c #7B7B7B",
"/	c #ADADAD",
"(	c #F7F7F7",
"_	c #B5B5B5",
":	c #737373",
"<	c #E8E8E8",
"[	c #999999",
"}	c #8C8C8C",
"|	c #BDBDBD",
"1	c #D6D6D6",
"2	c #E6E6E6",
"3	c #E4E4E4",
"4	c #424242",
"5	c #4A4A4A",
"6	c #D9D9D9",
"7	c #DBDBDB",
"8	c #DDDDDD",
"9	c #EFEFEF",
"0	c #E1E1E1",
"a	c #FFFFFF",
"b	c #E2E2E2",
"c	c #848484",
"d	c #F0F0F0",
"e	c #F5F5F5",
"f	c #F8F8F8",
"g	c #FAFAFA",
"h	c #FDFDFD",
"i	c #FBFBFB",
"j	c #FCFCFC",
"k	c #747474",
"l	c #808080",
"m	c #7C7C7C",
"n	c #E5E5E5",
".+@@@@@@..+@@@@@@",
"##$%%$$$###$%%$$$",
"&&&&&*=-;>,*&&&&&",
"')))=,*!~!*{=)'''",
"]]]^=/~(((~_,:<<<",
"]<[>}|1~~~1_}>[22",
"2~,:*/|!_!|_*^{~2",
"314[*_!!!!!_/[512",
"61{/!!11]1~!!/,17",
"8|:|!1]9]9]~!|:|~",
"0_:|19]aaa(]]|:_b",
"3|c_]9aaaaa(]|:|2",
"]1}c!aaaaaaa1}[1)",
"#1[:[~aaaaa9[=*1%",
"d@_},:*1a1*:,[_+@",
"ef(_}={544,=}|(((",
"ghij!/}c^c}/!hjjj",
"hhhhh!!___|!hhhhh",
"ggggggggggggggggg",
"+++++++++++++++++",
"k^l^lmmmkk^l^lmmm",
".+@@@@.+@.+@@@@@@",
"##$%%$##$##$%%$$$",
"&&&&&*=-;>,*&&&&&",
"')))=,*!~!*{=)'''",
"]]]^=/~(((~_,:<<<",
"]<[>}|1~~~1_}>[22",
"22,:*/|!_!|_*^{22",
"3n4[*_!!!!!_/[522",
"66{/!!11]1~!!/,77",
"88:|!1]9]9]~!|:~~",
"0b:|19]aaa(]]|:bb",
"3nc_]9aaaaa(]|:22",
"]&}c!aaaaaaa1}[))",
"#$[:[~aaaaa9[=*%%",
"d@@},:*1a1*:,[++@",
"ef((}={544,=}f(((",
"ghijh/}c^c}/jhjjj",
"hhhhhhhhhhhhhhhhh",
"ggggggggggggggggg",
"+++++++++++++++++",
"k^l^lmk^lk^l^lmmm"};
