<?xml version="1.0" encoding="UTF-8" standalone="no"?>
<!DOCTYPE svg PUBLIC "-//W3C//DTD SVG 20010904//EN"
"http://www.w3.org/TR/2001/REC-SVG-20010904/DTD/svg10.dtd"
[
 <!ATTLIST svg
  xmlns:xlink CDATA #FIXED "http://www.w3.org/1999/xlink">
]>
<!-- Created with Sodipodi ("http://www.sodipodi.com/") -->
<svg
   xmlns="http://www.w3.org/2000/svg"
   xmlns:xlink="http://www.w3.org/1999/xlink"
   version="1"
   x="0.00000000"
   y="0.00000000"
   width="90.0000000"
   height="90.0000000"
   id="svg604">
  <defs
     id="defs606">
    <linearGradient
       x1="0.00000000"
       y1="0.00000000"
       x2="1.00000000"
       y2="0.00000000"
       id="linearGradient705"
       gradientUnits="objectBoundingBox"
       spreadMethod="pad">
      <stop
         style="stop-color:#7fa8e3;stop-opacity:0.741176;"
         offset="0.00000000"
         id="stop706" />
      <stop
         style="stop-color:#ffffff;stop-opacity:0;"
         offset="1.00000000"
         id="stop707" />
    </linearGradient>
    <linearGradient
       x1="0.00000000"
       y1="0.00000000"
       x2="1.00000000"
       y2="0.00000000"
       id="linearGradient612"
       gradientUnits="objectBoundingBox"
       spreadMethod="pad">
      <stop
         style="stop-color:#ffffff;stop-opacity:1;"
         offset="0.00000000"
         id="stop613" />
      <stop
         style="stop-color:#ffffff;stop-opacity:0;"
         offset="1.00000000"
         id="stop614" />
    </linearGradient>
    <linearGradient
       x1="50.6438866"
       y1="5.36792946"
       x2="35.7520943"
       y2="68.0443573"
       id="linearGradient615"
       xlink:href="#linearGradient705"
       gradientUnits="userSpaceOnUse"
       spreadMethod="pad" />
    <radialGradient
       cx="8.17300129"
       cy="62.0631676"
       fx="8.17300129"
       fy="62.0631676"
       r="4.03522396"
       id="radialGradient704"
       xlink:href="#linearGradient612"
       gradientUnits="userSpaceOnUse"
       gradientTransform="matrix(1.111950,0.000000,0.000000,0.899321,3.428790e-7,-1.512959e-6)"
       spreadMethod="pad" />
    <radialGradient
       cx="0.05366803"
       cy="0.10153580"
       fx="0.05366803"
       fy="0.10153580"
       r="0.75628221"
       id="radialGradient708"
       xlink:href="#linearGradient612"
       gradientUnits="objectBoundingBox"
       spreadMethod="pad" />
  </defs>
  <path
     d="M 12.8163 74.753 C 10.3856 73.6481 7.07107 70.1126 8.83884 65.2512 C 9.72267 59.948 25.6326 13.1021 29.1682 10.8924 C 31.3778 8.90368 34.582 8.13026 39.1119 9.34561 C 42.8684 10.2295 76.6769 19.0684 78.6656 20.8361 C 80.6544 22.6039 82.2012 24.0402 80.6544 27.9072 C 79.5496 29.8959 66.4017 74.532 66.1808 77.4047 C 65.2969 80.4983 62.7558 84.2548 58.5573 84.0338 C 54.3589 83.8128 15.9099 75.4159 12.8163 74.753 z "
     transform="matrix(1.114903,0.000000,0.000000,1.114903,-5.305332,-3.889256)"
     style="font-size:12;fill-opacity:0.301471;fill-rule:evenodd;stroke-width:1pt;"
     id="path794" />
  <path
     d="M 12.8163 74.753 C 10.3856 73.6481 7.07107 70.1126 8.83884 65.2512 C 9.72267 59.948 25.6326 13.1021 29.1682 10.8924 C 31.3778 8.90368 34.582 8.13026 39.1119 9.34561 C 42.8684 10.2295 76.6769 19.0684 78.6656 20.8361 C 80.6544 22.6039 82.2012 24.0402 80.6544 27.9072 C 79.5496 29.8959 66.4017 74.532 66.1808 77.4047 C 65.2969 80.4983 62.7558 84.2548 58.5573 84.0338 C 54.3589 83.8128 15.9099 75.4159 12.8163 74.753 z "
     transform="matrix(1.114903,0.000000,0.000000,1.114903,-8.162471,-8.460684)"
     style="font-size:12;fill:#143c69;fill-rule:evenodd;stroke-width:1pt;"
     id="path609" />
  <path
     d="M 17.8987 70.9965 C 15.3576 70.3336 11.7114 69.6706 13.0373 65.6932 C 15.468 55.9705 27.8424 18.6264 33.1456 13.986 C 34.361 12.8811 38.4489 12.4392 46.1829 14.8699 C 55.0218 17.5215 72.9204 23.4877 74.6882 24.3716 C 76.4559 25.2555 77.1189 25.2555 75.793 29.233 C 73.8043 33.2105 64.9655 67.24 62.7557 72.9852 C 61.209 77.0732 60.8775 78.9514 58.2258 78.9514 "
     transform="matrix(1.114903,0.000000,0.000000,1.114903,-8.162471,-8.460684)"
     style="font-size:12;fill:#ffffff;fill-rule:evenodd;stroke-width:1pt;"
     id="path608" />
  <path
     d="M 28.75 13.75 C 28.75 13.75 31.875 7.49995 39.6875 9.37495 C 47.5 11.25 78.125 19.375 77.8125 21.875 C 77.5 24.375 71.875 39.0625 71.5625 40.3125 C 71.25 41.5625 42.5 40.9375 31.5625 47.5 C 20.625 54.0625 12.5 59.6875 12.5 59.6875 C 12.5 59.6875 23.75 24.6875 28.75 13.75 z "
     transform="matrix(0.946780,0.000000,0.000000,0.946780,-0.480566,0.409517)"
     style="font-size:12;fill:url(#linearGradient615);fill-rule:evenodd;stroke-width:1pt;"
     id="path636" />
  <path
     d="M 7.73398 34.2049 L 12.0429 51.3301 C 5.08232 51.2196 4.19844 55.9705 4.64039 59.1746 C 6.73961 68.2343 17.4567 65.6933 24.5277 62.7102 C 23.6438 59.506 20.3293 44.3696 19.8874 41.7178 C 23.7543 40.7235 31.8198 38.4033 31.8198 38.4033 C 31.8198 38.4033 34.6924 45.5849 35.1343 47.0212 C 26.0745 46.6897 25.4117 52.3244 26.1851 54.8656 C 27.6214 61.9367 34.0295 61.8262 37.5651 60.8318 C 40.8796 60.2795 45.52 58.2907 48.0612 57.1859 C 47.0668 53.3189 38.3384 29.233 37.2336 26.1394 C 32.9246 27.6862 7.62349 34.4258 7.73398 34.2049 z "
     transform="matrix(1.035546,0.000000,0.000000,1.035546,15.56160,-11.72637)"
     style="font-size:12;fill:#0d0000;fill-opacity:0.301471;fill-rule:evenodd;stroke-width:1pt;"
     id="path635" />
  <path
     d="M 7.73398 34.2049 L 12.0429 51.3301 C 5.08232 51.2196 4.19844 55.9705 4.64039 59.1746 C 6.73961 68.2343 17.4567 65.6933 24.5277 62.7102 C 23.6438 59.506 20.3293 44.3696 19.8874 41.7178 C 23.7543 40.7235 31.8198 38.4033 31.8198 38.4033 C 31.8198 38.4033 34.6924 45.5849 35.1343 47.0212 C 26.0745 46.6897 25.4117 52.3244 26.1851 54.8656 C 27.6214 61.9367 34.0295 61.8262 37.5651 60.8318 C 40.8796 60.2795 45.52 58.2907 48.0612 57.1859 C 47.0668 53.3189 38.3384 29.233 37.2336 26.1394 C 32.9246 27.6862 7.62349 34.4258 7.73398 34.2049 z "
     transform="translate(14.83929,-11.42410)"
     style="font-size:12;fill:#0d3c07;fill-rule:evenodd;stroke-width:1pt;"
     id="path616" />
  <path
     d="M 15.7994 54.2027 L 11.159 35.9726 L 35.7973 29.1225 L 44.7466 54.9761 C 44.7466 54.9761 33.3666 59.506 31.7093 57.5173 C 28.9471 57.4067 26.7375 51.2197 33.4771 50.0043 C 37.1231 49.8938 38.5594 49.6728 39.5538 50.0042 L 33.3666 34.0944 L 15.247 39.3977 L 20.3293 60.0584 C 20.3293 60.0584 13.7002 64.9198 7.95495 60.1689 C 6.73961 59.0641 6.62912 56.0809 8.61786 54.9761 C 10.2751 52.8769 15.6889 54.4237 15.7994 54.2027 z "
     transform="translate(14.83929,-11.42410)"
     style="font-size:12;fill:#2aaf18;fill-rule:evenodd;stroke-width:1pt;"
     id="path574" />
  <path
     d="M 14.4736 57.5725 C 12.6184 56.7928 11.9994 58.2032 11.601 60.0584 C 10.0153 60.0584 8.87676 59.2416 8.87676 57.8693 C 8.87676 56.4971 9.94109 55.5318 11.5268 55.5318 C 13.1125 55.5318 14.4736 56.2003 14.4736 57.5725 z "
     transform="matrix(1.488889,0.000000,0.000000,1.488889,8.836250,-40.12308)"
     style="font-size:12;fill:url(#radialGradient704);fill-rule:evenodd;stroke-width:1pt;"
     id="path623" />
  <path
     d="M 37.3441 53.6503 C 33.3666 51.8834 34.4706 54.4237 33.6428 56.8544 C 31.5997 56.8544 29.9416 55.4189 29.9416 53.6503 C 29.9416 51.8816 31.5997 50.4462 33.6428 50.4462 C 35.6859 50.4462 37.3441 51.8816 37.3441 53.6503 z "
     transform="translate(14.83929,-11.42410)"
     style="font-size:12;fill:url(#radialGradient708);fill-rule:evenodd;stroke-width:1pt;"
     id="path625" />
  <path
     d="M 15.3575 39.5082 L 33.3666 34.2049 L 33.8085 32.5476 L 15.7994 37.7404 L 15.3575 39.5082 z "
     transform="translate(14.83929,-11.42410)"
     style="font-size:12;fill:#34674b;fill-rule:evenodd;stroke-width:1pt;"
     id="path630" />
  <path
     d="M 11.159 35.9726 L 13.3687 36.5251 L 36.1287 30.2274 L 35.6868 29.1225 L 11.159 35.9726 z "
     transform="translate(14.83929,-11.42410)"
     style="font-size:12;fill:#cbff87;fill-rule:evenodd;stroke-width:1pt;"
     id="path631" />
  <path
     d="M 33.6981 32.879 L 39.6643 49.8938 L 33.2561 34.2049 L 33.6981 32.879 z "
     transform="translate(14.83929,-11.42410)"
     style="font-size:12;fill:#cbff87;fill-rule:evenodd;stroke-width:1pt;"
     id="path633" />
  <path
     d="M 13.1478 36.1936 C 13.1478 36.1936 16.1309 54.3132 16.0204 54.3132 C 15.9099 54.3132 11.2695 36.0831 11.2695 36.0831 L 13.1478 36.1936 z "
     transform="translate(14.83929,-11.42410)"
     style="font-size:12;fill:#cbff87;fill-rule:evenodd;stroke-width:1pt;"
     id="path634" />
  <path
     d="M 51.2034 56.1113 C 51.6096 56.1113 51.9651 56.2087 52.2698 56.4033 C 52.6253 56.6234 52.803 56.9238 52.803 57.3047 C 52.803 57.3724 52.7988 57.4401 52.7903 57.5078 C 51.597 61.4434 50.831 64.7907 50.4925 67.5498 C 50.3401 68.2354 49.9212 68.5527 49.2356 68.502 C 48.5416 68.4512 48.1861 68.1888 48.1692 67.7148 C 48.5332 64.668 49.2187 60.9736 50.2259 56.6318 C 50.4713 56.2848 50.7971 56.1113 51.2034 56.1113 z M 42.3421 56.5557 C 44.0856 56.5557 45.4059 56.9788 46.303 57.8252 C 47.2086 58.6631 47.7757 59.9961 48.0042 61.8242 C 47.9788 64.2363 46.9124 65.9375 44.805 66.9277 C 43.0784 67.7487 40.5013 68.1465 37.0735 68.1211 C 36.5996 68.0365 36.3118 67.9518 36.2102 67.8672 C 36.1002 67.7826 35.9606 67.516 35.7913 67.0674 C 35.7913 64.376 36.0452 61.9131 36.553 59.6787 C 36.5784 59.5856 36.5911 59.4925 36.5911 59.3994 C 36.5911 59.2809 36.5657 59.1286 36.5149 58.9424 C 36.4557 58.7477 36.4261 58.6081 36.4261 58.5234 C 36.4261 58.151 36.6884 57.8167 37.2132 57.5205 C 39.1513 56.8773 40.861 56.5557 42.3421 56.5557 z M 38.305 62.7891 C 38.2203 63.5254 38.178 64.1517 38.178 64.668 C 38.178 65.1335 38.2119 65.5101 38.2796 65.7979 C 38.7281 65.8317 39.1894 65.8486 39.6634 65.8486 C 41.2714 65.8486 42.5706 65.6497 43.5608 65.252 C 44.9912 64.6764 45.7063 63.7031 45.7063 62.332 C 45.427 60.1654 44.0559 59.082 41.593 59.082 C 40.7382 59.082 39.8242 59.2301 38.8509 59.5264 C 38.6139 60.6097 38.4319 61.6973 38.305 62.7891 z M 33.3665 56.1113 C 33.7727 56.1113 34.1282 56.2087 34.4329 56.4033 C 34.7884 56.6234 34.9661 56.9238 34.9661 57.3047 C 34.9661 57.3724 34.9619 57.4401 34.9534 57.5078 C 33.76 61.4434 32.9941 64.7907 32.6556 67.5498 C 32.5032 68.2354 32.0843 68.5527 31.3987 68.502 C 30.7047 68.4512 30.3492 68.1888 30.3323 67.7148 C 30.6962 64.668 31.3818 60.9736 32.3889 56.6318 C 32.6344 56.2848 32.9602 56.1113 33.3665 56.1113 z M 27.8059 57.1143 C 27.7975 57.0889 27.8017 57.0508 27.8186 57 C 28.2503 56.4414 28.7835 56.1621 29.4182 56.1621 C 30.2223 56.1621 30.6243 56.4076 30.6243 56.8984 C 30.6243 57.0085 30.5947 57.1312 30.5354 57.2666 C 30.0361 58.4684 29.6256 59.9792 29.304 61.7988 C 29.0332 63.3053 28.7708 65.0954 28.5169 67.1689 C 28.4746 67.5329 28.318 67.8418 28.0472 68.0957 C 27.7763 68.3411 27.4632 68.4639 27.1077 68.4639 C 26.7353 68.4639 26.346 68.2692 25.9397 67.8799 C 26.2783 66.4411 26.6422 64.5452 27.0315 62.1924 C 26.0074 63.2842 24.9876 64.2194 23.972 64.998 C 23.6503 65.5397 23.1848 65.8232 22.5755 65.8486 C 21.9069 65.8825 21.5006 65.654 21.3567 65.1631 C 20.7727 63.9274 20.3326 62.5563 20.0364 61.0498 C 19.4947 62.8018 19.2239 64.6045 19.2239 66.458 C 19.2239 66.695 19.2281 66.9277 19.2366 67.1562 C 19.1689 67.5286 19.0039 67.8418 18.7415 68.0957 C 18.4791 68.3411 18.166 68.4639 17.802 68.4639 C 17.4381 68.4639 17.0572 68.2734 16.6595 67.8926 C 16.9388 63.9824 17.6582 60.3473 18.8177 56.9873 C 19.2832 56.3695 19.9348 56.0944 20.7727 56.1621 C 21.4752 56.2214 21.8264 56.4626 21.8264 56.8857 C 21.8264 56.9873 21.8053 57.0889 21.763 57.1904 C 22.0338 59.484 22.5712 61.1556 23.3753 62.2051 C 24.7294 61.4772 26.2063 59.7803 27.8059 57.1143 z M 15.8723 66.2803 C 15.8723 66.7035 15.6692 67.0758 15.263 67.3975 C 14.8652 67.7191 14.4378 67.8799 13.9807 67.8799 C 13.8115 67.8799 13.6549 67.8545 13.511 67.8037 C 13.0878 67.6344 12.8763 67.334 12.8763 66.9023 C 12.8763 66.6061 12.982 66.3184 13.1936 66.0391 C 13.5999 65.5228 14.1077 65.2646 14.7171 65.2646 C 14.8948 65.2646 15.0641 65.2943 15.2249 65.3535 C 15.6565 65.5143 15.8723 65.8232 15.8723 66.2803 z "
     transform="matrix(0.981430,0.191822,-0.191822,0.981430,13.08541,-2.278442)"
     style="font-size:13;font-weight:bold;fill:#143c69;stroke-width:1pt;font-family:Kid Kosmic;"
     id="path590" />
</svg>
