<?xml version="1.0" encoding="UTF-8" standalone="no"?>
<!DOCTYPE svg PUBLIC "-//W3C//DTD SVG 1.0//EN"
"http://www.w3.org/TR/2001/REC-SVG-20010904/DTD/svg10.dtd">
<!-- Created with Sodipodi ("http://www.sodipodi.com/") -->
<svg
   id="svg683"
   sodipodi:version="0.34"
   xmlns="http://www.w3.org/2000/svg"
   xmlns:sodipodi="http://sodipodi.sourceforge.net/DTD/sodipodi-0.dtd"
   xmlns:xlink="http://www.w3.org/1999/xlink"
   width="72pt"
   height="72pt"
   xml:space="preserve"
   sodipodi:docbase="/home/zeus"
   sodipodi:docname="/home/zeus/icon-user.svg"><defs
   id="defs685" /><sodipodi:namedview
   id="base" /><rect
   style="font-size:12;fill:#000000;fill-rule:evenodd;stroke:none;stroke-width:6.320896;fill-opacity:0.3704;"
   id="rect648"
   width="80.3731832"
   height="77.5000678"
   x="8.25093068"
   y="9.06244267"
   ry="6.94029971" /><rect
   style="font-size:12;fill:#9bb9e3;fill-rule:evenodd;stroke:#3d4e67;stroke-width:6.320896;fill-opacity:1;stroke-opacity:1;"
   id="rect610"
   width="75.0606842"
   height="72.1875603"
   x="6.0634303"
   y="6.24994128"
   ry="6.46455329" /><path
   style="font-size:12;fill:#ffffff;fill-rule:evenodd;stroke:#3d4e67;stroke-width:4;"
   d="M 33.12501 34.37499 C 33.12501 39.72525 28.78777 44.06249 23.43751 44.06249 C 18.08725 44.06249 13.75001 39.72525 13.75001 34.37499 C 13.75001 29.02473 18.08725 24.68749 23.43751 24.68749 C 28.78777 24.68749 33.12501 29.02473 33.12501 34.37499 z "
   id="path749" /><path
   style="font-size:12;fill:#ffffff;fill-rule:evenodd;stroke:#3d4e67;stroke-width:4;"
   d="M 70.62502 34.68749 C 70.62502 40.03775 66.28778 44.37499 60.93752 44.37499 C 55.58726 44.37499 51.25002 40.03775 51.25002 34.68749 C 51.25002 29.33723 55.58726 24.99999 60.93752 24.99999 C 66.28778 24.99999 70.62502 29.33723 70.62502 34.68749 z "
   id="path750" /><path
   style="fill:none;fill-rule:evenodd;stroke:#3d4e67;stroke-opacity:1;stroke-width:5.625;stroke-linejoin:miter;stroke-linecap:round;fill-opacity:1;stroke-dasharray:none;"
   d="M 26.5625 54.37499 C 26.5625 75.31249 60.62501 74.68749 60.62501 54.06249 "
   id="path751"
   sodipodi:nodetypes="cc" /></svg>
