<?xml version="1.0" encoding="UTF-8" standalone="no"?>
<!DOCTYPE svg PUBLIC "-//W3C//DTD SVG 20010904//EN"
"http://www.w3.org/TR/2001/REC-SVG-20010904/DTD/svg10.dtd">
<!-- Created with Sodipodi ("http://www.sodipodi.com/") -->
<svg
   xmlns="http://www.w3.org/2000/svg"
   xmlns:sodipodi="http://sodipodi.sourceforge.net/DTD/sodipodi-0.dtd"
   xmlns:xlink="http://www.w3.org/1999/xlink"
   id="svg602"
   sodipodi:version="0.34"
   width="212.28pt"
   height="139.89pt"
   xml:space="preserve"
   sodipodi:docbase="/home/zeus/"
   sodipodi:docname="/home/zeus/gartoon-pallete.svg"><defs
   id="defs604" /><sodipodi:namedview
   id="base" /><text
   style="fill:black;stroke:none;font-family:Bitstream Vera Sans Mono;font-style:normal;font-weight:bold;font-size:12;fill-opacity:1;stroke-opacity:1;stroke-width:1pt;stroke-linejoin:miter;stroke-linecap:butt;text-anchor:start;writing-mode:lr;"
   x="9.49569321"
   y="18.2028809"
   id="text605"
   sodipodi:linespacing="100%"
   xml:space="preserve"><tspan
   x="9.49569321"
   y="18.2028809"
   sodipodi:role="line"
   id="tspan608">Gartoon Pallete</tspan></text><text
   style="fill:black;stroke:none;font-family:Bitstream Charter;font-style:normal;font-weight:normal;font-size:8;fill-opacity:1;stroke-opacity:1;stroke-width:1pt;stroke-linejoin:miter;stroke-linecap:butt;text-anchor:start;writing-mode:lr;"
   x="9.3354826"
   y="135.787292"
   id="text829"
   sodipodi:linespacing="100%"
   xml:space="preserve"><tspan
   x="9.3354826"
   y="135.787292"
   sodipodi:role="line"
   id="tspan836">Use this color as the primary color option,</tspan><tspan
   x="9.3354826"
   y="143.787292"
   sodipodi:role="line"
   id="tspan838">If force to use other colors, use the color with</tspan><tspan
   x="9.3354826"
   y="151.787292"
   sodipodi:role="line"
   id="tspan840">similar Hue.</tspan></text><rect
   style="font-size:12;fill:#ff933d;fill-rule:evenodd;"
   id="rect652"
   width="11.4020376"
   height="12.0021057"
   x="9.30165911"
   y="29.7796783"
   transform="matrix(0.483181,0,0,0.483181,14.98208,25.62382)" /><rect
   style="font-size:12;fill:#ffd056;fill-rule:evenodd;"
   id="rect653"
   width="11.4020376"
   height="12.0021057"
   x="20.4036398"
   y="29.7796478"
   transform="matrix(0.483181,0,0,0.483181,14.98208,25.62382)" /><rect
   style="font-size:12;fill:#999999;fill-rule:evenodd;"
   id="rect654"
   width="11.4020376"
   height="12.0021057"
   x="9.30165958"
   y="46.2825623"
   transform="matrix(0.483181,0,0,0.483181,14.98208,25.62382)" /><rect
   style="font-size:12;fill:#bbbbbb;fill-rule:evenodd;"
   id="rect655"
   width="11.4020376"
   height="12.0021057"
   x="20.1035891"
   y="46.2825317"
   transform="matrix(0.483181,0,0,0.483181,14.98208,25.62382)" /><rect
   style="font-size:12;fill:#c9c9c9;fill-rule:evenodd;"
   id="rect656"
   width="11.4020376"
   height="12.0021057"
   x="31.5056248"
   y="46.2825012"
   transform="matrix(0.483181,0,0,0.483181,14.98208,25.62382)" /><rect
   style="font-size:12;fill:#2aaf18;fill-rule:evenodd;"
   id="rect670"
   width="11.4020376"
   height="12.0021057"
   x="20.1035872"
   y="63.6856079"
   transform="matrix(0.483181,0,0,0.483181,14.98208,25.62382)" /><rect
   style="font-size:12;fill:#1f8b10;fill-rule:evenodd;"
   id="rect671"
   width="11.4020376"
   height="12.0021057"
   x="9.00160599"
   y="63.6855774"
   transform="matrix(0.483181,0,0,0.483181,14.98208,25.62382)" /><rect
   style="font-size:12;fill:#efe16b;fill-rule:evenodd;"
   id="rect712"
   width="11.4020376"
   height="12.0021057"
   x="31.5056257"
   y="29.7796173"
   transform="matrix(0.483181,0,0,0.483181,14.98208,25.62382)" /><rect
   style="font-size:12;fill:#bae6ff;fill-rule:evenodd;"
   id="rect713"
   width="11.4020376"
   height="12.0021057"
   x="73.0394402"
   y="80.0126343"
   transform="matrix(0.483181,0,0,0.483181,14.98208,25.62382)" /><rect
   style="font-size:12;fill:#7e0000;fill-rule:evenodd;"
   id="rect792"
   width="11.4020376"
   height="12.0021057"
   x="8.70155263"
   y="97.591568"
   transform="matrix(0.483181,0,0,0.483181,14.98208,25.62382)" /><rect
   style="font-size:12;fill:#cb0000;fill-rule:evenodd;"
   id="rect793"
   width="11.4020376"
   height="12.0021057"
   x="20.1035872"
   y="97.5915375"
   transform="matrix(0.483181,0,0,0.483181,14.98208,25.62382)" /><rect
   style="font-size:12;fill:#ff1500;fill-rule:evenodd;"
   id="rect794"
   width="11.4020376"
   height="12.0021057"
   x="31.2055683"
   y="97.591507"
   transform="matrix(0.483181,0,0,0.483181,14.98208,25.62382)" /><rect
   style="font-size:12;fill:#31baff;fill-rule:evenodd;"
   id="rect705"
   width="11.4020376"
   height="12.0021057"
   x="62.7861376"
   y="80.0125427"
   transform="matrix(0.483181,0,0,0.483181,14.98208,25.62382)" /><rect
   style="font-size:12;fill:#3d4e67;fill-rule:evenodd;"
   id="rect728"
   width="11.4020376"
   height="12.0021057"
   x="9.30165935"
   y="80.1884613"
   transform="matrix(0.483181,0,0,0.483181,14.98208,25.62382)" /><rect
   style="font-size:12;fill:#9bb9e3;fill-rule:evenodd;"
   id="rect729"
   width="11.4020376"
   height="12.0021057"
   x="31.8093338"
   y="80.1884155"
   transform="matrix(0.483181,0,0,0.483181,14.98208,25.62382)" /><rect
   style="font-size:12;fill:#437caf;fill-rule:evenodd;"
   id="rect766"
   width="11.4020376"
   height="12.0021057"
   x="20.3344927"
   y="80.1884308"
   transform="matrix(0.483181,0,0,0.483181,14.98208,25.62382)" /><rect
   style="font-size:12;fill:#955801;fill-rule:evenodd;"
   id="rect791"
   width="11.4020376"
   height="12.0021057"
   x="63.4413824"
   y="29.6971741"
   transform="matrix(0.483181,0,0,0.483181,14.98208,25.62382)" /><rect
   style="font-size:12;fill:#ffe6ba;fill-rule:evenodd;"
   id="rect795"
   width="11.4020376"
   height="12.0021057"
   x="97.1763935"
   y="29.6970215"
   transform="matrix(0.483181,0,0,0.483181,14.98208,25.62382)" /><rect
   style="font-size:12;fill:#e9a93d;fill-rule:evenodd;"
   id="rect796"
   width="11.4020376"
   height="12.0021057"
   x="85.9314041"
   y="29.6969757"
   transform="matrix(0.483181,0,0,0.483181,14.98208,25.62382)" /><rect
   style="font-size:12;fill:#c89134;fill-rule:evenodd;"
   id="rect797"
   width="11.4020376"
   height="12.0021057"
   x="74.4742126"
   y="29.696991"
   transform="matrix(0.483181,0,0,0.483181,14.98208,25.62382)" /><rect
   style="font-size:12;fill:#000001;fill-rule:evenodd;"
   id="rect842"
   width="11.4020376"
   height="12.0021057"
   x="62.5927048"
   y="98.4402466"
   transform="matrix(0.483181,0,0,0.483181,14.98208,25.62382)" /><rect
   style="font-size:12;fill:#ffffff;fill-rule:evenodd;stroke:#000000;"
   id="rect843"
   width="11.4020376"
   height="12.0021057"
   x="73.6255531"
   y="98.4402161"
   transform="matrix(0.483181,0,0,0.483181,14.98208,25.62382)" /></svg>
