<?xml version="1.0" encoding="UTF-8" standalone="no"?>
<!DOCTYPE svg PUBLIC "-//W3C//DTD SVG 20010904//EN"
"http://www.w3.org/TR/2001/REC-SVG-20010904/DTD/svg10.dtd">
<!-- Created with Inkscape (http://www.inkscape.org/) -->
<svg
   version="1.0"
   x="0"
   y="0"
   width="60.0000000"
   height="60.0000000"
   id="svg548"
   sodipodi:version="0.32"
   inkscape:version="0.37"
   sodipodi:docname="stock_quit.svg"
   sodipodi:docbase="/home/mula/Desktop/iconos"
   xmlns="http://www.w3.org/2000/svg"
   xmlns:inkscape="http://www.inkscape.org/namespaces/inkscape"
   xmlns:sodipodi="http://sodipodi.sourceforge.net/DTD/sodipodi-0.dtd"
   xmlns:xlink="http://www.w3.org/1999/xlink">
  <sodipodi:namedview
     id="base"
     pagecolor="#ffffff"
     bordercolor="#666666"
     borderopacity="1.0"
     inkscape:pageopacity="0.0"
     inkscape:pageshadow="2"
     inkscape:zoom="8.83618220"
     inkscape:cx="45.9348257"
     inkscape:cy="25.0158406"
     inkscape:window-width="1014"
     inkscape:window-height="693"
     inkscape:window-x="0"
     inkscape:window-y="0" />
  <defs
     id="defs550">
    <linearGradient
       x1="0.00000000"
       y1="0.00000000"
       x2="1.00000000"
       y2="0.00000000"
       id="linearGradient627"
       gradientUnits="objectBoundingBox"
       spreadMethod="pad">
      <stop
         style="stop-color:#f1e36c;stop-opacity:1;"
         offset="0.00000000"
         id="stop628" />
      <stop
         style="stop-color:#ffc83d;stop-opacity:1;"
         offset="1.00000000"
         id="stop629" />
    </linearGradient>
    <linearGradient
       x1="0.00000000"
       y1="0.00000000"
       x2="1.00000000"
       y2="0.00000000"
       id="linearGradient556"
       gradientUnits="objectBoundingBox"
       spreadMethod="pad">
      <stop
         style="stop-color:#000000;stop-opacity:1;"
         offset="0.00000000"
         id="stop557" />
      <stop
         style="stop-color:#ffffff;stop-opacity:1;"
         offset="1.00000000"
         id="stop558" />
    </linearGradient>
    <linearGradient
       id="linearGradient559"
       xlink:href="#linearGradient556"
       x1="0.53153151"
       y1="0.40625000"
       x2="0.53153151"
       y2="0.76562500" />
    <radialGradient
       id="radialGradient586"
       xlink:href="#linearGradient627"
       cx="0.49612409"
       cy="0.43410841"
       r="0.10797190"
       fx="0.50387597"
       fy="0.41085261"
       spreadMethod="reflect" />
    <linearGradient
       xlink:href="#linearGradient627"
       id="linearGradient637"
       x1="-0.09638554"
       y1="0.58914727"
       x2="0.62650603"
       y2="0.57364339" />
    <linearGradient
       xlink:href="#linearGradient556"
       id="linearGradient600"
       x1="-0.03184655"
       y1="0.07051279"
       x2="1.04458547"
       y2="0.44871783" />
    <radialGradient
       xlink:href="#linearGradient627"
       id="radialGradient598"
       cx="0.50000000"
       cy="0.50000000"
       r="0.50000000"
       fx="0.50000000"
       fy="0.50000000" />
    <linearGradient
       xlink:href="#linearGradient627"
       id="linearGradient599"
       x1="0.04651213"
       y1="0.13953483"
       x2="1.22480547"
       y2="0.73643392" />
  </defs>
  <path
     d="M 17.465133 59.824183 L 53.665648 59.746618 C 56.746721 59.740017 59.699067 55.825173 59.699067 52.744092 L 59.699067 10.806507 C 59.699067 7.7276537 56.739745 3.8169094 53.660892 3.8169094 L 17.431845 3.8169094 C 14.350765 3.8169094 11.396333 7.7383547 11.398426 10.819434 L 11.426959 52.834585 C 11.42905 55.913437 14.386287 59.83078 17.465133 59.824183 z "
     style="font-size:12;fill:#000000;fill-opacity:0.342466;fill-rule:evenodd;stroke:none;stroke-width:1.75;stroke-dasharray:none;stroke-opacity:1;"
     id="path602"
     sodipodi:nodetypes="cssssssss" />
  <path
     d="M 19.244002 24.867404 C 29.248759 25.105687 37.644949 27.735485 34.760859 41.488361 C 34.732742 41.621818 33.705727 34.37287 29.481117 30.474547 C 25.475071 26.83809 19.116798 24.863747 19.244002 24.867404 z "
     style="font-size:12;fill:#ffffff;fill-rule:evenodd;stroke-width:1pt;"
     id="path590" />
  <path
     d="M 33.197613 47.771228 C 33.197613 47.771228 27.553108 42.180518 26.147393 41.790195 C 24.741768 41.399952 25.530418 44.086947 25.530418 44.086947 C 25.530418 44.086947 32.671211 46.754014 33.197613 47.771228 z "
     style="font-size:12;fill:#ffffff;fill-rule:evenodd;stroke-width:1pt;"
     id="path606" />
  <path
     d="M 15.336464 57.419298 L 51.536979 57.341733 C 54.618052 57.335132 57.570398 53.420288 57.570398 50.339207 L 57.570398 8.4016221 C 57.570398 5.3227689 54.611076 1.4120246 51.532223 1.4120246 L 15.303176 1.4120246 C 12.222096 1.4120246 9.2676643 5.3334699 9.2697567 8.4145496 L 9.2982899 50.4297 C 9.3003808 53.508552 12.257618 57.425895 15.336464 57.419298 z "
     style="font-size:12;fill:url(#linearGradient559);fill-opacity:0.75;fill-rule:evenodd;stroke:#593a28;stroke-width:1.75;stroke-dasharray:none;stroke-opacity:1;"
     id="path610"
     sodipodi:nodetypes="cssssssss" />
  <path
     style="fill:#000000;fill-rule:evenodd;stroke:none;stroke-opacity:1;stroke-width:1pt;stroke-linejoin:miter;stroke-linecap:butt;fill-opacity:0.116438;"
     d="M 57.553758 49.956071 L 11.80009 53.87268 L 11.847593 2.3888652 L 51.958425 1.1665293 C 54.70579 1.0828062 57.679262 4.3638004 57.671696 7.11243 L 57.553758 49.956071 z "
     id="path599"
     sodipodi:nodetypes="cccssc" />
  <path
     d="M 12.731035 55.432714 L 43.850012 45.301475 L 44.18819 1.9615656 L 14.976557 2.5682583 C 12.411348 2.9658923 10.304228 6.0062699 10.276521 8.6019669 L 9.8632872 47.315564 C 9.7947449 53.736914 11.151728 55.94688 12.731035 55.432714 z "
     style="font-size:12;fill:url(#linearGradient637);fill-opacity:1;fill-rule:evenodd;stroke:none;stroke-width:2.5;stroke-dasharray:none;"
     id="path611"
     sodipodi:nodetypes="cccssss" />
  <path
     style="fill:none;fill-rule:evenodd;stroke:#593a28;stroke-opacity:1;stroke-width:1pt;stroke-linejoin:miter;stroke-linecap:butt;fill-opacity:0.75;"
     d="M 12.002382 55.853171 L 43.30589 45.238716 L 43.941436 1.3851745 "
     id="path597"
     sodipodi:nodetypes="ccc" />
  <path
     sodipodi:type="arc"
     style="font-size:12;fill:url(#radialGradient586);fill-opacity:1;fill-rule:evenodd;stroke:url(#linearGradient600);stroke-width:1pt;stroke-opacity:1;"
     id="path626"
     sodipodi:cx="42.28980255"
     sodipodi:cy="31.34168243"
     sodipodi:rx="2.68336320"
     sodipodi:ry="2.68336320"
     d="M 44.973166 31.341682 A 2.683363 2.683363 0 1 0 39.606439,31.341682 A 2.68336 2.68336 0 1 0 44.9732 31.3417 L 42.289803 31.341682 z"
     transform="matrix(0.794972,0.000000,0.000000,0.794972,6.356579,1.111842)" />
  <path
     d="M 39.792011 40.176527 C 39.030574 43.672526 25.237845 57.014522 22.463078 55.571762 C 17.227811 54.026551 18.628396 48.892492 16.612134 47.869219 C 14.532682 47.222313 3.3577066 49.033935 1.8702796 46.824965 C -0.26809238 42.029577 -0.66483938 33.060706 4.4361106 30.659524 C 9.6870844 29.21264 18.306852 31.969445 19.155083 29.404638 C 20.003313 26.839832 21.913558 25.41624 23.493016 25.698904 C 25.072475 25.981567 41.161874 36.545323 39.792011 40.176527 z "
     style="font-size:12;fill:#7e0000;fill-rule:evenodd;stroke-width:1pt;"
     id="path582" />
  <path
     d="M 35.24374 40.170214 C 34.802213 42.806064 25.743823 52.05062 23.472736 50.818624 C 21.201551 49.586558 22.033243 45.545027 20.351629 44.953698 C 18.669918 44.362299 5.3251996 44.991918 5.1260586 42.945542 C 4.9267496 40.899193 4.0787526 33.943956 6.1250316 33.744744 C 8.1714776 33.545506 21.413667 35.376363 21.967597 33.456118 C 22.521528 31.535873 22.184315 29.389061 23.451925 29.678789 C 24.719534 29.968518 36.162168 37.459455 35.24374 40.170214 z "
     style="font-size:12;fill:#ff1500;fill-rule:evenodd;stroke-width:1pt;"
     id="path581" />
  <path
     d="M 4.9761856 41.991404 C 4.9761856 41.991404 4.7987916 43.974714 7.1587086 44.215077 C 9.5184581 44.455467 20.753762 44.401693 21.004168 45.21783 C 21.140314 47.640645 22.869439 51.646562 24.401277 51.283822 C 27.125692 50.733671 35.166878 42.015523 35.419209 40.509282 C 35.671373 39.003067 27.279415 47.043053 24.832761 45.471919 C 22.386107 43.900784 23.229696 40.713026 21.246385 40.535631 C 19.263172 40.358307 5.6186816 39.079481 5.2914146 40.108653 C 4.9642176 41.137728 5.4276586 42.531538 4.9761856 41.991404 z "
     style="font-size:12;fill:#cb0000;fill-rule:evenodd;stroke-width:1pt;"
     id="path583" />
  <path
     d="M 6.0397356 35.795117 C 6.0397356 35.795117 20.715108 35.07872 21.34214 35.958002 C 21.969074 36.837214 9.4643003 38.923611 6.0397356 35.795117 z "
     style="font-size:12;fill:#ffffff;fill-rule:evenodd;stroke-width:1pt;"
     id="path588" />
  <path
     d="M 32.95209 38.289623 C 32.95209 38.289623 27.307585 32.698914 25.90187 32.308591 C 24.496245 31.918349 25.284895 34.605343 25.284895 34.605343 C 25.284895 34.605343 32.425688 37.27241 32.95209 38.289623 z "
     style="font-size:12;fill:#ffffff;fill-rule:evenodd;stroke-width:1pt;"
     id="path589" />
  <path
     style="fill:#000000;fill-rule:evenodd;stroke:none;stroke-opacity:1;stroke-width:1pt;stroke-linejoin:miter;stroke-linecap:butt;fill-opacity:0.30137;"
     d="M 14.252479 2.4242293 L 44.728055 10.018897 L 44.822016 1.9644719 L 14.252479 2.4242293 z "
     id="path598"
     sodipodi:nodetypes="cccc" />
</svg>
