/* XPM */
static char * xscreensaver_32x32_xpm[] = {
"32 32 358 2",
"  	c None",
". 	c #111111",
"+ 	c #4A4A4A",
"@ 	c #7B7B7B",
"# 	c #A0A0A0",
"$ 	c #979797",
"% 	c #292929",
"& 	c #171717",
"* 	c #2F2F2F",
"= 	c #545454",
"- 	c #858585",
"; 	c #BDBDBD",
"> 	c #DFDFDF",
", 	c #E1E1E1",
"' 	c #E2E2E2",
") 	c #D7D7D7",
"! 	c #898989",
"~ 	c #030303",
"{ 	c #212121",
"] 	c #5E5E5E",
"^ 	c #888888",
"/ 	c #A9A9A9",
"( 	c #C7C7C7",
"_ 	c #EAEAEA",
": 	c #E9E9E9",
"< 	c #D9D9D9",
"[ 	c #CFCFCF",
"} 	c #CECECE",
"| 	c #D3D3D3",
"1 	c #909090",
"2 	c #242424",
"3 	c #3D3D3D",
"4 	c #6A6A6A",
"5 	c #959595",
"6 	c #E7E7E7",
"7 	c #E5E5E5",
"8 	c #E3E3E3",
"9 	c #D8D8D8",
"0 	c #C6C6C6",
"a 	c #C4C4C4",
"b 	c #CCCCCC",
"c 	c #C9C9C9",
"d 	c #BFBFBF",
"e 	c #ADADAD",
"f 	c #A6A6A6",
"g 	c #D6D6D6",
"h 	c #919191",
"i 	c #131313",
"j 	c #717171",
"k 	c #9F9F9F",
"l 	c #C3C3C3",
"m 	c #DEDEDE",
"n 	c #F2F2F2",
"o 	c #EFEFEF",
"p 	c #D1D1D1",
"q 	c #CDCDCD",
"r 	c #C1C1C1",
"s 	c #AFAFAF",
"t 	c #989898",
"u 	c #838383",
"v 	c #5F5F5F",
"w 	c #4B4B4B",
"x 	c #7D7D7D",
"y 	c #818181",
"z 	c #EBEBEB",
"A 	c #CACACA",
"B 	c #8F8F8F",
"C 	c #757575",
"D 	c #606060",
"E 	c #535353",
"F 	c #434343",
"G 	c #393939",
"H 	c #363636",
"I 	c #777777",
"J 	c #E6E6E6",
"K 	c #929292",
"L 	c #999999",
"M 	c #C8C8C8",
"N 	c #CBCBCB",
"O 	c #B0B0B0",
"P 	c #828282",
"Q 	c #626262",
"R 	c #4F4F4F",
"S 	c #464646",
"T 	c #404040",
"U 	c #3E3E3E",
"V 	c #424242",
"W 	c #614140",
"X 	c #653E3E",
"Y 	c #3A3A3A",
"Z 	c #373737",
"` 	c #787878",
" .	c #B2B2B2",
"..	c #767676",
"+.	c #595959",
"@.	c #343434",
"#.	c #323232",
"$.	c #3E3231",
"%.	c #3C3535",
"&.	c #444444",
"*.	c #524545",
"=.	c #994140",
"-.	c #533F3E",
";.	c #4E4E4E",
">.	c #3B3B3B",
",.	c #0D0D0D",
"'.	c #939393",
").	c #E0E0E0",
"!.	c #A1A1A1",
"~.	c #2C2C2C",
"{.	c #2E2E2E",
"].	c #472929",
"^.	c #6F1E1D",
"/.	c #8A1714",
"(.	c #73211F",
"_.	c #3C3C3C",
":.	c #414141",
"<.	c #4C4949",
"[.	c #8A4443",
"}.	c #724040",
"|.	c #2B2929",
"1.	c #808080",
"2.	c #8C8C8C",
"3.	c #7A7A7A",
"4.	c #5B5B5B",
"5.	c #2D2D2D",
"6.	c #3F2E2E",
"7.	c #7D1B19",
"8.	c #A50C09",
"9.	c #852321",
"0.	c #564847",
"a.	c #744746",
"b.	c #914241",
"c.	c #2B2B2B",
"d.	c #5C5C5C",
"e.	c #727272",
"f.	c #6C6C6C",
"g.	c #666666",
"h.	c #090909",
"i.	c #8D8D8D",
"j.	c #DDDDDD",
"k.	c #313131",
"l.	c #403333",
"m.	c #801C1A",
"n.	c #A40D0A",
"o.	c #AE2A28",
"p.	c #8A4544",
"q.	c #9B4341",
"r.	c #5C3C3C",
"s.	c #454545",
"t.	c #B3B3B3",
"u.	c #8E8E8E",
"v.	c #6D6D6D",
"w.	c #696969",
"x.	c #686868",
"y.	c #4C4C4C",
"z.	c #8A8A8A",
"A.	c #DCDCDC",
"B.	c #A2A2A2",
"C.	c #303030",
"D.	c #353535",
"E.	c #383838",
"F.	c #403939",
"G.	c #762A28",
"H.	c #AF403E",
"I.	c #A44341",
"J.	c #8A4240",
"K.	c #252222",
"L.	c #AAAAAA",
"M.	c #AEAEAE",
"N.	c #515151",
"O.	c #181818",
"P.	c #DBDBDB",
"Q.	c #3F3B3B",
"R.	c #7F3C3B",
"S.	c #9D4341",
"T.	c #B34240",
"U.	c #9B3B3A",
"V.	c #412E2E",
"W.	c #232323",
"X.	c #292928",
"Y.	c #4D4D45",
"Z.	c #636363",
"`.	c #141414",
" +	c #878787",
".+	c #DADADA",
"++	c #A3A3A3",
"@+	c #333333",
"#+	c #66302F",
"$+	c #903836",
"%+	c #584444",
"&+	c #974240",
"*+	c #9A3635",
"=+	c #5F4B4A",
"-+	c #4A493F",
";+	c #A19C6E",
">+	c #E3DB87",
",+	c #F6EB71",
"'+	c #75733F",
")+	c #111107",
"!+	c #423A39",
"~+	c #8C1E1C",
"{+	c #5F3B3A",
"]+	c #4F4040",
"^+	c #562724",
"/+	c #6B645D",
"(+	c #646249",
"_+	c #EBE491",
":+	c #FAF3A0",
"<+	c #F6EEA1",
"[+	c #6B6B6B",
"}+	c #B3AA54",
"|+	c #74712E",
"1+	c #7A201E",
"2+	c #692B2A",
"3+	c #3F3F3F",
"4+	c #B1AB4F",
"5+	c #C4BF76",
"6+	c #BABABA",
"7+	c #656458",
"8+	c #F1EFC2",
"9+	c #FEFCC4",
"0+	c #E9D992",
"a+	c #917F64",
"b+	c #6D6052",
"c+	c #554429",
"d+	c #BBA341",
"e+	c #B2AB3F",
"f+	c #A4A4A4",
"g+	c #484848",
"h+	c #5A2F2E",
"i+	c #7D201F",
"j+	c #433D3D",
"k+	c #F1E44D",
"l+	c #B7A95C",
"m+	c #B7B7B7",
"n+	c #605C4B",
"o+	c #EBE5A7",
"p+	c #FEFBB3",
"q+	c #FDF9A7",
"r+	c #E1D177",
"s+	c #D2C269",
"t+	c #D8C254",
"u+	c #DEB738",
"v+	c #9D7B11",
"w+	c #D0D0D0",
"x+	c #494949",
"y+	c #6F6F6F",
"z+	c #282828",
"A+	c #E6B71C",
"B+	c #BD9530",
"C+	c #94866A",
"D+	c #6C5F46",
"E+	c #A18B52",
"F+	c #F1E68D",
"G+	c #FEF99A",
"H+	c #FAED86",
"I+	c #F4DA63",
"J+	c #EABC39",
"K+	c #D58709",
"L+	c #BC6700",
"M+	c #9D7700",
"N+	c #A5A5A5",
"O+	c #969696",
"P+	c #C2C2C2",
"Q+	c #4D4D4D",
"R+	c #F4D82F",
"S+	c #E3B316",
"T+	c #D8B040",
"U+	c #DFCA62",
"V+	c #ECD264",
"W+	c #F0D261",
"X+	c #EDC43A",
"Y+	c #ECBD1F",
"Z+	c #E8B209",
"`+	c #E3A300",
" @	c #D68800",
".@	c #CB7200",
"+@	c #9D9D9D",
"@@	c #ECECEC",
"#@	c #E4E4E4",
"$@	c #F8DE2E",
"%@	c #F1D101",
"&@	c #F1DE49",
"*@	c #F1D77A",
"=@	c #F6DA32",
"-@	c #F9DD03",
";@	c #D2B600",
">@	c #524400",
",@	c #0D0900",
"'@	c #846505",
")@	c #DD9600",
"!@	c #D17B00",
"~@	c #525252",
"{@	c #151515",
"]@	c #F6D301",
"^@	c #FAF485",
"/@	c #FEFEC1",
"(@	c #FEF041",
"_@	c #FBE204",
":@	c #877600",
"<@	c #010100",
"[@	c #0D0700",
"}@	c #71590E",
"|@	c #DE9900",
"1@	c #D17D00",
"2@	c #D4D4D4",
"3@	c #1E1E1E",
"4@	c #000000",
"5@	c #F6D300",
"6@	c #FEF57E",
"7@	c #FEFED3",
"8@	c #A48E00",
"9@	c #161200",
"0@	c #3F3008",
"a@	c #CBA518",
"b@	c #DC9500",
"c@	c #CC7400",
"d@	c #FEF15B",
"e@	c #FEFEE0",
"f@	c #EFCE00",
"g@	c #544400",
"h@	c #6F560B",
"i@	c #E9B60B",
"j@	c #D48400",
"k@	c #C06B00",
"l@	c #F6D826",
"m@	c #FEEE48",
"n@	c #FEFDE2",
"o@	c #A18300",
"p@	c #A78204",
"q@	c #D89203",
"r@	c #CC7A00",
"s@	c #C78800",
"t@	c #614800",
"u@	c #C09907",
"v@	c #F5D000",
"w@	c #FEEE40",
"x@	c #FEFCDF",
"y@	c #EFC500",
"z@	c #DCA000",
"A@	c #D89600",
"B@	c #936A00",
"C@	c #4A3800",
"D@	c #201800",
"E@	c #A17E00",
"F@	c #F0D226",
"G@	c #F9E9A0",
"H@	c #F9DE2F",
"I@	c #EAC602",
"J@	c #C49B00",
"K@	c #513D00",
"L@	c #100C00",
"M@	c #4E3C02",
"N@	c #705910",
"O@	c #624C04",
"P@	c #443400",
"Q@	c #231B00",
"                                                                ",
"                                                                ",
"                                                                ",
"                                      . + @ # $ %               ",
"                            & * = - ; > , , ' ) !               ",
"                    ~ { ] ^ / ( _ : < [ [ [ } | 1               ",
"            2 3 4 5 | 6 7 8 ' 9 0 a b c d e f g h               ",
"      i j k l m n o m p } q b [ r s t u v w x 8 h               ",
"      y o z 8 9 ( l A ( ; s B C D E F 3 G H I J K               ",
"      L J b M N r O L P Q R S T U V W X Y Z ` 6 K               ",
"      5 ' b  ...+.S @.#.$.%.Y 3 &.*.=.-.* % 3 ;.>.,.            ",
"      '.).b !.F ~.{.].^./.(._.:.<.[.}.|.:.1.'.2.3.4..           ",
"      B > b !.T 5.* 6.7.8.8.9.0.a.b.c.d. .1 e.f.4 g.+ h.        ",
"      i.j.q !.:.* k.@.l.m.n.o.p.q.r.s.t.u.v.w.w.x.] y.&         ",
"      z.A.q B.V C.#.D.E.F.G.H.I.J.K.L.M.N.N.E.C.u D U O.        ",
"      ^ P.} B.F #.@.Z G Q.R.S.T.U.V.A 1.#.W.X.Y.f Z.5.`.        ",
"       +.+} ++&.@+D.E.>.#+$+%+&+*+=+0 d.-+;+>+,+M 4 W.'+)+      ",
"       +.+} ++s.D.Z Y !+~+{+V ]+^+/+; = (+_+:+<+b [+W.}+|+      ",
"       +.+[ ++S H E.F.1+2+3+U W.4+5+6+E 7+8+9+0+a+b+c+d+e+      ",
"       +.+[ f+g+E.Y h+i+j+>.>.`.k+l+m+w n+o+p+q+r+s+t+u+v+      ",
"       +.+w+f+x+G >.U :.F = y+z+A+B+C+D+E+F+G+H+I+J+K+L+M+      ",
"       +.+w+N++ >.V y+O+P+[ ' Q+R+S+T+U+V+W+X+Y+Z+`+ @.@M+      ",
"       +.+w+m++@c @@@@#@A.A.< S $@%@&@*@=@-@;@>@,@'@)@!@M+      ",
"      P .+p g m > P..+P.; 2.~@{@$@]@^@/@(@_@:@<@[@}@|@1@M+      ",
"      3 ) p 2@d !.1.g+3@      4@$@5@6@7@(@_@8@9@0@a@b@c@M+      ",
"        3.- x+{.              4@$@5@d@e@(@_@f@g@h@i@j@k@M+      ",
"                              4@l@5@m@n@(@_@5@o@p@q@r@s@t@      ",
"                                u@v@w@x@(@_@5@y@z@A@B@C@        ",
"                                D@E@F@G@H@I@J@M+K@L@            ",
"                                    M@N@O@P@Q@                  ",
"                                                                ",
"                                                                "};
