<?xml version="1.0" encoding="UTF-8" standalone="no"?>
<!DOCTYPE svg PUBLIC "-//W3C//DTD SVG 20010904//EN"
"http://www.w3.org/TR/2001/REC-SVG-20010904/DTD/svg10.dtd">
<!-- Created with Sodipodi ("http://www.sodipodi.com/") -->
<svg
   xmlns="http://www.w3.org/2000/svg"
   xmlns:xlink="http://www.w3.org/1999/xlink"
   version="1.0"
   x="0"
   y="0"
   width="90"
   height="90"
   id="svg604"
   xmlns:sodipodi="http://sodipodi.sourceforge.net/DTD/sodipodi-0.dtd"
   sodipodi:version="0.34"
   sodipodi:docname="/home/zeus/.themes/Zeus-Test/gtk-2.0/stock_search.svg"
   sodipodi:docbase="/home/zeus/.themes/Zeus-Test/gtk-2.0/">
  <sodipodi:namedview
     id="base" />
  <defs
     id="defs606">
    <linearGradient
       id="linearGradient612">
      <stop
         style="stop-color:#7fa8e3;stop-opacity:0.7412;"
         offset="0"
         id="stop613" />
      <stop
         style="stop-color:#ffffff;stop-opacity:0;"
         offset="1"
         id="stop614" />
    </linearGradient>
    <linearGradient
       x1="50.6438866"
       y1="5.36792946"
       x2="35.7520943"
       y2="68.0443573"
       id="linearGradient615"
       xlink:href="#linearGradient612"
       gradientUnits="userSpaceOnUse"
       spreadMethod="pad" />
  </defs>
  <path
     d="M 19.42664 88.56264 C 15.7813 88.5096 9.66994 86.29721 9.136324 80.36025 C 7.254573 74.36182 0.713023 17.66636 3.869606 13.71738 C 5.500644 10.60839 9.052353 8.326116 15.37149 7.53493 C 20.54203 6.748074 67.57396 0.598683 71.042 1.553139 C 74.51015 2.50766 77.24208 3.314788 77.49157 8.101712 C 77.23506 10.70506 85.97069 63.80551 87.31085 66.93679 C 87.95031 70.60452 86.90061 75.72995 81.55282 77.41832 C 76.20512 79.10666 23.64821 87.84605 19.42664 88.56264 z "
     style="font-size:12;fill:#3d4e67;fill-rule:evenodd;stroke-width:1;"
     id="path609" />
  <path
     d="M 23.63807 82.27417 C 20.10388 82.73788 15.19471 83.70728 14.60833 78.90501 C 12.16657 67.53684 6.568032 22.48214 10.55725 15.16029 C 11.44824 13.43857 16.28576 11.10156 27.27452 10.12596 C 39.76211 8.877692 65.38475 6.979463 68.08108 7.102769 C 70.77729 7.226108 71.60215 6.922699 72.1886 11.72508 C 71.95043 16.83078 80.0844 56.77104 80.56493 63.84256 C 80.93881 68.86253 81.58226 70.99542 78.28314 72.20901 "
     style="font-size:12;fill:#ffffff;fill-rule:evenodd;stroke-width:1;"
     id="path608" />
  <path
     d="M 11.44143 21.9589 C 11.44143 21.9589 11.75928 15.14582 20.90864 13.78907 C 30.05799 12.43235 66.2934 7.808014 67.15677 10.16888 C 68.02011 12.52973 69.08899 27.87235 69.35558 29.11352 C 69.62218 30.35465 38.94834 40.96844 30.52544 51.09771 C 22.10254 61.22695 16.2036 69.42338 16.2036 69.42338 C 16.2036 69.42338 11.38038 33.6995 11.44143 21.9589 z "
     style="font-size:12;fill:url(#linearGradient615);fill-rule:evenodd;stroke-width:1;"
     id="path636" />
  <path
     d="M 73.94991 82.92512 L 62.62137 73.43318 C 62.52677 73.35392 54.42384 76.39687 50.15814 76.35562 C 40.24262 76.25857 26.38754 70.03584 25.25507 53.00094 C 24.36004 39.42529 33.43988 26.79054 49.9861 26.76455 C 63.58161 26.74339 76.14038 36.57594 74.80313 52.74287 C 74.16465 60.70527 71.94625 63.4715 72.58616 64.2001 L 82.82901 75.86282 C 83.87559 77.05448 83.29064 81.11224 81.43917 82.64375 C 79.44178 84.25732 75.24738 84.01225 73.94991 82.92512 z "
     style="font-size:12;fill-rule:evenodd;stroke:#000000;stroke-width:1.10107;"
     id="path634" />
  <path
     d="M 71.6282 51.16881 C 71.6282 54.19056 71.01509 57.06998 69.90657 59.68937 C 69.35231 60.99907 68.78184 62.32426 67.88694 63.40874 L 80.25406 79.32811 L 78.69302 81.47837 L 61.9714 69.32428 C 60.88692 70.21918 59.56173 70.78965 58.25204 71.34391 C 55.63264 72.45243 52.75322 73.06554 49.73147 73.06554 C 37.64447 73.06554 27.83474 63.2558 27.83474 51.16881 C 27.83474 39.08181 37.64447 29.27207 49.73147 29.27207 C 61.81847 29.27207 71.6282 39.08181 71.6282 51.16881 z "
     style="font-size:12;fill:#efe16b;fill-rule:evenodd;stroke-width:1;"
     id="path620" />
  <path
     d="M 68.11379 63.39663 L 80.03213 76.69944 C 81.96053 79.44599 78.86762 82.89479 75.66026 81.22239 L 62.00971 69.29791 C 62.27041 66.53207 66.10596 63.88909 68.11379 63.39663 z "
     style="font-size:12;fill:#ffc83d;fill-rule:evenodd;"
     id="path562" />
  <path
     d="M 67.73374 63.79509 L 79.62875 76.91175 C 80.46285 79.02836 79.09413 75.46878 77.33513 79.15082 L 65.16024 66.133 C 65.18203 65.27787 65.64232 64.2127 67.73374 63.79509 z "
     style="font-size:12;fill:#ff933d;fill-rule:evenodd;"
     id="path567" />
  <path
     d="M 63.91197 66.90423 L 76.56524 79.38439 C 77.08236 79.53214 75.959 79.78652 76.14547 81.08573 C 75.70396 80.46418 62.72354 68.58567 62.72354 68.58567 L 63.91197 66.90423 z "
     style="font-size:12;fill:#ffffff;fill-rule:evenodd;"
     id="path568" />
  <ellipse
     cx="29.4996109"
     cy="28.9535923"
     rx="18.451067"
     ry="18.451067"
     transform="matrix(1.035494,0,0,1.035494,19.1848,21.18753)"
     style="font-size:12;fill:#bae6ff;fill-rule:evenodd;stroke-width:1;"
     id="path611" />
  <path
     d="M 61.62184 36.27092 C 65.60271 39.11182 68.50059 43.47028 69.36975 48.67141 C 70.2389 53.87253 68.91557 58.9364 66.07467 62.91726 C 63.23378 66.89814 58.87531 69.79601 53.67419 70.66517 C 48.47306 71.53432 45.05151 70.48471 39.42833 67.3701 M 39.42833 67.3701 C 66.77347 59.14017 60.04941 52.45601 61.62184 36.27092 "
     style="font-size:12;fill:#437caf;fill-rule:evenodd;stroke-width:1;"
     id="path610" />
  <path
     d="M 68.0629 63.18767 C 66.018 63.95732 66.64656 63.84187 64.76808 65.0553 C 64.66354 65.22629 63.53354 65.11448 62.06044 69.37509 L 65.19282 72.18177 C 66.04239 71.0551 67.2876 69.00649 68.02623 68.49002 C 69.09725 67.69575 69.6273 67.28978 71.19757 66.66193 L 68.0629 63.18767 z "
     style="font-size:12;fill:#ff0000;fill-rule:evenodd;stroke-width:1;"
     id="path651" />
  <path
     d="M 65.62963 69.06111 L 64.64488 70.46855 L 62.75148 68.89424 L 63.63904 67.50742 L 65.62963 69.06111 z "
     style="font-size:12;fill:#ffffff;fill-rule:evenodd;stroke-width:1;"
     id="path652" />
</svg>
