/* XPM */
static char * netscape_32x32_xpm[] = {
"32 32 742 2",
"  	c None",
". 	c #2F7DA7",
"+ 	c #D1CAAF",
"@ 	c #7F7961",
"# 	c #423C26",
"$ 	c #35301E",
"% 	c #2F7CA5",
"& 	c #2E7BA5",
"* 	c #DFDAC4",
"= 	c #DAD4BC",
"- 	c #928C76",
"; 	c #524C38",
"> 	c #322F22",
", 	c #000000",
"' 	c #2F7BA4",
") 	c #2D7BA4",
"! 	c #2A7AA5",
"~ 	c #5F7B88",
"{ 	c #AF7C5C",
"] 	c #583E2E",
"^ 	c #E7E3D1",
"/ 	c #E1DCC6",
"( 	c #A29C88",
"_ 	c #625C4A",
": 	c #312E25",
"< 	c #E0C7B8",
"[ 	c #A18878",
"} 	c #624838",
"| 	c #2F7AA2",
"1 	c #3B7390",
"2 	c #496C7C",
"3 	c #858988",
"4 	c #CBAB95",
"5 	c #9C8675",
"6 	c #6D6155",
"7 	c #484139",
"8 	c #F4F2EB",
"9 	c #F0ECE2",
"0 	c #ECE8DA",
"a 	c #E9E5D5",
"b 	c #C7C2B2",
"c 	c #A6A08F",
"d 	c #858173",
"e 	c #656258",
"f 	c #817E76",
"g 	c #CCBBAF",
"h 	c #E4D0C2",
"i 	c #BC9D89",
"j 	c #956B50",
"k 	c #533D2E",
"l 	c #050505",
"m 	c #2F78A0",
"n 	c #486C7F",
"o 	c #60615E",
"p 	c #9C9288",
"q 	c #D9C2B1",
"r 	c #BEAA98",
"s 	c #A39280",
"t 	c #5D5349",
"u 	c #7E7E7C",
"v 	c #FCFBF9",
"w 	c #F3F0E8",
"x 	c #ECE8DB",
"y 	c #EEEBE0",
"z 	c #F1EEE4",
"A 	c #EDE9DC",
"B 	c #E9E4D4",
"C 	c #DAD4C2",
"D 	c #CAC4AF",
"E 	c #CAC6B9",
"F 	c #CBC9C6",
"G 	c #B4ADA7",
"H 	c #9C9188",
"I 	c #C6B7AC",
"J 	c #E6D4C7",
"K 	c #CAA892",
"L 	c #AE7D5C",
"M 	c #5A4231",
"N 	c #060606",
"O 	c #2E779F",
"P 	c #3C6C86",
"Q 	c #48616D",
"R 	c #76726C",
"S 	c #A2826C",
"T 	c #AE907A",
"U 	c #B99E88",
"V 	c #A49285",
"W 	c #8B8681",
"X 	c #C1BEB9",
"Y 	c #F8F6F2",
"Z 	c #EDE9DD",
"` 	c #E4DECC",
" .	c #D8D2C0",
"..	c #CCC6B4",
"+.	c #CEC8B2",
"@.	c #D0C9B0",
"#.	c #CFC7AE",
"$.	c #CDC6AC",
"%.	c #D1CBB7",
"&.	c #D6D2C3",
"*.	c #C7BDAB",
"=.	c #B9A993",
"-.	c #C3A78F",
";.	c #CCA68A",
">.	c #9D7A61",
",.	c #6E4E38",
"'.	c #38281E",
").	c #030303",
"!.	c #020202",
"~.	c #2E769E",
"{.	c #306C8D",
"].	c #31617C",
"^.	c #4E5251",
"/.	c #6C4326",
"(.	c #9E765B",
"_.	c #CFA990",
":.	c #E1CAB8",
"<.	c #F3EAE1",
"[.	c #F4EEE6",
"}.	c #F5F3EC",
"|.	c #E8E4D4",
"1.	c #DBD4BC",
"2.	c #C0B9A0",
"3.	c #A69E83",
"4.	c #AFA688",
"5.	c #B8AE8C",
"6.	c #C4BA9A",
"7.	c #D0C7A9",
"8.	c #D7D0B4",
"9.	c #DED8C0",
"0.	c #D6CAAE",
"a.	c #CEBB9C",
"b.	c #C09A75",
"c.	c #B2784E",
"d.	c #704C31",
"e.	c #2E1F14",
"f.	c #17100A",
"g.	c #2E749B",
"h.	c #2F7094",
"i.	c #306C8C",
"j.	c #3E5E6D",
"k.	c #4C504E",
"l.	c #92867C",
"m.	c #D6BCAA",
"n.	c #E5D5C8",
"o.	c #F3EEE6",
"p.	c #D4CEC4",
"q.	c #B4AEA0",
"r.	c #9A9484",
"s.	c #7E7A68",
"t.	c #9B9681",
"u.	c #B8B29A",
"v.	c #A69F82",
"w.	c #958C6A",
"x.	c #8A8265",
"y.	c #7F7860",
"z.	c #A69D83",
"A.	c #CDC2A6",
"B.	c #CBBE9D",
"C.	c #CABA94",
"D.	c #A78C69",
"E.	c #855F3D",
"F.	c #4E3724",
"G.	c #0C0805",
"H.	c #2E7298",
"I.	c #2E749A",
"J.	c #2E769D",
"K.	c #2E6A8A",
"L.	c #2D5D76",
"M.	c #86969E",
"N.	c #DED0C5",
"O.	c #E8E1D8",
"P.	c #F3F2EC",
"Q.	c #746A55",
"R.	c #4B4435",
"S.	c #221F15",
"T.	c #767263",
"U.	c #CAC5B1",
"V.	c #9E987C",
"W.	c #726A47",
"X.	c #504A30",
"Y.	c #2E2918",
"Z.	c #756A52",
"`.	c #BCAC8C",
" +	c #C0B28C",
".+	c #C5B98D",
"++	c #8E805C",
"@+	c #58462C",
"#+	c #2C2316",
"$+	c #2E7096",
"%+	c #487F9D",
"&+	c #618AA0",
"*+	c #A5B6BC",
"=+	c #E9E1D8",
"-+	c #CEC8BC",
";+	c #A09482",
">+	c #8C7962",
",+	c #5C5142",
"'+	c #2C2822",
")+	c #817C6F",
"!+	c #D6D0BC",
"~+	c #9E9880",
"{+	c #665F44",
"]+	c #655A42",
"^+	c #655441",
"/+	c #80694E",
"(+	c #9C7E5C",
"_+	c #A28E6B",
":+	c #A89E7A",
"<+	c #9B8E69",
"[+	c #8D7D58",
"}+	c #4B432F",
"|+	c #0A0805",
"1+	c #060603",
"2+	c #2E6E94",
"3+	c #2E7198",
"4+	c #6294B1",
"5+	c #95B7CA",
"6+	c #C4D4DB",
"7+	c #F4F2EC",
"8+	c #A48870",
"9+	c #6E5D50",
"0+	c #37322F",
"a+	c #8C877A",
"b+	c #9D9884",
"c+	c #595441",
"d+	c #7A6A56",
"e+	c #9C806A",
"f+	c #8C684B",
"g+	c #7B4F2C",
"h+	c #846949",
"i+	c #8C8366",
"j+	c #A79C76",
"k+	c #C2B485",
"l+	c #6A6248",
"m+	c #13110A",
"n+	c #0F0E08",
"o+	c #2E6F95",
"p+	c #2E7097",
"q+	c #77A0B5",
"r+	c #C0D0D2",
"s+	c #D3D8D3",
"t+	c #E5E0D3",
"u+	c #9B9A8F",
"v+	c #51544A",
"w+	c #5E594C",
"x+	c #6C5D4E",
"y+	c #776556",
"z+	c #826E5E",
"A+	c #B6AA9B",
"B+	c #EAE6D8",
"C+	c #C1BAA7",
"D+	c #988D76",
"E+	c #8E7A62",
"F+	c #83664E",
"G+	c #604732",
"H+	c #3E2816",
"I+	c #564833",
"J+	c #6F6850",
"K+	c #988E69",
"L+	c #C1B482",
"M+	c #807653",
"N+	c #403824",
"O+	c #2E291B",
"P+	c #2E6E93",
"Q+	c #2E6F94",
"R+	c #8DACB8",
"S+	c #E1DCCA",
"T+	c #D6CFBA",
"U+	c #82877D",
"V+	c #2E3F40",
"W+	c #303836",
"X+	c #33322C",
"Y+	c #806E5C",
"Z+	c #CDA98C",
"`+	c #E0CDBB",
" @	c #F3F1EA",
".@	c #E6DCCA",
"+@	c #D8C6AA",
"@@	c #A18A6E",
"#@	c #6A4D31",
"$@	c #352618",
"%@	c #29261C",
"&@	c #524C39",
"*@	c #89805C",
"=@	c #C0B37F",
"-@	c #968A5F",
";@	c #6D603F",
">@	c #49402A",
",@	c #678E9C",
"'@	c #789AA5",
")@	c #88A6AF",
"!@	c #BAC8C6",
"~@	c #ECE9DC",
"{@	c #D6D0BE",
"]@	c #BEB79F",
"^@	c #9E9D8C",
"/@	c #7C8278",
"(@	c #838579",
"_@	c #8A8779",
":@	c #B5AA9A",
"<@	c #E0CDBA",
"[@	c #E6DBCB",
"}@	c #DDD3BA",
"|@	c #CDBD97",
"1@	c #A08C64",
"2@	c #725B31",
"3@	c #71644A",
"4@	c #706E63",
"5@	c #858172",
"6@	c #9A9480",
"7@	c #AEA582",
"8@	c #C2B684",
"9@	c #9C8F64",
"0@	c #766944",
"a@	c #837B60",
"b@	c #969284",
"c@	c #999584",
"d@	c #A0ADA4",
"e@	c #C1C5B6",
"f@	c #E2DDC8",
"g@	c #E8E4D2",
"h@	c #EDEADD",
"i@	c #CAC4B0",
"j@	c #A79F84",
"k@	c #B9B29A",
"l@	c #CBC6B1",
"m@	c #D6D1BC",
"n@	c #F3F1E9",
"o@	c #E6E1CE",
"p@	c #D4CAA9",
"q@	c #C2B484",
"r@	c #9E8E5A",
"s@	c #7A6931",
"t@	c #AEA27C",
"u@	c #E2DCC6",
"v@	c #E2DCC7",
"w@	c #D3CAA8",
"x@	c #C4B88A",
"y@	c #A1956A",
"z@	c #7E724A",
"A@	c #B0A788",
"B@	c #BFBAA5",
"C@	c #707A75",
"D@	c #878A7E",
"E@	c #9F9A87",
"F@	c #C4C0AE",
"G@	c #CAC4AE",
"H@	c #ACA487",
"I@	c #9F9880",
"J@	c #928D79",
"K@	c #98937F",
"L@	c #9E9884",
"M@	c #C0B8A5",
"N@	c #E2D8C6",
"O@	c #DBD1B7",
"P@	c #C4B684",
"Q@	c #B6A260",
"R@	c #8A7942",
"S@	c #5E5024",
"T@	c #7E7454",
"U@	c #AAA48D",
"V@	c #B6AF96",
"W@	c #BDB492",
"X@	c #C4B98D",
"Y@	c #A0946A",
"Z@	c #7C7047",
"`@	c #8C8465",
" #	c #817C6B",
".#	c #646152",
"+#	c #3F4846",
"@#	c #4E5046",
"##	c #5C5846",
"$#	c #A09C88",
"%#	c #E5DFCB",
"&#	c #CAC4AA",
"*#	c #B0A88A",
"=#	c #847E66",
"-#	c #5A5442",
";#	c #5A5543",
">#	c #968A72",
",#	c #D2BFA2",
"'#	c #CABA93",
")#	c #C1B484",
"!#	c #B5A260",
"~#	c #A9903B",
"{#	c #76642A",
"]#	c #423818",
"^#	c #4E462C",
"/#	c #726B53",
"(#	c #C5BA90",
"_#	c #9F946A",
":#	c #796E44",
"<#	c #696142",
"[#	c #423F30",
"}#	c #2C2A20",
"|#	c #355465",
"1#	c #3B545F",
"2#	c #42555A",
"3#	c #86908A",
"4#	c #CACABA",
"5#	c #C4C0A9",
"6#	c #BEB698",
"7#	c #84826C",
"8#	c #4A4E40",
"9#	c #646051",
"0#	c #7E7362",
"a#	c #8F7D66",
"b#	c #A0886B",
"c#	c #9F8C63",
"d#	c #9E905A",
"e#	c #8A7A42",
"f#	c #6E5B31",
"g#	c #675238",
"h#	c #584B38",
"i#	c #4A4439",
"j#	c #67614E",
"k#	c #847D64",
"l#	c #A0966E",
"m#	c #BCAE78",
"n#	c #8A7E54",
"o#	c #574E30",
"p#	c #423C28",
"q#	c #212018",
"r#	c #161510",
"s#	c #2B6084",
"t#	c #295978",
"u#	c #27526D",
"v#	c #6C848A",
"w#	c #B0B6A8",
"x#	c #BEBDA8",
"y#	c #CDC4A7",
"z#	c #848674",
"A#	c #3B4740",
"B#	c #6E6C60",
"C#	c #A29180",
"D#	c #88705A",
"E#	c #6E5034",
"F#	c #755E32",
"G#	c #7C6B31",
"H#	c #605225",
"I#	c #433919",
"J#	c #685238",
"K#	c #8C6C58",
"L#	c #635044",
"M#	c #3A3531",
"N#	c #5C564A",
"O#	c #7E7862",
"P#	c #998D60",
"Q#	c #B4A25F",
"R#	c #74683D",
"S#	c #352F1B",
"T#	c #1A180E",
"U#	c #2A6084",
"V#	c #2A5E7F",
"W#	c #2A5B7A",
"X#	c #5B7E91",
"Y#	c #8DA2A7",
"Z#	c #B1B7AC",
"`#	c #D4CCB0",
" $	c #A8A38B",
".$	c #7C7A66",
"+$	c #877965",
"@$	c #927864",
"#$	c #6A5D4F",
"$$	c #43413A",
"%$	c #79725B",
"&$	c #AEA47C",
"*$	c #7E7554",
"=$	c #4E462D",
"-$	c #564834",
";$	c #5D493C",
">$	c #6E5A4A",
",$	c #806C58",
"'$	c #8D7D5C",
")$	c #9A8E60",
"!$	c #9C8D55",
"~$	c #9E8C4A",
"{$	c #5E542D",
"]$	c #1E1A10",
"^$	c #100E09",
"/$	c #2B6286",
"($	c #2C6488",
"_$	c #4B7997",
":$	c #6A8EA6",
"<$	c #A3B1B0",
"[$	c #DCD4BA",
"}$	c #CCC0A3",
"|$	c #BDAD8C",
"1$	c #9F866A",
"2$	c #816047",
"3$	c #4C4944",
"4$	c #183241",
"5$	c #7C8784",
"6$	c #443D30",
"7$	c #2E2620",
"8$	c #7A6450",
"9$	c #C6A380",
"0$	c #BEA46E",
"a$	c #B7A45D",
"b$	c #A08E49",
"c$	c #887735",
"d$	c #473E1E",
"e$	c #2A5F83",
"f$	c #2B6185",
"g$	c #2C6286",
"h$	c #43708E",
"i$	c #5A7E95",
"j$	c #99A4A2",
"k$	c #D8CAAE",
"l$	c #CCBE9D",
"m$	c #A49576",
"n$	c #88785F",
"o$	c #606358",
"p$	c #384F52",
"q$	c #8C968C",
"r$	c #A6A087",
"s$	c #6C6448",
"t$	c #5B5B4A",
"u$	c #4A514B",
"v$	c #847A5D",
"w$	c #BEA46F",
"x$	c #AF9859",
"y$	c #A08C43",
"z$	c #86763D",
"A$	c #6C5F38",
"B$	c #38311D",
"C$	c #2A5E82",
"D$	c #3A6884",
"E$	c #4A6E84",
"F$	c #8E9794",
"G$	c #D3C0A3",
"H$	c #CBBC98",
"I$	c #C3B78C",
"J$	c #A9A382",
"K$	c #8F8F77",
"L$	c #737E6C",
"M$	c #576C62",
"N$	c #9CA494",
"O$	c #7F754F",
"P$	c #727862",
"Q$	c #657C76",
"R$	c #8E906A",
"S$	c #B6A45E",
"T$	c #A08C44",
"U$	c #8A7429",
"V$	c #6E5E32",
"W$	c #51473A",
"X$	c #28241D",
"Y$	c #2A5C80",
"Z$	c #315E7C",
"`$	c #385F79",
" %	c #677E8D",
".%	c #959CA0",
"+%	c #A8988A",
"@%	c #BC9472",
"#%	c #AA8E6A",
"$%	c #988862",
"%%	c #A09470",
"&%	c #A8A27E",
"*%	c #9A9978",
"=%	c #8C9073",
"-%	c #B1AE90",
";%	c #D5CCAC",
">%	c #BBB18C",
",%	c #A2966C",
"'%	c #969169",
")%	c #8A8C66",
"!%	c #958D58",
"~%	c #9F8E4A",
"{%	c #806E36",
"]%	c #624F22",
"^%	c #725E3F",
"/%	c #826E5D",
"(%	c #65564A",
"_%	c #483E37",
":%	c #2D2622",
"<%	c #2A5B7D",
"[%	c #385C75",
"}%	c #465D6D",
"|%	c #939495",
"1%	c #E0CBBD",
"2%	c #C29A80",
"3%	c #A46942",
"4%	c #88603E",
"5%	c #6D5839",
"6%	c #98865F",
"7%	c #C6B88B",
"8%	c #C9BC92",
"9%	c #C6B98D",
"0%	c #C4B688",
"a%	c #BAAA70",
"b%	c #B09D57",
"c%	c #9C8A46",
"d%	c #605028",
"e%	c #392A1A",
"f%	c #765F4D",
"g%	c #B39480",
"h%	c #A28877",
"i%	c #917C6E",
"j%	c #53473F",
"k%	c #2A5A7C",
"l%	c #3B5E76",
"m%	c #4C6270",
"n%	c #87827F",
"o%	c #C2A48E",
"p%	c #987862",
"q%	c #6D4C37",
"r%	c #5A4D40",
"s%	c #464E4A",
"t%	c #616A60",
"u%	c #7C8677",
"v%	c #8A896C",
"w%	c #998C60",
"x%	c #9E9267",
"y%	c #A4976E",
"z%	c #A1946A",
"A%	c #9E9266",
"B%	c #8B8055",
"C%	c #786E44",
"D%	c #65603C",
"E%	c #525235",
"F%	c #404436",
"G%	c #2E3738",
"H%	c #5E5045",
"I%	c #8E6A52",
"J%	c #8E6D57",
"K%	c #8E715C",
"L%	c #4B3C31",
"M%	c #3E6078",
"N%	c #526674",
"O%	c #7C716A",
"P%	c #A57C5F",
"Q%	c #6E5646",
"R%	c #36302C",
"S%	c #2A3A43",
"T%	c #1F435A",
"U%	c #2A4E62",
"V%	c #365969",
"W%	c #535E52",
"X%	c #70643C",
"Y%	c #776B43",
"Z%	c #5C573A",
"`%	c #3F4030",
" &	c #2E3632",
".&	c #1C2C35",
"+&	c #203846",
"@&	c #234456",
"#&	c #46423C",
"$&	c #6A3F23",
"%&	c #7A5236",
"&&	c #8A664A",
"*&	c #453325",
"=&	c #2A597B",
"-&	c #345D7A",
";&	c #535E66",
">&	c #685C52",
",&	c #494A4A",
"'&	c #2A3841",
")&	c #284456",
"!&	c #24506C",
"~&	c #2A5772",
"{&	c #305E78",
"]&	c #3F606C",
"^&	c #4E6361",
"/&	c #7E8574",
"(&	c #4C5245",
"_&	c #304448",
":&	c #2A4855",
"<&	c #254C62",
"[&	c #27546D",
"}&	c #285B77",
"|&	c #3A5462",
"1&	c #4C4E4C",
"2&	c #50504D",
"3&	c #55534E",
"4&	c #313A3E",
"5&	c #0D222E",
"6&	c #29587A",
"7&	c #2A4B62",
"8&	c #2A3B46",
"9&	c #243E4E",
"0&	c #1F4056",
"a&	c #244E6A",
"b&	c #2A5D7E",
"c&	c #2A6082",
"d&	c #2B6387",
"e&	c #869FA6",
"f&	c #3C4E50",
"g&	c #204860",
"h&	c #275A78",
"i&	c #2E6D90",
"j&	c #2E7094",
"k&	c #2E6787",
"l&	c #2D5C76",
"m&	c #264E64",
"n&	c #204051",
"o&	c #1D4256",
"p&	c #1A445C",
"q&	c #28597C",
"r&	c #29597B",
"s&	c #2A5A7A",
"t&	c #2A526D",
"u&	c #2A4A5F",
"v&	c #274B64",
"w&	c #244C68",
"x&	c #275574",
"y&	c #2A5E80",
"z&	c #2A6083",
"A&	c #2B6386",
"B&	c #7A969F",
"C&	c #C8C9B8",
"D&	c #888879",
"E&	c #48483B",
"F&	c #344A51",
"G&	c #204D68",
"H&	c #275E7D",
"I&	c #2E6E92",
"J&	c #2E7095",
"K&	c #2E6889",
"L&	c #2A6280",
"M&	c #275A76",
"N&	c #265D7B",
"O&	c #246080",
"P&	c #26678A",
"Q&	c #285A7D",
"R&	c #28597A",
"S&	c #295878",
"T&	c #295879",
"U&	c #2A5B7E",
"V&	c #2A5E81",
"W&	c #2B6487",
"X&	c #6E8D98",
"Y&	c #B0B6A9",
"Z&	c #73786F",
"`&	c #363B35",
" *	c #2C4652",
".*	c #21526F",
"+*	c #286182",
"@*	c #2E7196",
"#*	c #2E759C",
"$*	c #2E78A0",
". .                           + @ # $                           ",
". .                           + @ # $                           ",
"% % &                       * = - ; > ,                         ",
"' ' ) ! ~ { ] ,             ^ / ( _ : , ,         < [ }         ",
"| | 1 2 3 4 5 6 7       8 9 0 a b c d e f       g h i j k l     ",
"m m n o p q r s t , u v w x y z A B C D E F G H I J K L M N l   ",
"O O P Q R S T U V W X Y Z `  ...+.@.#.$.%.&.*.=.-.;.>.,.'.).!.  ",
"~.~.{.].^./.(._.:.<.[.}.|.1.2.3.4.5.6.7.8.9.0.a.b.c.d.e.f., , , ",
"g.g.h.i.j.k.l.m.n.o.p.q.r.s.t.u.v.w.x.y.z.A.B.C.D.E.F.f.G., ,   ",
"H.H.I.J.K.L.M.N.O.P.q.Q.R.S.T.U.V.W.X.Y.Z.`. +.+++@+#+, , ,     ",
"$+$+H.I.%+&+*+=+-+q.;+>+,+'+)+!+~+{+]+^+/+(+_+:+<+[+}+|+1+,     ",
"2+2+$+3+4+5+6+7+q.Q.>+8+9+0+a+/ b+c+d+e+f+g+h+i+j+k+l+m+n+      ",
"2+2+o+p+q+r+s+t+u+v+w+x+y+z+A+B+C+D+E+F+G+H+I+J+K+L+M+N+O+      ",
"P+P+Q+$+R+x S+T+U+V+W+X+Y+Z+`+ @.@+@@@#@$@, %@&@*@=@-@;@>@,     ",
",@,@'@)@!@~@{@]@^@/@(@_@:@<@[@~@}@|@1@2@3@4@5@6@7@8@9@0@a@b@c@b+",
"d@d@e@f@g@h@i@j@k@l@m@/ B+n@~@o@p@q@r@s@t@/ u@v@w@x@y@z@A@/ B@b+",
"C@C@D@E@F@B G@H@I@J@K@L@M@N@O@p@P@Q@R@S@T@b+U@V@W@X@Y@Z@`@b+ #.#",
"+#+#@###$#%#&#*#=#c+-#;#>#,#'#)#!#~#{#]#^#c+/#x.:+(#_#:#<#c+[#}#",
"|#|#1#2#3#4#5#6#7#8#9#0#a#b#c#d#e#{#f#g#h#i#j#k#l#m#n#o#p#}#q#r#",
"s#s#t#u#v#w#x#y#z#A#B#C#D#E#F#G#H#I#J#K#L#M#N#O#P#Q#R#S#T#, , , ",
"U#U#V#W#X#Y#Z#`# $.$+$@$#$$$%$&$*$=$-$;$>$,$'$)$!$~${$]$^$, , , ",
"U#U#/$($_$:$<$[$}$|$1$2$3$4$5$/ b+c+6$7$8$9$0$a$b$c$d$N ).,     ",
"e$e$f$g$h$i$j$k$l$ +m$n$o$p$q$/ r$s$t$u$v$w$x$y$z$A$B$).!.,     ",
"C$C$U#f$D$E$F$G$H$I$J$K$L$M$N$/ *#O$P$Q$R$S$T$U$V$W$X$, , ,     ",
"Y$Y$Z$`$ %.%+%@%#%$%%%&%*%=%-%;%>%,%'%)%!%~%{%]%^%/%(%_%:%,     ",
"<%<%[%}%|%1%2%3%4%5%6%k+q@q@7%8%9%0%a%b%c%c$d%e%f%g%h%i%j%,     ",
"k%k%l%m%n%o%p%q%r%s%t%u%v%w%x%y%z%A%B%C%D%E%F%G%H%I%J%K%L%,     ",
"k%k%M%N%O%P%Q%R%S%T%U%V%W%X%Y%z@Z@:#Z%`% &.&+&@&#&$&%&&&*&, ,   ",
"=&=&-&M%;&>&,&'&)&!&~&{&]&^&/&A@`@<#(&_&:&<&[&}&|&1&2&3&4&5&5&  ",
"6&6&k%<%7&8&9&0&a&b&c&d&/$/$e&/ b+c+f&g&h&i&j&H.k&l&m&n&o&p&p&  ",
"q&q&r&s&t&u&v&w&x&y&z&/$/$A&B&C&D&E&F&G&H&I&J&H.i&K&L&M&N&O&P&  ",
"Q&Q&R&S&S&S&T&6&U&V&z&f$/$W&X&Y&Z&`& *.*+*J&@*H.I.#*#*#*$*' ) ! "};
