<?xml version="1.0" encoding="UTF-8" standalone="no"?>
<!DOCTYPE svg PUBLIC "-//W3C//DTD SVG 20010904//EN"
"http://www.w3.org/TR/2001/REC-SVG-20010904/DTD/svg10.dtd">
<!-- Created with Sodipodi ("http://www.sodipodi.com/") -->
<svg
   xmlns="http://www.w3.org/2000/svg"
   xmlns:xlink="http://www.w3.org/1999/xlink"
   version="1.0"
   x="0"
   y="0"
   width="90"
   height="90"
   id="svg604"
   xmlns:sodipodi="http://sodipodi.sourceforge.net/DTD/sodipodi-0.dtd"
   sodipodi:version="0.34"
   sodipodi:docname="/home/zeus/Project/stock_strikethrough.svg"
   sodipodi:docbase="/home/zeus/Project/">
  <sodipodi:namedview
     id="base" />
  <defs
     id="defs606">
    <linearGradient
       id="linearGradient612">
      <stop
         style="stop-color:#7fa8e3;stop-opacity:0.7412;"
         offset="0"
         id="stop613" />
      <stop
         style="stop-color:#ffffff;stop-opacity:0;"
         offset="1"
         id="stop614" />
    </linearGradient>
    <linearGradient
       x1="50.6438866"
       y1="5.36792946"
       x2="35.7520943"
       y2="68.0443573"
       id="linearGradient615"
       xlink:href="#linearGradient612"
       gradientUnits="userSpaceOnUse"
       spreadMethod="pad" />
  </defs>
  <path
     d="M 19.2491 89.14328 C 15.5787 89.08953 9.425319 86.84765 8.888039 80.83154 C 6.993349 74.75314 0.406825 17.30186 3.585106 13.30023 C 5.227361 10.1498 8.803489 7.837098 15.16606 7.035365 C 20.37216 6.238019 67.72743 0.006649 71.21931 0.97383 C 74.71132 1.941075 77.46203 2.758964 77.71323 7.609703 C 77.45497 10.24775 86.25064 64.0561 87.60002 67.22913 C 88.24387 70.94575 87.18696 76.13951 81.80241 77.85038 C 76.41793 79.56123 23.49969 88.41713 19.2491 89.14328 z "
     style="font-size:12;fill:#3d4e67;fill-rule:evenodd;stroke-width:1;"
     id="path609" />
  <path
     d="M 23.48948 82.77097 C 19.93099 83.24087 14.98807 84.22318 14.39766 79.3569 C 11.93911 67.83718 6.302088 22.18184 10.31872 14.76237 C 11.21584 13.0177 16.08662 10.64955 27.15093 9.660934 C 39.72438 8.396033 65.52318 6.472493 68.23804 6.597443 C 70.95278 6.722426 71.78331 6.414972 72.37381 11.28137 C 72.134 16.45514 80.32389 56.92784 80.80771 64.09364 C 81.18418 69.18054 81.83205 71.34186 78.51023 72.57163 "
     style="font-size:12;fill:#ffffff;fill-rule:evenodd;stroke-width:1;"
     id="path608" />
  <path
     d="M 11.20899 21.65162 C 11.20899 21.65162 11.52903 14.74771 20.7413 13.37287 C 29.95353 11.99807 66.43807 7.31209 67.30738 9.704429 C 68.17665 12.09676 69.25289 27.6439 69.52131 28.90162 C 69.78973 30.15929 38.90501 40.9146 30.4242 51.17889 C 21.9434 61.44317 16.0039 69.74887 16.0039 69.74887 C 16.0039 69.74887 11.14753 33.54875 11.20899 21.65162 z "
     style="font-size:12;fill:url(#linearGradient615);fill-rule:evenodd;stroke-width:1;"
     id="path636" />
  <path
     d="M 21.48386 51.67742 L 71.41935 42.09677 "
     style="font-size:12;fill:none;fill-rule:evenodd;stroke:#3d4e67;stroke-width:4.75;"
     id="path680" />
  <path
     transform="matrix(5.895949,-1.637901,1.637901,5.895948,0,0)"
     style="font-size:12;font-weight:normal;fill:#3d4e67;font-family:Bitstream Vera Sans;"
     d="M 7.536079 4.432147 L 7.536079 5.586444 C 7.08686 5.3716 6.663032 5.211444 6.264594 5.105975 C 5.866157 5.000506 5.481391 4.947772 5.110297 4.947772 C 4.465766 4.947772 3.967719 5.072772 3.616157 5.322772 C 3.2685 5.572772 3.094672 5.928241 3.094672 6.389178 C 3.094672 6.775897 3.209907 7.068866 3.440375 7.268084 C 3.67475 7.463397 4.116157 7.6216 4.764594 7.742694 L 5.479438 7.889178 C 6.36225 8.057147 7.012641 8.354022 7.43061 8.779803 C 7.852485 9.201678 8.063422 9.768084 8.063422 10.47902 C 8.063422 11.32668 7.778266 11.96926 7.207954 12.40676 C 6.641547 12.84426 5.809516 13.06301 4.71186 13.06301 C 4.297797 13.06301 3.856391 13.01613 3.387641 12.92238 C 2.922797 12.82863 2.440375 12.68996 1.940375 12.50637 L 1.940375 11.28762 C 2.420844 11.55715 2.891547 11.76027 3.352485 11.89699 C 3.813422 12.03371 4.266547 12.10207 4.71186 12.10207 C 5.387641 12.10207 5.909125 11.96926 6.276313 11.70363 C 6.6435 11.43801 6.827094 11.0591 6.827094 10.56691 C 6.827094 10.13723 6.694282 9.801288 6.428657 9.5591 C 6.166938 9.316913 5.735297 9.135272 5.133735 9.014178 L 4.413032 8.873553 C 3.530219 8.697772 2.891547 8.422381 2.497016 8.047381 C 2.102485 7.672381 1.905219 7.150897 1.905219 6.482928 C 1.905219 5.709491 2.176703 5.100116 2.719672 4.654803 C 3.266547 4.209491 4.0185 3.986834 4.975532 3.986834 C 5.385688 3.986834 5.803657 4.023944 6.229438 4.098163 C 6.655219 4.172381 7.090766 4.283709 7.536079 4.432147 z "
     id="path659" />
</svg>
