<?xml version="1.0" encoding="UTF-8" standalone="no"?>
<!DOCTYPE svg PUBLIC "-//W3C//DTD SVG 20010904//EN"
"http://www.w3.org/TR/2001/REC-SVG-20010904/DTD/svg10.dtd">
<!-- Created with Sodipodi ("http://www.sodipodi.com/") -->
<svg
   xmlns="http://www.w3.org/2000/svg"
   xmlns:sodipodi="http://sodipodi.sourceforge.net/DTD/sodipodi-0.dtd"
   xmlns:xlink="http://www.w3.org/1999/xlink"
   id="svg604"
   sodipodi:version="0.34"
   width="72pt"
   height="72pt"
   sodipodi:docbase="/home/zeus/.themes/Zeus-Test/gtk-2.0/"
   sodipodi:docname="/home/zeus/.themes/Zeus-Test/gtk-2.0/stock_copy.svg">
  <defs
     id="defs606">
    <linearGradient
       id="linearGradient612">
      <stop
         style="stop-color:#7fa8e3;stop-opacity:0.741176;"
         offset="0.000000"
         id="stop613" />
      <stop
         style="stop-color:#ffffff;stop-opacity:0;"
         offset="1.000000"
         id="stop614" />
    </linearGradient>
    <linearGradient
       xlink:href="#linearGradient612"
       id="linearGradient615"
       x1="50.6438866"
       y1="5.36792946"
       x2="35.7520943"
       y2="68.0443573"
       gradientUnits="userSpaceOnUse"
       spreadMethod="pad" />
  </defs>
  <sodipodi:namedview
     id="base" />
  <path
     style="fill:#3d4e67;fill-rule:evenodd;stroke:none;stroke-opacity:1;stroke-width:1pt;stroke-linejoin:miter;stroke-linecap:butt;fill-opacity:1;"
     d="M 14.74598 77.15899 C 11.94722 77.11395 7.255135 75.23543 6.845445 70.1944 C 5.400692 65.10118 0.378318 16.96153 2.801832 13.60848 C 4.054084 10.96866 6.780974 9.030801 11.63257 8.35901 C 15.60234 7.690901 51.71181 2.469502 54.37445 3.279918 C 57.03717 4.090399 59.13466 4.775719 59.32621 8.840264 C 59.12928 11.05074 65.83618 56.1379 66.86511 58.79665 C 67.35606 61.91088 66.55014 66.26285 62.44429 67.69644 C 58.33852 69.12998 17.98716 76.55054 14.74598 77.15899 z "
     id="path609"
     sodipodi:nodetypes="ccccccccc" />
  <path
     style="fill:#ffffff;fill-rule:evenodd;stroke:none;stroke-opacity:1;stroke-width:1pt;stroke-linejoin:miter;stroke-linecap:butt;fill-opacity:1;"
     d="M 17.97938 71.8195 C 15.26595 72.21323 11.49686 73.03634 11.04665 68.95877 C 9.171951 59.30615 4.873585 21.05057 7.936371 14.83364 C 8.620446 13.37173 12.33452 11.38741 20.77132 10.55902 C 30.35885 9.499143 50.03101 7.88737 52.10116 7.992064 C 54.17122 8.096792 54.80451 7.839173 55.25477 11.91683 C 55.07192 16.25204 61.31689 50.16499 61.68583 56.16935 C 61.97288 60.43178 62.4669 62.24279 59.93394 63.27325 "
     id="path608"
     sodipodi:nodetypes="cccccccs" />
  <path
     style="fill:url(#linearGradient615);fill-rule:evenodd;stroke:none;stroke-opacity:1;stroke-width:1pt;stroke-linejoin:miter;stroke-linecap:butt;fill-opacity:1;"
     d="M 8.615221 20.60629 C 8.615221 20.60629 8.859259 14.82135 15.88382 13.66935 C 22.90836 12.51737 50.72865 8.590882 51.39152 10.59548 C 52.05435 12.60006 52.87501 25.62734 53.07968 26.68122 C 53.28436 27.73505 29.73406 36.74714 23.26725 45.34781 C 16.80046 53.94847 12.27144 60.90799 12.27144 60.90799 C 12.27144 60.90799 8.568357 30.57514 8.615221 20.60629 z "
     id="path636" />
  <path
     style="fill:#3d4e67;fill-rule:evenodd;stroke:none;stroke-opacity:1;stroke-width:1pt;stroke-linejoin:miter;stroke-linecap:butt;fill-opacity:1;"
     d="M 36.81049 89.06221 C 34.01173 89.01717 29.31965 87.13865 28.90996 82.09762 C 27.46521 77.0044 22.44283 28.86475 24.86635 25.5117 C 26.1186 22.87188 28.84549 20.93402 33.69708 20.26223 C 37.66685 19.59412 73.77632 14.37273 76.43896 15.18314 C 79.10168 15.99362 81.19917 16.67894 81.39072 20.74349 C 81.19379 22.95396 87.90069 68.04112 88.92962 70.69987 C 89.42057 73.8141 88.61465 78.16607 84.5088 79.59966 C 80.40303 81.0332 40.05167 88.45376 36.81049 89.06221 z "
     id="path737"
     sodipodi:nodetypes="ccccccccc" />
  <path
     style="fill:#ffffff;fill-rule:evenodd;stroke:none;stroke-opacity:1;stroke-width:1pt;stroke-linejoin:miter;stroke-linecap:butt;fill-opacity:1;"
     d="M 40.04389 83.72272 C 37.33046 84.11645 33.56137 84.93956 33.11116 80.86199 C 31.23647 71.20937 26.9381 32.95379 30.00089 26.73686 C 30.68496 25.27495 34.39903 23.29063 42.83583 22.46224 C 52.42336 21.40237 72.09552 19.79059 74.16567 19.89529 C 76.23573 20.00002 76.86902 19.7424 77.31928 23.82005 C 77.13643 28.15526 83.3814 62.06821 83.75034 68.07257 C 84.03739 72.335 84.53141 74.14601 81.99845 75.17647 "
     id="path738"
     sodipodi:nodetypes="cccccccs" />
  <path
     style="fill:url(#linearGradient615);fill-rule:evenodd;stroke:none;stroke-opacity:1;stroke-width:1pt;stroke-linejoin:miter;stroke-linecap:butt;fill-opacity:1;"
     d="M 30.67974 32.50951 C 30.67974 32.50951 30.92377 26.72457 37.94833 25.57257 C 44.97287 24.42059 72.79316 20.49411 73.45603 22.4987 C 74.11886 24.50328 74.93952 37.53056 75.14419 38.58444 C 75.34887 39.63827 51.79857 48.65036 45.33176 57.25103 C 38.86497 65.85169 34.33595 72.81121 34.33595 72.81121 C 34.33595 72.81121 30.63287 42.47836 30.67974 32.50951 z "
     id="path739" />
</svg>
