<?xml version="1.0" encoding="UTF-8" standalone="no"?>
<!DOCTYPE svg PUBLIC "-//W3C//DTD SVG 20010904//EN"
"http://www.w3.org/TR/2001/REC-SVG-20010904/DTD/svg10.dtd">
<!-- Created with Inkscape (http://www.inkscape.org/) -->
<svg
   id="svg795"
   sodipodi:version="0.32"
   width="48pt"
   height="48pt"
   sodipodi:docbase="/home/mula/Desktop/Mis Iconos/48x48"
   sodipodi:docname="trash.svg"
   xmlns="http://www.w3.org/2000/svg"
   xmlns:sodipodi="http://sodipodi.sourceforge.net/DTD/sodipodi-0.dtd"
   xmlns:xlink="http://www.w3.org/1999/xlink"
   xmlns:inkscape="http://www.inkscape.org/namespaces/inkscape"
   inkscape:version="0.37">
  <defs
     id="defs797">
    <linearGradient
       id="linearGradient853">
      <stop
         style="stop-color:#b5b5b5;stop-opacity:1;"
         offset="0.000000"
         id="stop854" />
      <stop
         style="stop-color:#ffffff;stop-opacity:1;"
         offset="1.000000"
         id="stop855" />
    </linearGradient>
    <linearGradient
       id="linearGradient816">
      <stop
         style="stop-color:#0c1535;stop-opacity:0.698039;"
         offset="0.000000"
         id="stop817" />
      <stop
         style="stop-color:#ffffff;stop-opacity:0;"
         offset="1.000000"
         id="stop818" />
    </linearGradient>
    <linearGradient
       id="linearGradient808">
      <stop
         style="stop-color:#000;stop-opacity:1;"
         offset="0"
         id="stop809" />
      <stop
         style="stop-color:#fff;stop-opacity:1;"
         offset="1"
         id="stop810" />
    </linearGradient>
    <linearGradient
       xlink:href="#linearGradient808"
       id="linearGradient811"
       x1="26.0382957"
       y1="28.1627388"
       x2="26.1608067"
       y2="57.2600060"
       gradientUnits="userSpaceOnUse"
       spreadMethod="pad"
       gradientTransform="scale(1.563194,0.639716)" />
    <linearGradient
       xlink:href="#linearGradient816"
       id="linearGradient815"
       x1="35.0614166"
       y1="26.6189938"
       x2="67.4910965"
       y2="46.4692268"
       gradientUnits="userSpaceOnUse"
       spreadMethod="pad" />
    <linearGradient
       xlink:href="#linearGradient853"
       id="linearGradient852"
       x1="54.4152985"
       y1="65.3215179"
       x2="54.7179070"
       y2="62.7665443"
       gradientUnits="userSpaceOnUse"
       spreadMethod="pad"
       gradientTransform="scale(1.047658,0.954510)" />
    <linearGradient
       xlink:href="#linearGradient853"
       id="linearGradient856"
       x1="45.2853661"
       y1="87.7303848"
       x2="44.1507835"
       y2="85.9213257"
       gradientUnits="userSpaceOnUse"
       spreadMethod="pad"
       gradientTransform="scale(1.154071,0.866497)" />
    <linearGradient
       xlink:href="#linearGradient853"
       id="linearGradient857"
       x1="80.6359329"
       y1="66.7975998"
       x2="82.3356094"
       y2="59.0885315"
       gradientUnits="userSpaceOnUse"
       spreadMethod="pad"
       gradientTransform="scale(0.891910,1.121189)" />
  </defs>
  <sodipodi:namedview
     id="base"
     inkscape:zoom="4.29166667"
     inkscape:cx="36.0000000"
     inkscape:cy="36.0000000"
     inkscape:window-width="1014"
     inkscape:window-height="696"
     inkscape:window-x="0"
     inkscape:window-y="0" />
  <g
     id="g825"
     transform="matrix(0.655423,0.000000,0.000000,0.655423,5.058942,0.859774)">
    <path
       style="fill:#000000;fill-rule:evenodd;stroke:none;stroke-opacity:1;stroke-width:1pt;stroke-linejoin:miter;stroke-linecap:butt;fill-opacity:0.298246;"
       d="M 4.59365 19.0073 L 5.42885 31.1178 C 5.42885 31.1178 8.35208 32.3706 8.14328 32.5794 C 7.93448 32.7882 11.0665 70.1638 11.0665 70.1638 C 11.0665 70.1638 11.0665 72.6694 13.1545 74.131 C 15.2426 75.5927 33.8259 89.1648 35.7052 90 C 37.5844 90.8352 39.4636 91.044 42.178 89.7912 C 44.8925 88.5384 61.3878 81.8567 63.8934 80.8127 C 66.3991 79.7687 68.4871 78.7247 69.1135 74.131 C 69.7399 69.5374 73.2283 37.4832 73.2283 37.4832 C 73.6713 37.6309 73.2283 34.041 74.4812 34.2498 C 75.734 34.4586 77.6744 34.2498 78.3008 30.7002 C 78.9272 27.1506 79.5536 22.7657 79.5536 22.7657 C 79.5536 22.7657 78.362 19.8783 76.2739 18.2079 C 74.186 16.5375 44.8714 3.26062 44.0362 3.05182 C 43.201 2.84303 37.4263 3.66773 34.7118 4.71174 C 31.9974 5.75576 6.89047 12.952 4.59365 19.0073 z "
       id="path824"
       sodipodi:nodetypes="ccccccccccccccccc"
       transform="matrix(1.037424,0.000000,0.000000,0.954524,-4.453626,3.976088)" />
    <path
       style="fill:#1f1d1c;fill-rule:evenodd;stroke:none;stroke-opacity:1;stroke-width:1pt;stroke-linejoin:miter;stroke-linecap:butt;fill-opacity:1;"
       d="M 4.59365 19.0073 L 5.42885 31.1178 C 5.42885 31.1178 8.35208 32.3706 8.14328 32.5794 C 7.93448 32.7882 11.0665 70.1638 11.0665 70.1638 C 11.0665 70.1638 11.0665 72.6694 13.1545 74.131 C 15.2426 75.5927 33.8259 89.1648 35.7052 90 C 37.5844 90.8352 39.4636 91.044 42.178 89.7912 C 44.8925 88.5384 61.3878 81.8567 63.8934 80.8127 C 66.3991 79.7687 68.4871 78.7247 69.1135 74.131 C 69.7399 69.5374 73.2283 37.4832 73.2283 37.4832 C 73.6713 37.6309 73.2283 34.041 74.4812 34.2498 C 75.734 34.4586 77.6744 34.2498 78.3008 30.7002 C 78.9272 27.1506 79.5536 22.7657 79.5536 22.7657 C 79.5536 22.7657 78.362 19.8783 76.2739 18.2079 C 74.186 16.5375 44.8714 3.26062 44.0362 3.05182 C 43.201 2.84303 37.4263 3.66773 34.7118 4.71174 C 31.9974 5.75576 6.89047 12.952 4.59365 19.0073 z "
       id="path812"
       sodipodi:nodetypes="ccccccccccccccccc"
       transform="translate(-3.838782,-2.214680)" />
    <path
       style="fill:#ffec98;fill-rule:evenodd;stroke:none;stroke-opacity:1;stroke-width:1pt;stroke-linejoin:miter;stroke-linecap:butt;fill-opacity:1;"
       d="M 9.3961 20.0513 C 8.76969 22.3481 8.56088 26.1066 9.3961 27.9858 C 10.4401 28.821 21.9243 32.997 38.002 41.1403 C 45.1012 37.5906 70.5751 31.5354 72.0367 30.7002 C 73.4983 29.865 74.3336 28.4034 74.5424 27.1506 C 74.7512 25.8978 75.3776 22.3481 73.916 21.5129 C 69.3223 17.5457 43.0132 6.47915 41.134 6.89675 C 39.2548 7.31436 16.0777 14.6225 9.3961 20.0513 z "
       id="path803"
       sodipodi:nodetypes="cccccccc"
       transform="translate(-3.838782,-2.214680)" />
    <path
       style="fill:#000000;fill-rule:evenodd;stroke:none;stroke-opacity:1;stroke-width:1pt;stroke-linejoin:miter;stroke-linecap:butt;fill-opacity:1;"
       d="M 20.4626 19.6337 C 20.9846 18.5897 40.8208 11.1772 41.8648 11.5948 C 42.9088 12.0124 43.4308 11.908 44.8925 12.7432 C 46.3541 13.5784 61.5966 20.4689 61.3878 20.4689 C 61.179 20.4689 40.7164 28.4034 40.7164 28.4034 C 40.7164 28.4034 21.089 21.3041 20.4626 19.6337 z "
       id="path813"
       sodipodi:nodetypes="cccccc"
       transform="translate(-3.838782,-2.214680)" />
    <path
       style="fill:#e9a341;fill-rule:evenodd;stroke:none;stroke-opacity:1;stroke-width:1pt;stroke-linejoin:miter;stroke-linecap:butt;fill-opacity:1;"
       d="M 20.045 19.8425 L 25.4739 22.1393 C 25.4739 22.1393 30.6939 19.8425 32.7819 19.0073 C 34.87 18.1721 40.09 16.5017 40.09 16.5017 L 40.7164 11.6992 C 40.7164 11.6992 30.6939 14.6224 28.8147 15.6664 C 26.9355 16.7105 20.8802 18.5897 20.045 19.8425 z "
       id="path799"
       sodipodi:nodetypes="ccccccc"
       transform="translate(-3.986428,-2.362328)" />
    <path
       style="fill:#e7a240;fill-rule:evenodd;stroke:none;stroke-opacity:1;stroke-width:1pt;stroke-linejoin:miter;stroke-linecap:butt;fill-opacity:1;"
       d="M 42.3868 11.908 L 41.7604 17.3369 C 41.7604 17.3369 53.2445 22.7657 53.4533 22.7657 C 53.6621 22.7657 61.8054 20.6777 61.8054 20.6777 C 61.8054 20.6777 45.5189 12.5344 42.3868 11.908 z "
       id="path800"
       transform="translate(-3.838782,-2.214680)" />
    <path
       style="fill:url(#linearGradient811);fill-rule:evenodd;stroke:none;stroke-opacity:1;stroke-width:1pt;stroke-linejoin:miter;stroke-linecap:butt;fill-opacity:1;"
       d="M 27.3531 23.1833 C 27.3531 23.1833 35.914 18.3809 39.4636 18.5897 C 43.0132 18.7985 53.1401 23.7053 52.2005 23.8097 C 50.7389 24.8537 40.5076 28.6122 40.2988 28.4034 C 31.1115 24.645 27.7707 22.9745 27.3531 23.1833 z "
       id="path801"
       sodipodi:nodetypes="ccccc"
       transform="translate(-3.838782,-2.214680)" />
    <path
       style="fill:#578cc7;fill-rule:evenodd;stroke:none;stroke-opacity:1;stroke-width:1pt;stroke-linejoin:miter;stroke-linecap:butt;fill-opacity:1;"
       d="M 13.1545 31.7442 C 13.1545 31.7442 18.7921 32.8926 37.7932 42.9151 C 40.2988 43.7503 55.5414 34.8762 70.5751 32.997 C 66.399 51.1628 66.6079 68.911 65.9815 70.3726 C 65.3551 71.8342 65.3551 74.7574 61.8054 76.2191 C 56.3766 77.4719 40.7164 84.5712 36.7492 86.2416 C 34.6612 85.1976 25.0563 74.5486 16.4954 71.4166 C 15.4514 71.4166 13.5721 36.129 13.1545 31.7442 z "
       id="path802"
       sodipodi:nodetypes="cccccccc"
       transform="translate(-3.838782,-2.214680)" />
    <path
       style="fill:#4c5b86;fill-rule:evenodd;stroke:none;stroke-opacity:1;stroke-width:1pt;stroke-linejoin:miter;stroke-linecap:butt;fill-opacity:1;"
       d="M 9.15402 29.3177 C 9.15402 29.3177 24.3615 34.3377 33.9585 40.6864 C 35.8779 54.5651 34.992 76.1213 33.9585 84.3895 C 31.3008 83.3559 14.6169 68.739 11.9593 69.182 C 11.9593 68.739 9.30167 29.613 9.15402 29.3177 z "
       id="path819"
       sodipodi:nodetypes="ccccc" />
    <path
       style="fill:#1f1d1c;fill-rule:evenodd;stroke:none;stroke-opacity:1;stroke-width:1pt;stroke-linejoin:miter;stroke-linecap:butt;fill-opacity:1;"
       d="M 37.5844 45.3163 L 38.002 54.7124 C 38.002 54.7124 40.7164 50.5364 37.5844 45.3163 z "
       id="path804"
       transform="translate(-3.838782,-2.214680)" />
    <path
       style="fill:#e7a240;fill-rule:evenodd;stroke:none;stroke-opacity:1;stroke-width:1pt;stroke-linejoin:miter;stroke-linecap:butt;fill-opacity:1;"
       d="M 33.5155 32.5659 L 33.9585 38.9147 L 5.31524 25.6266 C 5.31524 25.6266 3.98643 17.3584 5.46288 18.2443 C 6.93934 19.1302 33.3679 32.4183 33.5155 32.5659 z "
       id="path820" />
    <path
       style="fill:#1f1d1c;fill-rule:evenodd;stroke:none;stroke-opacity:1;stroke-width:1pt;stroke-linejoin:miter;stroke-linecap:butt;fill-opacity:1;"
       d="M 39.046 62.8557 L 36.958 86.4504 L 39.046 85.4064 C 39.046 85.4064 39.8812 69.5374 39.046 62.8557 z "
       id="path805"
       transform="translate(-3.838782,-2.214680)" />
    <path
       style="fill:#1f1d1c;fill-rule:evenodd;stroke:none;stroke-opacity:1;stroke-width:1pt;stroke-linejoin:miter;stroke-linecap:butt;fill-opacity:0.996841;"
       d="M 9.3961 20.2601 C 9.3961 20.2601 25.6827 27.5682 28.6059 29.6562 C 31.5291 31.7442 36.5404 35.085 37.5844 34.8762 C 38.6284 34.6674 11.6929 25.0625 9.3961 20.2601 z "
       id="path806"
       transform="translate(-3.838782,-2.214680)" />
    <path
       style="fill:#1f1d1c;fill-rule:evenodd;stroke:none;stroke-opacity:1;stroke-width:1pt;stroke-linejoin:miter;stroke-linecap:butt;fill-opacity:1;"
       d="M 41.3428 34.4586 C 41.3428 34.4586 54.2885 29.2386 57.6294 27.777 C 60.9702 26.3154 72.8719 21.7217 74.3336 21.5129 C 75.7952 21.3041 44.2661 35.2938 41.3428 34.4586 z "
       id="path807"
       transform="translate(-3.838782,-2.214680)" />
    <path
       style="font-size:12;fill:url(#linearGradient815);fill-rule:evenodd;stroke-width:1pt;"
       d="M 34.2538 45.1158 C 18.9478 35.9125 16.4871 37.3397 9.59695 38.4717 C 9.49852 36.0601 9.1048 31.4339 9.30167 28.8747 C 16.1918 31.1386 25.4442 35.0267 34.1061 40.5388 C 45.4256 37.1921 55.8592 32.6643 67.0311 30.4988 C 66.3913 32.9596 65.7514 35.4204 65.1116 37.8811 C 55.8592 37.6351 44.9827 41.0801 34.2538 45.1158 z "
       id="path823"
       sodipodi:nodetypes="ccccccc" />
  </g>
</svg>
