<?xml version="1.0" encoding="UTF-8" standalone="no"?>
<!DOCTYPE svg PUBLIC "-//W3C//DTD SVG 20010904//EN"
"http://www.w3.org/TR/2001/REC-SVG-20010904/DTD/svg10.dtd">
<!-- Created with Inkscape (http://www.inkscape.org/) -->
<svg
   id="svg548"
   sodipodi:version="0.32"
   width="48pt"
   height="48pt"
   sodipodi:docbase="/home/mula/Desktop/Mis Iconos/48x48"
   sodipodi:docname="printer.svg"
   xmlns="http://www.w3.org/2000/svg"
   xmlns:sodipodi="http://sodipodi.sourceforge.net/DTD/sodipodi-0.dtd"
   xmlns:xlink="http://www.w3.org/1999/xlink"
   xmlns:inkscape="http://www.inkscape.org/namespaces/inkscape"
   inkscape:version="0.37">
  <defs
     id="defs550">
    <linearGradient
       id="linearGradient585">
      <stop
         style="stop-color:#5cb2ff;stop-opacity:1;"
         offset="0.000000"
         id="stop586" />
      <stop
         style="stop-color:#ffffff;stop-opacity:1;"
         offset="1.000000"
         id="stop587" />
    </linearGradient>
    <linearGradient
       id="linearGradient576">
      <stop
         style="stop-color:#ffffff;stop-opacity:1;"
         offset="0.000000"
         id="stop577" />
      <stop
         style="stop-color:#370000;stop-opacity:0;"
         offset="1.000000"
         id="stop578" />
    </linearGradient>
    <linearGradient
       id="linearGradient569">
      <stop
         style="stop-color:#ff3a00;stop-opacity:1;"
         offset="0.000000"
         id="stop570" />
      <stop
         style="stop-color:#370000;stop-opacity:1;"
         offset="1.000000"
         id="stop571" />
    </linearGradient>
    <linearGradient
       id="linearGradient562">
      <stop
         style="stop-color:#000;stop-opacity:1;"
         offset="0"
         id="stop563" />
      <stop
         style="stop-color:#fff;stop-opacity:1;"
         offset="1"
         id="stop564" />
    </linearGradient>
    <linearGradient
       xlink:href="#linearGradient562"
       id="linearGradient565"
       x1="30.5917225"
       y1="65.8304825"
       x2="18.4360981"
       y2="42.3886795"
       gradientUnits="userSpaceOnUse"
       spreadMethod="pad"
       gradientTransform="scale(1.323326,0.755672)" />
    <linearGradient
       xlink:href="#linearGradient562"
       id="linearGradient567"
       x1="24.9874783"
       y1="44.9967537"
       x2="33.7596359"
       y2="60.7528610"
       gradientUnits="userSpaceOnUse"
       spreadMethod="pad"
       gradientTransform="scale(1.587744,0.629824)" />
    <linearGradient
       xlink:href="#linearGradient576"
       id="linearGradient568"
       x1="0.82734060"
       y1="0.11727467"
       x2="0.57553899"
       y2="0.88281417"
       gradientUnits="objectBoundingBox"
       spreadMethod="pad" />
    <radialGradient
       xlink:href="#linearGradient569"
       id="radialGradient573"
       cx="39.9771919"
       cy="62.0348434"
       fx="39.9771919"
       fy="62.0348434"
       r="2.87974644"
       gradientUnits="userSpaceOnUse"
       spreadMethod="pad"
       gradientTransform="scale(1.181249,0.846561)" />
    <radialGradient
       xlink:href="#linearGradient576"
       id="radialGradient575" />
    <linearGradient
       xlink:href="#linearGradient562"
       id="linearGradient580"
       x1="0.48992321"
       y1="-0.04502178"
       x2="0.53917038"
       y2="1.25967419"
       gradientUnits="objectBoundingBox"
       spreadMethod="pad" />
    <linearGradient
       xlink:href="#linearGradient585"
       id="linearGradient584"
       x1="38.9676552"
       y1="112.427650"
       x2="34.3394775"
       y2="55.2668114"
       gradientUnits="userSpaceOnUse"
       spreadMethod="pad"
       gradientTransform="scale(1.107407,0.903010)" />
    <linearGradient
       xlink:href="#linearGradient585"
       id="linearGradient588"
       x1="18.5747337"
       y1="70.6098175"
       x2="21.0069866"
       y2="44.9572525"
       gradientUnits="userSpaceOnUse"
       spreadMethod="pad"
       gradientTransform="scale(0.777781,1.285709)" />
  </defs>
  <sodipodi:namedview
     id="base"
     showborder="true"
     showgrid="false"
     snaptogrid="false"
     vertgrid="false"
     horizgrid="false"
     inkscape:zoom="4.29166667"
     inkscape:cx="36.0000000"
     inkscape:cy="36.0000000"
     inkscape:window-width="1014"
     inkscape:window-height="696"
     inkscape:window-x="0"
     inkscape:window-y="0">
    <sodipodi:guide
       orientation="vertical"
       position="0.00000000"
       id="guide552" />
    <sodipodi:guide
       orientation="horizontal"
       position="72.0658264"
       id="guide553" />
    <sodipodi:guide
       orientation="vertical"
       position="72.0658264"
       id="guide554" />
    <sodipodi:guide
       orientation="horizontal"
       position="0.23474211"
       id="guide555" />
  </sodipodi:namedview>
  <path
     style="fill:#000000;fill-rule:evenodd;stroke:none;stroke-opacity:1;stroke-width:1pt;stroke-linejoin:miter;stroke-linecap:butt;fill-opacity:0.3;"
     d="M 5.5255791 23.239874 C 4.5154563 29.105808 3.4135 33.722223 2.7706911 39.379985 C 4.790938 45.00304 10.392523 49.376509 16.177798 50.209544 C 19.299955 49.688874 21.963067 49.584828 25.085291 47.814571 C 29.829803 50.001299 34.482497 52.604518 39.22701 54.791259 C 45.593878 50.591395 54.256393 44.621196 60.623261 40.421325 C 57.011271 38.546956 50.919923 37.089204 47.307932 35.214821 C 49.848623 25.148877 48.256871 17.686298 39.410653 11.889783 C 38.216917 10.848443 35.0947 10.119454 32.339823 11.264993 C 32.339823 11.264993 31.054209 6.4749676 29.309425 3.3510782 C 26.830009 2.9345273 7.7294836 8.8699404 7.0866773 10.327766 C 7.5152102 13.590481 8.4947059 17.269747 9.1069024 20.220104 C 7.3621578 21.608443 6.9948439 22.163827 5.5255791 23.239874 z "
     id="path592"
     sodipodi:nodetypes="ccccccccccccc" />
  <path
     style="fill:#000000;fill-rule:evenodd;stroke:none;stroke-opacity:1;stroke-width:1pt;stroke-linejoin:miter;stroke-linecap:butt;fill-opacity:1;"
     d="M 4.130193 19.758822 C 3.1200702 25.62475 2.0181139 30.241171 1.375305 35.898933 C 3.3955519 41.521988 8.9971335 45.895457 14.782409 46.728493 C 17.904566 46.207822 20.567685 46.103769 23.689908 44.333513 C 28.43442 46.520254 33.087108 49.123466 37.831627 51.310207 C 44.198495 47.110337 52.86101 41.140144 59.227879 36.94028 C 55.615881 35.065904 49.524541 33.608152 45.912543 31.733776 C 48.453233 21.667832 46.861488 14.205246 38.015263 8.4087317 C 36.821534 7.367391 33.699311 6.6384087 30.94444 7.7839419 C 30.94444 7.7839419 29.65882 2.993916 27.914035 -0.12997136 C 25.434626 -0.54652291 6.3340995 5.3888961 5.6912913 6.846714 C 6.1198261 10.109436 7.0993165 13.788696 7.7115196 16.739053 C 5.9667724 18.127392 5.5994578 18.682769 4.130193 19.758822 z "
     id="path561"
     sodipodi:nodetypes="ccccccccccccc" />
  <path
     style="fill:#c7eeff;fill-rule:evenodd;stroke:none;stroke-opacity:1;stroke-width:1pt;stroke-linejoin:miter;stroke-linecap:butt;fill-opacity:1;"
     d="M 24.700001 41.313749 L 37.464281 46.936732 L 53.25896 37.669196 C 53.25896 37.669196 40.770141 32.983362 40.678323 33.087475 C 40.586504 33.191595 24.791819 41.417862 24.700001 41.313749 z "
     id="path556" />
  <path
     style="fill:url(#linearGradient588);fill-rule:evenodd;stroke:none;stroke-opacity:1;stroke-width:1pt;stroke-linejoin:miter;stroke-linecap:butt;fill-opacity:1;"
     d="M 6.8850743 21.216648 C 5.3545832 25.971888 4.466901 30.727208 3.9465327 35.482455 C 6.6708135 40.61954 11.50722 42.320317 14.966112 43.500491 C 16.098693 40.480721 16.404765 31.317298 14.139602 27.152061 C 11.90511 23.819933 9.3950897 21.633199 6.8850743 21.216648 z "
     id="path557"
     sodipodi:nodetypes="ccccc" />
  <path
     style="font-size:12;fill:url(#linearGradient584);fill-rule:evenodd;stroke:#000000;stroke-width:0.666512;"
     d="M 7.7115793 19.967134 C 19.710624 26.631391 15.639469 40.376528 16.159848 43.604537 C 26.781454 40.654187 34.464487 35.30885 43.525018 30.38007 C 44.780028 24.757088 45.759511 15.801898 36.270486 9.7623645 C 26.659025 11.081364 16.037419 14.587025 7.7115793 19.967134 z "
     id="path559"
     sodipodi:nodetypes="ccccc" />
  <path
     style="fill:url(#linearGradient565);fill-rule:evenodd;stroke:none;stroke-opacity:1;stroke-width:1pt;stroke-linejoin:miter;stroke-linecap:butt;fill-opacity:1;"
     d="M 14.139602 16.739053 C 18.333126 17.988639 18.853511 24.548842 20.659503 24.861207 C 26.169258 26.388439 35.811381 21.459593 36.086843 19.134033 C 36.546007 16.704346 33.515608 11.463135 31.128077 10.907758 C 25.281593 12.434996 19.710624 14.066354 14.139602 16.739053 z "
     id="path558"
     sodipodi:nodetypes="ccccc" />
  <path
     style="fill:#ffffff;fill-rule:evenodd;stroke:none;stroke-opacity:1;stroke-width:1pt;stroke-linejoin:miter;stroke-linecap:butt;fill-opacity:1;"
     d="M 10.741918 17.884519 L 8.7216723 8.3045459 L 26.536603 2.993916 L 28.465024 10.5954 L 25.89379 11.532555 L 24.332648 7.1590724 L 13.129509 10.5954 L 14.323245 16.322575 "
     id="path560"
     sodipodi:nodetypes="cccccccc" />
  <path
     style="fill:url(#linearGradient567);fill-rule:evenodd;stroke:none;stroke-opacity:1;stroke-width:1pt;stroke-linejoin:miter;stroke-linecap:butt;fill-opacity:1;"
     d="M 14.139602 16.739053 C 15.476041 17.068233 15.634896 17.596286 17.585542 19.654696 C 25.666525 21.390253 28.888014 14.611222 34.214119 13.639294 C 32.627884 11.57783 32.689158 11.671374 31.128077 10.907758 C 25.281593 12.434996 19.710624 14.066354 14.139602 16.739053 z "
     id="path566"
     sodipodi:nodetypes="ccccc" />
  <path
     style="font-size:12;fill:url(#linearGradient580);fill-rule:evenodd;stroke-width:1pt;"
     d="M 34.775604 25.400904 C 35.110049 26.772268 34.097115 28.343248 32.514537 28.907514 C 30.93196 29.471793 29.376136 28.816712 29.041684 27.445347 C 28.707239 26.073983 29.720193 24.503076 31.302771 23.93881 C 32.885348 23.374538 34.441152 24.02954 34.775604 25.400904 z "
     id="path581" />
  <path
     style="font-size:12;fill:url(#radialGradient573);fill-rule:evenodd;stroke-width:1pt;"
     d="M 34.321479 25.175152 C 34.629728 26.36051 33.696138 27.718399 32.237523 28.206135 C 30.778907 28.693871 29.344954 28.12764 29.036705 26.942289 C 28.72845 25.756938 29.662059 24.399109 31.120675 23.911373 C 32.57929 23.423643 34.013229 23.989801 34.321479 25.175152 z "
     id="path583" />
  <path
     style="font-size:12;fill:url(#linearGradient568);fill-rule:evenodd;stroke-width:1pt;"
     d="M 33.240167 25.433931 C 33.240167 26.152404 32.68473 26.735537 32.000426 26.735537 C 31.316121 26.735537 30.760751 26.152404 30.760751 25.433931 C 30.760751 24.715384 31.316121 24.132252 32.000426 24.132252 C 32.68473 24.132252 33.240167 24.715384 33.240167 25.433931 z "
     id="path582" />
  <path
     style="font-size:12;fill:none;fill-rule:evenodd;stroke:#000000;stroke-width:0.666512;"
     d="M 48.095779 37.739884 C 47.984178 37.682958 47.282659 37.041983 46.926958 37.44541 C 46.389047 37.918455 46.407515 38.056219 46.407515 38.917993 C 46.214173 39.575723 45.860782 39.366694 45.368565 39.06527 C 44.96079 38.995923 44.825589 38.730054 44.719252 39.21254 C 44.546058 39.408856 44.632625 39.899719 44.459498 40.096101 C 43.785835 40.096101 42.932093 39.88694 42.51148 40.096101 C 42.51148 40.893654 42.419535 40.886125 41.73229 40.97967 C 40.965109 40.97967 40.683706 40.87314 40.303774 41.421421 C 40.014604 41.899644 39.884607 42.31095 39.524584 42.452252 C 38.886344 42.429907 38.145891 42.20314 37.706443 42.452252 C 37.558602 43.164778 37.542265 43.406302 36.797376 43.483098 C 36.274489 43.483098 36.277934 43.479194 36.277934 44.072185 C 36.084585 44.166088 36.081585 44.272763 35.888303 44.366659 "
     id="path589" />
  <path
     style="font-size:12;fill:none;fill-rule:evenodd;stroke:#000000;stroke-width:0.666512;"
     d="M 43.030968 35.678227 C 42.894015 35.552034 42.30028 35.23641 41.73227 35.23641 C 41.391525 35.593134 41.442031 35.920747 41.212828 36.267248 C 40.57346 36.267248 40.015713 36.074052 39.654441 36.267248 C 39.231199 36.747184 39.093063 37.001701 39.005122 37.739904 C 38.773097 37.955173 38.826611 38.034378 38.355743 38.034378 C 37.695217 37.978952 37.384014 37.658568 37.186981 38.328925 C 36.707722 38.75868 36.562072 38.770749 35.758406 38.770749 C 35.368655 38.770749 34.91437 38.697008 34.719521 38.918013 C 34.565672 39.659422 34.494068 39.814214 33.810454 40.096055 C 33.282189 40.505157 33.050848 40.371582 33.031258 41.1269 C 32.683881 41.27105 32.131325 41.274177 31.602689 41.274177 "
     id="path590" />
</svg>
