/* XPM */
static char * mozilla_16x16_xpm[] = {
"16 16 77 1",
" 	c None",
".	c #656565",
"+	c #000000",
"@	c #303030",
"#	c #484848",
"$	c #282828",
"%	c #3C0E09",
"&	c #8E2215",
"*	c #912315",
"=	c #832013",
"-	c #5C160E",
";	c #190604",
">	c #4D4A49",
",	c #2E2E2E",
"'	c #D0321E",
")	c #711B10",
"!	c #831F13",
"~	c #51140C",
"{	c #6A1A10",
"]	c #201D1C",
"^	c #3F211E",
"/	c #645E5E",
"(	c #666666",
"_	c #0C0C0C",
":	c #E23621",
"<	c #DB3420",
"[	c #6E1A10",
"}	c #200804",
"|	c #8E2214",
"1	c #982416",
"2	c #B02A1A",
"3	c #52201A",
"4	c #101010",
"5	c #050101",
"6	c #040404",
"7	c #46110A",
"8	c #B12A1A",
"9	c #C22E1C",
"0	c #7F1E12",
"a	c #912215",
"b	c #070201",
"c	c #302D2C",
"d	c #8A2114",
"e	c #711B11",
"f	c #BF2E1C",
"g	c #A22718",
"h	c #2A0A06",
"i	c #040100",
"j	c #4F1912",
"k	c #CD311E",
"l	c #1C0704",
"m	c #353535",
"n	c #4A120B",
"o	c #58150D",
"p	c #781D12",
"q	c #7C1E12",
"r	c #46231F",
"s	c #482F2C",
"t	c #72241B",
"u	c #893328",
"v	c #150503",
"w	c #606060",
"x	c #242424",
"y	c #6A1910",
"z	c #2B100D",
"A	c #444444",
"B	c #C62F1D",
"C	c #494443",
"D	c #120402",
"E	c #C9301E",
"F	c #D4331F",
"G	c #862014",
"H	c #6B332C",
"I	c #62261F",
"J	c #942416",
"K	c #BB2D1C",
"L	c #380E08",
"                ",
"                ",
"    .+++@#$     ",
"   #%&*=-%;>    ",
"  ,+'*)!~{]^/   ",
" (_+:<[}!|12)34 ",
" 567:8::90a:::-b",
" c_d:ef:ghijk:2l",
" m6n:ogf:pqrstuv",
" wx+:ff*qp)[yzx.",
"  A+B::2l5C#+@  ",
"  @DE:FGH       ",
"    IJKL+       ",
"     blb        ",
"                ",
"                "};
