<?xml version="1.0" encoding="UTF-8" standalone="no"?>
<!DOCTYPE svg PUBLIC "-//W3C//DTD SVG 20010904//EN"
"http://www.w3.org/TR/2001/REC-SVG-20010904/DTD/svg10.dtd"
[
 <!ATTLIST svg
  xmlns:xlink CDATA #FIXED "http://www.w3.org/1999/xlink">
]>
<!-- Created with Sodipodi ("http://www.sodipodi.com/") -->
<svg
   id="svg601"
   sodipodi:version="0.32"
   xmlns="http://www.w3.org/2000/svg"
   xmlns:sodipodi="http://sodipodi.sourceforge.net/DTD/sodipodi-0.dtd"
   xmlns:xlink="http://www.w3.org/1999/xlink"
   width="72pt"
   height="72pt"
   sodipodi:docbase="/home/zeus/desktop/icons/gartoon/svg"
   sodipodi:docname="/home/zeus/desktop/icons/gartoon/svg/star.svg">
  <defs
     id="defs603" />
  <sodipodi:namedview
     id="base" />
  <path
     transform="matrix(1.125583,2.517701e-2,-2.498810e-2,1.143513,26.85243,23.22553)"
     style="font-size:12;fill:#000000;fill-rule:evenodd;stroke-width:1pt;fill-opacity:0.3;"
     d="M 41.4745 51.4581 L 18.0189 40.0767 L -4.65423 52.9465 L -1.07805 27.1219 L -20.3244 9.53549 L 5.34141 4.95638 L 16.1196 -18.7825 L 28.4058 4.21214 L 54.3134 7.12709 L 36.2409 25.9177 L 41.4745 51.4581 z "
     id="path643" />
  <path
     transform="matrix(1.091929,2.414167e-2,-2.424099e-2,1.096489,25.95186,19.42645)"
     style="font-size:12;fill:#532c25;fill-rule:evenodd;stroke-width:1pt;fill-opacity:1;"
     d="M 41.4745 51.4581 L 18.0189 40.0767 L -4.65423 52.9465 L -1.07805 27.1219 L -20.3244 9.53549 L 5.34141 4.95638 L 16.1196 -18.7825 L 28.4058 4.21214 L 54.3134 7.12709 L 36.2409 25.9177 L 41.4745 51.4581 z "
     id="path635" />
  <polygon
     sodipodi:type="star"
     style="font-size:12;fill:#f1e36c;fill-rule:evenodd;stroke-width:1pt;fill-opacity:1;"
     id="polygon609"
     sodipodi:sides="5"
     sodipodi:cx="17.3857651"
     sodipodi:cy="20.4569397"
     sodipodi:r1="39.2598457"
     sodipodi:r2="19.6299229"
     sodipodi:arg1="0.91022110"
     sodipodi:arg2="1.53853965"
     points="41.4745,51.4581 18.0189,40.0767 -4.65423,52.9465 -1.07805,27.1219 -20.3244,9.53549 5.34141,4.95638 16.1196,-18.7825 28.4058,4.21214 54.3134,7.12709 36.2409,25.9177 41.4745,51.4581 "
     transform="matrix(0.890008,1.967676e-2,-1.975834e-2,0.893698,29.55550,23.23031)" />
  <path
     style="fill:#e07d25;fill-rule:evenodd;stroke:none;stroke-opacity:1;stroke-width:1pt;stroke-linejoin:miter;stroke-linecap:butt;fill-opacity:1;"
     d="M 65.5632 70.5195 C 65.3537 69.2627 44.6165 41.6131 44.6165 41.6131 L 44.8259 59.6273 L 65.5632 70.5195 z "
     id="path629"
     sodipodi:nodetypes="cccc" />
  <path
     style="fill:#e07d25;fill-rule:evenodd;stroke:none;stroke-opacity:1;stroke-width:1pt;stroke-linejoin:miter;stroke-linecap:butt;fill-opacity:1;"
     d="M 24.0887 70.9385 L 44.8259 42.032 L 44.826 59.4179 L 24.0887 70.9385 z "
     id="path630"
     sodipodi:nodetypes="cccc" />
  <path
     style="fill:#e07d25;fill-rule:evenodd;stroke:none;stroke-opacity:1;stroke-width:1pt;stroke-linejoin:miter;stroke-linecap:butt;fill-opacity:1;"
     d="M 45.6638 42.2415 L 10.8923 31.3492 L 28.2781 47.6877 L 45.6638 42.2415 z "
     id="path631"
     sodipodi:nodetypes="cccc" />
  <path
     style="fill:#e07d25;fill-rule:evenodd;stroke:none;stroke-opacity:1;stroke-width:1pt;stroke-linejoin:miter;stroke-linecap:butt;fill-opacity:1;"
     d="M 44.6165 41.8226 L 77.7122 30.7208 L 61.7928 47.0593 L 44.6165 41.8226 z "
     id="path632"
     sodipodi:nodetypes="cccc" />
  <path
     style="fill:#e07d25;fill-rule:evenodd;stroke:none;stroke-opacity:1;stroke-width:1pt;stroke-linejoin:miter;stroke-linecap:butt;fill-opacity:1;"
     d="M 44.1976 6.84157 C 44.1976 7.26051 44.1976 42.4509 44.6165 42.2415 L 54.6709 27.7883 L 44.1976 6.84157 z "
     id="path633"
     sodipodi:nodetypes="cccc" />
  <path
     style="fill:#fff7dc;fill-rule:evenodd;stroke:none;stroke-opacity:1;stroke-width:1pt;stroke-linejoin:miter;stroke-linecap:butt;fill-opacity:1;"
     d="M 44.1975 7.26051 L 44.407 41.8226 L 39.7987 36.167 L 44.1975 7.26051 z "
     id="path636" />
  <path
     style="fill:#fff7dc;fill-rule:evenodd;stroke:none;stroke-opacity:1;stroke-width:1pt;stroke-linejoin:miter;stroke-linecap:butt;fill-opacity:1;"
     d="M 43.9881 41.1942 L 10.8923 31.7682 L 39.5893 36.7954 L 43.9881 41.1942 z "
     id="path637" />
  <path
     style="fill:#fff7dc;fill-rule:evenodd;stroke:none;stroke-opacity:1;stroke-width:1pt;stroke-linejoin:miter;stroke-linecap:butt;fill-opacity:1;"
     d="M 44.407 42.8699 L 24.7171 70.5196 L 38.542 44.5457 L 44.407 42.8699 z "
     id="path638"
     sodipodi:nodetypes="cccc" />
  <path
     style="fill:#fff7dc;fill-rule:evenodd;stroke:none;stroke-opacity:1;stroke-width:1pt;stroke-linejoin:miter;stroke-linecap:butt;fill-opacity:1;"
     d="M 77.0839 30.5114 L 48.8058 35.9575 C 48.8058 35.9575 51.11 31.9776 51.3194 31.9776 C 51.5289 31.9776 77.2933 30.7208 77.0839 30.5114 z "
     id="path639" />
  <path
     style="fill:#fff7dc;fill-rule:evenodd;stroke:none;stroke-opacity:1;stroke-width:1pt;stroke-linejoin:miter;stroke-linecap:butt;fill-opacity:1;"
     d="M 45.4543 42.451 L 65.1443 69.4722 L 62.4212 53.9717 L 62.0022 61.0935 L 45.4543 42.451 z "
     id="path640" />
  <path
     style="fill:#a15a1a;fill-rule:evenodd;stroke:none;stroke-opacity:1;stroke-width:1pt;stroke-linejoin:miter;stroke-linecap:butt;fill-opacity:1;"
     d="M 25.136 70.1006 C 25.136 70.729 36.0283 59.4178 42.9407 52.7149 L 44.6165 42.6604 L 25.136 70.1006 z "
     id="path641"
     sodipodi:nodetypes="cccc" />
</svg>
