<?xml version="1.0" encoding="UTF-8" standalone="no"?>
<!DOCTYPE svg PUBLIC "-//W3C//DTD SVG 20010904//EN"
"http://www.w3.org/TR/2001/REC-SVG-20010904/DTD/svg10.dtd">
<!-- Created with Sodipodi ("http://www.sodipodi.com/") -->
<svg
   xmlns="http://www.w3.org/2000/svg"
   xmlns:sodipodi="http://sodipodi.sourceforge.net/DTD/sodipodi-0.dtd"
   xmlns:xlink="http://www.w3.org/1999/xlink"
   id="svg604"
   sodipodi:version="0.34"
   width="72pt"
   height="72pt"
   sodipodi:docbase="/home/zeus/.icons/gartoon/scalable/mimetypes/"
   sodipodi:docname="/home/zeus/.icons/gartoon/scalable/mimetypes/gnome-mime-application-rhythmbox-effect.svg">
  <defs
     id="defs606">
    <linearGradient
       id="linearGradient705">
      <stop
         style="stop-color:#7fa8e3;stop-opacity:0.741176;"
         offset="0.000000"
         id="stop706" />
      <stop
         style="stop-color:#ffffff;stop-opacity:0;"
         offset="1.000000"
         id="stop707" />
    </linearGradient>
    <linearGradient
       id="linearGradient612">
      <stop
         style="stop-color:#ffffff;stop-opacity:1;"
         offset="0.000000"
         id="stop613" />
      <stop
         style="stop-color:#ffffff;stop-opacity:0;"
         offset="1.000000"
         id="stop614" />
    </linearGradient>
    <linearGradient
       xlink:href="#linearGradient705"
       id="linearGradient615"
       x1="50.6438866"
       y1="5.36792946"
       x2="35.7520943"
       y2="68.0443573"
       gradientUnits="userSpaceOnUse"
       spreadMethod="pad" />
    <radialGradient
       xlink:href="#linearGradient612"
       id="radialGradient704"
       cx="8.17300129"
       cy="62.0631676"
       fx="8.17300129"
       fy="62.0631676"
       r="4.03522396"
       gradientUnits="userSpaceOnUse"
       spreadMethod="pad"
       gradientTransform="matrix(1.111950,0.000000,0.000000,0.899321,3.428790e-7,-1.512959e-6)" />
    <radialGradient
       xlink:href="#linearGradient612"
       id="radialGradient708"
       cx="0.05366803"
       cy="0.10153580"
       fx="0.05366803"
       fy="0.10153580"
       r="0.75628221"
       gradientUnits="objectBoundingBox"
       spreadMethod="pad" />
  </defs>
  <sodipodi:namedview
     id="base" />
  <path
     style="fill:#000000;fill-rule:evenodd;stroke:none;stroke-opacity:1;stroke-width:1pt;stroke-linejoin:miter;stroke-linecap:butt;fill-opacity:0.301471;"
     d="M 12.8163 74.753 C 10.3856 73.6481 7.07107 70.1126 8.83884 65.2512 C 9.72267 59.948 25.6326 13.1021 29.1682 10.8924 C 31.3778 8.90368 34.582 8.13026 39.1119 9.34561 C 42.8684 10.2295 76.6769 19.0684 78.6656 20.8361 C 80.6544 22.6039 82.2012 24.0402 80.6544 27.9072 C 79.5496 29.8959 66.4017 74.532 66.1808 77.4047 C 65.2969 80.4983 62.7558 84.2548 58.5573 84.0338 C 54.3589 83.8128 15.9099 75.4159 12.8163 74.753 z "
     id="path794"
     sodipodi:nodetypes="ccccccccc"
     transform="matrix(1.114903,0.000000,0.000000,1.114903,-5.305332,-3.889256)" />
  <path
     style="fill:#143c69;fill-rule:evenodd;stroke:none;stroke-opacity:1;stroke-width:1pt;stroke-linejoin:miter;stroke-linecap:butt;fill-opacity:1;"
     d="M 12.8163 74.753 C 10.3856 73.6481 7.07107 70.1126 8.83884 65.2512 C 9.72267 59.948 25.6326 13.1021 29.1682 10.8924 C 31.3778 8.90368 34.582 8.13026 39.1119 9.34561 C 42.8684 10.2295 76.6769 19.0684 78.6656 20.8361 C 80.6544 22.6039 82.2012 24.0402 80.6544 27.9072 C 79.5496 29.8959 66.4017 74.532 66.1808 77.4047 C 65.2969 80.4983 62.7558 84.2548 58.5573 84.0338 C 54.3589 83.8128 15.9099 75.4159 12.8163 74.753 z "
     id="path609"
     sodipodi:nodetypes="ccccccccc"
     transform="matrix(1.114903,0.000000,0.000000,1.114903,-8.162471,-8.460684)" />
  <path
     style="fill:#ffffff;fill-rule:evenodd;stroke:none;stroke-opacity:1;stroke-width:1pt;stroke-linejoin:miter;stroke-linecap:butt;fill-opacity:1;"
     d="M 17.8987 70.9965 C 15.3576 70.3336 11.7114 69.6706 13.0373 65.6932 C 15.468 55.9705 27.8424 18.6264 33.1456 13.986 C 34.361 12.8811 38.4489 12.4392 46.1829 14.8699 C 55.0218 17.5215 72.9204 23.4877 74.6882 24.3716 C 76.4559 25.2555 77.1189 25.2555 75.793 29.233 C 73.8043 33.2105 64.9655 67.24 62.7557 72.9852 C 61.209 77.0732 60.8775 78.9514 58.2258 78.9514 "
     id="path608"
     sodipodi:nodetypes="cccccccs"
     transform="matrix(1.114903,0.000000,0.000000,1.114903,-8.162471,-8.460684)" />
  <path
     style="fill:url(#linearGradient615);fill-rule:evenodd;stroke:none;stroke-opacity:1;stroke-width:1pt;stroke-linejoin:miter;stroke-linecap:butt;fill-opacity:1;"
     d="M 28.75 13.75 C 28.75 13.75 31.875 7.49995 39.6875 9.37495 C 47.5 11.25 78.125 19.375 77.8125 21.875 C 77.5 24.375 71.875 39.0625 71.5625 40.3125 C 71.25 41.5625 42.5 40.9375 31.5625 47.5 C 20.625 54.0625 12.5 59.6875 12.5 59.6875 C 12.5 59.6875 23.75 24.6875 28.75 13.75 z "
     id="path636"
     transform="matrix(0.946780,0.000000,0.000000,0.946780,-0.480566,0.409517)" />
  <path
     style="font-size:12;fill:#0d0000;fill-opacity:0.301471;fill-rule:evenodd;stroke-width:1pt;"
     d="M 7.73398 34.2049 L 12.0429 51.3301 C 5.08232 51.2196 4.19844 55.9705 4.64039 59.1746 C 6.73961 68.2343 17.4567 65.6933 24.5277 62.7102 C 23.6438 59.506 20.3293 44.3696 19.8874 41.7178 C 23.7543 40.7235 31.8198 38.4033 31.8198 38.4033 C 31.8198 38.4033 34.6924 45.5849 35.1343 47.0212 C 26.0745 46.6897 25.4117 52.3244 26.1851 54.8656 C 27.6214 61.9367 34.0295 61.8262 37.5651 60.8318 C 40.8796 60.2795 45.52 58.2907 48.0612 57.1859 C 47.0668 53.3189 38.3384 29.233 37.2336 26.1394 C 32.9246 27.6862 7.62349 34.4258 7.73398 34.2049 z "
     id="path635"
     sodipodi:nodetypes="cccccccccccc"
     transform="matrix(1.035546,0.000000,0.000000,1.035546,15.56160,-11.72637)" />
  <path
     style="font-size:12;fill:#0d3c07;fill-rule:evenodd;stroke-width:1pt;"
     d="M 7.73398 34.2049 L 12.0429 51.3301 C 5.08232 51.2196 4.19844 55.9705 4.64039 59.1746 C 6.73961 68.2343 17.4567 65.6933 24.5277 62.7102 C 23.6438 59.506 20.3293 44.3696 19.8874 41.7178 C 23.7543 40.7235 31.8198 38.4033 31.8198 38.4033 C 31.8198 38.4033 34.6924 45.5849 35.1343 47.0212 C 26.0745 46.6897 25.4117 52.3244 26.1851 54.8656 C 27.6214 61.9367 34.0295 61.8262 37.5651 60.8318 C 40.8796 60.2795 45.52 58.2907 48.0612 57.1859 C 47.0668 53.3189 38.3384 29.233 37.2336 26.1394 C 32.9246 27.6862 7.62349 34.4258 7.73398 34.2049 z "
     id="path616"
     sodipodi:nodetypes="cccccccccccc"
     transform="translate(14.83929,-11.42410)" />
  <path
     style="font-size:12;fill:#2aaf18;fill-rule:evenodd;stroke-width:1pt;"
     d="M 15.7994 54.2027 L 11.159 35.9726 L 35.7973 29.1225 L 44.7466 54.9761 C 44.7466 54.9761 33.3666 59.506 31.7093 57.5173 C 28.9471 57.4067 26.7375 51.2197 33.4771 50.0043 C 37.1231 49.8938 38.5594 49.6728 39.5538 50.0042 L 33.3666 34.0944 L 15.247 39.3977 L 20.3293 60.0584 C 20.3293 60.0584 13.7002 64.9198 7.95495 60.1689 C 6.73961 59.0641 6.62912 56.0809 8.61786 54.9761 C 10.2751 52.8769 15.6889 54.4237 15.7994 54.2027 z "
     id="path574"
     sodipodi:nodetypes="ccccccccccccc"
     transform="translate(14.83929,-11.42410)" />
  <path
     transform="matrix(1.488889,0.000000,0.000000,1.488889,8.836250,-40.12308)"
     style="font-size:12;fill-rule:evenodd;stroke-width:1pt;fill:url(#radialGradient704);"
     d="M 14.4736 57.5725 C 12.6184 56.7928 11.9994 58.2032 11.601 60.0584 C 10.0153 60.0584 8.87676 59.2416 8.87676 57.8693 C 8.87676 56.4971 9.94109 55.5318 11.5268 55.5318 C 13.1125 55.5318 14.4736 56.2003 14.4736 57.5725 z "
     id="path623"
     sodipodi:nodetypes="ccccc" />
  <path
     style="font-size:12;fill-rule:evenodd;stroke-width:1pt;fill:url(#radialGradient708);"
     d="M 37.3441 53.6503 C 33.3666 51.8834 34.4706 54.4237 33.6428 56.8544 C 31.5997 56.8544 29.9416 55.4189 29.9416 53.6503 C 29.9416 51.8816 31.5997 50.4462 33.6428 50.4462 C 35.6859 50.4462 37.3441 51.8816 37.3441 53.6503 z "
     id="path625"
     sodipodi:nodetypes="ccccc"
     transform="translate(14.83929,-11.42410)" />
  <path
     style="font-size:12;fill:#34674b;fill-rule:evenodd;stroke-width:1pt;"
     d="M 15.3575 39.5082 L 33.3666 34.2049 L 33.8085 32.5476 L 15.7994 37.7404 L 15.3575 39.5082 z "
     id="path630"
     sodipodi:nodetypes="ccccc"
     transform="translate(14.83929,-11.42410)" />
  <path
     style="font-size:12;fill:#cbff87;fill-rule:evenodd;stroke-width:1pt;"
     d="M 11.159 35.9726 L 13.3687 36.5251 L 36.1287 30.2274 L 35.6868 29.1225 L 11.159 35.9726 z "
     id="path631"
     transform="translate(14.83929,-11.42410)" />
  <path
     style="font-size:12;fill:#cbff87;fill-rule:evenodd;stroke-width:1pt;"
     d="M 33.6981 32.879 L 39.6643 49.8938 L 33.2561 34.2049 L 33.6981 32.879 z "
     id="path633"
     transform="translate(14.83929,-11.42410)" />
  <path
     style="font-size:12;fill:#cbff87;fill-rule:evenodd;stroke-width:1pt;"
     d="M 13.1478 36.1936 C 13.1478 36.1936 16.1309 54.3132 16.0204 54.3132 C 15.9099 54.3132 11.2695 36.0831 11.2695 36.0831 L 13.1478 36.1936 z "
     id="path634"
     transform="translate(14.83929,-11.42410)" />
  <path
     style="font-size:12;font-weight:bold;fill:#143c69;stroke-width:1;font-family:Kid Kosmic;"
     d="M 16.09473 66.6022 C 16.02192 66.98597 15.77363 67.28875 15.34987 67.51053 C 14.93378 67.73376 14.5185 67.80606 14.10402 67.72743 C 13.95051 67.69831 13.81288 67.64834 13.69112 67.57753 C 13.33647 67.35122 13.19628 67.04232 13.27054 66.65086 C 13.32151 66.38223 13.46696 66.13945 13.7069 65.92256 C 14.16415 65.52425 14.6691 65.37752 15.22174 65.48236 C 15.38294 65.51294 15.53136 65.56893 15.66699 65.65032 C 16.03078 65.87042 16.17336 66.18771 16.09473 66.6022 z M 18.38058 62.78957 C 18.50936 62.48797 18.83721 61.78679 19.36412 60.68602 C 19.93006 59.50519 20.2397 58.89996 20.29303 58.87032 C 20.32744 58.94046 20.34702 58.98393 20.35179 59.00074 L 20.50506 58.69584 L 20.56481 58.69524 C 21.01081 58.39817 21.52932 58.30569 22.12034 58.41782 C 22.32758 58.45713 22.50981 58.52351 22.66702 58.61695 C 24.05248 58.64919 25.38923 58.79146 26.67727 59.04378 C 28.03439 59.3092 28.77601 59.6964 28.9021 60.20539 C 29.23603 61.58875 29.31491 62.7448 29.13871 63.67355 C 28.92175 64.81721 28.32829 65.61909 27.35835 66.07917 C 25.95367 66.7351 23.93496 66.81333 21.30223 66.31386 C 20.71888 66.20319 20.10847 66.06751 19.471 65.90682 C 19.24095 66.65836 19.07523 67.4062 18.97381 68.15033 C 18.84834 68.47641 18.64478 68.73201 18.36316 68.91714 C 18.09066 69.09604 17.78939 69.15419 17.45934 69.09157 C 17.12928 69.02896 16.81281 68.79 16.5099 68.37471 C 17.04163 66.36835 17.66518 64.50662 18.38058 62.78957 z M 20.17345 63.96464 C 20.67606 64.12361 21.33801 64.281 22.1593 64.43681 C 24.2423 64.81609 25.69612 64.63466 26.52077 63.89255 C 26.69242 63.74223 26.80227 63.54041 26.85033 63.28712 C 26.91586 62.94171 26.86711 62.50705 26.7041 61.9831 C 26.26529 61.61359 25.72351 61.36768 25.07876 61.24536 C 24.38795 61.1143 23.28424 61.06395 21.76764 61.0943 C 21.12693 61.99854 20.59553 62.95532 20.17345 63.96464 z M 32.40394 61.04865 C 32.88529 60.60719 33.45911 60.45365 34.12544 60.58801 C 34.81479 60.72675 35.1523 61.0015 35.13798 61.41228 C 35.95166 65.12908 36.9115 67.59336 38.01753 68.80511 C 38.29654 68.04696 39.03743 65.96497 40.24019 62.55916 C 40.73834 62.11294 41.27525 61.94443 41.85092 62.05365 C 42.11957 62.10461 42.34109 62.19435 42.51552 62.32287 C 42.75464 62.48751 42.85236 62.68497 42.80867 62.91523 C 42.78829 63.02269 42.73958 63.13272 42.66255 63.24534 C 41.99233 64.26326 41.35557 65.56584 40.75228 67.15308 C 40.33283 68.27424 39.79459 69.85394 39.13753 71.89219 C 39.03654 72.21496 38.83755 72.46745 38.54058 72.64967 C 38.25273 72.82566 37.94378 72.88235 37.61373 72.81973 C 37.28367 72.75712 36.96793 72.51432 36.66649 72.09135 L 36.68673 72.04748 C 35.84591 71.15639 35.08111 70.05311 34.39236 68.73762 C 33.88953 67.78342 33.34866 66.54766 32.76976 65.03036 C 31.90377 66.70295 31.32144 68.47309 31.02278 70.34077 C 30.90497 70.66831 30.70527 70.92464 30.42364 71.10977 C 30.14346 71.28721 29.83835 71.34463 29.5083 71.28202 C 29.17825 71.2194 28.86561 70.98117 28.57038 70.56733 C 29.47817 67.0817 30.75602 63.90881 32.40394 61.04865 z M 45.32452 63.98891 C 45.81949 63.68522 46.81415 63.55585 48.30852 63.6008 C 49.55767 63.63899 50.63676 63.75623 51.54579 63.95255 C 52.28595 64.11682 52.78188 64.37392 53.03357 64.72384 C 52.93944 65.42959 52.82538 66.13556 52.69142 66.84171 C 52.2633 69.09833 51.63475 71.38452 50.80578 73.70028 C 50.58514 74.31843 50.17573 74.67413 49.57755 74.7674 C 49.3572 74.79716 49.17411 74.7982 49.02828 74.77054 C 48.72125 74.71229 48.54698 74.52019 48.50543 74.19423 C 49.03313 73.17314 49.43953 72.20457 49.72464 71.28853 L 43.17763 71.15576 C 43.00968 71.3704 42.69369 71.79949 42.22968 72.44303 C 41.96444 73.04477 41.51771 73.34567 40.88949 73.34577 C 40.73016 73.34735 40.61595 73.34159 40.54686 73.32849 C 40.17843 73.25859 40.02189 73.0778 40.07722 72.78613 C 40.09324 72.7017 40.12918 72.61707 40.18503 72.53224 C 42.25352 69.59285 43.96669 66.74507 45.32452 63.98891 z M 50.29563 66.5184 C 50.23146 66.22792 49.89619 66.02515 49.28982 65.91011 C 48.89069 65.83439 48.38562 65.81412 47.77461 65.84928 C 47.08247 65.89291 46.60856 66.0018 46.35287 66.17594 C 45.89744 67.06762 45.35869 67.97927 44.73665 68.9109 L 50.27208 68.78021 C 50.34133 68.03792 50.34918 67.28398 50.29563 66.5184 z "
     id="path637" />
</svg>
