<?xml version="1.0" encoding="UTF-8" standalone="no"?>
<!DOCTYPE svg PUBLIC "-//W3C//DTD SVG 20010904//EN"
"http://www.w3.org/TR/2001/REC-SVG-20010904/DTD/svg10.dtd">
<!-- Created with Sodipodi ("http://www.sodipodi.com/") -->
<svg
   id="svg604"
   sodipodi:version="0.32"
   width="72pt"
   height="72pt"
   sodipodi:docbase="/home/zeus/desktop/icons/gartoon/svg"
   sodipodi:docname="/home/zeus/desktop/icons/gartoon/svg/cd-audio-ogg.svg"
   xmlns="http://www.w3.org/2000/svg"
   xmlns:sodipodi="http://sodipodi.sourceforge.net/DTD/sodipodi-0.dtd"
   xmlns:xlink="http://www.w3.org/1999/xlink">
  <defs
     id="defs606">
    <linearGradient
       id="linearGradient705">
      <stop
         style="stop-color:#7fa8e3;stop-opacity:0.741176;"
         offset="0.000000"
         id="stop706" />
      <stop
         style="stop-color:#ffffff;stop-opacity:0;"
         offset="1.000000"
         id="stop707" />
    </linearGradient>
    <linearGradient
       id="linearGradient612">
      <stop
         style="stop-color:#ffffff;stop-opacity:1;"
         offset="0.000000"
         id="stop613" />
      <stop
         style="stop-color:#ffffff;stop-opacity:0;"
         offset="1.000000"
         id="stop614" />
    </linearGradient>
    <linearGradient
       xlink:href="#linearGradient705"
       id="linearGradient615"
       x1="50.6438866"
       y1="5.36792946"
       x2="35.7520943"
       y2="68.0443573"
       gradientUnits="userSpaceOnUse"
       spreadMethod="pad" />
    <radialGradient
       xlink:href="#linearGradient612"
       id="radialGradient704"
       cx="8.17300129"
       cy="62.0631676"
       fx="8.17300129"
       fy="62.0631676"
       r="4.03522396"
       gradientUnits="userSpaceOnUse"
       spreadMethod="pad"
       gradientTransform="matrix(1.111950,0.000000,0.000000,0.899321,3.428790e-7,-1.512959e-6)" />
    <radialGradient
       xlink:href="#linearGradient612"
       id="radialGradient708"
       cx="0.05366803"
       cy="0.10153580"
       fx="0.05366803"
       fy="0.10153580"
       r="0.75628221"
       gradientUnits="objectBoundingBox"
       spreadMethod="pad" />
  </defs>
  <sodipodi:namedview
     id="base" />
  <path
     style="fill:#000000;fill-rule:evenodd;stroke:none;stroke-opacity:1;stroke-width:1pt;stroke-linejoin:miter;stroke-linecap:butt;fill-opacity:0.301471;"
     d="M 12.8163 74.753 C 10.3856 73.6481 7.07107 70.1126 8.83884 65.2512 C 9.72267 59.948 25.6326 13.1021 29.1682 10.8924 C 31.3778 8.90368 34.582 8.13026 39.1119 9.34561 C 42.8684 10.2295 76.6769 19.0684 78.6656 20.8361 C 80.6544 22.6039 82.2012 24.0402 80.6544 27.9072 C 79.5496 29.8959 66.4017 74.532 66.1808 77.4047 C 65.2969 80.4983 62.7558 84.2548 58.5573 84.0338 C 54.3589 83.8128 15.9099 75.4159 12.8163 74.753 z "
     id="path794"
     sodipodi:nodetypes="ccccccccc"
     transform="matrix(1.114903,0.000000,0.000000,1.114903,-5.305332,-3.889256)" />
  <path
     style="fill:#143c69;fill-rule:evenodd;stroke:none;stroke-opacity:1;stroke-width:1pt;stroke-linejoin:miter;stroke-linecap:butt;fill-opacity:1;"
     d="M 12.8163 74.753 C 10.3856 73.6481 7.07107 70.1126 8.83884 65.2512 C 9.72267 59.948 25.6326 13.1021 29.1682 10.8924 C 31.3778 8.90368 34.582 8.13026 39.1119 9.34561 C 42.8684 10.2295 76.6769 19.0684 78.6656 20.8361 C 80.6544 22.6039 82.2012 24.0402 80.6544 27.9072 C 79.5496 29.8959 66.4017 74.532 66.1808 77.4047 C 65.2969 80.4983 62.7558 84.2548 58.5573 84.0338 C 54.3589 83.8128 15.9099 75.4159 12.8163 74.753 z "
     id="path609"
     sodipodi:nodetypes="ccccccccc"
     transform="matrix(1.114903,0.000000,0.000000,1.114903,-8.162471,-8.460684)" />
  <path
     style="fill:#ffffff;fill-rule:evenodd;stroke:none;stroke-opacity:1;stroke-width:1pt;stroke-linejoin:miter;stroke-linecap:butt;fill-opacity:1;"
     d="M 17.8987 70.9965 C 15.3576 70.3336 11.7114 69.6706 13.0373 65.6932 C 15.468 55.9705 27.8424 18.6264 33.1456 13.986 C 34.361 12.8811 38.4489 12.4392 46.1829 14.8699 C 55.0218 17.5215 72.9204 23.4877 74.6882 24.3716 C 76.4559 25.2555 77.1189 25.2555 75.793 29.233 C 73.8043 33.2105 64.9655 67.24 62.7557 72.9852 C 61.209 77.0732 60.8775 78.9514 58.2258 78.9514 "
     id="path608"
     sodipodi:nodetypes="cccccccs"
     transform="matrix(1.114903,0.000000,0.000000,1.114903,-8.162471,-8.460684)" />
  <path
     style="fill:url(#linearGradient615);fill-rule:evenodd;stroke:none;stroke-opacity:1;stroke-width:1pt;stroke-linejoin:miter;stroke-linecap:butt;fill-opacity:1;"
     d="M 28.75 13.75 C 28.75 13.75 31.875 7.49995 39.6875 9.37495 C 47.5 11.25 78.125 19.375 77.8125 21.875 C 77.5 24.375 71.875 39.0625 71.5625 40.3125 C 71.25 41.5625 42.5 40.9375 31.5625 47.5 C 20.625 54.0625 12.5 59.6875 12.5 59.6875 C 12.5 59.6875 23.75 24.6875 28.75 13.75 z "
     id="path636"
     transform="matrix(0.946780,0.000000,0.000000,0.946780,-0.480566,0.409517)" />
  <path
     style="font-size:12;fill:#0d0000;fill-opacity:0.301471;fill-rule:evenodd;stroke-width:1pt;"
     d="M 7.73398 34.2049 L 12.0429 51.3301 C 5.08232 51.2196 4.19844 55.9705 4.64039 59.1746 C 6.73961 68.2343 17.4567 65.6933 24.5277 62.7102 C 23.6438 59.506 20.3293 44.3696 19.8874 41.7178 C 23.7543 40.7235 31.8198 38.4033 31.8198 38.4033 C 31.8198 38.4033 34.6924 45.5849 35.1343 47.0212 C 26.0745 46.6897 25.4117 52.3244 26.1851 54.8656 C 27.6214 61.9367 34.0295 61.8262 37.5651 60.8318 C 40.8796 60.2795 45.52 58.2907 48.0612 57.1859 C 47.0668 53.3189 38.3384 29.233 37.2336 26.1394 C 32.9246 27.6862 7.62349 34.4258 7.73398 34.2049 z "
     id="path635"
     sodipodi:nodetypes="cccccccccccc"
     transform="matrix(1.035546,0.000000,0.000000,1.035546,15.56160,-11.72637)" />
  <path
     style="font-size:12;fill:#0d3c07;fill-rule:evenodd;stroke-width:1pt;"
     d="M 7.73398 34.2049 L 12.0429 51.3301 C 5.08232 51.2196 4.19844 55.9705 4.64039 59.1746 C 6.73961 68.2343 17.4567 65.6933 24.5277 62.7102 C 23.6438 59.506 20.3293 44.3696 19.8874 41.7178 C 23.7543 40.7235 31.8198 38.4033 31.8198 38.4033 C 31.8198 38.4033 34.6924 45.5849 35.1343 47.0212 C 26.0745 46.6897 25.4117 52.3244 26.1851 54.8656 C 27.6214 61.9367 34.0295 61.8262 37.5651 60.8318 C 40.8796 60.2795 45.52 58.2907 48.0612 57.1859 C 47.0668 53.3189 38.3384 29.233 37.2336 26.1394 C 32.9246 27.6862 7.62349 34.4258 7.73398 34.2049 z "
     id="path616"
     sodipodi:nodetypes="cccccccccccc"
     transform="translate(14.83929,-11.42410)" />
  <path
     style="font-size:12;fill:#2aaf18;fill-rule:evenodd;stroke-width:1pt;"
     d="M 15.7994 54.2027 L 11.159 35.9726 L 35.7973 29.1225 L 44.7466 54.9761 C 44.7466 54.9761 33.3666 59.506 31.7093 57.5173 C 28.9471 57.4067 26.7375 51.2197 33.4771 50.0043 C 37.1231 49.8938 38.5594 49.6728 39.5538 50.0042 L 33.3666 34.0944 L 15.247 39.3977 L 20.3293 60.0584 C 20.3293 60.0584 13.7002 64.9198 7.95495 60.1689 C 6.73961 59.0641 6.62912 56.0809 8.61786 54.9761 C 10.2751 52.8769 15.6889 54.4237 15.7994 54.2027 z "
     id="path574"
     sodipodi:nodetypes="ccccccccccccc"
     transform="translate(14.83929,-11.42410)" />
  <path
     transform="matrix(1.488889,0.000000,0.000000,1.488889,8.836250,-40.12308)"
     style="font-size:12;fill-rule:evenodd;stroke-width:1pt;fill:url(#radialGradient704);"
     d="M 14.4736 57.5725 C 12.6184 56.7928 11.9994 58.2032 11.601 60.0584 C 10.0153 60.0584 8.87676 59.2416 8.87676 57.8693 C 8.87676 56.4971 9.94109 55.5318 11.5268 55.5318 C 13.1125 55.5318 14.4736 56.2003 14.4736 57.5725 z "
     id="path623"
     sodipodi:nodetypes="ccccc" />
  <path
     style="font-size:12;fill-rule:evenodd;stroke-width:1pt;fill:url(#radialGradient708);"
     d="M 37.3441 53.6503 C 33.3666 51.8834 34.4706 54.4237 33.6428 56.8544 C 31.5997 56.8544 29.9416 55.4189 29.9416 53.6503 C 29.9416 51.8816 31.5997 50.4462 33.6428 50.4462 C 35.6859 50.4462 37.3441 51.8816 37.3441 53.6503 z "
     id="path625"
     sodipodi:nodetypes="ccccc"
     transform="translate(14.83929,-11.42410)" />
  <path
     style="font-size:12;fill:#34674b;fill-rule:evenodd;stroke-width:1pt;"
     d="M 15.3575 39.5082 L 33.3666 34.2049 L 33.8085 32.5476 L 15.7994 37.7404 L 15.3575 39.5082 z "
     id="path630"
     sodipodi:nodetypes="ccccc"
     transform="translate(14.83929,-11.42410)" />
  <path
     style="font-size:12;fill:#cbff87;fill-rule:evenodd;stroke-width:1pt;"
     d="M 11.159 35.9726 L 13.3687 36.5251 L 36.1287 30.2274 L 35.6868 29.1225 L 11.159 35.9726 z "
     id="path631"
     transform="translate(14.83929,-11.42410)" />
  <path
     style="font-size:12;fill:#cbff87;fill-rule:evenodd;stroke-width:1pt;"
     d="M 33.6981 32.879 L 39.6643 49.8938 L 33.2561 34.2049 L 33.6981 32.879 z "
     id="path633"
     transform="translate(14.83929,-11.42410)" />
  <path
     style="font-size:12;fill:#cbff87;fill-rule:evenodd;stroke-width:1pt;"
     d="M 13.1478 36.1936 C 13.1478 36.1936 16.1309 54.3132 16.0204 54.3132 C 15.9099 54.3132 11.2695 36.0831 11.2695 36.0831 L 13.1478 36.1936 z "
     id="path634"
     transform="translate(14.83929,-11.42410)" />
  <path
     transform="matrix(0.974525,0.224278,-0.224278,0.974525,0.000000,0.000000)"
     style="font-size:13;font-weight:bold;fill:#143c69;stroke-width:1pt;font-family:Kid Kosmic;"
     d="M 69.6086 53.201 C 69.5409 53.5396 69.325 53.8189 68.9611 54.0389 C 68.631 54.2505 68.284 54.3563 67.9201 54.3563 C 67.4631 54.3563 67.1203 54.1151 66.8918 53.6327 C 66.7479 53.2179 66.5998 52.8075 66.4474 52.4012 C 64.2808 52.4012 62.6219 52.9471 61.4709 54.0389 C 60.3029 55.1646 59.702 56.2479 59.6681 57.2889 C 59.6427 58.3045 60.1759 59.0197 61.2677 59.4344 C 61.5301 59.536 61.8221 59.5868 62.1437 59.5868 C 63.2186 59.5868 64.6659 59.0662 66.4855 58.0252 C 66.5109 57.9406 66.5405 57.8221 66.5744 57.6698 C 66.3374 57.4412 65.9396 57.327 65.381 57.327 C 64.3485 57.327 63.4217 57.5386 62.6007 57.9618 C 62.1183 57.9194 61.8094 57.6528 61.674 57.162 C 61.6486 57.0689 61.6359 56.98 61.6359 56.8954 C 61.6359 56.523 61.8348 56.1929 62.2326 55.9051 C 62.7319 55.3465 63.6545 55.0672 65.0002 55.0672 C 65.4064 55.0672 65.9185 55.0968 66.5363 55.1561 C 67.3488 55.2238 67.7931 55.2619 67.8693 55.2704 C 68.7749 55.7274 69.2277 56.2394 69.2277 56.8065 C 69.2277 57.0773 69.1473 57.4539 68.9865 57.9364 C 68.7495 58.6812 68.411 59.1805 67.9709 59.4344 C 67.0991 60.0946 66.0793 60.6278 64.9113 61.034 C 63.7179 61.4487 62.5881 61.6561 61.5216 61.6561 C 59.9644 61.6561 58.8048 61.1652 58.0431 60.1834 C 57.3914 59.3371 57.0656 58.4061 57.0656 57.3905 C 57.0656 56.9419 57.1248 56.4849 57.2433 56.0194 C 57.785 53.9289 59.1307 52.3377 61.2804 51.2459 C 63.1086 50.3065 65.1948 49.8621 67.5392 49.9129 C 68.3348 50.023 68.8849 50.298 69.1896 50.7381 C 69.4351 51.1021 69.5705 51.7072 69.5959 52.5536 C 69.6466 52.799 69.6509 53.0148 69.6086 53.201 z M 56.4816 53.201 C 56.4139 53.5396 56.1981 53.8189 55.8341 54.0389 C 55.5041 54.2505 55.1571 54.3563 54.7931 54.3563 C 54.3361 54.3563 53.9933 54.1151 53.7648 53.6327 C 53.6209 53.2179 53.4728 52.8075 53.3205 52.4012 C 51.1538 52.4012 49.495 52.9471 48.3439 54.0389 C 47.1759 55.1646 46.575 56.2479 46.5412 57.2889 C 46.5158 58.3045 47.049 59.0197 48.1408 59.4344 C 48.4032 59.536 48.6951 59.5868 49.0168 59.5868 C 50.0916 59.5868 51.5389 59.0662 53.3586 58.0252 C 53.3839 57.9406 53.4136 57.8221 53.4474 57.6698 C 53.2104 57.4412 52.8127 57.327 52.2541 57.327 C 51.2215 57.327 50.2948 57.5386 49.4738 57.9618 C 48.9914 57.9194 48.6825 57.6528 48.547 57.162 C 48.5216 57.0689 48.5089 56.98 48.5089 56.8954 C 48.5089 56.523 48.7078 56.1929 49.1056 55.9051 C 49.605 55.3465 50.5275 55.0672 51.8732 55.0672 C 52.2795 55.0672 52.7915 55.0968 53.4093 55.1561 C 54.2218 55.2238 54.6662 55.2619 54.7423 55.2704 C 55.6479 55.7274 56.1007 56.2394 56.1007 56.8065 C 56.1007 57.0773 56.0203 57.4539 55.8595 57.9364 C 55.6226 58.6812 55.284 59.1805 54.8439 59.4344 C 53.9722 60.0946 52.9523 60.6278 51.7843 61.034 C 50.591 61.4487 49.4611 61.6561 48.3947 61.6561 C 46.8374 61.6561 45.6779 61.1652 44.9162 60.1834 C 44.2645 59.3371 43.9386 58.4061 43.9386 57.3905 C 43.9386 56.9419 43.9979 56.4849 44.1164 56.0194 C 44.658 53.9289 46.0037 52.3377 48.1535 51.2459 C 49.9816 50.3065 52.0679 49.8621 54.4123 49.9129 C 55.2078 50.023 55.758 50.298 56.0627 50.7381 C 56.3081 51.1021 56.4435 51.7072 56.4689 52.5536 C 56.5197 52.799 56.5239 53.0148 56.4816 53.201 z M 39.6349 60.0311 C 38.0184 61.1144 36.4272 61.6603 34.8615 61.6688 C 33.2873 61.6773 31.95 61.1821 30.8498 60.1834 C 29.8595 59.2863 29.3644 58.2199 29.3644 56.9842 C 29.3644 55.3084 30.3081 53.6115 32.1955 51.8934 C 33.8289 50.3954 35.509 49.6421 37.2355 49.6336 C 38.8351 49.6252 40.1978 50.2726 41.3234 51.576 C 42.2459 52.6509 42.7072 53.8231 42.7072 55.0926 C 42.7072 55.3635 42.686 55.6385 42.6437 55.9178 C 42.4067 57.4666 41.4038 58.8377 39.6349 60.0311 z M 37.9084 52.5536 C 37.519 52.2827 37.0832 52.1473 36.6007 52.1473 C 35.9491 52.1473 35.2847 52.3758 34.6076 52.8329 C 33.9051 53.3068 33.3 53.8569 32.7922 54.4832 C 32.132 55.2873 31.8019 56.0405 31.8019 56.743 C 31.8019 57.0985 31.8908 57.4328 32.0685 57.7459 C 32.7541 58.9393 33.7612 59.536 35.09 59.536 C 36.1226 59.536 37.2017 59.134 38.3273 58.3299 C 39.3599 57.6021 39.8761 56.7811 39.8761 55.867 C 39.8761 55.5285 39.7957 55.1815 39.6349 54.826 C 39.2033 53.8104 38.6278 53.0529 37.9084 52.5536 z M 28.1076 59.6375 C 28.1076 60.0607 27.9045 60.4331 27.4982 60.7547 C 27.1004 61.0763 26.673 61.2371 26.216 61.2371 C 26.0467 61.2371 25.8901 61.2118 25.7463 61.161 C 25.3231 60.9917 25.1115 60.6912 25.1115 60.2596 C 25.1115 59.9634 25.2173 59.6756 25.4289 59.3963 C 25.8351 58.8801 26.3429 58.6219 26.9523 58.6219 C 27.13 58.6219 27.2993 58.6515 27.4601 58.7108 C 27.8918 58.8716 28.1076 59.1805 28.1076 59.6375 z "
     id="path894" />
</svg>
