<?xml version="1.0" encoding="UTF-8" standalone="no"?>
<!DOCTYPE svg PUBLIC "-//W3C//DTD SVG 20010904//EN"
"http://www.w3.org/TR/2001/REC-SVG-20010904/DTD/svg10.dtd">
<!-- Created with Sodipodi ("http://www.sodipodi.com/") -->
<svg
   xmlns="http://www.w3.org/2000/svg"
   xmlns:sodipodi="http://sodipodi.sourceforge.net/DTD/sodipodi-0.dtd"
   xmlns:xlink="http://www.w3.org/1999/xlink"
   id="svg704"
   sodipodi:version="0.34"
   width="72pt"
   height="72pt"
   sodipodi:docbase="/home/natem"
   sodipodi:docname="/home/natem/gnome-remote-desktop.svg">
  <defs
     id="defs706">
    <linearGradient
       id="linearGradient734">
      <stop
         style="stop-color:#2a2535;stop-opacity:1;"
         offset="0.000000"
         id="stop735" />
      <stop
         style="stop-color:#e3e1cf;stop-opacity:1;"
         offset="1.000000"
         id="stop736" />
    </linearGradient>
    <linearGradient
       id="linearGradient724">
      <stop
         style="stop-color:#ffffff;stop-opacity:0.490196;"
         offset="0.000000"
         id="stop725" />
      <stop
         style="stop-color:#ffffff;stop-opacity:0.176471;"
         offset="1.000000"
         id="stop726" />
    </linearGradient>
    <linearGradient
       id="linearGradient718">
      <stop
         style="stop-color:#e3e1cf;stop-opacity:1;"
         offset="0.000000"
         id="stop719" />
      <stop
         style="stop-color:#ffffff;stop-opacity:1;"
         offset="1.000000"
         id="stop720" />
    </linearGradient>
    <linearGradient
       xlink:href="#linearGradient718"
       id="linearGradient721"
       x1="45.4330635"
       y1="41.9262352"
       x2="24.0375099"
       y2="27.2048512"
       gradientUnits="userSpaceOnUse"
       spreadMethod="pad"
       gradientTransform="scale(1.033999,0.967119)" />
    <linearGradient
       xlink:href="#linearGradient724"
       id="linearGradient723"
       x1="40.2607956"
       y1="39.8445053"
       x2="37.3197212"
       y2="68.6665039"
       gradientUnits="userSpaceOnUse"
       spreadMethod="pad"
       gradientTransform="scale(1.185464,0.843551)" />
    <linearGradient
       xlink:href="#linearGradient724"
       id="linearGradient732" />
    <radialGradient
       xlink:href="#linearGradient734"
       id="radialGradient733"
       cx="33.2134209"
       cy="118.190964"
       fx="33.2134209"
       fy="118.190964"
       r="14.8945398"
       gradientUnits="userSpaceOnUse"
       spreadMethod="pad"
       gradientTransform="scale(1.559286,0.641319)" />
    <radialGradient
       xlink:href="#linearGradient734"
       id="radialGradient738" />
  </defs>
  <sodipodi:namedview
     id="base" />
  <path
     transform="matrix(1.267303,0.166421,-0.141093,1.494785,-6.484511,-50.56691)"
     style="font-size:12;fill:#000000;fill-rule:evenodd;stroke-width:1pt;fill-opacity:0.3;"
     d="M 67.6563 79.6875 C 67.6563 84.0863 58.9763 87.6563 48.2813 87.6563 C 37.5863 87.6563 28.9063 84.0863 28.9063 79.6875 C 28.9063 75.2887 37.5863 71.7187 48.2813 71.7187 C 58.9763 71.7187 67.6563 75.2887 67.6563 79.6875 z "
     id="path744" />
  <path
     style="fill:#000000;fill-rule:evenodd;stroke:none;stroke-opacity:1;stroke-width:1pt;stroke-linejoin:miter;stroke-linecap:butt;fill-opacity:0.3;"
     d="M 11.9721 61.9975 C 10.1055 59.3328 1.05153 37.445 8.81341 5.71367 C 40.7348 -0.836156 68.3995 11.3724 82.7618 20.5532 C 85.6926 26.6343 80.6883 72.3183 69.9704 76.7947 C 62.7829 79.1385 25.173 78.4924 11.9721 61.9975 z "
     id="path743"
     sodipodi:nodetypes="ccccc"
     transform="matrix(0.956645,0.000000,0.000000,0.956645,1.875667,-1.473331)" />
  <path
     transform="matrix(1.172519,0.148924,-0.130541,1.337628,-4.587529,-38.49639)"
     style="font-size:12;fill:#211301;fill-rule:evenodd;stroke-width:1pt;"
     d="M 67.6563 79.6875 C 67.6563 84.0863 58.9763 87.6563 48.2813 87.6563 C 37.5863 87.6563 28.9063 84.0863 28.9063 79.6875 C 28.9063 75.2887 37.5863 71.7187 48.2813 71.7187 C 58.9763 71.7187 67.6563 75.2887 67.6563 79.6875 z "
     id="path739" />
  <path
     sodipodi:type="arc"
     style="fill-rule:evenodd;stroke:none;fill:url(#radialGradient733);fill-opacity:1;stroke-opacity:1;stroke-width:1pt;stroke-linejoin:miter;stroke-linecap:butt;"
     id="path731"
     d="M 67.65627 79.6875 A 19.375 7.968754 0 1 0 28.90626 79.6875 A 19.375 7.968754 0 1 0  67.65627 79.6875 z"
     sodipodi:cx="48.281261"
     sodipodi:cy="79.687500"
     sodipodi:rx="19.375004"
     sodipodi:ry="7.968754"
     transform="matrix(0.970062,0.117700,-0.108001,1.057171,3.391123,-15.87606)" />
  <path
     transform="matrix(1.063878,9.503721e-2,-0.115466,0.875658,2.482887,-4.786491e-2)"
     style="font-size:12;fill:#211301;fill-rule:evenodd;stroke-width:1pt;fill-opacity:1;"
     d="M 58.9063 75.9375 C 58.9063 79.56 53.2713 82.5 46.3281 82.5 C 39.385 82.5 33.75 79.56 33.75 75.9375 C 33.75 72.315 39.385 69.375 46.3281 69.375 C 53.2713 69.375 58.9063 72.315 58.9063 75.9375 z "
     id="path730" />
  <path
     style="font-size:12;fill:#bebdae;fill-rule:evenodd;stroke-width:1pt;fill-opacity:1;"
     d="M 58.9063 75.9375 C 58.9063 79.56 53.2713 82.5 46.3281 82.5 C 39.385 82.5 33.75 79.56 33.75 75.9375 C 33.75 72.315 39.385 69.375 46.3281 69.375 C 53.2713 69.375 58.9063 72.315 58.9063 75.9375 z "
     id="path728"
     transform="matrix(0.925354,7.570947e-2,-0.100432,0.697573,7.758820,13.64370)" />
  <path
     style="fill:#211301;fill-rule:evenodd;stroke:none;stroke-opacity:1;stroke-width:1pt;stroke-linejoin:miter;stroke-linecap:butt;fill-opacity:1;"
     d="M 11.9721 61.9975 C 10.1055 59.3328 1.05153 37.445 8.81341 5.71367 C 40.7348 -0.836156 68.3995 11.3724 82.7618 20.5532 C 85.6926 26.6343 80.6883 72.3183 69.9704 76.7947 C 62.7829 79.1385 25.173 78.4924 11.9721 61.9975 z "
     id="path715"
     sodipodi:nodetypes="ccccc"
     transform="matrix(0.956645,0.000000,0.000000,0.956645,-2.449967,-1.257048)" />
  <path
     style="fill:url(#linearGradient721);fill-rule:evenodd;stroke:none;stroke-opacity:1;stroke-width:1pt;stroke-linejoin:miter;stroke-linecap:butt;fill-opacity:1;"
     d="M 15.4688 60.7812 C 13.9062 57.8125 5.15625 41.0937 11.0938 8.90623 C 44.6875 2.81248 67.0312 15.7812 80.9375 23.5937 C 82.5 29.2188 77.3437 71.4062 68.9062 73.9062 C 61.7187 76.25 25.7812 74.8437 15.4688 60.7812 z "
     id="path713"
     sodipodi:nodetypes="ccccc"
     transform="matrix(0.930788,0.000000,0.000000,0.930788,-1.282937,-0.194969)" />
  <path
     style="fill:#b5a794;fill-rule:evenodd;stroke:none;stroke-opacity:1;stroke-width:1pt;stroke-linejoin:miter;stroke-linecap:butt;fill-opacity:1;"
     d="M 19.0625 19.0625 L 16.5625 19.8437 C 16.25 22.1875 12.3438 41.25 16.0938 49.6875 C 20.4688 57.0312 22.5 58.4375 22.0313 57.6562 C 16.7187 48.75 15 35.1562 19.0625 19.0625 z "
     id="path717"
     sodipodi:nodetypes="ccccc"
     transform="matrix(0.930788,0.000000,0.000000,0.930788,-1.282937,-0.194969)" />
  <path
     style="fill:#000000;fill-rule:evenodd;stroke:none;stroke-opacity:1;stroke-width:1pt;stroke-linejoin:miter;stroke-linecap:butt;fill-opacity:1;"
     d="M 19.6875 19.5312 C 19.6875 19.5312 13.5938 41.7188 21.4063 55.1562 C 27.3438 63.4375 46.5625 70 62.3438 65.3125 C 65.3126 61.5625 72.0312 41.25 65.7813 30 C 63.4375 26.0937 35.1563 14.0625 19.6875 19.5312 z "
     id="path711"
     sodipodi:nodetypes="ccccc"
     transform="matrix(0.965054,0.000000,0.000000,0.965054,-2.752628,-1.651411)" />
  <path
     style="fill:#437caf;fill-rule:evenodd;stroke:none;stroke-opacity:1;stroke-width:1pt;stroke-linejoin:miter;stroke-linecap:butt;fill-opacity:1;"
     d="M 19.6875 19.5312 C 19.6875 19.5312 13.5938 41.7188 21.4063 55.1562 C 27.3438 63.4375 46.5625 70 62.3438 65.3125 C 65.3126 61.5625 72.0312 41.25 65.7813 30 C 63.4375 26.0937 35.1563 14.0625 19.6875 19.5312 z "
     id="path710"
     sodipodi:nodetypes="ccccc"
     transform="matrix(0.930788,0.000000,0.000000,0.930788,-1.282937,-0.194969)" />
  <path
     style="fill:url(#linearGradient723);fill-rule:evenodd;stroke:none;stroke-opacity:1;stroke-width:1pt;stroke-linejoin:miter;stroke-linecap:butt;fill-opacity:1;"
     d="M 17.6563 41.875 C 17.6563 41.875 30.625 24.2187 42.9687 35.4687 C 47.9688 52.1874 66.25 56.0937 66.25 56.0937 L 62.6563 65 C 49.0625 69.8438 22.9688 59.8437 21.7188 56.0937 C 20.4688 52.3437 21.4063 58.125 17.6563 41.875 z "
     id="path722"
     sodipodi:nodetypes="cccccc"
     transform="matrix(0.930788,0.000000,0.000000,0.930788,-1.282937,-0.194969)" />
  <path
     style="fill:#000000;fill-rule:evenodd;stroke:none;stroke-opacity:1;stroke-width:1pt;stroke-linejoin:miter;stroke-linecap:butt;fill-opacity:1;"
     d="M 24.3561 51.16 L 24.2188 58.7026 C 30.0285 66.1552 47.8599 69.6306 53.2718 67.1686 C 53.1156 65.9185 52.9593 63.125 52.6657 61.9508 C 48.8494 61.0701 31.0369 58.4659 24.3561 51.16 z "
     id="path709"
     sodipodi:nodetypes="ccccc"
     transform="matrix(0.990839,0.000000,0.000000,0.990839,-3.018782,-4.510803)" />
  <path
     style="fill:#b5a794;fill-rule:evenodd;stroke:none;stroke-opacity:1;stroke-width:1pt;stroke-linejoin:miter;stroke-linecap:butt;fill-opacity:1;"
     d="M 81.25 23.9062 C 81.25 23.9062 76.0938 24.0625 75.9376 24.0625 C 75.7812 24.0625 76.7188 37.3437 76.0938 42.1875 C 75.4688 47.0312 73.9063 58.4375 72.9688 61.4062 C 72.0313 64.375 66.5625 73.9062 66.0938 74.5312 C 65.625 75.1562 67.3438 74.3749 70 73.5937 C 77.1875 65.3124 80.7813 45.4688 81.25 23.9062 z "
     id="path716"
     sodipodi:nodetypes="ccccccc"
     transform="matrix(0.930788,0.000000,0.000000,0.930788,-1.282937,-0.194969)" />
  <path
     style="fill:#c7bda8;fill-rule:evenodd;stroke:none;stroke-opacity:1;stroke-width:1pt;stroke-linejoin:miter;stroke-linecap:butt;fill-opacity:1;"
     d="M 24.0625 52.1875 L 24.2188 57.9687 C 30.4688 64.6874 48.5938 68.7499 53.125 66.875 C 52.9688 65.6249 52.8125 63.125 52.8125 63.125 C 52.8125 63.125 30.1562 58.9062 24.0625 52.1875 z "
     id="path708"
     sodipodi:nodetypes="ccccc"
     transform="matrix(0.930788,0.000000,0.000000,0.930788,-0.701195,-0.922146)" />
  <path
     style="fill:#211301;fill-rule:evenodd;stroke:none;stroke-opacity:1;stroke-width:1pt;stroke-linejoin:miter;stroke-linecap:butt;fill-opacity:1;"
     d="M 65.7813 74.2187 C 65.7813 74.2187 77.9688 64.6875 74.8438 24.6875 C 72.1875 22.0312 68.125 19.0625 68.125 19.0625 C 68.125 19.0625 75.9375 22.8125 76.4063 24.0625 C 77.1875 25.7812 77.6562 67.1875 65.7813 74.2187 z "
     id="path712"
     sodipodi:nodetypes="ccccc"
     transform="matrix(0.930788,0.000000,0.000000,0.930788,-1.282937,-0.194969)" />
  <path
     style="fill:#fbfbfb;fill-rule:evenodd;stroke:none;stroke-opacity:1;stroke-width:1pt;stroke-linejoin:miter;stroke-linecap:butt;fill-opacity:1;"
     d="M 26.5625 78.5937 L 27.9688 77.5 C 32.9688 86.25 53.4375 87.1875 55 86.875 C 56.5625 86.5625 37.6562 92.5 26.5625 78.5937 z "
     id="path740"
     sodipodi:nodetypes="cccc"
     transform="matrix(0.930788,0.000000,0.000000,0.930788,-1.282937,-0.194969)" />
  <path
     style="fill:none;fill-rule:evenodd;stroke:black;stroke-opacity:1;stroke-width:0.875;stroke-linejoin:round;stroke-linecap:round;fill-opacity:1;stroke-dasharray:none;"
     d="M 27.5 54.5312 C 27.5 52.9687 27.5 59.2188 27.5 59.2188 "
     id="path741"
     sodipodi:nodetypes="cc"
     transform="matrix(0.930788,0.000000,0.000000,0.930788,-1.282937,-0.194969)" />
  <path
     style="fill:none;fill-rule:evenodd;stroke:black;stroke-opacity:1;stroke-width:0.875;stroke-linejoin:round;stroke-linecap:round;fill-opacity:1;stroke-dasharray:none;"
     d="M 27.5 54.5312 C 27.5 52.9687 27.5 59.2188 27.5 59.2188 "
     id="path742"
     sodipodi:nodetypes="cc"
     transform="matrix(0.930788,0.000000,0.000000,0.930788,17.33283,6.349640)" />
  <g
     id="g683"
     transform="matrix(0.66,0,0,0.66,30.63601,29.87298)">
    <defs
       id="defs571">
      <linearGradient
         id="linearGradient584">
        <stop
           style="stop-color:#ffffff;stop-opacity:0;"
           offset="0.000000"
           id="stop585" />
        <stop
           style="stop-color:#ffffff;stop-opacity:1;"
           offset="1.000000"
           id="stop586" />
      </linearGradient>
      <linearGradient
         xlink:href="#linearGradient584"
         id="linearGradient587"
         x1="28.2520447"
         y1="32.8688049"
         x2="68.3603058"
         y2="21.4794312"
         gradientUnits="userSpaceOnUse"
         spreadMethod="pad"
         gradientTransform="matrix(1.036821,-1.811349e-6,3.827296e-7,0.964487,2.057071e-6,1.075978e-6)" />
    </defs>
    <sodipodi:namedview
       id="namedview689" />
    <path
       sodipodi:type="arc"
       style="font-size:12;fill:none;fill-rule:evenodd;stroke:#000000;stroke-width:8.5;stroke-opacity:0.3;"
       id="path589"
       d="M 83.82384 45.39078 A 40.45953 40.45952 0 1 0 2.904785 45.39078 A 40.45953 40.45952 0 1 0  83.82384 45.39078 z"
       sodipodi:cx="43.364311"
       sodipodi:cy="45.390781"
       sodipodi:rx="40.459526"
       sodipodi:ry="40.459522"
       transform="matrix(0.941981,0.000000,0.000000,0.941981,5.915554,5.375080)" />
    <path
       sodipodi:type="arc"
       style="font-size:12;fill:#31baff;fill-rule:evenodd;stroke-width:1pt;"
       id="path573"
       d="M 83.82384 45.39078 A 40.45953 40.45952 0 1 0 2.904785 45.39078 A 40.45953 40.45952 0 1 0  83.82384 45.39078 z"
       sodipodi:cx="43.364311"
       sodipodi:cy="45.390781"
       sodipodi:rx="40.459526"
       sodipodi:ry="40.459522"
       transform="matrix(0.846155,0.000000,0.000000,0.846155,6.256445,5.738268)" />
    <path
       style="font-size:12;fill:#e48e6f;fill-rule:evenodd;stroke-width:1pt;"
       d="M 28.507 13.4277 L 33.5075 22.0666 L 21.4273 37.0306 C 21.4273 37.0306 27.3038 50.7498 31.5585 50.5779 C 28.9177 51.1396 28.922 62.4819 30.2424 66.003 C 34.3774 62.4315 14.8677 57.4856 16.5276 47.5264 C 18.1874 37.5671 17.0138 35.0166 12.4491 42.0711 C 7.88442 49.1255 7.05448 50.9929 7.46945 47.6731 C 7.88442 44.3534 6.46331 19.7781 28.507 13.4277 z "
       id="path576"
       sodipodi:nodetypes="ccccccccc" />
    <path
       style="font-size:12;fill:#fffcac;fill-rule:evenodd;stroke-width:1pt;"
       d="M 30.7077 12.4007 L 37.7622 22.36 L 24.0682 36.8839 C 24.0682 36.8839 33.6125 50.1629 33.6125 50.5779 C 33.6125 50.9929 29.8778 61.3671 29.8778 61.3671 C 29.8778 61.3671 16.5988 54.3126 18.2587 44.3534 C 19.9185 34.3941 18.2587 30.6594 13.694 37.7139 C 9.12933 44.7683 7.05448 50.9929 7.46945 47.6731 C 7.88442 44.3534 9.5443 16.5504 30.7077 12.4007 z "
       id="path574" />
    <path
       style="font-size:12;fill:#ffd87c;fill-rule:evenodd;stroke-width:1pt;"
       d="M 28.507 13.4277 L 33.5075 22.0666 L 21.4273 37.0306 C 21.4273 37.0306 27.3038 50.7498 31.5585 50.5779 C 28.9177 51.1396 27.6771 56.6723 28.9975 60.1934 C 27.5304 55.792 16.5276 56.2407 18.1875 46.2815 C 19.8473 36.3222 18.2587 30.6594 13.694 37.7139 C 9.12933 44.7683 7.05448 50.9929 7.46945 47.6731 C 7.88442 44.3534 6.46331 19.7781 28.507 13.4277 z "
       id="path575"
       sodipodi:nodetypes="ccccccccc" />
    <path
       style="font-size:12;fill:#e48e6f;fill-rule:evenodd;stroke-width:1pt;"
       d="M 42.8405 18.697 C 42.8405 18.697 48.1222 22.5116 42.2536 28.0867 C 36.385 33.6619 28.1691 35.7159 35.2113 39.5304 C 42.2536 43.345 51.9367 43.9318 51.0564 37.183 C 50.1762 30.4342 49.0025 16.0562 42.8405 18.697 z "
       id="path577" />
    <path
       style="font-size:12;fill:#fffbaa;fill-rule:evenodd;stroke-width:1pt;"
       d="M 42.8405 18.697 C 42.8405 18.697 48.1222 22.5116 42.2536 28.0867 C 36.385 33.6619 28.1691 35.7159 35.2113 39.5304 C 42.2536 43.345 51.9367 43.9318 51.0564 37.183 C 50.1762 30.4342 49.0025 16.0562 42.8405 18.697 z "
       id="path578"
       transform="matrix(0.968474,0.000000,0.000000,0.938789,2.198177,1.124868)" />
    <path
       style="font-size:12;fill:#ffd87c;fill-rule:evenodd;stroke-width:1pt;"
       d="M 42.8405 18.697 C 42.8405 18.697 48.1222 22.5116 42.2536 28.0867 C 36.385 33.6619 28.1691 35.7159 35.2113 39.5304 C 42.2536 43.345 51.9367 43.9318 51.0564 37.183 C 50.1762 30.4342 49.0025 16.0562 42.8405 18.697 z "
       id="path579"
       transform="matrix(0.826610,0.000000,0.000000,0.889821,6.808317,2.024765)" />
    <path
       style="font-size:12;fill:#e48e6f;fill-rule:evenodd;stroke-width:1pt;"
       d="M 77.1715 47.1595 C 77.1715 47.1595 63.087 45.1055 62.2067 45.6924 C 61.3264 46.2793 49.0024 47.453 50.1762 53.9084 C 51.3499 60.3638 55.4579 65.6455 50.1762 69.4601 C 44.8945 73.2746 39.0259 76.2089 44.3076 77.9695 C 49.5893 79.73 56.925 77.676 59.2724 75.622 C 61.6198 73.568 56.6316 72.3943 57.2184 66.5258 C 57.8053 60.6572 56.0447 56.8427 62.2067 58.8966 C 68.3687 60.9506 68.0753 63.2981 72.1832 58.8966 C 76.2912 54.4952 79.8124 53.3215 77.1715 47.1595 z "
       id="path580" />
    <path
       style="font-size:12;fill:#fffcac;fill-rule:evenodd;stroke-width:1pt;"
       d="M 77.1715 47.1595 C 78.3452 45.6098 63.087 41.3862 62.2067 43.8328 C 61.3264 41.9402 46.3615 44.6636 47.5354 51.1189 C 48.7091 57.5744 53.6973 64.7157 48.4156 68.5303 C 43.1339 72.3448 39.0259 76.2089 44.3076 77.9695 C 49.5893 79.73 56.925 77.676 59.2724 75.622 C 61.6198 73.568 55.4579 72.3943 56.0447 66.5258 C 56.6316 60.6572 56.0447 55.293 62.2067 57.3469 C 68.3687 59.4009 68.0753 61.7484 72.1832 57.3469 C 76.2912 52.9455 79.8124 53.3215 77.1715 47.1595 z "
       id="path582"
       transform="matrix(1.000000,0.000000,0.000000,0.946729,0.000000,2.428446)"
       sodipodi:nodetypes="cccccccccc" />
    <path
       style="font-size:12;fill:#ffd87c;fill-rule:evenodd;stroke-width:1pt;"
       d="M 77.1715 47.1595 C 77.1715 47.1595 63.087 45.1055 62.2067 45.6924 C 61.3264 46.2793 49.0024 47.453 50.1762 53.9084 C 51.3499 60.3638 55.4579 65.6455 50.1762 69.4601 C 44.8945 73.2746 39.0259 76.2089 44.3076 77.9695 C 49.5893 79.73 56.925 77.676 59.2724 75.622 C 61.6198 73.568 55.4579 72.3943 56.0447 66.5258 C 56.6316 60.6572 56.0447 55.293 62.2067 57.3469 C 68.3687 59.4009 68.0753 61.7484 72.1832 57.3469 C 76.2912 52.9455 79.8124 53.3215 77.1715 47.1595 z "
       id="path581"
       transform="matrix(1.000000,0.000000,0.000000,0.946729,0.000000,2.428446)"
       sodipodi:nodetypes="cccccccccc" />
    <path
       transform="matrix(0.920224,0.000000,0.000000,0.920224,3.044474,1.961231)"
       style="font-size:12;fill:none;fill-rule:evenodd;stroke:#283d53;stroke-width:8.5;"
       d="M 83.8238 45.3908 C 83.8238 67.7244 65.698 85.8503 43.3643 85.8503 C 21.0307 85.8503 2.90479 67.7244 2.90479 45.3908 C 2.90479 23.0571 21.0307 4.93126 43.3643 4.93126 C 65.698 4.93126 83.8238 23.0571 83.8238 45.3908 z "
       id="path654" />
    <path
       transform="matrix(0.933582,-0.664775,0.918324,1.029434,-29.83966,37.88266)"
       style="font-size:12;fill:url(#linearGradient587);fill-rule:evenodd;stroke-width:1pt;"
       d="M 72.1832 30.4342 C 72.1832 40.1525 63.7044 48.0398 53.2571 48.0398 C 42.8099 48.0398 34.3311 40.1525 34.3311 30.4342 C 34.3311 20.7158 42.8099 12.8285 53.2571 12.8285 C 63.7044 12.8285 72.1832 20.7158 72.1832 30.4342 z "
       id="path588" />
  </g>
</svg>
