/* XPM */
static char * netscape_48x48_xpm[] = {
"48 48 1731 2",
"  	c None",
". 	c #2F7DA7",
"+ 	c #D1CAAF",
"@ 	c #A59E85",
"# 	c #746E56",
"$ 	c #4B452F",
"% 	c #3D3723",
"& 	c #312C1C",
"* 	c #2F7CA6",
"= 	c #D8D2BA",
"- 	c #D6D0B6",
"; 	c #ADA78F",
"> 	c #7D7761",
", 	c #544E38",
"' 	c #413B29",
") 	c #2E2A1D",
"! 	c #2F7CA5",
"~ 	c #2E7BA5",
"{ 	c #2D7BA5",
"] 	c #DFDAC4",
"^ 	c #DCD6BF",
"/ 	c #B7B19B",
"( 	c #8A846E",
"_ 	c #5F5945",
": 	c #454030",
"< 	c #2B281E",
"[ 	c #0A0907",
"} 	c #000000",
"| 	c #2F7BA4",
"1 	c #2E7BA4",
"2 	c #2D7BA4",
"3 	c #2B7AA5",
"4 	c #427A98",
"5 	c #6A7B82",
"6 	c #E4E0CD",
"7 	c #E1DCC6",
"8 	c #C0BAA5",
"9 	c #958F7B",
"0 	c #6A6451",
"a 	c #494436",
"b 	c #29271F",
"c 	c #080806",
"d 	c #2F7AA3",
"e 	c #31799F",
"f 	c #357698",
"g 	c #3A7391",
"h 	c #567A8C",
"i 	c #808687",
"j 	c #B29480",
"k 	c #A0816B",
"l 	c #766152",
"m 	c #4C4239",
"n 	c #3B352E",
"o 	c #EEEADE",
"p 	c #E9E5D4",
"q 	c #E6E1CF",
"r 	c #CDC8B5",
"s 	c #ACA795",
"t 	c #8C8675",
"u 	c #6F6B5C",
"v 	c #545147",
"w 	c #393731",
"x 	c #3B3A35",
"y 	c #52504C",
"z 	c #E1CBBD",
"A 	c #CAB0A0",
"B 	c #A98B78",
"C 	c #896650",
"D 	c #694C3A",
"E 	c #423125",
"F 	c #2F7AA2",
"G 	c #367698",
"H 	c #407189",
"I 	c #4A6B7A",
"J 	c #6B7A7F",
"K 	c #94918B",
"L 	c #C2A998",
"M 	c #B99F8C",
"N 	c #9C8877",
"O 	c #7F7163",
"P 	c #655B4F",
"Q 	c #433D35",
"R 	c #F7F6F1",
"S 	c #F3F0E8",
"T 	c #F0ECE2",
"U 	c #EEEADD",
"V 	c #ECE8DA",
"W 	c #EBE7D8",
"X 	c #DCD8C8",
"Y 	c #C9C4B4",
"Z 	c #B6B0A0",
"` 	c #A29D8D",
" .	c #8E8A7C",
"..	c #7B776B",
"+.	c #817D73",
"@.	c #96938B",
"#.	c #B7A99E",
"$.	c #D0BFB3",
"%.	c #E1CEC0",
"&.	c #D2B8A7",
"*.	c #B99781",
"=.	c #A0775C",
"-.	c #795741",
";.	c #483528",
">.	c #130F0D",
",.	c #050505",
"'.	c #2F78A0",
").	c #4A6B7D",
"!.	c #596468",
"~.	c #7B7A75",
"{.	c #A3988E",
"].	c #CDB7A7",
"^.	c #C8B2A0",
"/.	c #B5A18F",
"(.	c #A1907F",
"_.	c #7E7163",
":.	c #4E453D",
"<.	c #12100E",
"[.	c #3F3F3E",
"}.	c #939391",
"|.	c #E7E6E4",
"1.	c #F7F5F0",
"2.	c #F2EFE6",
"3.	c #EDEADE",
"4.	c #EDEADD",
"5.	c #EEEBE0",
"6.	c #EFECE1",
"7.	c #EBE8DB",
"8.	c #E5E1D3",
"9.	c #DFDACB",
"0.	c #D5CFBF",
"a.	c #C9C3B1",
"b.	c #BCB7A4",
"c.	c #BCB8A8",
"d.	c #C2BEB3",
"e.	c #C9C6C2",
"f.	c #C0BBB6",
"g.	c #B0A8A2",
"h.	c #A0968D",
"i.	c #B3A69C",
"j.	c #CDBDB1",
"k.	c #E1CFC3",
"l.	c #D7BDAC",
"m.	c #C39F88",
"n.	c #B08263",
"o.	c #825E46",
"p.	c #4B382A",
"q.	c #14100D",
"r.	c #060606",
"s.	c #2E78A0",
"t.	c #387291",
"u.	c #456A7E",
"v.	c #51636A",
"w.	c #6F7270",
"x.	c #92877D",
"y.	c #B59D8B",
"z.	c #BAA08C",
"A.	c #B59C88",
"B.	c #AF9985",
"C.	c #998777",
"D.	c #796D63",
"E.	c #55504C",
"F.	c #767471",
"G.	c #B1AFAC",
"H.	c #EBEAE7",
"I.	c #F5F2EB",
"J.	c #E9E4D6",
"K.	c #E6E1D2",
"L.	c #E2DECF",
"M.	c #DFDBCD",
"N.	c #DED9CA",
"O.	c #DDD8C6",
"P.	c #DDD7C3",
"Q.	c #D8D2BD",
"R.	c #D3CCB6",
"S.	c #CDC6AF",
"T.	c #CDC7B2",
"U.	c #CEC9BA",
"V.	c #D0CDC2",
"W.	c #C8C2B7",
"X.	c #BBB2A5",
"Y.	c #AFA292",
"Z.	c #B9A796",
"`.	c #C8B19F",
" +	c #D6BBA7",
".+	c #C6A791",
"++	c #AD8A72",
"@+	c #946D52",
"#+	c #6C4D39",
"$+	c #3E2D22",
"%+	c #100D0A",
"&+	c #040404",
"*+	c #030303",
"=+	c #2E779F",
"-+	c #347193",
";+	c #3C6A83",
">+	c #426373",
",+	c #5A676C",
"'+	c #766E66",
")+	c #927662",
"!+	c #A2826B",
"~+	c #AE8F78",
"{+	c #BA9C86",
"]+	c #B69E8C",
"^+	c #AC9B8F",
"/+	c #A19992",
"(+	c #B4B0AA",
"_+	c #D2CFC9",
":+	c #F0EEE9",
"<+	c #EAE6D8",
"[+	c #E4DECC",
"}+	c #DBD5C2",
"|+	c #D2CBB8",
"1+	c #C8C2AE",
"2+	c #C7C1AB",
"3+	c #C9C3AB",
"4+	c #CBC4AA",
"5+	c #CDC5AA",
"6+	c #CDC5AB",
"7+	c #CDC6AB",
"8+	c #D0C9B1",
"9+	c #D3CDB8",
"0+	c #D7D2C0",
"a+	c #D1C9B7",
"b+	c #C8BCA8",
"c+	c #BFB098",
"d+	c #C0A88F",
"e+	c #C3A489",
"f+	c #C79F82",
"g+	c #AF886D",
"h+	c #8D6B53",
"i+	c #6C4E39",
"j+	c #4B3526",
"k+	c #2B1E17",
"l+	c #0B0807",
"m+	c #020202",
"n+	c #010101",
"o+	c #2E769E",
"p+	c #307195",
"q+	c #326A89",
"r+	c #34637D",
"s+	c #455C68",
"t+	c #5A5650",
"u+	c #704F38",
"v+	c #8B6449",
"w+	c #A88268",
"x+	c #C4A087",
"y+	c #D1B49F",
"z+	c #D9C5B6",
"A+	c #E1D7CD",
"B+	c #E8E1D9",
"C+	c #EEE9E2",
"D+	c #F4F1EB",
"E+	c #E7E2D2",
"F+	c #DFD8C2",
"G+	c #D0C9B2",
"H+	c #C0B9A1",
"I+	c #B0A990",
"J+	c #B0A88D",
"K+	c #B5AD90",
"L+	c #BBB192",
"M+	c #C1B798",
"N+	c #C7BE9F",
"O+	c #CEC5A7",
"P+	c #D3CBAF",
"Q+	c #D7D1B6",
"R+	c #DCD6BE",
"S+	c #D8D0B7",
"T+	c #D2C5AA",
"U+	c #CCBB9E",
"V+	c #C6AA8A",
"W+	c #BF9774",
"X+	c #B8845D",
"Y+	c #976A49",
"Z+	c #6D4C34",
"`+	c #432E1F",
" @	c #2B1D14",
".@	c #18110B",
"+@	c #050403",
"@@	c #2E759C",
"#@	c #2F7296",
"$@	c #306D8E",
"%@	c #306886",
"&@	c #3B5F71",
"*@	c #4A5659",
"=@	c #584C40",
"-@	c #7A6453",
";@	c #A28774",
">@	c #C9AA95",
",@	c #DBC1AE",
"'@	c #E6D4C6",
")@	c #F0E7DE",
"!@	c #ECE5DC",
"~@	c #E1DCD3",
"{@	c #D7D3C9",
"]@	c #CBC6B9",
"^@	c #BEB9A8",
"/@	c #B0AB96",
"(@	c #ADA791",
"_@	c #AEA890",
":@	c #AFA88F",
"<@	c #ADA58A",
"[@	c #AAA283",
"}@	c #A79E7D",
"|@	c #A79E80",
"1@	c #A79F84",
"2@	c #B3AB90",
"3@	c #C2BA9F",
"4@	c #D2C9AF",
"5@	c #D3C8AC",
"6@	c #D0C2A3",
"7@	c #CDBC9A",
"8@	c #C0A784",
"9@	c #B08C68",
"0@	c #A0724C",
"a@	c #7D5738",
"b@	c #553B26",
"c@	c #2D1F14",
"d@	c #1A120B",
"e@	c #0F0A06",
"f@	c #030201",
"g@	c #2E749A",
"h@	c #2E7298",
"i@	c #2F7094",
"j@	c #306E90",
"k@	c #366780",
"l@	c #3D5E6D",
"m@	c #45545A",
"n@	c #6B6D6B",
"o@	c #9C9289",
"p@	c #CBB6A7",
"q@	c #DECBBD",
"r@	c #E8DBCF",
"s@	c #F1EBE2",
"t@	c #E1DCD2",
"u@	c #B0A99B",
"v@	c #9B9585",
"w@	c #888272",
"x@	c #746F5F",
"y@	c #827D6B",
"z@	c #9B9682",
"A@	c #B5AF98",
"B@	c #B0AA8F",
"C@	c #A19A7C",
"D@	c #938A69",
"E@	c #888060",
"F@	c #7E765B",
"G@	c #746D55",
"H@	c #888067",
"I@	c #A59B81",
"J@	c #C3B79B",
"K@	c #CABD9E",
"L@	c #C9BC99",
"M@	c #C9BA94",
"N@	c #B6A27D",
"O@	c #9D825F",
"P@	c #846342",
"Q@	c #63472E",
"R@	c #3F2D1D",
"S@	c #1C140D",
"T@	c #090604",
"U@	c #020101",
"V@	c #2E7399",
"W@	c #316682",
"X@	c #325D73",
"Y@	c #5D7784",
"Z@	c #969D9F",
"`@	c #CFC3BA",
" #	c #E2D6CB",
".#	c #E9E2D9",
"+#	c #F1EEE7",
"@#	c #D6D2C8",
"##	c #88806D",
"$#	c #6B6352",
"%#	c #524B3D",
"&#	c #383428",
"*#	c #575345",
"=#	c #898474",
"-#	c #BBB6A2",
";#	c #B3AE95",
">#	c #999275",
",#	c #7E7755",
"'#	c #696243",
")#	c #554E35",
"!#	c #413B27",
"~#	c #5C543F",
"{#	c #887D63",
"]#	c #B4A587",
"^#	c #C0B290",
"/#	c #C3B58F",
"(#	c #C5B88E",
"_#	c #AC9E76",
":#	c #8A7956",
"<#	c #685337",
"[#	c #493824",
"}#	c #2A2015",
"|#	c #0B0905",
"1#	c #2E7197",
"2#	c #2E759B",
"3#	c #347598",
"4#	c #3D7492",
"5#	c #45748C",
"6#	c #6E8D9C",
"7#	c #A2AEB3",
"8#	c #D6D0C9",
"9#	c #DFD6CC",
"0#	c #DAD4C9",
"a#	c #D5D1C7",
"b#	c #BFB9AC",
"c#	c #A39988",
"d#	c #877964",
"e#	c #6A5E4B",
"f#	c #4C4436",
"g#	c #2E2A21",
"h#	c #514D42",
"i#	c #8A8576",
"j#	c #C2BDAA",
"k#	c #B7B19A",
"l#	c #968F75",
"m#	c #746D4F",
"n#	c #635B3F",
"o#	c #584F37",
"p#	c #4C422F",
"q#	c #62543E",
"r#	c #837156",
"s#	c #A48E6E",
"t#	c #AF9B78",
"u#	c #B2A27D",
"v#	c #B6AA82",
"w#	c #A69973",
"x#	c #8F815D",
"y#	c #786847",
"z#	c #574A32",
"A#	c #322B1D",
"B#	c #0E0C08",
"C#	c #040302",
"D#	c #020201",
"E#	c #010100",
"F#	c #2E7096",
"G#	c #3D7B9D",
"H#	c #5185A1",
"I#	c #658FA6",
"J#	c #8AA6B4",
"K#	c #B5C2C6",
"L#	c #E0DDD7",
"M#	c #C4BEB1",
"N#	c #AFA899",
"O#	c #9B8C79",
"P#	c #927F68",
"Q#	c #776754",
"R#	c #574C3F",
"S#	c #36312A",
"T#	c #58544A",
"U#	c #918C7E",
"V#	c #CAC4B1",
"W#	c #BBB59F",
"X#	c #948E76",
"Y#	c #6E674E",
"Z#	c #665D44",
"`#	c #695C46",
" $	c #6D5C47",
".$	c #78624B",
"+$	c #856B4F",
"@$	c #937453",
"#$	c #9A7F5D",
"$$	c #9E8B68",
"%$	c #A29774",
"&$	c #A09571",
"*$	c #9C8F69",
"=$	c #978861",
"-$	c #736749",
";$	c #453E2C",
">$	c #17140D",
",$	c #0A0905",
"'$	c #060603",
")$	c #2E6E94",
"!$	c #2E6F95",
"~$	c #2E7198",
"{$	c #4681A3",
"]$	c #6596B1",
"^$	c #85AABF",
"/$	c #A6BFCC",
"($	c #C7D4D9",
"_$	c #EAEAE6",
":$	c #9D846D",
"<$	c #86705E",
"[$	c #625448",
"}$	c #3E3732",
"|$	c #605B52",
"1$	c #989385",
"2$	c #D1CCB8",
"3$	c #BEB9A4",
"4$	c #928D78",
"5$	c #66614C",
"6$	c #695F4A",
"7$	c #7B6A55",
"8$	c #8E7660",
"9$	c #8E7057",
"0$	c #886548",
"a$	c #825A38",
"b$	c #856341",
"c$	c #8A7353",
"d$	c #8F8365",
"e$	c #9B916F",
"f$	c #A89D75",
"g$	c #B6A87C",
"h$	c #8F8461",
"i$	c #57503A",
"j$	c #1F1C13",
"k$	c #100E08",
"l$	c #0C0B06",
"m$	c #2E7097",
"n$	c #4D85A5",
"o$	c #77A1B8",
"p$	c #A0BDCA",
"q$	c #BBCDD2",
"r$	c #D1D9D8",
"s$	c #E7E6DE",
"t$	c #CAC6BC",
"u$	c #9C988C",
"v$	c #6E6B5C",
"w$	c #6C6453",
"x$	c #786B58",
"y$	c #85715E",
"z$	c #7D6A59",
"A$	c #6F5E51",
"B$	c #605349",
"C$	c #7F7468",
"D$	c #ACA596",
"E$	c #DAD5C4",
"F$	c #CAC5B2",
"G$	c #A6A08C",
"H$	c #827A65",
"I$	c #7E715C",
"J$	c #86725C",
"K$	c #8E735C",
"L$	c #83654D",
"M$	c #72533A",
"N$	c #614026",
"O$	c #654A30",
"P$	c #705D43",
"Q$	c #7B7156",
"R$	c #8F8565",
"S$	c #A59A73",
"T$	c #BCAF80",
"U$	c #9B9068",
"V$	c #686044",
"W$	c #363020",
"X$	c #252115",
"Y$	c #1D1A10",
"Z$	c #5489A6",
"`$	c #87AABA",
" %	c #BBCCCE",
".%	c #CED6D2",
"+%	c #D8D9D1",
"@%	c #E0DCCF",
"#%	c #BDBAAD",
"$%	c #8A8B81",
"%%	c #585C54",
"&%	c #515248",
"*%	c #585448",
"=%	c #605548",
"-%	c #6E5E50",
";%	c #7C6959",
">%	c #8B7563",
",%	c #A69483",
"'%	c #C5B9AA",
")%	c #E4DED1",
"!%	c #D9D4C4",
"~%	c #C1B9A5",
"{%	c #A99D86",
"]%	c #9A8A71",
"^%	c #8E7860",
"/%	c #82664E",
"(%	c #6C523B",
"_%	c #533C29",
":%	c #3A2717",
"<%	c #413221",
"[%	c #534834",
"}%	c #665E47",
"|%	c #80785A",
"1%	c #9D926B",
"2%	c #BAAD7D",
"3%	c #A2976B",
"4%	c #7A704E",
"5%	c #524830",
"6%	c #3F3724",
"7%	c #2E291B",
"8%	c #2E6E93",
"9%	c #2E6F94",
"0%	c #5C8DA7",
"a%	c #99B4BD",
"b%	c #D5DAD4",
"c%	c #E2E0D2",
"d%	c #DEDAC9",
"e%	c #DAD3C0",
"f%	c #AFAE9F",
"g%	c #787E76",
"h%	c #424E4C",
"i%	c #36403E",
"j%	c #383D38",
"k%	c #3C3A33",
"l%	c #5E5346",
"m%	c #8A7562",
"n%	c #B5977D",
"o%	c #CDB39D",
"p%	c #DDCEBE",
"q%	c #EDE8DF",
"r%	c #E9E3D6",
"s%	c #DDD2BE",
"t%	c #D0C1A7",
"u%	c #B6A287",
"v%	c #967E63",
"w%	c #765A3F",
"x%	c #553E29",
"y%	c #342518",
"z%	c #130D08",
"A%	c #1D1912",
"B%	c #373225",
"C%	c #504B38",
"D%	c #716A4E",
"E%	c #948A64",
"F%	c #B7AB7A",
"G%	c #A99D6E",
"H%	c #8B7F57",
"I%	c #6D6140",
"J%	c #584D32",
"K%	c #3D3623",
"L%	c #100E09",
"M%	c #4A7E98",
"N%	c #4F819A",
"O%	c #54869D",
"P%	c #5A8AA1",
"Q%	c #7FA2B1",
"R%	c #B0C2C4",
"S%	c #E0E1D7",
"T%	c #E4DFD0",
"U%	c #D9D3C0",
"V%	c #CDC6B0",
"W%	c #ADAA98",
"X%	c #868A7E",
"Y%	c #5F6963",
"Z%	c #575F5A",
"`%	c #5A5E57",
" &	c #5E5D53",
".&	c #7C7467",
"+&	c #A49482",
"@&	c #CCB39C",
"#&	c #DDC7B3",
"$&	c #E5D8C8",
"%&	c #EDE9DE",
"&&	c #E8E2D2",
"*&	c #DFD4BC",
"=&	c #D5C5A6",
"-&	c #BAA685",
";&	c #988260",
">&	c #765D3A",
",&	c #604C31",
"'&	c #4E4331",
")&	c #3C3931",
"!&	c #47453C",
"~&	c #5C584B",
"{&	c #716B59",
"]&	c #898166",
"^&	c #A29872",
"/&	c #BBAF7E",
"(&	c #ADA072",
"_&	c #92865C",
":&	c #786B47",
"<&	c #6D6244",
"[&	c #665F48",
"}&	c #5D594E",
"|&	c #625F55",
"1&	c #70939D",
"2&	c #7A9AA3",
"3&	c #87A3AA",
"4&	c #94ADB1",
"5&	c #ACBEBE",
"6&	c #C9D1CB",
"7&	c #E5E4D9",
"8&	c #E0DCCC",
"9&	c #D0CAB6",
"0&	c #BEB8A0",
"a&	c #AEAA94",
"b&	c #9E9D8C",
"c&	c #8D9184",
"d&	c #8D8F83",
"e&	c #929284",
"f&	c #979586",
"g&	c #ABA595",
"h&	c #C4B9A9",
"i&	c #DDCEBD",
"j&	c #E8DFD0",
"k&	c #E3DDC8",
"l&	c #D9CEB1",
"m&	c #CEBF9A",
"n&	c #B5A47B",
"o&	c #98845A",
"p&	c #7B6539",
"q&	c #776642",
"r&	c #7C7158",
"s&	c #827D6E",
"t&	c #8C887A",
"u&	c #979382",
"v&	c #A39D8A",
"w&	c #ADA68A",
"x&	c #B7AD88",
"y&	c #C0B486",
"z&	c #B0A375",
"A&	c #978A60",
"B&	c #7E714A",
"C&	c #817655",
"D&	c #8F886E",
"E&	c #A19C8A",
"F&	c #A4A08F",
"G&	c #A19D8B",
"H&	c #9E9986",
"I&	c #96A8A3",
"J&	c #A6B3AB",
"K&	c #BAC1B6",
"L&	c #CED0C1",
"M&	c #DADACA",
"N&	c #E2E1D2",
"O&	c #C6C0AB",
"P&	c #B0A98F",
"Q&	c #B6B19A",
"R&	c #BCB9A5",
"S&	c #C3BFAC",
"T&	c #CAC6B2",
"U&	c #DAD5C3",
"V&	c #EDE8DE",
"W&	c #EDE9DD",
"X&	c #E8E3D2",
"Y&	c #DED7BE",
"Z&	c #D3C8A6",
"`&	c #C7B98D",
" *	c #B1A271",
".*	c #988755",
"+*	c #7F6D38",
"@*	c #8E7F52",
"#*	c #ABA07F",
"$*	c #D0CBB7",
"%*	c #D3CDB9",
"&*	c #D5CFBB",
"**	c #D1CAAE",
"=*	c #CBC29E",
"-*	c #C5BA8D",
";*	c #B2A679",
">*	c #9A8E64",
",*	c #83764E",
"'*	c #938865",
")*	c #B1A98C",
"!*	c #CFCAB3",
"~*	c #C9C4AF",
"{*	c #B6B19D",
"]*	c #A29D89",
"^*	c #88948D",
"/*	c #969E93",
"(*	c #A9AB9C",
"_*	c #BCB8A5",
":*	c #CBC7B4",
"<*	c #DAD6C4",
"[*	c #E8E4D4",
"}*	c #C5BEA8",
"|*	c #AFA78C",
"1*	c #ABA389",
"2*	c #ACA68E",
"3*	c #AEA994",
"4*	c #B3AE99",
"5*	c #B8B39F",
"6*	c #D9D3C3",
"7*	c #E7E1D3",
"8*	c #E7E1D1",
"9*	c #E2DCC7",
"0*	c #D5CBA9",
"a*	c #C9BD90",
"b*	c #BFAF78",
"c*	c #A89760",
"d*	c #8D7D48",
"e*	c #736330",
"f*	c #817449",
"g*	c #9D9372",
"h*	c #B8B29B",
"i*	c #C3BDA7",
"j*	c #C7C1AA",
"k*	c #CBC5AE",
"l*	c #CAC2A6",
"m*	c #C7BE9A",
"n*	c #C5BA8E",
"o*	c #B2A67B",
"p*	c #9B8F64",
"q*	c #83774E",
"r*	c #8E8360",
"s*	c #A49C7E",
"t*	c #BAB49D",
"u*	c #B0AB97",
"v*	c #9B9683",
"w*	c #868270",
"x*	c #68726D",
"y*	c #737971",
"z*	c #818376",
"A*	c #908D7B",
"B*	c #A9A592",
"C*	c #C5C1AF",
"D*	c #E1DCCB",
"E*	c #D9D4C0",
"F*	c #C5BFA7",
"G*	c #B2AA8E",
"H*	c #A49C82",
"I*	c #98917A",
"J*	c #8C8672",
"K*	c #8B8672",
"L*	c #8F8976",
"M*	c #928C78",
"N*	c #A69F8B",
"O*	c #BFB6A2",
"P*	c #D9CEBA",
"Q*	c #DCD1B9",
"R*	c #D7CCAF",
"S*	c #D2C7A5",
"T*	c #B6A260",
"U*	c #9D8A4C",
"V*	c #7F6F39",
"W*	c #615327",
"X*	c #685C38",
"Y*	c #7B7255",
"Z*	c #8D8772",
"`*	c #99947E",
" =	c #A39D85",
".=	c #ACA58C",
"+=	c #B4AC8E",
"@=	c #BBB28E",
"#=	c #C2B88E",
"$=	c #B2A77C",
"%=	c #82764C",
"&=	c #817753",
"*=	c #888163",
"==	c #908A75",
"-=	c #847F6D",
";=	c #726E5D",
">=	c #5F5C4E",
",=	c #47504E",
"'=	c #4F554F",
")=	c #5A5B50",
"!=	c #656151",
"~=	c #878370",
"{=	c #B1AC99",
"]=	c #DBD6C2",
"^=	c #D8D2BC",
"/=	c #C6BFA5",
"(=	c #B4AC8F",
"_=	c #9C957A",
":=	c #827C65",
"<=	c #696450",
"[=	c #635E4B",
"}=	c #655F4C",
"|=	c #65604E",
"1=	c #817964",
"2=	c #A69A82",
"3=	c #CBBBA0",
"4=	c #D1C1A1",
"5=	c #CBBD97",
"6=	c #C6B98D",
"7=	c #BEAF78",
"8=	c #B5A260",
"9=	c #AD9647",
"0=	c #927D38",
"a=	c #71602B",
"b=	c #4F431D",
"c=	c #4E4526",
"d=	c #585137",
"e=	c #625C48",
"f=	c #706A54",
"g=	c #7F785F",
"h=	c #8E866A",
"i=	c #9E9676",
"j=	c #B0A681",
"k=	c #C1B68D",
"l=	c #B2A77D",
"m=	c #998E64",
"n=	c #80754B",
"o=	c #746B46",
"p=	c #6D6649",
"q=	c #66614B",
"r=	c #585443",
"s=	c #494637",
"t=	c #39372B",
"u=	c #3A4E55",
"v=	c #3F5054",
"w=	c #465352",
"x=	c #4D5650",
"y=	c #71766C",
"z=	c #9EA093",
"A=	c #CCCAB9",
"B=	c #CFCBB6",
"C=	c #C4BFA5",
"D=	c #BAB295",
"E=	c #9E987D",
"F=	c #7C7862",
"G=	c #5A5947",
"H=	c #585645",
"I=	c #615C4B",
"J=	c #6A6251",
"K=	c #7F745F",
"L=	c #998970",
"M=	c #B39E82",
"N=	c #B7A381",
"O=	c #B4A379",
"P=	c #B0A271",
"Q=	c #A89860",
"R=	c #9D8B4C",
"S=	c #816D30",
"T=	c #6D5B2D",
"U=	c #594929",
"V=	c #54472D",
"W=	c #534934",
"X=	c #524B3B",
"Y=	c #5F5947",
"Z=	c #716A54",
"`=	c #837B61",
" -	c #968D6C",
".-	c #A99E77",
"+-	c #BCB081",
"@-	c #AB9F72",
"#-	c #8D8259",
"$-	c #6F6540",
"%-	c #5F5638",
"&-	c #524C34",
"*-	c #464231",
"=-	c #3A372A",
"--	c #2F2D22",
";-	c #24221A",
">-	c #33566A",
",-	c #365567",
"'-	c #395562",
")-	c #3D555E",
"!-	c #607174",
"~-	c #8D9792",
"{-	c #BABDB0",
"]-	c #C4C3B0",
"^-	c #C3BEA6",
"/-	c #C1BA9D",
"(-	c #A29E84",
"_-	c #7A7A66",
":-	c #525648",
"<-	c #57574A",
"[-	c #6B6657",
"}-	c #7F7464",
"|-	c #897965",
"1-	c #8F7B64",
"2-	c #967E62",
"3-	c #98825E",
"4-	c #98855A",
"5-	c #988954",
"6-	c #8E7F48",
"7-	c #7F703A",
"8-	c #71612B",
"9-	c #6D5934",
"0-	c #6D573B",
"a-	c #63513C",
"b-	c #574A3A",
"c-	c #4A4338",
"d-	c #565042",
"e-	c #7E7760",
"f-	c #918868",
"g-	c #A3986D",
"h-	c #B6A872",
"i-	c #A19362",
"j-	c #7E724A",
"k-	c #5A5132",
"l-	c #463F28",
"m-	c #383322",
"n-	c #28261C",
"o-	c #201F17",
"p-	c #1A1913",
"q-	c #14130E",
"r-	c #2D5E7F",
"s-	c #2C5B79",
"t-	c #2C5772",
"u-	c #2C536B",
"v-	c #4E6C7A",
"w-	c #7C8F90",
"x-	c #A9B1A6",
"y-	c #BABBAA",
"z-	c #C1BEA8",
"A-	c #C9C1A5",
"B-	c #A7A48C",
"C-	c #787B6A",
"D-	c #495248",
"E-	c #55594F",
"F-	c #747062",
"G-	c #948676",
"H-	c #937F6B",
"I-	c #866E57",
"J-	c #795D42",
"K-	c #79603C",
"L-	c #7D683A",
"M-	c #816F38",
"N-	c #746531",
"O-	c #625528",
"P-	c #50441E",
"Q-	c #5A4A29",
"R-	c #6E573B",
"S-	c #81644E",
"T-	c #735B4A",
"U-	c #5B4B3F",
"V-	c #433B35",
"W-	c #4D483F",
"X-	c #635D4F",
"Y-	c #79735E",
"Z-	c #8D8462",
"`-	c #9F9262",
" ;	c #B1A063",
".;	c #978852",
"+;	c #6E623B",
"@;	c #453D24",
"#;	c #2E2918",
"$;	c #1C1A10",
"%;	c #0C0B08",
"&;	c #060605",
"*;	c #050504",
"=;	c #040403",
"-;	c #2A6084",
";;	c #2A5E80",
">;	c #295B7A",
",;	c #295775",
"';	c #466C80",
");	c #6D8892",
"!;	c #95A5A3",
"~;	c #ABB3A9",
"{;	c #BCBCAA",
"];	c #CCC6AB",
"^;	c #8C8C78",
"/;	c #65695A",
"(;	c #6B695B",
"_;	c #807565",
":;	c #95826F",
"<;	c #8A7663",
"[;	c #746250",
"};	c #5E4E3C",
"|;	c #68583F",
"1;	c #7C6D49",
"2;	c #908254",
"3;	c #827549",
"4;	c #695D38",
"5;	c #4F4527",
"6;	c #54462C",
"7;	c #634F39",
"8;	c #715847",
"9;	c #6F5849",
"0;	c #675447",
"a;	c #5F5145",
"b;	c #695D4C",
"c;	c #786E55",
"d;	c #887F5F",
"e;	c #93885E",
"f;	c #9D8F5A",
"g;	c #A79556",
"h;	c #897B45",
"i;	c #5E5430",
"j;	c #342E1B",
"k;	c #1F1C11",
"l;	c #12100A",
"m;	c #2A5F82",
"n;	c #2A5D7D",
"o;	c #416D87",
"p;	c #608395",
"q;	c #7F99A3",
"r;	c #9BAAAA",
"s;	c #B5BAAD",
"t;	c #CFC9B1",
"u;	c #C2BBA0",
"v;	c #A7A289",
"w;	c #8D8972",
"x;	c #897F69",
"y;	c #8C7A65",
"z;	c #8E7560",
"A;	c #7A6756",
"B;	c #5E554A",
"C;	c #43433E",
"D;	c #5B5A4E",
"E;	c #847F68",
"F;	c #ACA482",
"G;	c #9D9472",
"H;	c #585138",
"I;	c #514732",
"J;	c #534634",
"K;	c #554437",
"L;	c #634F41",
"M;	c #75604E",
"N;	c #87715B",
"O;	c #907C5F",
"P;	c #97865F",
"Q;	c #9D8F5F",
"R;	c #9E8F59",
"S;	c #9C8C51",
"T;	c #9B8949",
"U;	c #7A6C39",
"V;	c #4F4726",
"W;	c #252013",
"X;	c #14120B",
"Y;	c #0C0A07",
"Z;	c #2A6184",
"`;	c #2B6285",
" >	c #2C6286",
".>	c #3D6E8E",
"+>	c #537E99",
"@>	c #6A8DA3",
"#>	c #8BA2AB",
"$>	c #AEB7B1",
"%>	c #D2CDB7",
"&>	c #D0C7AC",
"*>	c #B5A88A",
"=>	c #A79477",
"->	c #977F64",
";>	c #886951",
">>	c #6A5849",
",>	c #494845",
"'>	c #273841",
")>	c #4D5C5E",
"!>	c #8B9187",
"~>	c #C9C5B0",
"{>	c #4F4837",
"]>	c #443C2F",
"^>	c #392F27",
"/>	c #57473A",
"(>	c #836C56",
"_>	c #AF9172",
":>	c #B89C72",
"<>	c #B59E69",
"[>	c #B3A060",
"}>	c #A99754",
"|>	c #9C8B48",
"1>	c #8F7E3C",
"2>	c #6B5E2D",
"3>	c #40381C",
"4>	c #15130C",
"5>	c #080706",
"6>	c #2B6286",
"7>	c #2C6387",
"8>	c #3A6C8D",
"9>	c #4C7794",
"0>	c #5E839C",
"a>	c #8098A3",
"b>	c #A8B1AB",
"c>	c #D3C7AA",
"d>	c #CABC9D",
"e>	c #C1B28F",
"f>	c #B09E7E",
"g>	c #9D886B",
"h>	c #897258",
"i>	c #6D6150",
"j>	c #4E524D",
"k>	c #30444A",
"l>	c #566769",
"m>	c #939B92",
"n>	c #D2CFBC",
"o>	c #C1BCA6",
"p>	c #97917B",
"q>	c #6D674F",
"r>	c #595441",
"s>	c #4C493C",
"t>	c #3F3E37",
"u>	c #5D5546",
"v>	c #8A785C",
"w>	c #B79B72",
"x>	c #BCA16E",
"y>	c #B59D60",
"z>	c #AD9953",
"A>	c #9F8D4A",
"B>	c #8F7E41",
"C>	c #7E6F39",
"D>	c #5D512A",
"E>	c #362F19",
"F>	c #0E0D09",
"G>	c #2A5F83",
"H>	c #2B6185",
"I>	c #376889",
"J>	c #45718D",
"K>	c #547991",
"L>	c #778F99",
"M>	c #A2A8A2",
"N>	c #CCC2AA",
"O>	c #D2C3A4",
"P>	c #CABC99",
"Q>	c #C2B58F",
"R>	c #B3A582",
"S>	c #A09374",
"T>	c #8E8066",
"U>	c #76725F",
"V>	c #5D645A",
"W>	c #435756",
"X>	c #667671",
"Y>	c #9CA497",
"Z>	c #D3D1BD",
"`>	c #C4BFA7",
" ,	c #797154",
".,	c #67634C",
"+,	c #5C5F4F",
"@,	c #515951",
"#,	c #6A6B59",
"$,	c #B49E6A",
"%,	c #B59D61",
"&,	c #AA9452",
"*,	c #9F8A42",
"=,	c #8F7D3D",
"-,	c #7E6E3B",
";,	c #6C5F39",
">,	c #4E452B",
",,	c #2D2719",
"',	c #0B0A07",
"),	c #2A5E82",
"!,	c #336585",
"~,	c #3E6B86",
"{,	c #4A6F87",
"],	c #6E858F",
"^,	c #9BA099",
"/,	c #C8BBA2",
"(,	c #D0BF9F",
"_,	c #CABB97",
":,	c #C4B78E",
"<,	c #B5AB86",
"[,	c #A49D7E",
"},	c #928F75",
"|,	c #7F826E",
"1,	c #6B7667",
"2,	c #576A61",
"3,	c #768479",
"4,	c #A5AB9B",
"5,	c #D5D2BD",
"6,	c #C8C1A8",
"7,	c #A69E80",
"8,	c #847B58",
"9,	c #757356",
"0,	c #6C7361",
"a,	c #63756C",
"b,	c #76816B",
"c,	c #939067",
"d,	c #B0A062",
"e,	c #AD9954",
"f,	c #9F8A43",
"g,	c #917C32",
"h,	c #806D31",
"i,	c #6D5E35",
"j,	c #5A4F39",
"k,	c #40392B",
"l,	c #242018",
"m,	c #080705",
"n,	c #2A5D81",
"o,	c #2C5E80",
"p,	c #2E5F80",
"q,	c #31607F",
"r,	c #416984",
"s,	c #56768A",
"t,	c #6A8290",
"u,	c #858E90",
"v,	c #A29B8E",
"w,	c #C0A78B",
"x,	c #C1A886",
"y,	c #B8A47F",
"z,	c #B0A079",
"A,	c #A99E78",
"B,	c #A39B79",
"C,	c #9D997A",
"D,	c #919276",
"E,	c #838971",
"F,	c #75806C",
"G,	c #8C937E",
"H,	c #AFB098",
"I,	c #D2CDB3",
"J,	c #C8C0A2",
"K,	c #AFA683",
"L,	c #978C65",
"M,	c #8A8561",
"N,	c #828467",
"O,	c #7A846D",
"P,	c #848968",
"Q,	c #96905F",
"R,	c #A69756",
"S,	c #9D8B49",
"T,	c #8C7839",
"U,	c #7A6629",
"V,	c #73602F",
"W,	c #6F5D3C",
"X,	c #6B5B48",
"Y,	c #584C3F",
"Z,	c #41382F",
"`,	c #2A241F",
" '	c #1E1A17",
".'	c #14110F",
"+'	c #050404",
"@'	c #2A5C80",
"#'	c #2E5D7D",
"$'	c #345E7A",
"%'	c #395E78",
"&'	c #547083",
"*'	c #778792",
"='	c #999EA1",
"-'	c #A79E97",
";'	c #AE9683",
">'	c #B68F6F",
",'	c #AE8A66",
"''	c #A18561",
")'	c #94815C",
"!'	c #988964",
"~'	c #A19570",
"{'	c #AAA27C",
"]'	c #A6A17D",
"^'	c #9F9C79",
"/'	c #979777",
"('	c #A5A382",
"_'	c #BAB493",
":'	c #CEC5A4",
"<'	c #C8BE9A",
"['	c #B9AE88",
"}'	c #AB9F75",
"|'	c #A2986D",
"1'	c #9A9469",
"2'	c #929065",
"3'	c #938E5C",
"4'	c #978C53",
"5'	c #9A8B49",
"6'	c #8B7A3D",
"7'	c #756431",
"8'	c #604E24",
"9'	c #675431",
"0'	c #776247",
"a'	c #86715D",
"b'	c #7D695A",
"c'	c #6B5B4F",
"d'	c #594C43",
"e'	c #463B35",
"f'	c #2D2622",
"g'	c #0A0908",
"h'	c #2A5B7E",
"i'	c #305C7A",
"j'	c #395D75",
"k'	c #425D70",
"l'	c #687781",
"m'	c #98999A",
"n'	c #C8BBB2",
"o'	c #C9AE9D",
"p'	c #BA9378",
"q'	c #AC7753",
"r'	c #9B6C48",
"s'	c #896644",
"t'	c #786141",
"u'	c #877451",
"v'	c #9F8F68",
"w'	c #B8AA7E",
"x'	c #BCB083",
"y'	c #BBAF82",
"z'	c #B9AE81",
"A'	c #BEB286",
"B'	c #C4B88E",
"C'	c #CABD95",
"D'	c #C8BB92",
"E'	c #C3B68B",
"F'	c #BFB285",
"G'	c #B9AB79",
"H'	c #B2A46B",
"I'	c #AB9C5D",
"J'	c #A29251",
"K'	c #988846",
"L'	c #8E7D3B",
"M'	c #796831",
"N'	c #5F4F28",
"O'	c #46361E",
"P'	c #5B4833",
"Q'	c #7E6753",
"R'	c #A28672",
"S'	c #A18775",
"T'	c #957D6E",
"U'	c #887467",
"V'	c #6B5B51",
"W'	c #423832",
"X'	c #0F0D0B",
"Y'	c #2A5A7C",
"Z'	c #325C79",
"`'	c #3C5D74",
" )	c #465F70",
".)	c #6B757C",
"+)	c #98928F",
"@)	c #C6B0A1",
"#)	c #BFA08B",
"$)	c #A78168",
"%)	c #8F6245",
"&)	c #7D593E",
"*)	c #6D563F",
"=)	c #5D5441",
"-)	c #6B6650",
";)	c #827E65",
">)	c #999779",
",)	c #A39E7B",
"')	c #A79F77",
"))	c #ACA073",
"!)	c #B0A376",
"~)	c #B3A67A",
"{)	c #B6A97F",
"])	c #B5A87E",
"^)	c #B3A67B",
"/)	c #B1A478",
"()	c #AA9D6D",
"_)	c #A0925F",
":)	c #968851",
"<)	c #8A7D47",
"[)	c #7D723F",
"})	c #706737",
"|)	c #5F5732",
"1)	c #4B462E",
"2)	c #38352A",
"3)	c #4F4439",
"4)	c #735E4E",
"5)	c #977864",
"6)	c #9C7D68",
"7)	c #977A67",
"8)	c #917765",
"9)	c #715D4F",
"0)	c #43372F",
"a)	c #0E0C0A",
"b)	c #335C79",
"c)	c #3E5F75",
"d)	c #4A6272",
"e)	c #697176",
"f)	c #8F847D",
"g)	c #B49884",
"h)	c #A78872",
"i)	c #896B57",
"j)	c #6B4F3C",
"k)	c #5B493B",
"l)	c #4F4A43",
"m)	c #434C4B",
"n)	c #4C5956",
"o)	c #5C6A64",
"p)	c #6C7A71",
"q)	c #79806E",
"r)	c #848265",
"s)	c #8F855C",
"t)	c #95885E",
"u)	c #998C62",
"v)	c #9D9067",
"w)	c #9C8F66",
"x)	c #988C61",
"y)	c #8E8358",
"z)	c #80764E",
"A)	c #726943",
"B)	c #65603E",
"C)	c #595739",
"D)	c #4C4E36",
"E)	c #424737",
"F)	c #384139",
"G)	c #2F3B3C",
"H)	c #434340",
"I)	c #625145",
"J)	c #805F49",
"K)	c #89664E",
"L)	c #8B6A53",
"M)	c #8D6E58",
"N)	c #6D5645",
"O)	c #3E3127",
"P)	c #0D0A08",
"Q)	c #345D7A",
"R)	c #416177",
"S)	c #4E6474",
"T)	c #676D70",
"U)	c #85766C",
"V)	c #A38068",
"W)	c #8F6F59",
"X)	c #6C5546",
"Y)	c #483B33",
"Z)	c #393938",
"`)	c #303E46",
" !	c #284454",
".!	c #2C4C5C",
"+!	c #365563",
"@!	c #3F5E6A",
"#!	c #4F6361",
"$!	c #616653",
"%!	c #726A45",
"&!	c #7A6E46",
"*!	c #7F734A",
"=!	c #83774F",
"-!	c #80744A",
";!	c #726944",
">!	c #5F5A3D",
",!	c #4D4B35",
"'!	c #404234",
")!	c #343B34",
"!!	c #283435",
"~!	c #25363C",
"{!	c #253B46",
"]!	c #25414F",
"^!	c #374347",
"/!	c #50453A",
"(!	c #6A462E",
"_!	c #774E33",
":!	c #80593E",
"<!	c #88654A",
"[!	c #684E3A",
"}!	c #3A2C20",
"|!	c #0C0907",
"1!	c #325C7A",
"2!	c #3C5F78",
"3!	c #466276",
"4!	c #58656F",
"5!	c #6D6865",
"6!	c #816B5B",
"7!	c #715E50",
"8!	c #544B45",
"9!	c #373939",
"0!	c #2D3941",
"a!	c #284150",
"b!	c #23485F",
"c!	c #264E66",
"d!	c #2C546B",
"e!	c #325A6F",
"f!	c #3E5D68",
"g!	c #4D605C",
"h!	c #5B6351",
"i!	c #6D6E55",
"j!	c #7F7B5E",
"k!	c #928967",
"l!	c #8D835F",
"m!	c #635E41",
"n!	c #4F513F",
"o!	c #3C453D",
"p!	c #324040",
"q!	c #2A3E45",
"r!	c #223C4A",
"s!	c #224152",
"t!	c #24485C",
"u!	c #254E64",
"v!	c #334D5B",
"w!	c #454A4B",
"x!	c #57473B",
"y!	c #604C3C",
"z!	c #675343",
"A!	c #6E5B4A",
"B!	c #554A3F",
"C!	c #32302D",
"D!	c #0F171B",
"E!	c #061117",
"F!	c #2A597B",
"G!	c #2E5B7B",
"H!	c #395F79",
"I!	c #435D6F",
"J!	c #4F5A62",
"K!	c #5B5754",
"L!	c #504F4D",
"M!	c #3E464A",
"N!	c #2D3C46",
"O!	c #283F4F",
"P!	c #27485D",
"Q!	c #25506B",
"R!	c #275572",
"S!	c #2B5A76",
"T!	c #2E5E7A",
"U!	c #356075",
"V!	c #3E616F",
"W!	c #466269",
"X!	c #647672",
"Y!	c #899080",
"Z!	c #AFA98F",
"`!	c #A39C7E",
" ~	c #585844",
".~	c #454F48",
"+~	c #32474B",
"@~	c #2B4853",
"#~	c #294C5D",
"$~	c #275067",
"%~	c #27556F",
"&~	c #285A75",
"*~	c #295E7B",
"=~	c #315B72",
"-~	c #3A5665",
";~	c #445157",
">~	c #485052",
",~	c #4A5050",
"'~	c #4C504F",
")~	c #3D4648",
"!~	c #293840",
"~~	c #142B38",
"{~	c #0F2836",
"]~	c #29587A",
"^~	c #2C5B7C",
"/~	c #2D5C7C",
"(~	c #2F556F",
"_~	c #314C5E",
":~	c #34434C",
"<~	c #2F404B",
"[~	c #29404E",
"}~	c #223F52",
"|~	c #23455D",
"1~	c #254F6A",
"2~	c #285878",
"3~	c #295D7D",
"4~	c #2A5F80",
"5~	c #2C6284",
"6~	c #2D6283",
"7~	c #2F6281",
"8~	c #306280",
"9~	c #5B7E8F",
"0~	c #93A4A3",
"a~	c #CBCAB7",
"b~	c #B9B49D",
"c~	c #4D5248",
"d~	c #3A4D50",
"e~	c #27495A",
"f~	c #254F67",
"g~	c #285A76",
"h~	c #2C6585",
"i~	c #2D698B",
"j~	c #2D6C8E",
"k~	c #2D6E92",
"l~	c #2F698A",
"m~	c #30627E",
"n~	c #325B72",
"o~	c #305468",
"p~	c #2C4C5E",
"q~	c #2A4553",
"r~	c #254251",
"s~	c #1F4052",
"t~	c #193F54",
"u~	c #183E54",
"v~	c #28587B",
"w~	c #29597B",
"x~	c #2A5472",
"y~	c #2A4C64",
"z~	c #2A4456",
"A~	c #284356",
"B~	c #25455A",
"C~	c #22465E",
"D~	c #234C67",
"E~	c #265372",
"F~	c #295C7C",
"G~	c #2A5F81",
"H~	c #2A6083",
"I~	c #567E94",
"J~	c #8EA4A7",
"K~	c #C6C9BA",
"L~	c #B4B19F",
"M~	c #888574",
"N~	c #5C5949",
"O~	c #444D47",
"P~	c #344C54",
"Q~	c #244B61",
"R~	c #24536F",
"S~	c #285F7E",
"T~	c #2D6B8D",
"U~	c #2E6F93",
"V~	c #2E7095",
"W~	c #2E7297",
"X~	c #2E6E92",
"Y~	c #2E6989",
"Z~	c #2E6381",
"`~	c #2B5D79",
" {	c #275670",
".{	c #244F66",
"+{	c #224E66",
"@{	c #215069",
"#{	c #1F526D",
"${	c #205471",
"%{	c #215A79",
"&{	c #28597C",
"*{	c #2A5A7A",
"={	c #2A5674",
"-{	c #2A526D",
";{	c #2A4D65",
">{	c #294D65",
",{	c #274D68",
"'{	c #254E6A",
"){	c #265270",
"!{	c #285777",
"~{	c #2A5D7E",
"{{	c #2B6386",
"]{	c #527C92",
"^{	c #859DA2",
"/{	c #B7BEB2",
"({	c #A4A696",
"_{	c #7A7B6D",
":{	c #505044",
"<{	c #3C4846",
"[{	c #304A55",
"}{	c #234D65",
"|{	c #245673",
"1{	c #286181",
"2{	c #2D6C8F",
"3{	c #2E6D91",
"4{	c #2E6B8D",
"5{	c #2C6888",
"6{	c #2A6483",
"7{	c #29607E",
"8{	c #28607F",
"9{	c #276282",
"0{	c #266485",
"a{	c #26678A",
"b{	c #286D92",
"c{	c #285A7D",
"d{	c #28597A",
"e{	c #295879",
"f{	c #295877",
"g{	c #295776",
"h{	c #295674",
"i{	c #295675",
"j{	c #295676",
"k{	c #285677",
"l{	c #2A5B7D",
"m{	c #2A5D80",
"n{	c #2B6487",
"o{	c #4E7990",
"p{	c #7B969C",
"q{	c #A9B2A8",
"r{	c #959A8E",
"s{	c #6C7067",
"t{	c #434740",
"u{	c #334244",
"v{	c #2B4856",
"w{	c #234F69",
"x{	c #245977",
"y{	c #296384",
"z{	c #2D6D91",
"A{	c #2E7196",
"B{	c #2E7398",
"C{	c #2D7297",
"D{	c #2D7196",
"E{	c #2D7298",
"F{	c #2D749B",
"G{	c #2D769D",
"H{	c #2D779F",
"I{	c #2C79A1",
"J{	c #2A7AA4",
". . . .                                       + @ # $ % &                                       ",
". . . .                                       + @ # $ % &                                       ",
". . . .                                       + @ # $ % &                                       ",
"* * * *                                     = - ; > , ' )                                       ",
"! ! ! ~ {                                   ] ^ / ( _ : < [ }                                   ",
"| | | 1 2 3 4 5                             6 7 8 9 0 a b c }                                   ",
"d d d e f g h i j k l m n                 o p q r s t u v w x y             z A B C D E         ",
"F F F G H I J K L M N O P Q         R S T U V W X Y Z `  ...+.@.        #.$.%.&.*.=.-.;.>.,.    ",
"'.'.'.g ).!.~.{.].^./.(._.:.<.[.}.|.1.2.3.4.5.6.7.8.9.0.a.b.c.d.e.f.g.h.i.j.k.l.m.n.o.p.q.r.,.  ",
"s.s.s.t.u.v.w.x.y.z.A.B.C.D.E.F.G.H.I.5.J.K.L.M.N.O.P.Q.R.S.T.U.V.W.X.Y.Z.`. +.+++@+#+$+%+&+*+  ",
"=+=+=+-+;+>+,+'+)+!+~+{+]+^+/+(+_+:+2.<+[+}+|+1+2+3+4+5+6+7+8+9+0+a+b+c+d+e+f+g+h+i+j+k+l+m+n+  ",
"o+o+o+p+q+r+s+t+u+v+w+x+y+z+A+B+C+D+6.E+F+G+H+I+J+K+L+M+N+O+P+Q+R+S+T+U+V+W+X+Y+Z+`+ @.@+@} } } ",
"@@@@@@#@$@%@&@*@=@-@;@>@,@'@)@!@~@{@]@^@/@(@_@:@<@[@}@}@|@1@2@3@4@5@6@7@8@9@0@a@b@c@d@e@f@} }   ",
"g@g@g@h@i@j@k@l@m@n@o@p@q@r@s@t@W.u@v@w@x@y@z@A@B@C@D@E@F@G@H@I@J@K@L@M@N@O@P@Q@R@S@e@T@U@}     ",
"h@h@h@V@V@g@j@W@X@Y@Z@`@ #.#+#@#u@##$#%#&#*#=#-#;#>#,#'#)#!#~#{#]#^#/#(#_#:#<#[#}#|#f@U@} }     ",
"1#1#1#h@V@2#3#4#5#6#7#8#9#0#a#b#c#d#e#f#g#h#i#j#k#l#m#n#o#p#q#r#s#t#u#v#w#x#y#z#A#B#C#D#E#      ",
"F#F#F#1#h@V@G#H#I#J#K#L#0#M#N#c#O#P#Q#R#S#T#U#V#W#X#Y#Z#`# $.$+$@$#$$$%$&$*$=$-$;$>$,$'$D#      ",
")$)$)$!$1#~${$]$^$/$($_$a#N###d#P#:$<$[$}$|$1$2$3$4$5$6$7$8$9$0$a$b$c$d$e$f$g$h$i$j$k$l$        ",
")$)$)$!$F#m$n$o$p$q$r$s$t$u$v$w$x$y$z$A$B$C$D$E$F$G$H$I$J$K$L$M$N$O$P$Q$R$S$T$U$V$W$X$Y$        ",
")$)$)$)$!$F#Z$`$ %.%+%@%#%$%%%&%*%=%-%;%>%,%'%)%!%~%{%]%^%/%(%_%:%<%[%}%|%1%2%3%4%5%6%7%        ",
"8%8%8%)$9%F#0%a%b%c%d%e%f%g%h%i%j%k%l%m%n%o%p%q%r%s%t%u%v%w%x%y%z%A%B%C%D%E%F%G%H%I%J%K%L%      ",
"M%M%M%N%O%P%Q%R%S%T%U%V%W%X%Y%Z%`% &.&+&@&#&$&%&&&*&=&-&;&>&,&'&)&!&~&{&]&^&/&(&_&:&<&[&}&|&    ",
"1&1&1&2&3&4&5&6&7&8&9&0&a&b&c&d&e&f&g&h&i&$&j&<+k&l&m&n&o&p&q&r&s&t&u&v&w&x&y&z&A&B&C&D&E&F&G&H&",
"I&I&I&J&K&L&M&N&7.X O&P&I+Q&R&S&T&2$U&)%V&W&<+X&Y&Z&`& *.*+*@*#*2+$*%*&***=*-*;*>*,*'*)*!*~*{*]*",
"^*^*^*/*(*_*:*<*[*<*}*|*1*2*3*4*5*3$F$6*7*8*9*Y&0*a*b*c*d*e*f*g*h*i*j*k*l*m*n*o*p*q*r*s*t*u*v*w*",
"x*x*x*y*z*A*B*C*D*E*F*G*H*I*J*K*L*M*N*O*P*Q*R*S*a*b*T*U*V*W*X*Y*Z*`* =.=+=@=#=$=>*%=&=*===-=;=>=",
",=,=,='=)=!=~={=]=^=/=(=_=:=<=[=}=|=1=2=3=4=5=6=7=8=9=0=a=b=c=d=e=f=g=h=i=j=k=l=m=n=o=p=q=r=s=t=",
"u=u=u=v=w=x=y=z=A=B=C=D=E=F=G=H=I=J=K=L=M=N=O=P=Q=R=0=S=T=U=V=W=X=Y=Z=`= -.-+-@-#-$-%-&-*-=---;-",
">->->-,-'-)-!-~-{-]-^-/-(-_-:-<-[-}-|-1-2-3-4-5-6-7-8-T=9-0-a-b-c-d-0 e-f-g-h-i-j-k-l-m-n-o-p-q-",
"r-r-r-s-t-u-v-w-x-y-z-A-B-C-D-E-F-G-H-I-J-K-L-M-N-O-P-Q-R-S-T-U-V-W-X-Y-Z-`- ;.;+;@;#;$;%;&;*;=;",
"-;-;-;;;>;,;';);!;~;{;];;#^;/;(;_;:;<;[;};|;1;2;3;4;5;6;7;8;9;0;a;b;c;d;e;f;g;h;i;j;k;l;C#} } } ",
"-;-;-;m;;;n;o;p;q;r;s;t;u;v;w;x;y;z;A;B;C;D;E;F;G;Y*H;I;J;K;L;M;N;O;P;Q;R;S;T;U;V;W;X;Y;D#} }   ",
"-;-;-;Z;`; >.>+>@>#>$>%>&>J@*>=>->;>>>,>'>)>!>~>h*Z*e={>]>^>/>(>_>:><>[>}>|>1>2>3>4>5>+@n+}     ",
"-;-;-;-;6>7>8>9>0>a>b>G+c>d>e>f>g>h>i>j>k>l>m>n>o>p>q>r>s>t>u>v>w>x>y>z>A>B>C>D>E>F>&+m+} }     ",
"G>G>G>-;H> >I>J>K>L>M>N>O>P>Q>R>S>T>U>V>W>X>Y>Z>`>E= ,.,+,@,#,h$$,%,&,*,=,-,;,>,,,',m+n+}       ",
"),),),G>-;H>!,~,{,],^,/,(,_,:,<,[,},|,1,2,3,4,5,6,7,8,9,0,a,b,c,d,e,f,g,h,i,j,k,l,m,} } }       ",
"n,n,n,o,p,q,r,s,t,u,v,w,x,y,z,A,B,C,D,E,F,G,H,I,J,K,L,M,N,O,P,Q,R,S,T,U,V,W,X,Y,Z,`, '.'+'      ",
"@'@'@'#'$'%'&'*'='-';'>',''')'!'~'{']'^'/'('_':'<'['}'|'1'2'3'4'5'6'7'8'9'0'a'b'c'd'e'f'g'      ",
"h'h'h'i'j'k'l'm'n'o'p'q'r's't'u'v'w'x'y'z'A'B'C'D'E'F'G'H'I'J'K'L'M'N'O'P'Q'R'S'T'U'V'W'X'}     ",
"Y'Y'Y'Z'`' ).)+)@)#)$)%)&)*)=)-);)>),)')))!)~){)])^)/)()_):)<)[)})|)1)2)3)4)5)6)7)8)9)0)a)}     ",
"Y'Y'Y'b)c)d)e)f)g)h)i)j)k)l)m)n)o)p)q)r)s)t)u)v)w)>*x)y)z)A)B)C)D)E)F)G)H)I)J)K)L)M)N)O)P)}     ",
"Y'Y'Y'Q)R)S)T)U)V)W)X)Y)Z)`) !.!+!@!#!$!%!&!*!=!q*%=-!;!>!,!'!)!!!~!{!]!^!/!(!_!:!<![!}!|!}     ",
"Y'Y'Y'1!2!3!4!5!6!7!8!9!0!a!b!c!d!e!f!g!h!i!j!k!l!&=o=m!n!o!p!q!r!s!t!u!v!w!x!y!z!A!B!C!D!E!    ",
"F!F!F!G!Q)H!I!J!K!L!M!N!O!P!Q!R!S!T!U!V!W!X!Y!Z!`!*=p= ~.~+~@~#~$~%~&~*~=~-~;~>~,~'~)~!~~~{~    ",
"]~]~]~F!^~/~(~_~:~<~[~}~|~1~2~3~4~5~6~7~8~9~0~a~b~==q=c~d~e~f~g~h~i~j~k~l~m~n~o~p~q~r~s~t~u~    ",
"v~v~v~w~Y'Y'x~y~z~A~B~C~D~E~F~G~H~6>6>6>6>I~J~K~L~M~N~O~P~Q~R~S~T~U~V~W~X~Y~Z~`~ {.{+{@{#{${%{  ",
"&{&{&{&{w~*{={-{;{>{,{'{){!{~{m;H~`;6>6>{{]{^{/{({_{:{<{[{}{|{1{2{9%F#h@V~3{4{5{6{7{8{9{0{a{b{  ",
"c{c{c{&{d{e{f{g{h{i{j{k{]~l{m{m;H~H>6>6>n{o{p{q{r{s{t{u{v{w{x{y{z{V~A{h@h@B{V@h@C{D{E{F{G{H{I{J{"};
