<?xml version="1.0" encoding="UTF-8" standalone="no"?>
<!DOCTYPE svg PUBLIC "-//W3C//DTD SVG 20010904//EN"
"http://www.w3.org/TR/2001/REC-SVG-20010904/DTD/svg10.dtd">
<!-- Created with Sodipodi ("http://www.sodipodi.com/") -->
<svg
   xmlns="http://www.w3.org/2000/svg"
   xmlns:sodipodi="http://sodipodi.sourceforge.net/DTD/sodipodi-0.dtd"
   xmlns:xlink="http://www.w3.org/1999/xlink"
   xmlns:inkscape="http://www.inkscape.org/namespaces/inkscape"
   version="1"
   x="0.00000000"
   y="0.00000000"
   width="48pt"
   height="48pt"
   id="svg548"
   sodipodi:version="0.34"
   sodipodi:docname="/home/zeus/gartoon-stock.0.1/stock_goto-first.svg"
   sodipodi:docbase="/home/zeus/gartoon-stock.0.1/"
   inkscape:version="0.37">
  <sodipodi:namedview
     id="base"
     inkscape:zoom="9.65625000"
     inkscape:cx="16.0000000"
     inkscape:cy="28.4271845"
     inkscape:window-width="1014"
     inkscape:window-height="696"
     inkscape:window-x="0"
     inkscape:window-y="0" />
  <defs
     id="defs550">
    <linearGradient
       x1="0.00000000"
       y1="0.00000000"
       x2="1.00000000"
       y2="0.00000000"
       id="linearGradient556"
       gradientUnits="objectBoundingBox"
       spreadMethod="pad">
      <stop
         style="stop-color:#ff8700;stop-opacity:1;"
         offset="0.00000000"
         id="stop557" />
      <stop
         style="stop-color:#ffff8d;stop-opacity:0;"
         offset="1.00000000"
         id="stop558" />
    </linearGradient>
    <linearGradient
       x1="0.00000000"
       y1="0.00000000"
       x2="1.00000000"
       y2="0.00000000"
       id="linearGradient559"
       xlink:href="#linearGradient556"
       gradientUnits="objectBoundingBox"
       spreadMethod="pad" />
  </defs>
  <path
     d="M 11.85722 30.95554 C 12.79752 35.92092 29.54074 54.7964 32.88519 52.72621 C 39.2021 50.49357 37.48002 43.20359 39.91039 41.73498 C 42.41927 40.80106 55.93267 43.30066 57.71716 40.14985 C 60.27322 33.31727 60.70069 20.56276 54.52323 17.18356 C 48.17001 15.16217 37.77057 19.14048 36.73078 15.49965 C 35.69101 11.85883 33.37459 9.847803 31.46774 10.26044 C 29.56089 10.67309 10.18098 25.80209 11.85722 30.95554 z "
     style="font-size:12;fill:#0d3c07;fill-rule:evenodd;"
     id="path582" />
  <path
     d="M 17.35294 30.91572 C 17.9017 34.66033 28.90063 47.7424 31.63768 45.97529 C 34.37486 44.20809 33.34652 38.46756 35.37501 37.61536 C 37.40362 36.76306 53.53191 37.56733 53.76069 34.65646 C 53.98967 31.74563 54.97406 21.851 52.50035 21.58171 C 50.02644 21.31238 34.03628 24.00567 33.35584 21.27927 C 32.6754 18.55287 33.07043 15.49826 31.54044 15.91884 C 30.01044 16.3394 16.22749 27.06787 17.35294 30.91572 z "
     style="font-size:12;fill:#2aaf18;fill-rule:evenodd;"
     id="path581" />
  <path
     d="M 53.93627 33.29886 C 53.93627 33.29886 54.1621 36.11749 51.31196 36.47532 C 48.46203 36.83318 34.88591 36.83326 34.58807 37.99534 C 34.43759 41.441 32.37146 47.14834 30.5184 46.64303 C 27.22326 45.87939 17.45649 33.53884 17.14288 31.399 C 16.82946 29.25921 27.01615 40.63317 29.96339 38.38268 C 32.91062 36.1322 31.87284 31.60564 34.26828 31.33992 C 36.66361 31.07428 53.14306 29.1631 53.54447 30.62414 C 53.94579 32.08504 53.39387 34.06989 53.93627 33.29886 z "
     style="font-size:12;fill:#208c11;fill-rule:evenodd;"
     id="path583" />
  <path
     d="M 52.61528 24.49631 C 52.61528 24.49631 34.87863 23.57773 34.12607 24.83215 C 33.37362 26.08648 48.49543 28.96769 52.61528 24.49631 z "
     style="font-size:12;fill:#ffffff;fill-rule:evenodd;"
     id="path588" />
  <path
     d="M 20.11107 28.22631 C 20.11107 28.22631 26.89906 20.23907 28.59534 19.67453 C 30.29153 19.11011 29.35414 22.93582 29.35414 22.93582 C 29.35414 22.93582 20.74125 26.77646 20.11107 28.22631 z "
     style="font-size:12;fill:#ffffff;fill-rule:evenodd;"
     id="path589" />
  <path
     style="font-size:12;fill:#0d3c07;fill-rule:evenodd;stroke-width:1;"
     d="M 12.19186 7.779333 L 7.908722 7.256003 C 5.783539 7.118753 4.48322 7.029553 1.662942 7.306823 L 2.258093 51.65822 C 5.028808 52.51971 6.083124 52.77088 8.528266 52.2959 C 10.27524 51.74839 8.947822 52.23026 11.23618 51.30184 C 11.42971 51.81558 12.89668 9.577323 12.19186 7.779333 z "
     id="path590"
     sodipodi:nodetypes="ccccccc" />
  <path
     style="font-size:12;fill:#2aaf18;fill-rule:evenodd;stroke-width:1;"
     d="M 9.333772 9.538043 C 8.481031 9.142253 7.630353 9.073183 6.779689 9.004123 C 5.929012 8.935053 5.169081 8.811153 4.22972 9.123643 L 4.491111 50.50701 C 5.237983 50.96677 5.983107 51.15426 6.727228 51.17839 C 7.471334 51.20251 7.895928 51.11907 8.955793 50.65181 L 9.333772 9.538043 z "
     id="path591"
     sodipodi:nodetypes="ccccccc" />
  <path
     style="font-size:12;fill:#208c11;fill-rule:evenodd;stroke-width:1;"
     d="M 4.718027 9.611673 L 4.891437 50.12418 C 4.891437 50.12418 5.728082 50.37936 6.568501 50.4167 C 7.408921 50.45405 8.253129 50.27356 8.273745 50.27348 C 8.314977 50.27331 8.434202 49.56491 7.851065 48.64164 C 7.191333 47.65811 6.086982 48.90821 6.07418 48.05004 L 5.502165 9.717323 C 5.498597 9.478623 4.7149 8.883323 4.718027 9.611673 z "
     id="path592"
     sodipodi:nodetypes="ccssssss" />
  <path
     style="font-size:12;fill:#ffffff;fill-rule:evenodd;stroke-width:1;"
     d="M 8.728396 10.29233 C 7.998402 9.277003 6.796137 9.863923 6.796596 9.936653 C 7.661424 13.20635 7.583443 29.50035 7.583443 29.50035 C 7.758644 30.19065 8.01467 32.40591 8.174862 32.44385 C 8.316614 32.4774 8.481418 30.35272 8.489277 29.71481 L 8.728396 10.29233 z "
     id="path577"
     sodipodi:nodetypes="ccsssc" />
</svg>
