<?xml version="1.0" encoding="UTF-8" standalone="no"?>
<!DOCTYPE svg PUBLIC "-//W3C//DTD SVG 1.0//EN"
"http://www.w3.org/TR/2001/REC-SVG-20010904/DTD/svg10.dtd">
<!-- Created with Sodipodi ("http://www.sodipodi.com/") -->
<svg
   id="svg665"
   sodipodi:version="0.34"
   xmlns="http://www.w3.org/2000/svg"
   xmlns:sodipodi="http://sodipodi.sourceforge.net/DTD/sodipodi-0.dtd"
   xmlns:xlink="http://www.w3.org/1999/xlink"
   width="72pt"
   height="72pt"
   xml:space="preserve"
   sodipodi:docbase="/home/zeus"
   sodipodi:docname="/home/zeus/gnome-settings-sound.svg"><defs
   id="defs667"><linearGradient
   id="linearGradient714"><stop
   style="stop-color:#9bb9e3;stop-opacity:1;"
   offset="0"
   id="stop715" /><stop
   style="stop-color:#3d4e67;stop-opacity:1;"
   offset="1"
   id="stop716" /></linearGradient><linearGradient
   id="linearGradient709"><stop
   style="stop-color:#000000;stop-opacity:1;"
   offset="0"
   id="stop710" /><stop
   style="stop-color:#3d4e67;stop-opacity:1;"
   offset="1"
   id="stop711" /></linearGradient><linearGradient
   xlink:href="#linearGradient714"
   id="linearGradient712"
   x1="1.56392336"
   y1="0.50141692"
   x2="-0.31447431"
   y2="0.42964059" /><radialGradient
   xlink:href="#linearGradient709"
   id="radialGradient713"
   cx="51.7725792"
   cy="41.0985031"
   r="18.8926411"
   fx="51.7725792"
   fy="41.0985031"
   gradientUnits="userSpaceOnUse"
   gradientTransform="scale(0.826767,1.20953)" /><linearGradient
   xlink:href="#linearGradient709"
   id="linearGradient719"
   x1="0.64773393"
   y1="0.921875"
   x2="0.73863637"
   y2="0.3828125" /></defs><sodipodi:namedview
   id="base" /><path
   style="font-size:12;fill:#000000;fill-rule:evenodd;stroke-width:1;fill-opacity:0.4103;"
   d="M 79.06252 77.34375 C 79.06252 80.70924 62.97275 83.4375 43.12501 83.4375 C 23.27727 83.4375 7.1875 80.70924 7.1875 77.34375 C 7.1875 73.97826 23.27727 71.25 43.12501 71.25 C 62.97275 71.25 79.06252 73.97826 79.06252 77.34375 z "
   id="path746" /><path
   style="fill:#000000;fill-rule:evenodd;stroke:none;stroke-opacity:1;stroke-width:1pt;stroke-linejoin:miter;stroke-linecap:butt;fill-opacity:1;"
   d="M 22.8125 27.18749 C 22.8125 27.18749 10.9375 34.37499 9.687501 37.18749 C 8.437501 39.99999 7.187502 46.87499 7.187501 52.18749 C 7.812501 58.125 12.1875 75.3125 19.0625 75.3125 C 23.125 77.1875 23.4375 77.1875 23.4375 77.1875 L 43.43751 76.875 L 27.8125 26.24999 L 22.8125 27.18749 z "
   id="path747"
   sodipodi:nodetypes="cccccccc" /><path
   style="font-size:12;fill:url(#linearGradient719);fill-rule:evenodd;fill-opacity:1;"
   d="M 17.24304 35.69754 C 12.49037 36.93651 11.8913 41.86782 11.37722 48.23136 C 12.07473 55.39052 14.39662 62.75643 17.56629 66.57396 C 21.9646 71.83611 24.31742 74.98682 29.0701 73.74785 L 43.11519 74.23961 C 47.86787 73.00062 47.16119 64.49461 45.54074 59.2813 L 39.56364 40.0516 C 37.94319 34.8383 33.21604 27.59124 28.46337 28.83022 L 17.24304 35.69754 z "
   id="path718"
   sodipodi:nodetypes="ccccccccc" /><path
   style="font-size:12;fill:#000000;fill-rule:evenodd;stroke-width:1;fill-opacity:1;"
   d="M 69.91719 31.18949 C 78.25025 48.98324 74.7088 69.80095 62.00718 77.68718 C 49.30554 85.57341 32.25356 77.54177 23.9205 59.74801 C 15.58743 41.95425 19.12886 21.13652 31.8305 13.2503 C 44.53213 5.364083 61.58412 13.39573 69.91719 31.18949 z "
   id="path706" /><path
   style="font-size:12;fill:url(#linearGradient712);fill-rule:evenodd;stroke-width:1;"
   d="M 68.96471 31.30831 C 76.07537 48.26623 73.05345 68.10608 62.21506 75.62186 C 51.37667 83.13763 36.82609 75.48327 29.71543 58.52534 C 22.60477 41.56742 25.62669 21.72756 36.46508 14.21178 C 47.30347 6.696002 61.85405 14.35038 68.96471 31.30831 z "
   id="path705" /><path
   style="font-size:12;fill:url(#radialGradient713);fill-rule:evenodd;stroke-width:1;fill-opacity:1;"
   d="M 60.88819 43.06531 C 62.36582 50.97845 58.75476 58.13989 52.82267 59.06085 C 46.89057 59.98181 40.8838 54.31353 39.40617 46.40039 C 37.92854 38.48726 41.5396 31.3258 47.4717 30.40484 C 53.40379 29.48388 59.41056 35.15217 60.88819 43.06531 z "
   id="path708" /><g
   id="g720"
   transform="matrix(0.652935,0,0,0.733023,32.34969,-3.982286)"><defs
   id="defs550"><linearGradient
   x1="0.00000000"
   y1="0.00000000"
   x2="1.00000000"
   y2="0.00000000"
   id="linearGradient619"
   gradientUnits="objectBoundingBox"
   spreadMethod="pad"><stop
   style="stop-color:#ffffff;stop-opacity:1;"
   offset="0.00000000"
   id="stop620" /><stop
   style="stop-color:#ffffff;stop-opacity:0;"
   offset="1.00000000"
   id="stop621" /></linearGradient><radialGradient
   cx="9.37104893"
   cy="60.7591972"
   fx="9.37104893"
   fy="60.7591972"
   r="3.43041444"
   id="radialGradient622"
   xlink:href="#linearGradient619"
   gradientUnits="userSpaceOnUse"
   gradientTransform="matrix(1.074967,0.000000,0.000000,0.930261,-2.970606e-7,-1.274941e-6)"
   spreadMethod="pad" /><linearGradient
   x1="0.00000000"
   y1="0.00000000"
   x2="1.00000000"
   y2="0.00000000"
   id="linearGradient626"
   xlink:href="#linearGradient619"
   gradientUnits="objectBoundingBox"
   spreadMethod="pad" /><radialGradient
   cx="0.12751552"
   cy="0.13278121"
   fx="0.12751552"
   fy="0.13278121"
   r="0.80776817"
   id="radialGradient627"
   xlink:href="#linearGradient619"
   gradientUnits="objectBoundingBox"
   spreadMethod="pad" /></defs><g
   transform="translate(3.125000,-8.281250)"
   style="font-size:12;"
   id="g644"><path
   d="M 7.73398 34.2049 L 12.0429 51.3301 C 5.08232 51.2196 4.19844 55.9705 4.64039 59.1746 C 6.73961 68.2343 17.4567 65.6933 24.5277 62.7102 C 23.6438 59.506 20.3293 44.3696 19.8874 41.7178 C 23.7543 40.7235 31.8198 38.4033 31.8198 38.4033 C 31.8198 38.4033 34.6924 45.5849 35.1343 47.0212 C 26.0745 46.6897 25.4117 52.3244 26.1851 54.8656 C 27.6214 61.9367 34.0295 61.8262 37.5651 60.8318 C 40.8796 60.2795 45.52 58.2907 48.0612 57.1859 C 47.0668 53.3189 38.3384 29.233 37.2336 26.1394 C 32.9246 27.6862 7.62349 34.4258 7.73398 34.2049 z "
   transform="matrix(1.035546,0.000000,0.000000,1.035546,0.722309,-0.302267)"
   style="fill:#0d0000;fill-opacity:0.301471;fill-rule:evenodd;stroke-width:1pt;"
   id="path635" /><path
   d="M 7.73398 34.2049 L 12.0429 51.3301 C 5.08232 51.2196 4.19844 55.9705 4.64039 59.1746 C 6.73961 68.2343 17.4567 65.6933 24.5277 62.7102 C 23.6438 59.506 20.3293 44.3696 19.8874 41.7178 C 23.7543 40.7235 31.8198 38.4033 31.8198 38.4033 C 31.8198 38.4033 34.6924 45.5849 35.1343 47.0212 C 26.0745 46.6897 25.4117 52.3244 26.1851 54.8656 C 27.6214 61.9367 34.0295 61.8262 37.5651 60.8318 C 40.8796 60.2795 45.52 58.2907 48.0612 57.1859 C 47.0668 53.3189 38.3384 29.233 37.2336 26.1394 C 32.9246 27.6862 7.62349 34.4258 7.73398 34.2049 z "
   style="fill:#0d3c07;fill-rule:evenodd;stroke-width:1pt;"
   id="path616" /><path
   d="M 15.7994 54.2027 L 11.159 35.9726 L 35.7973 29.1225 L 44.7466 54.9761 C 44.7466 54.9761 33.3666 59.506 31.7093 57.5173 C 28.9471 57.4067 26.7375 51.2197 33.4771 50.0043 C 37.1231 49.8938 38.5594 49.6728 39.5538 50.0042 L 33.3666 34.0944 L 15.247 39.3977 L 20.3293 60.0584 C 20.3293 60.0584 13.7002 64.9198 7.95495 60.1689 C 6.73961 59.0641 6.62912 56.0809 8.61786 54.9761 C 10.2751 52.8769 15.6889 54.4237 15.7994 54.2027 z "
   style="fill:#2aaf18;fill-rule:evenodd;stroke-width:1pt;"
   id="path574" /><path
   d="M 14.4736 57.5725 C 12.6184 56.7928 11.9994 58.2032 11.601 60.0584 C 10.0153 60.0584 8.87676 59.2416 8.87676 57.8693 C 8.87676 56.4971 9.94109 55.5318 11.5268 55.5318 C 13.1125 55.5318 14.4736 56.2003 14.4736 57.5725 z "
   transform="matrix(1.488889,0.000000,0.000000,1.488889,-6.003039,-28.69898)"
   style="fill:url(#radialGradient622);fill-rule:evenodd;stroke-width:1pt;"
   id="path623" /><path
   d="M 37.3441 53.6503 C 33.3666 51.8834 34.4706 54.4237 33.6428 56.8544 C 31.5997 56.8544 29.9416 55.4189 29.9416 53.6503 C 29.9416 51.8816 31.5997 50.4462 33.6428 50.4462 C 35.6859 50.4462 37.3441 51.8816 37.3441 53.6503 z "
   style="fill:url(#radialGradient627);fill-rule:evenodd;stroke-width:1pt;"
   id="path625" /><path
   d="M 15.3575 39.5082 L 33.3666 34.2049 L 33.8085 32.5476 L 15.7994 37.7404 L 15.3575 39.5082 z "
   style="fill:#34674b;fill-rule:evenodd;stroke-width:1pt;"
   id="path630" /><path
   d="M 11.159 35.9726 L 13.3687 36.5251 L 36.1287 30.2274 L 35.6868 29.1225 L 11.159 35.9726 z "
   style="fill:#cbff87;fill-rule:evenodd;stroke-width:1pt;"
   id="path631" /><path
   d="M 33.6981 32.879 L 39.6643 49.8938 L 33.2561 34.2049 L 33.6981 32.879 z "
   style="fill:#cbff87;fill-rule:evenodd;stroke-width:1pt;"
   id="path633" /><path
   d="M 13.1478 36.1936 C 13.1478 36.1936 16.1309 54.3132 16.0204 54.3132 C 15.9099 54.3132 11.2695 36.0831 11.2695 36.0831 L 13.1478 36.1936 z "
   style="fill:#cbff87;fill-rule:evenodd;stroke-width:1pt;"
   id="path634" /></g><g
   transform="translate(-8.906250,-2.187500)"
   style="font-size:12;"
   id="g637"><path
   d="M 59.5517 32.3266 L 63.5291 56.8544 C 52.7015 54.3132 51.9282 59.948 52.1491 63.152 C 52.7016 75.8578 66.6227 75.416 71.926 72.6538 C 72.147 68.8973 71.926 40.7235 71.926 40.7235 C 76.3454 35.9727 84.4109 27.0233 86.7311 24.4821 C 80.8753 25.808 62.5347 31.6637 59.5517 32.3266 z "
   transform="translate(1.878252,1.988735)"
   style="fill:#0d0007;fill-opacity:0.3;fill-rule:evenodd;stroke-width:1pt;"
   id="path636" /><path
   d="M 59.5517 32.3266 L 63.5291 56.8544 C 52.7015 54.3132 51.9282 59.948 52.1491 63.152 C 52.7016 75.8578 66.6227 75.416 71.926 72.6538 C 72.147 68.8973 71.926 40.7235 71.926 40.7235 C 76.3454 35.9727 84.4109 27.0233 86.7311 24.4821 C 80.8753 25.808 62.5347 31.6637 59.5517 32.3266 z "
   style="fill:#0d3c07;fill-rule:evenodd;stroke-width:1pt;"
   id="path617" /><path
   d="M 67.5066 63.9254 L 63.1977 35.6412 L 80.4334 28.1282 L 67.9485 39.6186 C 67.838 41.3864 69.6058 67.3505 69.2744 69.3392 C 69.6059 70.9966 67.1751 70.665 64.8549 70.665 C 56.0162 69.2287 53.1435 62.5996 58.5573 60.0584 C 61.5404 59.5061 66.5122 61.2738 67.5066 63.9254 z "
   style="fill:#2aaf18;fill-rule:evenodd;stroke-width:1pt;"
   id="path575" /><path
   d="M 14.4736 57.5725 C 12.6184 56.7928 11.9994 58.2032 11.601 60.0584 C 10.0153 60.0584 8.87676 59.2416 8.87676 57.8693 C 8.87676 56.4971 9.94109 55.5318 11.5268 55.5318 C 13.1125 55.5318 14.4736 56.2003 14.4736 57.5725 z "
   transform="matrix(1.488889,0.000000,0.000000,1.488889,42.83153,-22.62228)"
   style="fill:url(#radialGradient622);fill-rule:evenodd;stroke-width:1pt;"
   id="path628" /><path
   d="M 67.9485 39.8396 L 67.3961 37.9614 L 80.2124 28.2386 L 67.9485 39.8396 z "
   style="fill:#34674b;fill-rule:evenodd;stroke-width:1pt;"
   id="path629" /><path
   d="M 79.881 28.4596 L 64.634 36.5251 L 67.5066 63.4835 L 63.1977 35.5307 L 79.881 28.4596 z "
   style="fill:#cbff87;fill-rule:evenodd;stroke-width:1pt;"
   id="path632" /></g></g></svg>
