<?xml version="1.0" encoding="UTF-8" standalone="no"?>
<!DOCTYPE svg PUBLIC "-//W3C//DTD SVG 20010904//EN"
"http://www.w3.org/TR/2001/REC-SVG-20010904/DTD/svg10.dtd"
[
 <!ATTLIST svg
  xmlns:xlink CDATA #FIXED "http://www.w3.org/1999/xlink">
]>
<!-- Created with Sodipodi ("http://www.sodipodi.com/") -->
<svg
   xmlns="http://www.w3.org/2000/svg"
   xmlns:xlink="http://www.w3.org/1999/xlink"
   version="1"
   x="0.00000000"
   y="0.00000000"
   width="90.0000000"
   height="90.0000000"
   id="svg596">
  <defs
     id="defs598">
    <linearGradient
       x1="0.00000000"
       y1="0.00000000"
       x2="1.00000000"
       y2="0.00000000"
       id="linearGradient612"
       gradientUnits="objectBoundingBox"
       spreadMethod="pad">
      <stop
         style="stop-color:#7fa8e3;stop-opacity:0.741176;"
         offset="0.00000000"
         id="stop613" />
      <stop
         style="stop-color:#ffffff;stop-opacity:0;"
         offset="1.00000000"
         id="stop614" />
    </linearGradient>
    <linearGradient
       x1="0.00000000"
       y1="0.00000000"
       x2="1.00000000"
       y2="0.00000000"
       id="linearGradient626"
       gradientUnits="objectBoundingBox"
       spreadMethod="pad">
      <stop
         style="stop-color:#ff0047;stop-opacity:1;"
         offset="0.00000000"
         id="stop627" />
      <stop
         style="stop-color:#ab322d;stop-opacity:0;"
         offset="1.00000000"
         id="stop628" />
    </linearGradient>
    <linearGradient
       x1="0.00000000"
       y1="0.00000000"
       x2="1.00000000"
       y2="0.00000000"
       id="linearGradient618"
       gradientUnits="objectBoundingBox"
       spreadMethod="pad">
      <stop
         style="stop-color:#956d47;stop-opacity:1;"
         offset="0.00000000"
         id="stop619" />
      <stop
         style="stop-color:#ab322d;stop-opacity:0;"
         offset="1.00000000"
         id="stop620" />
    </linearGradient>
    <linearGradient
       x1="0.00000000"
       y1="0.00000000"
       x2="1.00000000"
       y2="0.00000000"
       id="linearGradient614"
       gradientUnits="objectBoundingBox"
       spreadMethod="pad">
      <stop
         style="stop-color:#000000;stop-opacity:1;"
         offset="0.00000000"
         id="stop615" />
      <stop
         style="stop-color:#ffffff;stop-opacity:1;"
         offset="1.00000000"
         id="stop616" />
    </linearGradient>
    <linearGradient
       x1="-0.19608469"
       y1="0.57031226"
       x2="1.07843077"
       y2="0.52343726"
       id="linearGradient617"
       xlink:href="#linearGradient618"
       gradientUnits="objectBoundingBox"
       spreadMethod="pad" />
    <linearGradient
       x1="42.9995728"
       y1="77.3980103"
       x2="28.5382881"
       y2="63.0152588"
       id="linearGradient625"
       xlink:href="#linearGradient626"
       gradientUnits="userSpaceOnUse"
       gradientTransform="matrix(0.934001,0.000000,0.000000,1.070663,-1.516226e-6,-1.716230e-7)"
       spreadMethod="pad" />
    <linearGradient
       x1="16.4110699"
       y1="10.6072874"
       x2="24.6243172"
       y2="61.6665344"
       id="linearGradient636"
       xlink:href="#linearGradient612"
       gradientUnits="userSpaceOnUse"
       spreadMethod="pad" />
  </defs>
  <g
     transform="translate(-1.146498,1.146498)"
     style="font-size:12;"
     id="g898">
    <path
       d="M 12.8163 74.753 C 10.3856 73.6481 7.07107 70.1126 8.83884 65.2512 C 9.72267 59.948 25.6326 13.1021 29.1682 10.8924 C 31.3778 8.90368 34.582 8.13026 39.1119 9.34561 C 42.8684 10.2295 76.6769 19.0684 78.6656 20.8361 C 80.6544 22.6039 82.2012 24.0402 80.6544 27.9072 C 79.5496 29.8959 66.4017 74.532 66.1808 77.4047 C 65.2969 80.4983 62.7558 84.2548 58.5573 84.0338 C 54.3589 83.8128 15.9099 75.4159 12.8163 74.753 z "
       transform="matrix(1.114903,0.000000,0.000000,1.114903,1.287023,-5.035753)"
       style="fill-opacity:0.301471;fill-rule:evenodd;stroke-width:1pt;"
       id="path794" />
    <path
       d="M 12.8163 74.753 C 10.3856 73.6481 7.07107 70.1126 8.83884 65.2512 C 9.72267 59.948 25.6326 13.1021 29.1682 10.8924 C 31.3778 8.90368 34.582 8.13026 39.1119 9.34561 C 42.8684 10.2295 76.6769 19.0684 78.6656 20.8361 C 80.6544 22.6039 82.2012 24.0402 80.6544 27.9072 C 79.5496 29.8959 66.4017 74.532 66.1808 77.4047 C 65.2969 80.4983 62.7558 84.2548 58.5573 84.0338 C 54.3589 83.8128 15.9099 75.4159 12.8163 74.753 z "
       transform="matrix(1.114903,0.000000,0.000000,1.114903,-1.570116,-9.607182)"
       style="fill:#3d4e67;fill-rule:evenodd;stroke-width:1pt;"
       id="path895" />
    <path
       d="M 17.8987 70.9965 C 15.3576 70.3336 11.7114 69.6706 13.0373 65.6932 C 15.468 55.9705 27.8424 18.6264 33.1456 13.986 C 34.361 12.8811 38.4489 12.4392 46.1829 14.8699 C 55.0218 17.5215 72.9204 23.4877 74.6882 24.3716 C 76.4559 25.2555 77.1189 25.2555 75.793 29.233 C 73.8043 33.2105 64.9655 67.24 62.7557 72.9852 C 61.209 77.0732 60.8775 78.9514 58.2258 78.9514 "
       transform="matrix(1.114903,0.000000,0.000000,1.114903,-1.570116,-9.607182)"
       style="fill:#ffffff;fill-rule:evenodd;stroke-width:1pt;"
       id="path896" />
    <path
       d="M 28.75 13.75 C 28.75 13.75 31.875 7.49995 39.6875 9.37495 C 47.5 11.25 78.125 19.375 77.8125 21.875 C 77.5 24.375 71.875 39.0625 71.5625 40.3125 C 71.25 41.5625 42.5 40.9375 31.5625 47.5 C 20.625 54.0625 12.5 59.6875 12.5 59.6875 C 12.5 59.6875 23.75 24.6875 28.75 13.75 z "
       transform="matrix(0.946780,0.000000,0.000000,0.946780,6.111789,-0.736980)"
       style="fill:url(#linearGradient636);fill-rule:evenodd;stroke-width:1pt;"
       id="path636" />
  </g>
  <path
     d="M 67.911 66.4866 C 67.911 68.1832 66.4512 69.56 64.6525 69.56 C 62.8537 69.56 61.3939 68.1832 61.3939 66.4866 C 61.3939 64.7901 62.8537 63.4132 64.6525 63.4132 C 66.4512 63.4132 67.911 64.7901 67.911 66.4866 z "
     transform="matrix(0.665098,0.000000,0.000000,0.665098,26.75834,4.099827)"
     style="font-size:12;fill:#470000;fill-rule:evenodd;stroke-width:1pt;"
     id="path613" />
  <path
     d="M 61.2458 74.2998 C 59.6905 72.5223 57.1726 73.4851 56.3579 74.7441 C 55.4692 77.8545 56.8764 80.6687 60.5793 79.3357 C 64.2822 78.0026 65.6152 75.929 65.6152 76.0771 C 65.6152 76.2253 62.6529 84.0754 58.2094 84.6678 C 53.7659 85.2603 51.322 85.4084 46.4342 85.4825 C 41.3983 86.3712 38.9544 86.2971 38.9544 86.2971 L 45.1752 77.4102 C 45.1752 77.4102 46.8045 76.5215 49.4706 72.078 C 52.1367 67.6346 56.8763 66.5977 59.2462 68.0789 C 61.3939 68.9675 62.5788 70.1525 63.1713 72.4483 C 63.0232 74.9662 62.5788 75.929 61.2458 74.2998 z "
     transform="matrix(0.665098,0.000000,0.000000,0.665098,26.75834,4.099827)"
     style="font-size:12;fill:#470000;fill-rule:evenodd;stroke-width:1pt;"
     id="path610" />
  <path
     d="M 37.9176 76.4474 C 40.1393 77.0399 37.5473 80.2243 36.1402 78.0026 C 35.0293 79.5578 35.5477 75.7809 35.5477 75.7809 L 30.808 85.7046 C 30.808 85.7046 38.9544 88.667 42.0648 84.3716 C 45.1752 80.0763 45.5456 77.8545 43.8423 76.0771 C 41.8426 73.3371 40.0652 74.4479 39.3247 74.8922 C 38.5841 75.3366 38.2879 75.6328 37.9176 76.4474 z "
     transform="matrix(0.665098,0.000000,0.000000,0.665098,26.95536,4.099827)"
     style="font-size:12;fill:#230000;fill-opacity:0.99899;fill-rule:evenodd;stroke-width:1pt;"
     id="path609" />
  <path
     d="M 36.1402 62.0062 C 36.1402 62.0062 37.0288 56.674 36.7326 53.8598 C 36.2883 47.787 23.5503 -3.31281 14.071 5.57413 C 3.11042 9.86949 16.1446 58.8957 17.7739 61.7099 C 19.4031 64.5241 21.773 66.5977 21.773 66.5977 C 21.773 66.5977 18.07 83.483 31.9189 85.8527 C 36.9549 76.5215 40.5087 72.8006 39.695 68.5973 C 39.2506 66.2275 38.6582 64.0057 36.1402 62.0062 z "
     transform="matrix(0.665098,0.000000,0.000000,0.665098,26.75834,4.099827)"
     style="font-size:12;fill:#230000;fill-rule:evenodd;stroke-width:1pt;"
     id="path608" />
  <path
     d="M 19.4031 58.3033 C 22.0692 55.0448 25.0315 52.6749 32.5854 53.4155 C 30.2156 40.2331 21.773 4.68543 15.7002 7.94398 C 8.88697 9.12891 15.2559 48.8239 19.4031 58.3033 z "
     transform="matrix(0.665098,0.000000,0.000000,0.665098,26.75834,4.099827)"
     style="font-size:12;fill:#f2962c;fill-rule:evenodd;stroke-width:1pt;"
     id="path600" />
  <path
     d="M 19.8475 59.6363 C 19.8475 59.6363 21.1805 63.9316 24.7353 64.2279 C 26.3646 61.7099 30.0675 61.2656 33.1779 61.4137 C 33.9185 58.5995 34.5109 55.1928 33.326 55.0447 C 31.8449 54.156 23.5504 52.5268 19.8475 59.6363 z "
     transform="matrix(0.665098,0.000000,0.000000,0.665098,26.75834,4.099827)"
     style="font-size:12;fill:#8b8b8b;fill-rule:evenodd;stroke-width:1pt;"
     id="path601" />
  <path
     d="M 24.8834 66.4496 C 25.624 63.1911 31.2524 60.9694 33.7703 63.6354 C 39.8431 67.0421 37.177 75.4847 34.5109 75.6328 C 33.7703 86.149 40.8799 80.3724 40.7318 78.1508 C 46.0639 77.4102 41.7686 84.9641 38.2138 84.5197 C 33.326 85.2603 20.2918 80.8169 24.8834 66.4496 z "
     transform="matrix(0.665098,0.000000,0.000000,0.665098,26.75834,4.099827)"
     style="font-size:12;fill:#65532d;fill-rule:evenodd;stroke-width:1pt;"
     id="path602" />
  <path
     d="M 44.5828 81.2612 C 44.7309 81.4093 46.6564 81.2612 47.6932 79.4838 C 48.73 77.7064 52.2848 70.4487 54.8028 70.3006 C 60.8755 68.0789 60.8755 72.2261 60.8755 72.2261 C 60.8755 72.2261 55.2471 70.1525 54.6546 73.7073 C 54.0622 77.2621 53.0254 79.3357 59.8386 82.1499 C 55.9877 83.4829 43.966 83.74 43.2253 83.74 C 42.4847 83.74 44.7309 81.1131 44.5828 81.2612 z "
     transform="matrix(0.665098,0.000000,0.000000,0.665098,26.75834,4.099827)"
     style="font-size:12;fill:#bc0000;fill-rule:evenodd;stroke-width:1pt;"
     id="path603" />
  <path
     d="M 46.6564 67.6346 C 48.4338 64.9685 54.5806 66.3015 57.3947 65.7091 C 60.8014 64.8204 59.02 58.5954 55.169 58.5955 C 52.5142 58.0648 46.9527 58.1551 46.6564 67.6346 z "
     transform="matrix(0.665098,0.000000,0.000000,0.665098,26.75834,4.099827)"
     style="font-size:12;fill:#470000;fill-rule:evenodd;stroke-width:1pt;"
     id="path611" />
  <path
     d="M 48.1376 64.8204 C 48.1376 64.8204 54.5065 64.2279 56.1358 64.2279 C 58.0613 64.6397 58.1915 61.7181 56.5801 60.6731 C 53.766 58.7476 49.9149 58.5995 48.1376 64.8204 z "
     transform="matrix(0.665098,0.000000,0.000000,0.665098,26.75834,4.099827)"
     style="font-size:12;fill:#bc0000;fill-rule:evenodd;stroke-width:1pt;"
     id="path604" />
  <path
     d="M 66.8001 66.5977 C 66.8001 67.7424 65.838 68.6714 64.6524 68.6714 C 63.4669 68.6714 62.5048 67.7424 62.5048 66.5977 C 62.5048 65.4531 63.4669 64.5241 64.6524 64.5241 C 65.838 64.5241 66.8001 65.4531 66.8001 66.5977 z "
     transform="matrix(0.665098,0.000000,0.000000,0.665098,26.75834,4.099827)"
     style="font-size:12;fill:#bc0000;fill-rule:evenodd;stroke-width:1pt;"
     id="path606" />
  <path
     d="M 19.4031 58.3033 C 22.0692 55.0448 25.0315 52.6749 32.5854 53.4155 C 30.2156 40.2331 21.773 4.68543 15.7002 7.94398 C 8.88697 9.12891 15.2559 48.8239 19.4031 58.3033 z "
     transform="matrix(0.665098,0.000000,0.000000,0.665098,26.75834,4.099827)"
     style="font-size:12;fill:url(#linearGradient617);fill-rule:evenodd;stroke-width:1pt;"
     id="path621" />
  <path
     d="M 28.4382 52.5267 C 25.1369 52.6775 14.6017 8.00417 18.6625 10.462 C 19.6179 11.1298 34.3749 52.522 28.4382 52.5267 z "
     transform="matrix(0.665098,0.000000,0.000000,0.665098,26.75834,4.099827)"
     style="font-size:12;fill:#f2d0a8;fill-rule:evenodd;stroke-width:1pt;"
     id="path622" />
  <path
     d="M 30.5118 54.4523 L 31.1043 61.2656 L 27.6976 62.0062 L 26.2165 54.6003 C 26.2165 54.6003 30.2156 54.1561 30.5118 54.4523 z "
     transform="matrix(0.665098,0.000000,0.000000,0.665098,26.75834,4.099827)"
     style="font-size:12;fill:#f2f2f2;fill-rule:evenodd;stroke-width:1pt;"
     id="path623" />
  <path
     d="M 24.8834 66.4496 C 25.624 63.1911 31.2524 60.9694 33.7703 63.6354 C 39.8431 67.0421 37.177 75.4847 34.5109 75.6328 C 33.7703 86.149 40.8799 80.3724 40.7318 78.1508 C 46.0639 77.4102 41.7686 84.9641 38.2138 84.5197 C 33.326 85.2603 20.2918 80.8169 24.8834 66.4496 z "
     transform="matrix(0.665098,0.000000,0.000000,0.665098,26.75834,4.099827)"
     style="font-size:12;fill:url(#linearGradient625);stroke-width:1pt;"
     id="path624" />
  <path
     d="M 51.7199 56.9597 C 52.1854 56.5366 53.218 56.198 54.8176 55.9441 C 56.1548 55.7325 57.327 55.6394 58.3342 55.6648 C 59.1551 55.6902 59.7349 55.8637 60.0734 56.1853 C 60.1158 56.9555 60.1369 57.7299 60.1369 58.5086 C 60.1369 60.9968 59.9296 63.5571 59.5148 66.1892 C 59.4048 66.8917 59.0409 67.353 58.4231 67.573 C 58.1945 67.6492 57.9999 67.6873 57.8391 67.6873 C 57.5005 67.6873 57.2762 67.518 57.1662 67.1795 C 57.5217 65.9861 57.7587 64.8731 57.8772 63.8406 L 50.882 65.0213 C 50.7466 65.2836 50.4969 65.8041 50.133 66.5828 C 49.9722 67.2768 49.5575 67.6873 48.8889 67.8142 C 48.7196 67.8481 48.5969 67.865 48.5207 67.865 C 48.1145 67.865 47.9113 67.7042 47.9113 67.3826 C 47.9113 67.2895 47.9325 67.1922 47.9748 67.0906 C 49.5829 63.5444 50.8313 60.1674 51.7199 56.9597 z M 57.5217 58.6482 C 57.3947 58.352 56.9969 58.2039 56.3283 58.2039 C 55.8882 58.2039 55.3466 58.2843 54.7033 58.4451 C 53.9755 58.6313 53.493 58.8429 53.2561 59.0798 C 52.9514 60.1209 52.562 61.2 52.0881 62.3172 L 57.9533 61.0603 C 57.8772 60.2563 57.7333 59.4522 57.5217 58.6482 z M 48.2287 59.2068 C 48.161 59.5453 47.9452 59.8246 47.5813 60.0447 C 47.2512 60.2563 46.9042 60.3621 46.5402 60.3621 C 46.0832 60.3621 45.7404 60.1209 45.5119 59.6384 C 45.368 59.2237 45.2199 58.8132 45.0676 58.407 C 42.9009 58.407 41.2421 58.9529 40.091 60.0447 C 38.923 61.1703 38.3221 62.2537 38.2883 63.2947 C 38.2629 64.3103 38.7961 65.0255 39.8879 65.4402 C 40.1503 65.5418 40.4423 65.5925 40.7639 65.5925 C 41.8387 65.5925 43.286 65.072 45.1057 64.031 C 45.1311 63.9464 45.1607 63.8279 45.1945 63.6756 C 44.9576 63.447 44.5598 63.3328 44.0012 63.3328 C 42.9686 63.3328 42.0419 63.5444 41.2209 63.9675 C 40.7385 63.9252 40.4296 63.6586 40.2941 63.1677 C 40.2688 63.0746 40.2561 62.9858 40.2561 62.9011 C 40.2561 62.5287 40.455 62.1987 40.8527 61.9109 C 41.3521 61.3523 42.2746 61.073 43.6203 61.073 C 44.0266 61.073 44.5386 61.1026 45.1564 61.1619 C 45.9689 61.2296 46.4133 61.2677 46.4895 61.2761 C 47.3951 61.7332 47.8479 62.2452 47.8479 62.8123 C 47.8479 63.0831 47.7675 63.4597 47.6066 63.9422 C 47.3697 64.6869 47.0311 65.1863 46.591 65.4402 C 45.7193 66.1004 44.6994 66.6336 43.5314 67.0398 C 42.3381 67.4545 41.2082 67.6619 40.1418 67.6619 C 38.5845 67.6619 37.425 67.171 36.6633 66.1892 C 36.0116 65.3429 35.6857 64.4119 35.6857 63.3963 C 35.6857 62.9477 35.745 62.4907 35.8635 62.0252 C 36.4051 59.9347 37.7508 58.3435 39.9006 57.2517 C 41.7287 56.3123 43.815 55.8679 46.1594 55.9187 C 46.955 56.0287 47.5051 56.3038 47.8098 56.7439 C 48.0552 57.1078 48.1906 57.713 48.216 58.5593 C 48.2668 58.8048 48.271 59.0206 48.2287 59.2068 z M 27.1799 61.1746 C 27.383 60.2436 27.6327 59.2957 27.9289 58.3308 C 26.854 58.4239 25.7622 58.5763 24.6535 58.7879 C 24.5943 58.7963 24.5181 58.8006 24.425 58.8006 C 24.1203 58.8006 23.8664 58.6694 23.6633 58.407 C 23.4686 58.1446 23.3713 57.8569 23.3713 57.5437 C 23.3713 57.1205 23.6167 56.6847 24.1076 56.2361 C 26.1219 55.906 28.0389 55.7368 29.8586 55.7283 C 31.8729 55.7283 33.7603 55.7579 35.5207 55.8172 C 35.7323 56.1303 35.8381 56.4985 35.8381 56.9216 C 35.8381 57.311 35.745 57.6453 35.5588 57.9246 C 35.3557 58.2377 35.0721 58.4282 34.7082 58.4959 C 33.2948 58.3266 31.9406 58.2377 30.6457 58.2293 C 29.5201 60.506 28.9572 62.9688 28.9572 65.6179 C 28.9572 65.8803 28.9657 66.1469 28.9826 66.4177 C 28.9234 66.7817 28.7626 67.0864 28.5002 67.3318 C 28.2378 67.5688 27.9289 67.6873 27.5734 67.6873 C 27.201 67.6873 26.8202 67.5011 26.4309 67.1287 C 26.5409 64.9874 26.7906 63.0027 27.1799 61.1746 z M 21.0734 65.6433 C 21.0734 66.0665 20.8703 66.4389 20.4641 66.7605 C 20.0663 67.0821 19.6389 67.2429 19.1818 67.2429 C 19.0126 67.2429 18.856 67.2175 18.7121 67.1668 C 18.2889 66.9975 18.0773 66.697 18.0773 66.2654 C 18.0773 65.9692 18.1831 65.6814 18.3947 65.4021 C 18.801 64.8858 19.3088 64.6277 19.9182 64.6277 C 20.0959 64.6277 20.2652 64.6573 20.426 64.7166 C 20.8576 64.8774 21.0734 65.1863 21.0734 65.6433 z "
     transform="matrix(0.976792,0.214191,-0.214191,0.976792,12.41693,-1.783752)"
     style="font-size:13;font-weight:bold;fill:#3c4d66;fill-opacity:0.993305;stroke-width:1pt;font-family:Kid Kosmic;"
     id="path1007" />
</svg>
