<?xml version="1.0" encoding="UTF-8" standalone="no"?>
<!DOCTYPE svg PUBLIC "-//W3C//DTD SVG 20010904//EN"
"http://www.w3.org/TR/2001/REC-SVG-20010904/DTD/svg10.dtd">
<!-- Created with Sodipodi ("http://www.sodipodi.com/") -->
<svg
   xmlns="http://www.w3.org/2000/svg"
   xmlns:xlink="http://www.w3.org/1999/xlink"
   version="1.0"
   x="0"
   y="0"
   width="90"
   height="90"
   id="svg704"
   xmlns:sodipodi="http://sodipodi.sourceforge.net/DTD/sodipodi-0.dtd"
   sodipodi:version="0.34"
   sodipodi:docname="/home/zeus/screenshot.svg"
   sodipodi:docbase="/home/zeus/">
  <sodipodi:namedview
     id="base" />
  <defs
     id="defs706">
    <linearGradient
       id="linearGradient633">
      <stop
         style="stop-color:#2ec2ff;stop-opacity:0.9294;"
         offset="0"
         id="stop634" />
      <stop
         style="stop-color:#ede29d;stop-opacity:1;"
         offset="1"
         id="stop635" />
    </linearGradient>
    <linearGradient
       id="linearGradient734">
      <stop
         style="stop-color:#2a2535;stop-opacity:1;"
         offset="0"
         id="stop735" />
      <stop
         style="stop-color:#e3e1cf;stop-opacity:1;"
         offset="1"
         id="stop736" />
    </linearGradient>
    <linearGradient
       id="linearGradient724">
      <stop
         style="stop-color:#ffffff;stop-opacity:0.4902;"
         offset="0"
         id="stop725" />
      <stop
         style="stop-color:#ffffff;stop-opacity:0.1765;"
         offset="1"
         id="stop726" />
    </linearGradient>
    <linearGradient
       id="linearGradient718">
      <stop
         style="stop-color:#e3e1cf;stop-opacity:1;"
         offset="0"
         id="stop719" />
      <stop
         style="stop-color:#ffffff;stop-opacity:1;"
         offset="1"
         id="stop720" />
    </linearGradient>
    <linearGradient
       x1="45.4330635"
       y1="41.9262352"
       x2="24.0375099"
       y2="27.2048512"
       id="linearGradient721"
       xlink:href="#linearGradient718"
       gradientUnits="userSpaceOnUse"
       gradientTransform="scale(1.033999,0.967119)"
       spreadMethod="pad" />
    <linearGradient
       x1="40.2607956"
       y1="39.8445053"
       x2="37.3197212"
       y2="68.6665039"
       id="linearGradient723"
       xlink:href="#linearGradient724"
       gradientUnits="userSpaceOnUse"
       gradientTransform="scale(1.185464,0.843551)"
       spreadMethod="pad" />
    <linearGradient
       id="linearGradient732"
       xlink:href="#linearGradient633"
       x1="0.49999997"
       y1="2.34375969e-2"
       x2="0.37313432"
       y2="1.0859375" />
    <radialGradient
       cx="33.2134209"
       cy="118.190964"
       r="14.8945398"
       fx="33.2134209"
       fy="118.190964"
       id="radialGradient733"
       xlink:href="#linearGradient734"
       gradientUnits="userSpaceOnUse"
       gradientTransform="scale(1.559286,0.641319)"
       spreadMethod="pad" />
    <radialGradient
       id="radialGradient738"
       xlink:href="#linearGradient734" />
  </defs>
  <path
     d="M 12.54589 66.08518 C 10.53906 63.2203 0.804919 39.68818 9.149907 5.573048 C 43.46938 -1.468831 73.21238 11.65689 88.65365 21.52739 C 91.80462 28.06533 86.42437 77.18133 74.9013 81.99402 C 67.17384 84.51389 26.73851 83.81925 12.54589 66.08518 z "
     style="font-size:12;fill-opacity:0.3;fill-rule:evenodd;stroke-width:1;"
     id="path743" />
  <path
     d="M 7.684535 66.32826 C 5.677707 63.46338 -4.056439 39.93127 4.288549 5.81613 C 38.60802 -1.225749 68.35102 11.89997 83.79229 21.77048 C 86.94326 28.30842 81.56302 77.42441 70.03994 82.2371 C 62.31248 84.75697 21.87715 84.06234 7.684535 66.32826 z "
     style="font-size:12;fill:#211301;fill-rule:evenodd;stroke-width:1;"
     id="path715" />
  <path
     d="M 12.30597 64.44791 C 10.67139 61.34246 1.518372 43.85351 7.729434 10.18333 C 42.87063 3.808869 66.24359 17.37499 80.79048 25.54737 C 82.42495 31.43159 77.03113 75.56235 68.20496 78.17751 C 60.68637 80.62928 23.09341 79.1582 12.30597 64.44791 z "
     style="font-size:12;fill:url(#linearGradient721);fill-rule:evenodd;stroke-width:1;"
     id="path713" />
  <path
     d="M 16.06521 20.80745 L 13.73486 19.06134 C 13.40797 21.51311 9.037015 44.01701 12.95976 52.84318 C 17.5363 61.09479 22.50916 64.55954 22.01887 63.74225 C 16.46155 54.42579 11.81557 37.6425 16.06521 20.80745 z "
     style="font-size:12;fill:#b5a794;fill-rule:evenodd;stroke-width:1;"
     id="path717"
     sodipodi:nodetypes="ccccc" />
  <path
     d="M 15.82546 20.41306 C 15.82546 20.41306 9.216381 44.47717 17.68962 59.05103 C 24.12929 68.03272 44.9734 75.15024 62.0894 70.0663 C 65.30929 65.99914 72.59611 43.96872 65.81763 31.76726 C 63.2756 27.53058 32.60253 14.48184 15.82546 20.41306 z "
     style="font-size:12;fill-rule:evenodd;stroke-width:1;fill:url(#linearGradient732);"
     id="path711" />
  <path
     d="M 14.59424 44.6708 C 14.59424 44.6708 28.16034 26.20117 41.07265 37.96939 C 46.30308 55.45824 65.4264 59.54448 65.4264 59.54448 L 61.66716 68.86105 C 47.44716 73.92798 20.15146 63.46723 18.84388 59.54448 C 17.5363 55.62174 18.51698 61.66935 14.59424 44.6708 z "
     style="font-size:12;fill:url(#linearGradient723);fill-rule:evenodd;stroke-width:1;"
     id="path722" />
  <path
     d="M 81.11737 25.87427 C 81.11737 25.87427 75.72365 26.03777 75.56026 26.03777 C 75.39665 26.03777 76.37744 39.93077 75.72365 44.9977 C 75.06986 50.06452 73.43539 61.99625 72.4547 65.1017 C 71.47401 68.20726 65.75329 78.17751 65.263 78.8313 C 64.77261 79.48509 66.57059 78.6678 69.34914 77.85062 C 76.86773 69.18784 80.62708 48.43015 81.11737 25.87427 z "
     style="font-size:12;fill:#b5a794;fill-rule:evenodd;stroke-width:1;"
     id="path716" />
  <path
     d="M 64.93611 78.50441 C 64.93611 78.50441 77.68502 68.53415 74.41607 26.69156 C 71.63741 23.9129 67.38777 20.80745 67.38777 20.80745 C 67.38777 20.80745 75.56015 24.73019 76.05055 26.03777 C 76.86773 27.83564 77.35802 71.14932 64.93611 78.50441 z "
     style="font-size:12;fill:#211301;fill-rule:evenodd;stroke-width:1;"
     id="path712" />
  <path
     d="M 46.95188 82.4507 C 43.89772 78.57976 51.11156 82.06952 40.44928 70.16631 C 37.13413 64.52595 33.61179 59.44963 38.5845 57.19347 C 43.76442 56.0654 43.76442 65.08999 45.83639 65.46601 C 47.70116 62.83384 44.5932 51.74112 44.80041 49.86101 C 45.2148 47.41685 48.94433 45.34871 50.80911 47.98089 C 53.08827 50.42505 53.78748 58.02557 53.78748 58.02557 C 53.78748 58.02557 54.12425 48.73294 55.78182 46.6648 C 57.85379 45.16071 60.96174 44.97269 61.37614 48.1689 C 61.79053 51.3651 62.28253 53.32526 61.03935 56.52147 C 63.11132 53.70129 63.4481 48.92095 68.21363 50.98908 C 71.73595 52.11715 69.48246 56.89192 67.82487 59.9001 C 70.31122 58.39602 70.00077 57.46712 72.56476 56.61827 C 76.5015 54.55014 78.46952 61.04493 74.53279 65.74523 C 71.21763 69.69349 61.51133 83.00358 58.35142 85.08845 C 54.62188 85.46448 48.25016 85.46864 46.95188 82.4507 z "
     style="font-size:12;fill:#5fa2c7;fill-rule:evenodd;stroke-width:1;"
     id="path647"
     sodipodi:nodetypes="cccccccccccccccc" />
  <path
     d="M 48.39138 76.92807 C 46.67474 76.00453 44.83991 74.31989 42.70904 70.90853 C 39.86787 66.03517 35.19154 61.83715 39.4533 59.88779 C 43.89264 58.91311 41.82067 64.64237 46.28995 67.97546 C 49.3385 63.82111 45.8461 53.29674 46.02368 51.67229 C 46.37883 49.56049 48.95355 47.96161 50.55172 50.23586 C 52.09063 54.7918 53.68897 63.90528 53.68897 63.90528 C 54.93216 64.2813 55.25766 50.13359 56.67825 48.34668 C 58.45399 47.04711 60.2888 47.26069 60.64395 50.02227 C 60.99909 52.78384 59.5191 60.03214 59.90403 62.98173 C 61.67977 60.54504 63.45567 50.67206 67.53987 52.45894 C 70.5586 53.43363 66.44463 61.3498 65.02403 63.94893 C 67.1549 62.64937 70.35157 59.7344 72.30487 59.24706 C 75.67876 57.46017 76.18187 60.82943 70.52881 67.52273 C 67.68764 70.9341 62.9524 78.39008 59.75608 78.71496 C 56.55976 79.03986 48.74652 78.39008 48.39138 76.92807 z "
     style="font-size:12;fill:#ffffff;fill-rule:evenodd;stroke-width:1;"
     id="path648" />
  <path
     d="M 52.46668 65.65402 C 52.67387 66.78209 50.60191 69.41426 51.43069 69.60227 C 52.25948 69.79029 54.33145 68.4742 52.46668 65.65402 z "
     style="font-size:12;fill:#5fa2c7;fill-rule:evenodd;stroke-width:1;"
     id="path649" />
  <path
     d="M 58.06099 66.03005 C 58.26818 67.15812 56.19622 69.79029 57.025 69.9783 C 57.85379 70.16631 59.92576 68.85023 58.06099 66.03005 z "
     style="font-size:12;fill:#5fa2c7;fill-rule:evenodd;stroke-width:1;"
     id="path650" />
  <path
     d="M 62.82651 66.97011 C 63.0337 68.09818 60.96174 70.73034 61.79052 70.91836 C 62.61931 71.10637 64.69128 69.79029 62.82651 66.97011 z "
     style="font-size:12;fill:#5fa2c7;fill-rule:evenodd;stroke-width:1;"
     id="path651" />
  <path
     d="M 49.05554 78.28853 C 49.05554 78.28853 47.0668 80.0563 48.83457 80.94019 C 50.60234 81.82407 56.56856 84.03378 58.55729 81.82407 C 60.54603 79.61436 61.87185 78.73048 60.54603 78.28854 C 57.89438 81.38212 49.27652 78.73047 49.05554 78.28853 z "
     style="font-size:12;fill:#ffffff;fill-rule:evenodd;stroke-width:1;"
     id="path652" />
</svg>
