<?xml version="1.0" encoding="UTF-8" standalone="no"?>
<!DOCTYPE svg PUBLIC "-//W3C//DTD SVG 1.0//EN"
"http://www.w3.org/TR/2001/REC-SVG-20010904/DTD/svg10.dtd">
<!-- Created with Sodipodi ("http://www.sodipodi.com/") -->
<svg
   xmlns="http://www.w3.org/2000/svg"
   xmlns:xlink="http://www.w3.org/1999/xlink"
   version="1.0"
   x="0"
   y="0"
   width="60"
   height="60"
   id="svg604">
  <defs
     id="defs606">
    <linearGradient
       id="linearGradient612">
      <stop
         style="stop-color:#7fa8e3;stop-opacity:0.7412;"
         offset="0"
         id="stop613" />
      <stop
         style="stop-color:#ffffff;stop-opacity:0;"
         offset="1"
         id="stop614" />
    </linearGradient>
    <linearGradient
       x1="50.6438866"
       y1="5.36792946"
       x2="35.7520943"
       y2="68.0443573"
       id="linearGradient615"
       xlink:href="#linearGradient612"
       gradientUnits="userSpaceOnUse"
       spreadMethod="pad" />
    <linearGradient
       id="linearGradient571"
       xlink:href="#linearGradient612" />
  </defs>
  <g
     transform="translate(-3.864304e-6,0.291262)"
     style="font-size:12;"
     id="g620">
    <defs
       id="defs621">
      <linearGradient
         id="linearGradient585">
        <stop
           style="stop-color:#5cb2ff;stop-opacity:1;"
           offset="0"
           id="stop586" />
        <stop
           style="stop-color:#ffffff;stop-opacity:1;"
           offset="1"
           id="stop587" />
      </linearGradient>
      <linearGradient
         id="linearGradient576">
        <stop
           style="stop-color:#ffffff;stop-opacity:1;"
           offset="0"
           id="stop577" />
        <stop
           style="stop-color:#370000;stop-opacity:0;"
           offset="1"
           id="stop578" />
      </linearGradient>
      <linearGradient
         id="linearGradient569">
        <stop
           style="stop-color:#ff3a00;stop-opacity:1;"
           offset="0"
           id="stop570" />
        <stop
           style="stop-color:#370000;stop-opacity:1;"
           offset="1"
           id="stop571" />
      </linearGradient>
      <linearGradient
         id="linearGradient562">
        <stop
           style="stop-color:#000000;stop-opacity:1;"
           offset="0"
           id="stop563" />
        <stop
           style="stop-color:#ffffff;stop-opacity:1;"
           offset="1"
           id="stop564" />
      </linearGradient>
      <linearGradient
         x1="30.5917225"
         y1="65.8304825"
         x2="18.4360981"
         y2="42.3886795"
         id="linearGradient565"
         xlink:href="#linearGradient562"
         gradientUnits="userSpaceOnUse"
         gradientTransform="scale(1.323326,0.755672)"
         spreadMethod="pad" />
      <linearGradient
         x1="24.9874783"
         y1="44.9967537"
         x2="33.7596359"
         y2="60.752861"
         id="linearGradient567"
         xlink:href="#linearGradient562"
         gradientUnits="userSpaceOnUse"
         gradientTransform="scale(1.587744,0.629824)"
         spreadMethod="pad" />
      <linearGradient
         x1="0.8273406"
         y1="0.11727467"
         x2="0.57553899"
         y2="0.88281417"
         id="linearGradient568"
         xlink:href="#linearGradient576"
         gradientUnits="objectBoundingBox"
         spreadMethod="pad" />
      <radialGradient
         cx="39.9771919"
         cy="62.0348434"
         r="2.87974644"
         fx="39.9771919"
         fy="62.0348434"
         id="radialGradient573"
         xlink:href="#linearGradient569"
         gradientUnits="userSpaceOnUse"
         gradientTransform="scale(1.181249,0.846561)"
         spreadMethod="pad" />
      <radialGradient
         id="radialGradient575"
         xlink:href="#linearGradient576" />
      <linearGradient
         x1="0.48992321"
         y1="-4.50217798e-2"
         x2="0.53917038"
         y2="1.25967419"
         id="linearGradient580"
         xlink:href="#linearGradient562"
         gradientUnits="objectBoundingBox"
         spreadMethod="pad" />
      <linearGradient
         x1="38.9676552"
         y1="112.42765"
         x2="34.3394775"
         y2="55.2668114"
         id="linearGradient584"
         xlink:href="#linearGradient585"
         gradientUnits="userSpaceOnUse"
         gradientTransform="scale(1.107407,0.90301)"
         spreadMethod="pad" />
      <linearGradient
         x1="18.5747337"
         y1="70.6098175"
         x2="21.0069866"
         y2="44.9572525"
         id="linearGradient588"
         xlink:href="#linearGradient585"
         gradientUnits="userSpaceOnUse"
         gradientTransform="scale(0.777781,1.285709)"
         spreadMethod="pad" />
    </defs>
    <path
       d="M 5.525579 23.23987 C 4.515456 29.10581 3.4135 33.72222 2.770691 39.37998 C 4.790938 45.00304 10.39252 49.37651 16.1778 50.20954 C 19.29996 49.68887 21.96307 49.58483 25.08529 47.81457 C 29.8298 50.0013 34.4825 52.60452 39.22701 54.79126 C 45.59388 50.59139 54.25639 44.6212 60.62326 40.42133 C 57.01127 38.54696 50.91992 37.0892 47.30793 35.21482 C 49.84862 25.14888 48.25687 17.6863 39.41065 11.88978 C 38.21692 10.84844 35.0947 10.11945 32.33982 11.26499 C 32.33982 11.26499 31.05421 6.474968 29.30943 3.351078 C 26.83001 2.934527 7.729484 8.86994 7.086677 10.32777 C 7.51521 13.59048 8.494706 17.26975 9.106902 20.2201 C 7.362158 21.60844 6.994844 22.16383 5.525579 23.23987 z "
       style="fill-opacity:0.3;fill-rule:evenodd;stroke-width:1;"
       id="path592" />
    <path
       d="M 4.130193 19.75882 C 3.12007 25.62475 2.018114 30.24117 1.375305 35.89893 C 3.395552 41.52199 8.997134 45.89546 14.78241 46.72849 C 17.90457 46.20782 20.56769 46.10377 23.68991 44.33351 C 28.43442 46.52025 33.08711 49.12347 37.83163 51.31021 C 44.1985 47.11034 52.86101 41.14014 59.22788 36.94028 C 55.61588 35.0659 49.52454 33.60815 45.91254 31.73378 C 48.45323 21.66783 46.86149 14.20525 38.01526 8.408732 C 36.82153 7.367391 33.69931 6.638409 30.94444 7.783942 C 30.94444 7.783942 29.65882 2.993916 27.91403 -0.129971 C 25.43463 -0.546523 6.334099 5.388896 5.691291 6.846714 C 6.119826 10.10944 7.099316 13.7887 7.71152 16.73905 C 5.966772 18.12739 5.599458 18.68277 4.130193 19.75882 z "
       style="fill-rule:evenodd;stroke-width:1;"
       id="path561" />
    <path
       d="M 24.7 41.31375 L 37.46428 46.93673 L 53.25896 37.6692 C 53.25896 37.6692 40.77014 32.98336 40.67832 33.08747 C 40.5865 33.19159 24.79182 41.41786 24.7 41.31375 z "
       style="fill:#c7eeff;fill-rule:evenodd;stroke-width:1;"
       id="path556" />
    <path
       d="M 6.885074 21.21665 C 5.354583 25.97189 4.466901 30.72721 3.946533 35.48246 C 6.670814 40.61954 11.50722 42.32032 14.96611 43.50049 C 16.09869 40.48072 16.40477 31.3173 14.1396 27.15206 C 11.90511 23.81993 9.39509 21.6332 6.885074 21.21665 z "
       style="fill:url(#linearGradient588);fill-rule:evenodd;stroke-width:1;"
       id="path557" />
    <path
       d="M 7.711579 19.96713 C 19.71062 26.63139 15.63947 40.37653 16.15985 43.60454 C 26.78145 40.65419 34.46449 35.30885 43.52502 30.38007 C 44.78003 24.75709 45.75951 15.8019 36.27049 9.762365 C 26.65902 11.08136 16.03742 14.58703 7.711579 19.96713 z "
       style="fill:url(#linearGradient584);fill-rule:evenodd;stroke:#000000;stroke-width:0.666512;"
       id="path559" />
    <path
       d="M 14.1396 16.73905 C 18.33313 17.98864 18.85351 24.54884 20.6595 24.86121 C 26.16926 26.38844 35.81138 21.45959 36.08684 19.13403 C 36.54601 16.70435 33.51561 11.46313 31.12808 10.90776 C 25.28159 12.435 19.71062 14.06635 14.1396 16.73905 z "
       style="fill:url(#linearGradient565);fill-rule:evenodd;stroke-width:1;"
       id="path558" />
    <path
       d="M 10.74192 17.88452 L 8.721672 8.304546 L 26.5366 2.993916 L 28.46502 10.5954 L 25.89379 11.53256 L 24.33265 7.159072 L 13.12951 10.5954 L 14.32324 16.32258 "
       style="fill:#ffffff;fill-rule:evenodd;stroke-width:1;"
       id="path560" />
    <path
       d="M 14.1396 16.73905 C 15.47604 17.06823 15.6349 17.59629 17.58554 19.6547 C 25.66653 21.39025 28.88801 14.61122 34.21412 13.63929 C 32.62788 11.57783 32.68916 11.67137 31.12808 10.90776 C 25.28159 12.435 19.71062 14.06635 14.1396 16.73905 z "
       style="fill:url(#linearGradient567);fill-rule:evenodd;stroke-width:1;"
       id="path566" />
    <path
       d="M 34.7756 25.4009 C 35.11005 26.77227 34.09712 28.34325 32.51454 28.90751 C 30.93196 29.47179 29.37614 28.81671 29.04168 27.44535 C 28.70724 26.07398 29.72019 24.50308 31.30277 23.93881 C 32.88535 23.37454 34.44115 24.02954 34.7756 25.4009 z "
       style="fill:url(#linearGradient580);fill-rule:evenodd;stroke-width:1;"
       id="path581" />
    <path
       d="M 34.32148 25.17515 C 34.62973 26.36051 33.69614 27.7184 32.23752 28.20613 C 30.77891 28.69387 29.34495 28.12764 29.03671 26.94229 C 28.72845 25.75694 29.66206 24.39911 31.12067 23.91137 C 32.57929 23.42364 34.01323 23.9898 34.32148 25.17515 z "
       style="fill:url(#radialGradient573);fill-rule:evenodd;stroke-width:1;"
       id="path583" />
    <path
       d="M 33.24017 25.43393 C 33.24017 26.1524 32.68473 26.73554 32.00043 26.73554 C 31.31612 26.73554 30.76075 26.1524 30.76075 25.43393 C 30.76075 24.71538 31.31612 24.13225 32.00043 24.13225 C 32.68473 24.13225 33.24017 24.71538 33.24017 25.43393 z "
       style="fill:url(#linearGradient568);fill-rule:evenodd;stroke-width:1;"
       id="path582" />
    <path
       d="M 48.09578 37.73988 C 47.98418 37.68296 47.28266 37.04198 46.92696 37.44541 C 46.38905 37.91846 46.40751 38.05622 46.40751 38.91799 C 46.21417 39.57572 45.86078 39.36669 45.36856 39.06527 C 44.96079 38.99592 44.82559 38.73005 44.71925 39.21254 C 44.54606 39.40886 44.63262 39.89972 44.4595 40.0961 C 43.78583 40.0961 42.93209 39.88694 42.51148 40.0961 C 42.51148 40.89365 42.41954 40.88612 41.73229 40.97967 C 40.96511 40.97967 40.68371 40.87314 40.30377 41.42142 C 40.0146 41.89964 39.88461 42.31095 39.52458 42.45225 C 38.88634 42.42991 38.14589 42.20314 37.70644 42.45225 C 37.5586 43.16478 37.54227 43.4063 36.79738 43.4831 C 36.27449 43.4831 36.27793 43.47919 36.27793 44.07218 C 36.08458 44.16609 36.08158 44.27276 35.8883 44.36666 "
       style="fill:none;fill-rule:evenodd;stroke:#000000;stroke-width:0.666512;"
       id="path589" />
    <path
       d="M 43.03097 35.67823 C 42.89402 35.55203 42.30028 35.23641 41.73227 35.23641 C 41.39153 35.59313 41.44203 35.92075 41.21283 36.26725 C 40.57346 36.26725 40.01571 36.07405 39.65444 36.26725 C 39.2312 36.74718 39.09306 37.0017 39.00512 37.7399 C 38.7731 37.95517 38.82661 38.03438 38.35574 38.03438 C 37.69522 37.97895 37.38401 37.65857 37.18698 38.32892 C 36.70772 38.75868 36.56207 38.77075 35.75841 38.77075 C 35.36865 38.77075 34.91437 38.69701 34.71952 38.91801 C 34.56567 39.65942 34.49407 39.81421 33.81045 40.09605 C 33.28219 40.50516 33.05085 40.37158 33.03126 41.1269 C 32.68388 41.27105 32.13132 41.27418 31.60269 41.27418 "
       style="fill:none;fill-rule:evenodd;stroke:#000000;stroke-width:0.666512;"
       id="path590" />
  </g>
  <g
     transform="matrix(0.564863,0,0,0.564863,21.0894,15.46971)"
     style="font-size:12;"
     id="g902">
    <defs
       id="defs903">
      <linearGradient
         id="linearGradient621">
        <stop
           style="stop-color:#666565;stop-opacity:1;"
           offset="0"
           id="stop623" />
        <stop
           style="stop-color:#ffffff;stop-opacity:1;"
           offset="1"
           id="stop622" />
      </linearGradient>
      <linearGradient
         id="linearGradient610">
        <stop
           style="stop-color:#666565;stop-opacity:1;"
           offset="0"
           id="stop612" />
        <stop
           style="stop-color:#ffffff;stop-opacity:1;"
           offset="1"
           id="stop611" />
      </linearGradient>
      <linearGradient
         id="linearGradient910">
        <stop
           style="stop-color:#7fa8e3;stop-opacity:0.7412;"
           offset="0"
           id="stop911" />
        <stop
           style="stop-color:#ffffff;stop-opacity:0;"
           offset="1"
           id="stop912" />
      </linearGradient>
      <linearGradient
         x1="7.68350018e-3"
         y1="0.9624567"
         x2="1.02190578"
         y2="7.76174664e-2"
         id="linearGradient913"
         xlink:href="#linearGradient610"
         gradientUnits="objectBoundingBox"
         gradientTransform="scale(0.993504,1.006539)" />
      <defs
         id="defs550">
        <linearGradient
           x1="0"
           y1="0"
           x2="1"
           y2="0"
           id="linearGradient554"
           xlink:href="#linearGradient610"
           gradientUnits="objectBoundingBox"
           spreadMethod="pad" />
        <linearGradient
           x1="12.9236002"
           y1="79.96035"
           x2="8.33575153"
           y2="72.2902298"
           id="linearGradient557"
           xlink:href="#linearGradient554"
           gradientUnits="userSpaceOnUse"
           gradientTransform="scale(1.122498,0.89087)"
           spreadMethod="pad" />
        <linearGradient
           x1="7.79836702"
           y1="68.6560287"
           x2="12.9945765"
           y2="78.4289169"
           id="linearGradient559"
           xlink:href="#linearGradient554"
           gradientUnits="userSpaceOnUse"
           gradientTransform="scale(1.122498,0.89087)"
           spreadMethod="pad" />
        <linearGradient
           id="linearGradient563"
           xlink:href="#linearGradient554" />
      </defs>
      <defs
         id="defs573">
        <linearGradient
           x1="0"
           y1="0"
           x2="1"
           y2="0"
           id="linearGradient604"
           xlink:href="#linearGradient621"
           gradientUnits="objectBoundingBox"
           spreadMethod="pad" />
        <linearGradient
           id="linearGradient600">
          <stop
             style="stop-color:#000000;stop-opacity:1;"
             offset="0"
             id="stop601" />
          <stop
             style="stop-color:#ffffff;stop-opacity:1;"
             offset="1"
             id="stop602" />
        </linearGradient>
        <linearGradient
           x1="61.0468903"
           y1="28.6572132"
           x2="79.6281509"
           y2="14.1547699"
           id="linearGradient603"
           xlink:href="#linearGradient604"
           gradientUnits="userSpaceOnUse"
           gradientTransform="scale(0.994399,1.005632)"
           spreadMethod="pad" />
      </defs>
      <linearGradient
         x1="26.441227"
         y1="54.8398895"
         x2="29.670187"
         y2="59.9142227"
         id="linearGradient613"
         xlink:href="#linearGradient610"
         gradientUnits="userSpaceOnUse"
         gradientTransform="scale(1.122498,0.89087)" />
      <radialGradient
         cx="6.20155111e-2"
         cy="0.1171875"
         r="0.76277786"
         fx="6.20155111e-2"
         fy="0.1171875"
         id="radialGradient614"
         xlink:href="#linearGradient612"
         spreadMethod="repeat" />
    </defs>
    <path
       d="M 50.08409 57.90915 L 38.75555 48.41721 C 38.66095 48.33795 30.55802 51.38089 26.29232 51.33965 C 16.37681 51.2426 2.521728 45.01987 1.389258 27.98496 C 0.494222 14.40931 9.574061 1.774569 26.12028 1.748579 C 39.71579 1.727415 52.27456 11.55997 50.93732 27.7269 C 50.29883 35.6893 48.08044 38.45552 48.72034 39.18413 L 58.96319 50.84685 C 60.00977 52.03851 59.42482 56.09627 57.57335 57.62777 C 55.57596 59.24134 51.38156 58.99627 50.08409 57.90915 z "
       style="fill-rule:evenodd;stroke:#000000;stroke-width:1.10107;"
       id="path634" />
    <path
       d="M 47.76239 26.15283 C 47.76239 29.17458 47.14928 32.054 46.04075 34.6734 C 45.48649 35.9831 44.91602 37.30828 44.02112 38.39276 L 56.38824 54.31214 L 54.8272 56.4624 L 38.10558 44.3083 C 37.0211 45.2032 35.69592 45.77367 34.38622 46.32793 C 31.76682 47.43646 28.8874 48.04957 25.86565 48.04957 C 13.77866 48.04957 3.96892 38.23983 3.96892 26.15283 C 3.96892 14.06584 13.77866 4.256101 25.86565 4.256101 C 37.95265 4.256101 47.76239 14.06584 47.76239 26.15283 z "
       style="fill:#efe16b;fill-rule:evenodd;stroke-width:1;"
       id="path620" />
    <path
       d="M 44.24797 38.38065 L 56.16631 51.68346 C 58.09472 54.43001 55.00181 57.87882 51.79444 56.20642 L 38.14389 44.28193 C 38.40459 41.51609 42.24014 38.87311 44.24797 38.38065 z "
       style="fill:#ffc83d;fill-rule:evenodd;"
       id="path562" />
    <path
       d="M 43.86792 38.77912 L 55.76294 51.89578 C 56.59703 54.01239 55.22832 50.45281 53.46932 54.13485 L 41.29443 41.11702 C 41.31622 40.26189 41.77651 39.19672 43.86792 38.77912 z "
       style="fill:#ff933d;fill-rule:evenodd;"
       id="path567" />
    <path
       d="M 40.04615 41.88825 L 52.69942 54.36842 C 53.21655 54.51617 52.09318 54.77055 52.27966 56.06976 C 51.83815 55.4482 38.85772 43.56969 38.85772 43.56969 L 40.04615 41.88825 z "
       style="fill:#ffffff;fill-rule:evenodd;"
       id="path568" />
    <ellipse
       cx="29.4996109"
       cy="28.9535923"
       rx="18.451067"
       ry="18.451067"
       transform="matrix(1.035494,0,0,1.035494,-4.681022,-3.828444)"
       style="fill:#bae6ff;fill-rule:evenodd;stroke-width:1;"
       id="path611" />
    <path
       d="M 37.75602 11.25495 C 41.73689 14.09585 44.63477 18.45431 45.50393 23.65544 C 46.37308 28.85656 45.04975 33.92043 42.20885 37.90129 C 39.36796 41.88217 35.00949 44.78004 29.80837 45.6492 C 24.60724 46.51835 21.18569 45.46874 15.56251 42.35413 M 15.56251 42.35413 C 42.90765 34.1242 36.18359 27.44004 37.75602 11.25495 "
       style="fill:#437caf;fill-rule:evenodd;stroke-width:1;"
       id="path610" />
    <path
       d="M 44.19708 38.1717 C 42.15218 38.94135 42.78075 38.8259 40.90227 40.03932 C 40.79773 40.21032 39.66772 40.0985 38.19462 44.35911 L 41.327 47.1658 C 42.17657 46.03913 43.42179 43.99052 44.16041 43.47404 C 45.23143 42.67977 45.76148 42.27381 47.33176 41.64595 L 44.19708 38.1717 z "
       style="fill:#ff0000;fill-rule:evenodd;stroke-width:1;"
       id="path651" />
    <path
       d="M 41.76381 44.04514 L 40.77906 45.45258 L 38.88567 43.87826 L 39.77322 42.49145 L 41.76381 44.04514 z "
       style="fill:#ffffff;fill-rule:evenodd;stroke-width:1;"
       id="path652" />
  </g>
</svg>
