<?xml version="1.0" encoding="UTF-8" standalone="no"?>
<!DOCTYPE svg PUBLIC "-//W3C//DTD SVG 20010904//EN"
"http://www.w3.org/TR/2001/REC-SVG-20010904/DTD/svg10.dtd">
<!-- Created with Sodipodi ("http://www.sodipodi.com/") -->
<svg
   xmlns="http://www.w3.org/2000/svg"
   xmlns:xlink="http://www.w3.org/1999/xlink"
   xmlns:sodipodi="http://sodipodi.sourceforge.net/DTD/sodipodi-0.dtd"
   version="1.0"
   x="0"
   y="0"
   width="90"
   height="90"
   id="svg704"
   sodipodi:version="0.34"
   sodipodi:docname="/home/zeus/.themes/Zeus-Test/gtk-2.0/stock_screenshot.svg"
   sodipodi:docbase="/home/zeus/.themes/Zeus-Test/gtk-2.0/">
  <sodipodi:namedview
     id="base" />
  <defs
     id="defs706">
    <linearGradient
       id="linearGradient633">
      <stop
         style="stop-color:#2ec2ff;stop-opacity:0.9294;"
         offset="0"
         id="stop634" />
      <stop
         style="stop-color:#ede29d;stop-opacity:1;"
         offset="1"
         id="stop635" />
    </linearGradient>
    <linearGradient
       id="linearGradient734">
      <stop
         style="stop-color:#2a2535;stop-opacity:1;"
         offset="0"
         id="stop735" />
      <stop
         style="stop-color:#e3e1cf;stop-opacity:1;"
         offset="1"
         id="stop736" />
    </linearGradient>
    <linearGradient
       id="linearGradient724">
      <stop
         style="stop-color:#ffffff;stop-opacity:0.4902;"
         offset="0"
         id="stop725" />
      <stop
         style="stop-color:#ffffff;stop-opacity:0.1765;"
         offset="1"
         id="stop726" />
    </linearGradient>
    <linearGradient
       id="linearGradient718">
      <stop
         style="stop-color:#e3e1cf;stop-opacity:1;"
         offset="0"
         id="stop719" />
      <stop
         style="stop-color:#ffffff;stop-opacity:1;"
         offset="1"
         id="stop720" />
    </linearGradient>
    <linearGradient
       x1="45.4330635"
       y1="41.9262352"
       x2="24.0375099"
       y2="27.2048512"
       id="linearGradient721"
       xlink:href="#linearGradient718"
       gradientUnits="userSpaceOnUse"
       gradientTransform="scale(1.033999,0.967119)"
       spreadMethod="pad" />
    <linearGradient
       x1="40.2607956"
       y1="39.8445053"
       x2="37.3197212"
       y2="68.6665039"
       id="linearGradient723"
       xlink:href="#linearGradient724"
       gradientUnits="userSpaceOnUse"
       gradientTransform="scale(1.185464,0.843551)"
       spreadMethod="pad" />
    <linearGradient
       id="linearGradient732"
       xlink:href="#linearGradient633"
       x1="0.49999997"
       y1="2.34375969e-2"
       x2="0.37313432"
       y2="1.0859375" />
    <radialGradient
       cx="33.2134209"
       cy="118.190964"
       r="14.8945398"
       fx="33.2134209"
       fy="118.190964"
       id="radialGradient733"
       xlink:href="#linearGradient734"
       gradientUnits="userSpaceOnUse"
       gradientTransform="scale(1.559286,0.641319)"
       spreadMethod="pad" />
    <radialGradient
       id="radialGradient738"
       xlink:href="#linearGradient734" />
  </defs>
  <path
     d="M 12.54589 66.08518 C 10.53906 63.2203 0.804919 39.68818 9.149907 5.573048 C 43.46938 -1.468831 73.21238 11.65689 88.65365 21.52739 C 91.80462 28.06533 86.42437 77.18133 74.9013 81.99402 C 67.17384 84.51389 26.73851 83.81925 12.54589 66.08518 z "
     style="font-size:12;fill-opacity:0.3;fill-rule:evenodd;stroke-width:1;"
     id="path743" />
  <path
     d="M 7.684535 66.32826 C 5.677707 63.46338 -4.056439 39.93127 4.288549 5.81613 C 38.60802 -1.225749 68.35102 11.89997 83.79229 21.77048 C 86.94326 28.30842 81.56302 77.42441 70.03994 82.2371 C 62.31248 84.75697 21.87715 84.06234 7.684535 66.32826 z "
     style="font-size:12;fill:#211301;fill-rule:evenodd;stroke-width:1;"
     id="path715" />
  <path
     d="M 12.30597 64.44791 C 10.67139 61.34246 1.518372 43.85351 7.729434 10.18333 C 42.87063 3.808869 66.24359 17.37499 80.79048 25.54737 C 82.42495 31.43159 77.03113 75.56235 68.20496 78.17751 C 60.68637 80.62928 23.09341 79.1582 12.30597 64.44791 z "
     style="font-size:12;fill:url(#linearGradient721);fill-rule:evenodd;stroke-width:1;"
     id="path713" />
  <path
     d="M 16.06521 20.80745 L 13.73486 19.06134 C 13.40797 21.51311 9.037015 44.01701 12.95976 52.84318 C 17.5363 61.09479 22.50916 64.55954 22.01887 63.74225 C 16.46155 54.42579 11.81557 37.6425 16.06521 20.80745 z "
     style="font-size:12;fill:#b5a794;fill-rule:evenodd;stroke-width:1;"
     id="path717"
     sodipodi:nodetypes="ccccc" />
  <path
     d="M 15.82546 20.41306 C 15.82546 20.41306 9.216381 44.47717 17.68962 59.05103 C 24.12929 68.03272 44.9734 75.15024 62.0894 70.0663 C 65.30929 65.99914 72.59611 43.96872 65.81763 31.76726 C 63.2756 27.53058 32.60253 14.48184 15.82546 20.41306 z "
     style="font-size:12;fill-rule:evenodd;stroke-width:1;fill:url(#linearGradient732);"
     id="path711" />
  <path
     d="M 14.59424 44.6708 C 14.59424 44.6708 28.16034 26.20117 41.07265 37.96939 C 46.30308 55.45824 65.4264 59.54448 65.4264 59.54448 L 61.66716 68.86105 C 47.44716 73.92798 20.15146 63.46723 18.84388 59.54448 C 17.5363 55.62174 18.51698 61.66935 14.59424 44.6708 z "
     style="font-size:12;fill:url(#linearGradient723);fill-rule:evenodd;stroke-width:1;"
     id="path722" />
  <path
     d="M 81.11737 25.87427 C 81.11737 25.87427 75.72365 26.03777 75.56026 26.03777 C 75.39665 26.03777 76.37744 39.93077 75.72365 44.9977 C 75.06986 50.06452 73.43539 61.99625 72.4547 65.1017 C 71.47401 68.20726 65.75329 78.17751 65.263 78.8313 C 64.77261 79.48509 66.57059 78.6678 69.34914 77.85062 C 76.86773 69.18784 80.62708 48.43015 81.11737 25.87427 z "
     style="font-size:12;fill:#b5a794;fill-rule:evenodd;stroke-width:1;"
     id="path716" />
  <path
     d="M 64.93611 78.50441 C 64.93611 78.50441 77.68502 68.53415 74.41607 26.69156 C 71.63741 23.9129 67.38777 20.80745 67.38777 20.80745 C 67.38777 20.80745 75.56015 24.73019 76.05055 26.03777 C 76.86773 27.83564 77.35802 71.14932 64.93611 78.50441 z "
     style="font-size:12;fill:#211301;fill-rule:evenodd;stroke-width:1;"
     id="path712" />
  <path
     d="M 40.76737 81.63536 C 36.51108 76.2408 46.56432 81.10415 31.70532 64.51578 C 27.08531 56.65534 22.17656 49.58096 29.10655 46.43676 C 36.32531 44.86468 36.32531 57.44139 39.21282 57.96542 C 41.81157 54.29721 37.4803 38.83834 37.76907 36.21821 C 38.34657 32.81202 43.54406 29.92985 46.14282 33.59807 C 49.31907 37.00426 50.2935 47.59638 50.2935 47.59638 C 50.2935 47.59638 50.76282 34.64613 53.07282 31.76396 C 55.96033 29.66785 60.29158 29.40582 60.86909 33.86008 C 61.44659 38.31432 62.13224 41.04601 60.39974 45.50026 C 63.28724 41.57004 63.75658 34.90814 70.39785 37.79029 C 75.30657 39.36238 72.1661 46.01652 69.85607 50.20874 C 73.32106 48.11264 72.88842 46.81812 76.4616 45.63516 C 81.94786 42.75301 84.69051 51.80418 79.20426 58.35454 C 74.58424 63.85685 61.05749 82.40586 56.65382 85.31135 C 51.45632 85.83538 42.57666 85.84118 40.76737 81.63536 z "
     style="font-size:12;fill:#253f4e;fill-rule:evenodd;stroke-width:1;fill-opacity:1;"
     id="path647"
     sodipodi:nodetypes="cccccccccccccccc" />
  <path
     d="M 42.77346 73.939 C 40.38115 72.65195 37.82412 70.30423 34.85453 65.55014 C 30.89506 58.7586 24.3781 52.90822 30.31731 50.19158 C 36.504 48.83326 33.61649 56.81759 39.8449 61.4626 C 44.09338 55.67308 39.22635 41.00626 39.47383 38.74242 C 39.96877 35.7994 43.55691 33.5712 45.78412 36.7406 C 47.92876 43.08978 50.15621 55.79037 50.15621 55.79037 C 51.88873 56.3144 52.34235 36.59808 54.32209 34.10783 C 56.79677 32.29675 59.35377 32.59439 59.84871 36.44294 C 60.34363 40.29148 58.28111 50.39275 58.81755 54.50331 C 61.29223 51.10753 63.76713 37.34849 69.45889 39.8387 C 73.66581 41.19703 67.93256 52.22905 65.95281 55.85121 C 68.9224 54.04013 73.37729 49.97782 76.09942 49.29866 C 80.80129 46.80844 81.50243 51.50386 73.62429 60.83167 C 69.66483 65.58577 63.06577 75.97646 58.61137 76.42922 C 54.15696 76.882 43.26839 75.97646 42.77346 73.939 z "
     style="font-size:12;fill:#ffffff;fill-rule:evenodd;stroke-width:1;"
     id="path648" />
  <path
     d="M 48.45282 58.22743 C 48.74156 59.79951 45.85407 63.46772 47.00906 63.72973 C 48.16407 63.99175 51.05158 62.15764 48.45282 58.22743 z "
     style="font-size:12;fill:#5fa2c7;fill-rule:evenodd;stroke-width:1;"
     id="path649" />
  <path
     d="M 56.24908 58.75147 C 56.53782 60.32355 53.65033 63.99175 54.80532 64.25377 C 55.96033 64.51578 58.84783 62.68168 56.24908 58.75147 z "
     style="font-size:12;fill:#5fa2c7;fill-rule:evenodd;stroke-width:1;"
     id="path650" />
  <path
     d="M 62.89033 60.06154 C 63.17907 61.63362 60.29158 65.30181 61.44657 65.56384 C 62.60158 65.82585 65.48908 63.99175 62.89033 60.06154 z "
     style="font-size:12;fill:#5fa2c7;fill-rule:evenodd;stroke-width:1;"
     id="path651" />
  <path
     d="M 43.69904 75.83494 C 43.69904 75.83494 40.92752 78.29852 43.3911 79.53031 C 45.85467 80.76209 54.16922 83.84155 56.94073 80.76209 C 59.71224 77.68263 61.55991 76.45085 59.71224 75.83496 C 56.01689 80.14619 44.007 76.45083 43.69904 75.83494 z "
     style="font-size:12;fill:#ffffff;fill-rule:evenodd;stroke-width:1;"
     id="path652" />
</svg>
