<?xml version="1.0" encoding="UTF-8" standalone="no"?>
<!DOCTYPE svg PUBLIC "-//W3C//DTD SVG 20010904//EN"
"http://www.w3.org/TR/2001/REC-SVG-20010904/DTD/svg10.dtd">
<!-- Created with Sodipodi ("http://www.sodipodi.com/") -->
<svg
   xmlns="http://www.w3.org/2000/svg"
   xmlns:sodipodi="http://sodipodi.sourceforge.net/DTD/sodipodi-0.dtd"
   xmlns:xlink="http://www.w3.org/1999/xlink"
   xmlns:inkscape="http://www.inkscape.org/namespaces/inkscape"
   version="1"
   x="0.00000000"
   y="0.00000000"
   width="48pt"
   height="48pt"
   id="svg548"
   sodipodi:version="0.34"
   sodipodi:docname="/home/zeus/.themes/Zeus-Test/gtk-2.0/button_ok.svg"
   sodipodi:docbase="/home/zeus/.themes/Zeus-Test/gtk-2.0/"
   inkscape:version="0.37">
  <sodipodi:namedview
     id="base"
     inkscape:zoom="9.65625000"
     inkscape:cx="16.0000000"
     inkscape:cy="32.5695793"
     inkscape:window-width="1014"
     inkscape:window-height="696"
     inkscape:window-x="0"
     inkscape:window-y="0" />
  <defs
     id="defs550">
    <linearGradient
       x1="0.00000000"
       y1="0.00000000"
       x2="1.00000000"
       y2="0.00000000"
       id="linearGradient556"
       gradientUnits="objectBoundingBox"
       spreadMethod="pad">
      <stop
         style="stop-color:#ff0000;stop-opacity:1.0000;"
         offset="0"
         id="stop557" />
      <stop
         style="stop-color:#ffff8d;stop-opacity:0;"
         offset="1"
         id="stop558" />
    </linearGradient>
    <linearGradient
       id="linearGradient559"
       xlink:href="#linearGradient556"
       x1="0.984508"
       y1="0.968756"
       x2="-0.573643"
       y2="-0.171875" />
  </defs>
  <g
     id="g687"
     transform="matrix(-0.99851,-5.457858e-2,5.457858e-2,-0.99851,59.37221,62.84238)">
    <sodipodi:namedview
       id="namedview688"
       inkscape:zoom="9.65625000"
       inkscape:cx="16.0000000"
       inkscape:cy="20.1423948"
       inkscape:window-width="1014"
       inkscape:window-height="696"
       inkscape:window-x="0"
       inkscape:window-y="0" />
    <defs
       id="defs689">
      <linearGradient
         x1="0.00000000"
         y1="0.00000000"
         x2="1.00000000"
         y2="0.00000000"
         id="linearGradient690"
         gradientUnits="objectBoundingBox"
         spreadMethod="pad">
        <stop
           style="stop-color:#ff0000;stop-opacity:1.0000;"
           offset="0"
           id="stop691" />
        <stop
           style="stop-color:#ffff8d;stop-opacity:0;"
           offset="1"
           id="stop692" />
      </linearGradient>
      <linearGradient
         id="linearGradient693"
         xlink:href="#linearGradient556"
         x1="0.984508"
         y1="0.968756"
         x2="-0.573643"
         y2="-0.171875" />
    </defs>
    <path
       d="M 60.01725 23.99648 C 59.53549 18.42523 39.28151 -0.155997 34.6921 1.525979 C 26.26824 2.875133 27.80318 12.48977 24.47333 13.67308 C 21.12074 14.2603 -7.972638 17.44191 5.187324 48.65893 C 7.581571 54.25087 9.102327 55.29983 11.60488 57.13311 C 14.0401 58.78143 17.95009 58.8779 21.12059 55.3124 C 24.01675 51.00947 22.76623 46.76743 21.42301 43.20362 C 17.19612 32.53529 24.99563 32.40727 29.30969 30.15509 C 30.31799 33.8884 32.17592 42.69868 34.68069 42.57612 C 37.18548 42.45358 60.64089 35.12471 60.01725 23.99648 z "
       style="font-size:12;fill:#0d3c07;fill-rule:evenodd;"
       id="path582"
       sodipodi:nodetypes="cccsscsccc" />
    <path
       d="M 56.43394 23.6407 C 56.27621 19.46667 39.11294 4.640965 35.3464 6.096892 C 31.57967 7.552896 33.49308 12.85851 31.87806 15.80547 C -4.80765 16.56439 4.758002 57.5538 16.64254 52.80007 C 23.15131 50.27578 12.05925 39.66178 17.21876 32.46884 C 21.59482 26.19341 33.14937 25.01374 33.38684 26.55734 C 33.86179 29.64459 34.44591 38.87531 36.46869 38.67948 C 38.4915 38.48365 57.31595 28.02613 56.43394 23.6407 z "
       style="font-size:12;fill:#2aaf18;fill-rule:evenodd;"
       id="path581"
       sodipodi:nodetypes="ccccsccc" />
    <path
       d="M 6.835245 41.70574 C 8.271465 32.53362 10.38564 27.15574 15.38294 23.37504 C 20.88176 19.00195 30.21643 18.33108 30.49849 17.5357 C 30.78051 16.74034 23.72856 18.85646 18.28161 20.48563 C 8.069523 23.49743 5.940525 35.37665 6.835245 41.70574 z "
       style="font-size:12;fill:#ffffff;fill-rule:evenodd;"
       id="path588"
       sodipodi:nodetypes="cscsc" />
    <path
       d="M 48.10932 19.7236 C 46.94802 18.36876 38.77247 11.53838 36.54244 11.06304 C 34.31254 10.58784 35.79821 14.70468 35.79821 14.70468 C 35.79821 14.70468 47.19147 18.18673 48.10932 19.7236 z "
       style="font-size:12;fill:#ffffff;fill-rule:evenodd;"
       id="path589"
       sodipodi:nodetypes="cccc" />
    <path
       style="font-size:12;fill:none;fill-rule:evenodd;stroke-width:1pt;"
       d="M 48.89974 35.68601 C 48.89974 35.68601 58.05552 31.86359 58.04005 31.98362 C 58.02458 32.10363 56.33631 30.05579 56.33631 30.05579 L 53.96308 30.48197 L 48.70187 32.48812 L 48.89974 35.68601 z "
       id="path576" />
    <path
       style="fill:#1f8b10;fill-rule:evenodd;stroke:none;stroke-opacity:1;stroke-width:1pt;stroke-linejoin:miter;stroke-linecap:butt;fill-opacity:0.9899;"
       d="M 56.32258 23.6129 C 57.29033 29.41935 36.19355 39.09677 36.19355 39.09677 C 34.25806 37.54839 33.09677 27.09678 31.16129 25.74193 C 27.67742 27.29032 16.83871 30.38709 16.25807 34.45161 C 15.67741 38.51613 18.58065 46.64516 18.96775 48.58064 C 19.74194 51.48388 17.22581 54.19355 14.70968 53.03226 C 12.19355 51.87097 11.80645 49.54838 11.80645 49.54838 C 11.80645 49.54838 14.51613 49.54839 14.90323 47.41935 C 15.29032 45.29032 9.67742 34.83871 12.58065 30.77419 C 15.48387 26.70968 27.09677 21.09678 34.25806 21.67742 L 37.16129 33.67741 C 37.16129 33.67741 40.06451 33.48388 56.32258 23.6129 z "
       id="path615"
       sodipodi:nodetypes="cccccccccccc" />
  </g>
</svg>
