<?xml version="1.0" encoding="UTF-8" standalone="no"?>
<!DOCTYPE svg PUBLIC "-//W3C//DTD SVG 20010904//EN"
"http://www.w3.org/TR/2001/REC-SVG-20010904/DTD/svg10.dtd">
<!-- Created with Sodipodi ("http://www.sodipodi.com/") -->
<svg
   xmlns="http://www.w3.org/2000/svg"
   xmlns:xlink="http://www.w3.org/1999/xlink"
   version="1.0"
   x="0"
   y="0"
   width="90"
   height="90"
   id="svg604"
   xmlns:sodipodi="http://sodipodi.sourceforge.net/DTD/sodipodi-0.dtd"
   sodipodi:version="0.34"
   sodipodi:docname="/home/zeus/.themes/Zeus-Test/gtk-2.0/stock_text-indent.svg"
   sodipodi:docbase="/home/zeus/.themes/Zeus-Test/gtk-2.0/">
  <sodipodi:namedview
     id="base" />
  <defs
     id="defs606">
    <linearGradient
       id="linearGradient612">
      <stop
         style="stop-color:#7fa8e3;stop-opacity:0.7412;"
         offset="0"
         id="stop613" />
      <stop
         style="stop-color:#ffffff;stop-opacity:0;"
         offset="1"
         id="stop614" />
    </linearGradient>
    <linearGradient
       x1="50.6438866"
       y1="5.36792946"
       x2="35.7520943"
       y2="68.0443573"
       id="linearGradient615"
       xlink:href="#linearGradient612"
       gradientUnits="userSpaceOnUse"
       spreadMethod="pad" />
  </defs>
  <path
     d="M 18.89402 89.14329 C 15.17349 89.08935 8.93609 86.8401 8.391471 80.80421 C 6.470903 74.70581 -0.205571 17.06557 3.016118 13.05078 C 4.680796 9.889982 8.305763 7.569676 14.75523 6.765306 C 20.03242 5.965338 68.03442 -0.286529 71.57398 0.683834 C 75.11367 1.65426 77.90195 2.474839 78.15658 7.341533 C 77.89478 9.988262 86.81057 63.97359 88.17839 67.15706 C 88.83104 70.8859 87.75969 76.09674 82.3016 77.81325 C 76.8436 79.52972 23.20266 88.41475 18.89402 89.14329 z "
     style="font-size:12;fill:#3d4e67;fill-rule:evenodd;"
     id="path609" />
  <path
     d="M 23.19232 82.75002 C 19.58523 83.22146 14.57481 84.20701 13.97633 79.32472 C 11.4842 67.7671 5.77019 21.9616 9.841695 14.51773 C 10.75106 12.76731 15.68837 10.39138 26.90377 9.399511 C 39.64893 8.130449 65.80005 6.200582 68.55199 6.325944 C 71.30381 6.451338 72.14568 6.142873 72.74424 11.02528 C 72.50115 16.21607 80.80289 56.82189 81.29332 64.01125 C 81.67493 69.11489 82.33165 71.28332 78.96447 72.51713 "
     style="font-size:12;fill:#ffffff;fill-rule:evenodd;"
     id="path608" />
  <path
     d="M 10.74411 21.42964 C 10.74411 21.42964 11.06852 14.50301 20.40659 13.12366 C 29.74465 11.74433 66.72744 7.042941 67.60862 9.443149 C 68.48977 11.84334 69.5807 27.44162 69.85278 28.70348 C 70.12487 29.96529 38.81837 40.75597 30.22175 51.05402 C 21.62512 61.35207 15.60451 69.68508 15.60451 69.68508 C 15.60451 69.68508 10.68181 33.36589 10.74411 21.42964 z "
     style="font-size:12;fill:url(#linearGradient615);fill-rule:evenodd;"
     id="path636" />
  <path
     d="M 16.81916 24.67294 L 65.59493 18.10229 "
     style="font-size:12;fill:none;fill-rule:evenodd;stroke:#4a5a71;stroke-width:4.212393;stroke-linecap:round;"
     id="path706" />
  <path
     d="M 37.8903 33.7467 L 66.76554 29.36626 "
     style="font-size:12;fill:none;fill-rule:evenodd;stroke:#4a5a71;stroke-width:4.212393;stroke-linecap:round;"
     id="path707" />
  <path
     d="M 41.40216 45.63646 L 67.93618 40.94313 "
     style="font-size:12;fill:none;fill-rule:evenodd;stroke:#4a5a71;stroke-width:4.212393;stroke-linecap:round;"
     id="path708" />
  <path
     d="M 42.96298 57.52621 L 69.88719 52.83288 "
     style="font-size:12;fill:none;fill-rule:evenodd;stroke:#4a5a71;stroke-width:4.212393;stroke-linecap:round;"
     id="path709" />
  <path
     d="M 23.84288 73.7964 L 72.61863 64.40976 "
     style="font-size:12;fill:none;fill-rule:evenodd;stroke:#4a5a71;stroke-width:4.212393;stroke-linecap:round;"
     id="path710" />
  <g
     transform="matrix(-6.260452e-2,-0.53236,0.462204,-7.2107e-2,12.23993,58.07674)"
     style="font-size:12;"
     id="g682">
    <defs
       id="defs550">
      <linearGradient
         x1="0"
         y1="0"
         x2="1"
         y2="0"
         id="linearGradient556"
         gradientUnits="objectBoundingBox"
         spreadMethod="pad">
        <stop
           style="stop-color:#ff8700;stop-opacity:1;"
           offset="0"
           id="stop557" />
        <stop
           style="stop-color:#ffff8d;stop-opacity:0;"
           offset="1"
           id="stop558" />
      </linearGradient>
      <linearGradient
         x1="0"
         y1="0"
         x2="1"
         y2="0"
         id="linearGradient559"
         xlink:href="#linearGradient556"
         gradientUnits="objectBoundingBox"
         spreadMethod="pad" />
    </defs>
    <path
       d="M 51.9665 36.0486 C 53.9602 37.0454 65.20482 39.65023 65.48962 37.51422 C 64.34288 34.42199 61.38139 32.17381 61.60069 30.63191 C 62.02789 29.20781 68.41024 19.72011 67.85634 17.99121 C 66.26284 14.84691 62.38818 11.19485 59.61133 13.25934 C 57.04183 16.39958 53.88892 24.26578 52.32242 23.69618 C 50.71228 24.31008 47.40281 21.10238 46.97561 22.09918 C 46.54842 23.09598 49.6881 35.3365 51.9665 36.0486 z "
       transform="matrix(1.081451,-1.441644,0.694035,1.745769,-68.11286,71.5964)"
       style="fill:#0d3c07;fill-rule:evenodd;"
       id="path582" />
    <path
       d="M 49.79802 37.52962 C 51.79172 38.52642 63.60147 40.45933 63.88628 38.32334 C 64.17108 36.18724 59.17928 33.27601 59.60648 31.85201 C 60.03367 30.42791 69.4937 17.6582 68.212 16.519 C 66.9304 15.3797 62.6582 11.3924 61.519 12.674 C 60.3797 13.9557 52.62867 27.86461 51.06217 27.29501 C 49.49567 26.72541 46.13126 23.92755 45.70406 24.92435 C 45.27686 25.92115 47.51962 36.81752 49.79802 37.52962 z "
       transform="matrix(0.789589,-1.052573,0.57481,1.445871,-47.98446,55.81936)"
       style="fill:#2aaf18;fill-rule:evenodd;"
       id="path581" />
    <path
       d="M 67.6424 15.9494 C 67.6424 15.9494 69.0665 16.8038 68.0696 18.5127 C 67.0728 20.2215 58.84579 32.11449 59.27299 32.68409 C 60.83939 33.96569 64.54568 37.24423 63.54887 38.09873 C 61.84007 39.66513 51.71666 37.50908 50.57737 36.93948 C 49.43816 36.36978 62.15273 37.3728 57.39603 32.59019 C 57.53843 30.16929 58.7778 28.32641 59.6322 26.90231 C 60.4866 25.47831 65.3639 14.9525 66.2184 15.2373 C 67.0728 15.5221 67.7848 16.519 67.6424 15.9494 z "
       transform="matrix(0.789589,-1.052573,0.57481,1.445871,-47.98446,55.81936)"
       style="fill:#208c11;fill-rule:evenodd;"
       id="path583" />
    <path
       d="M 16.9462 4.6519 C 16.9462 4.6519 9.25633 14.193 9.54114 15.0475 C 9.82595 15.9019 17.3734 8.49683 16.9462 4.6519 z "
       transform="matrix(0.789589,-1.052573,0.57481,1.445871,-6.508902,20.37594)"
       style="fill:#ffffff;fill-rule:evenodd;"
       id="path588" />
    <path
       d="M 6.584837 20.72351 C 2.612252 18.09925 0.675687 18.22699 1.102897 17.08769 C 1.530117 15.94849 3.27656 18.7037 5.706755 18.73263 C 7.218279 21.70708 7.979783 19.72312 6.584837 20.72351 z "
       transform="matrix(0.789589,-1.052573,0.57481,1.445871,-6.508902,20.37594)"
       style="fill:#ffffff;fill-rule:evenodd;"
       id="path589" />
  </g>
</svg>
