<?xml version="1.0" encoding="UTF-8" standalone="no"?>
<!DOCTYPE svg PUBLIC "-//W3C//DTD SVG 20010904//EN"
"http://www.w3.org/TR/2001/REC-SVG-20010904/DTD/svg10.dtd">
<!-- Created with Sodipodi ("http://www.sodipodi.com/") -->
<svg
   xmlns="http://www.w3.org/2000/svg"
   xmlns:sodipodi="http://sodipodi.sourceforge.net/DTD/sodipodi-0.dtd"
   xmlns:xlink="http://www.w3.org/1999/xlink"
   id="svg604"
   sodipodi:version="0.34"
   width="72pt"
   height="72pt"
   sodipodi:docbase="/home/zeus/.icons/gartoon/scalable/mimetypes/"
   sodipodi:docname="/home/zeus/.icons/gartoon/scalable/mimetypes/gnome-mime-application-rhythmbox-playlist.svg">
  <defs
     id="defs606">
    <linearGradient
       id="linearGradient705">
      <stop
         style="stop-color:#7fa8e3;stop-opacity:0.741176;"
         offset="0.000000"
         id="stop706" />
      <stop
         style="stop-color:#ffffff;stop-opacity:0;"
         offset="1.000000"
         id="stop707" />
    </linearGradient>
    <linearGradient
       id="linearGradient612">
      <stop
         style="stop-color:#ffffff;stop-opacity:1;"
         offset="0.000000"
         id="stop613" />
      <stop
         style="stop-color:#ffffff;stop-opacity:0;"
         offset="1.000000"
         id="stop614" />
    </linearGradient>
    <linearGradient
       xlink:href="#linearGradient705"
       id="linearGradient615"
       x1="50.6438866"
       y1="5.36792946"
       x2="35.7520943"
       y2="68.0443573"
       gradientUnits="userSpaceOnUse"
       spreadMethod="pad" />
    <radialGradient
       xlink:href="#linearGradient612"
       id="radialGradient704"
       cx="8.17300129"
       cy="62.0631676"
       fx="8.17300129"
       fy="62.0631676"
       r="4.03522396"
       gradientUnits="userSpaceOnUse"
       spreadMethod="pad"
       gradientTransform="matrix(1.111950,0.000000,0.000000,0.899321,3.428790e-7,-1.512959e-6)" />
    <radialGradient
       xlink:href="#linearGradient612"
       id="radialGradient708"
       cx="0.05366803"
       cy="0.10153580"
       fx="0.05366803"
       fy="0.10153580"
       r="0.75628221"
       gradientUnits="objectBoundingBox"
       spreadMethod="pad" />
  </defs>
  <sodipodi:namedview
     id="base" />
  <path
     style="fill:#000000;fill-rule:evenodd;stroke:none;stroke-opacity:1;stroke-width:1pt;stroke-linejoin:miter;stroke-linecap:butt;fill-opacity:0.301471;"
     d="M 12.8163 74.753 C 10.3856 73.6481 7.07107 70.1126 8.83884 65.2512 C 9.72267 59.948 25.6326 13.1021 29.1682 10.8924 C 31.3778 8.90368 34.582 8.13026 39.1119 9.34561 C 42.8684 10.2295 76.6769 19.0684 78.6656 20.8361 C 80.6544 22.6039 82.2012 24.0402 80.6544 27.9072 C 79.5496 29.8959 66.4017 74.532 66.1808 77.4047 C 65.2969 80.4983 62.7558 84.2548 58.5573 84.0338 C 54.3589 83.8128 15.9099 75.4159 12.8163 74.753 z "
     id="path794"
     sodipodi:nodetypes="ccccccccc"
     transform="matrix(1.114903,0.000000,0.000000,1.114903,-5.305332,-3.889256)" />
  <path
     style="fill:#143c69;fill-rule:evenodd;stroke:none;stroke-opacity:1;stroke-width:1pt;stroke-linejoin:miter;stroke-linecap:butt;fill-opacity:1;"
     d="M 12.8163 74.753 C 10.3856 73.6481 7.07107 70.1126 8.83884 65.2512 C 9.72267 59.948 25.6326 13.1021 29.1682 10.8924 C 31.3778 8.90368 34.582 8.13026 39.1119 9.34561 C 42.8684 10.2295 76.6769 19.0684 78.6656 20.8361 C 80.6544 22.6039 82.2012 24.0402 80.6544 27.9072 C 79.5496 29.8959 66.4017 74.532 66.1808 77.4047 C 65.2969 80.4983 62.7558 84.2548 58.5573 84.0338 C 54.3589 83.8128 15.9099 75.4159 12.8163 74.753 z "
     id="path609"
     sodipodi:nodetypes="ccccccccc"
     transform="matrix(1.114903,0.000000,0.000000,1.114903,-8.162471,-8.460684)" />
  <path
     style="fill:#ffffff;fill-rule:evenodd;stroke:none;stroke-opacity:1;stroke-width:1pt;stroke-linejoin:miter;stroke-linecap:butt;fill-opacity:1;"
     d="M 17.8987 70.9965 C 15.3576 70.3336 11.7114 69.6706 13.0373 65.6932 C 15.468 55.9705 27.8424 18.6264 33.1456 13.986 C 34.361 12.8811 38.4489 12.4392 46.1829 14.8699 C 55.0218 17.5215 72.9204 23.4877 74.6882 24.3716 C 76.4559 25.2555 77.1189 25.2555 75.793 29.233 C 73.8043 33.2105 64.9655 67.24 62.7557 72.9852 C 61.209 77.0732 60.8775 78.9514 58.2258 78.9514 "
     id="path608"
     sodipodi:nodetypes="cccccccs"
     transform="matrix(1.114903,0.000000,0.000000,1.114903,-8.162471,-8.460684)" />
  <path
     style="fill:url(#linearGradient615);fill-rule:evenodd;stroke:none;stroke-opacity:1;stroke-width:1pt;stroke-linejoin:miter;stroke-linecap:butt;fill-opacity:1;"
     d="M 28.75 13.75 C 28.75 13.75 31.875 7.49995 39.6875 9.37495 C 47.5 11.25 78.125 19.375 77.8125 21.875 C 77.5 24.375 71.875 39.0625 71.5625 40.3125 C 71.25 41.5625 42.5 40.9375 31.5625 47.5 C 20.625 54.0625 12.5 59.6875 12.5 59.6875 C 12.5 59.6875 23.75 24.6875 28.75 13.75 z "
     id="path636"
     transform="matrix(0.946780,0.000000,0.000000,0.946780,-0.480566,0.409517)" />
  <path
     style="font-size:12;fill:#0d0000;fill-opacity:0.301471;fill-rule:evenodd;stroke-width:1pt;"
     d="M 7.73398 34.2049 L 12.0429 51.3301 C 5.08232 51.2196 4.19844 55.9705 4.64039 59.1746 C 6.73961 68.2343 17.4567 65.6933 24.5277 62.7102 C 23.6438 59.506 20.3293 44.3696 19.8874 41.7178 C 23.7543 40.7235 31.8198 38.4033 31.8198 38.4033 C 31.8198 38.4033 34.6924 45.5849 35.1343 47.0212 C 26.0745 46.6897 25.4117 52.3244 26.1851 54.8656 C 27.6214 61.9367 34.0295 61.8262 37.5651 60.8318 C 40.8796 60.2795 45.52 58.2907 48.0612 57.1859 C 47.0668 53.3189 38.3384 29.233 37.2336 26.1394 C 32.9246 27.6862 7.62349 34.4258 7.73398 34.2049 z "
     id="path635"
     sodipodi:nodetypes="cccccccccccc"
     transform="matrix(1.035546,0.000000,0.000000,1.035546,15.56160,-11.72637)" />
  <path
     style="font-size:12;fill:#0d3c07;fill-rule:evenodd;stroke-width:1pt;"
     d="M 7.73398 34.2049 L 12.0429 51.3301 C 5.08232 51.2196 4.19844 55.9705 4.64039 59.1746 C 6.73961 68.2343 17.4567 65.6933 24.5277 62.7102 C 23.6438 59.506 20.3293 44.3696 19.8874 41.7178 C 23.7543 40.7235 31.8198 38.4033 31.8198 38.4033 C 31.8198 38.4033 34.6924 45.5849 35.1343 47.0212 C 26.0745 46.6897 25.4117 52.3244 26.1851 54.8656 C 27.6214 61.9367 34.0295 61.8262 37.5651 60.8318 C 40.8796 60.2795 45.52 58.2907 48.0612 57.1859 C 47.0668 53.3189 38.3384 29.233 37.2336 26.1394 C 32.9246 27.6862 7.62349 34.4258 7.73398 34.2049 z "
     id="path616"
     sodipodi:nodetypes="cccccccccccc"
     transform="translate(14.83929,-11.42410)" />
  <path
     style="font-size:12;fill:#2aaf18;fill-rule:evenodd;stroke-width:1pt;"
     d="M 15.7994 54.2027 L 11.159 35.9726 L 35.7973 29.1225 L 44.7466 54.9761 C 44.7466 54.9761 33.3666 59.506 31.7093 57.5173 C 28.9471 57.4067 26.7375 51.2197 33.4771 50.0043 C 37.1231 49.8938 38.5594 49.6728 39.5538 50.0042 L 33.3666 34.0944 L 15.247 39.3977 L 20.3293 60.0584 C 20.3293 60.0584 13.7002 64.9198 7.95495 60.1689 C 6.73961 59.0641 6.62912 56.0809 8.61786 54.9761 C 10.2751 52.8769 15.6889 54.4237 15.7994 54.2027 z "
     id="path574"
     sodipodi:nodetypes="ccccccccccccc"
     transform="translate(14.83929,-11.42410)" />
  <path
     transform="matrix(1.488889,0.000000,0.000000,1.488889,8.836250,-40.12308)"
     style="font-size:12;fill-rule:evenodd;stroke-width:1pt;fill:url(#radialGradient704);"
     d="M 14.4736 57.5725 C 12.6184 56.7928 11.9994 58.2032 11.601 60.0584 C 10.0153 60.0584 8.87676 59.2416 8.87676 57.8693 C 8.87676 56.4971 9.94109 55.5318 11.5268 55.5318 C 13.1125 55.5318 14.4736 56.2003 14.4736 57.5725 z "
     id="path623"
     sodipodi:nodetypes="ccccc" />
  <path
     style="font-size:12;fill-rule:evenodd;stroke-width:1pt;fill:url(#radialGradient708);"
     d="M 37.3441 53.6503 C 33.3666 51.8834 34.4706 54.4237 33.6428 56.8544 C 31.5997 56.8544 29.9416 55.4189 29.9416 53.6503 C 29.9416 51.8816 31.5997 50.4462 33.6428 50.4462 C 35.6859 50.4462 37.3441 51.8816 37.3441 53.6503 z "
     id="path625"
     sodipodi:nodetypes="ccccc"
     transform="translate(14.83929,-11.42410)" />
  <path
     style="font-size:12;fill:#34674b;fill-rule:evenodd;stroke-width:1pt;"
     d="M 15.3575 39.5082 L 33.3666 34.2049 L 33.8085 32.5476 L 15.7994 37.7404 L 15.3575 39.5082 z "
     id="path630"
     sodipodi:nodetypes="ccccc"
     transform="translate(14.83929,-11.42410)" />
  <path
     style="font-size:12;fill:#cbff87;fill-rule:evenodd;stroke-width:1pt;"
     d="M 11.159 35.9726 L 13.3687 36.5251 L 36.1287 30.2274 L 35.6868 29.1225 L 11.159 35.9726 z "
     id="path631"
     transform="translate(14.83929,-11.42410)" />
  <path
     style="font-size:12;fill:#cbff87;fill-rule:evenodd;stroke-width:1pt;"
     d="M 33.6981 32.879 L 39.6643 49.8938 L 33.2561 34.2049 L 33.6981 32.879 z "
     id="path633"
     transform="translate(14.83929,-11.42410)" />
  <path
     style="font-size:12;fill:#cbff87;fill-rule:evenodd;stroke-width:1pt;"
     d="M 13.1478 36.1936 C 13.1478 36.1936 16.1309 54.3132 16.0204 54.3132 C 15.9099 54.3132 11.2695 36.0831 11.2695 36.0831 L 13.1478 36.1936 z "
     id="path634"
     transform="translate(14.83929,-11.42410)" />
  <path
     transform="matrix(0.974161,0.225853,-0.225853,0.974161,0,0)"
     style="font-size:14;font-weight:bold;fill:#143c69;stroke-width:1;font-family:Kid Kosmic;"
     d="M 29.79059 61.18333 C 29.79059 61.63906 29.57184 62.0401 29.13434 62.38645 C 28.70595 62.73281 28.24567 62.90598 27.75348 62.90598 C 27.57119 62.90598 27.40257 62.87864 27.24762 62.82395 C 26.79189 62.64166 26.56403 62.31809 26.56403 61.85325 C 26.56403 61.53424 26.67796 61.22434 26.90582 60.92356 C 27.34332 60.36757 27.8902 60.08958 28.54645 60.08958 C 28.73785 60.08958 28.92015 60.12148 29.09332 60.18528 C 29.55817 60.35846 29.79059 60.69114 29.79059 61.18333 z M 32.96246 51.40794 L 32.92145 51.25755 L 33.01715 51.21653 C 33.09007 51.18007 33.14476 51.15728 33.18121 51.14817 C 33.62783 50.71067 34.2066 50.49192 34.91754 50.49192 C 35.17275 50.49192 35.40061 50.52838 35.60114 50.6013 C 37.17796 50.33697 38.73199 50.20937 40.26324 50.21848 C 41.88564 50.2276 42.81989 50.51015 43.06598 51.06614 C 43.75869 52.57916 44.10504 53.87799 44.10504 54.96262 C 44.10504 55.85585 43.87718 56.61692 43.42145 57.24583 C 42.47353 58.55833 40.71897 59.34674 38.15778 59.61106 C 38.66819 60.08502 39.3609 60.49973 40.2359 60.8552 C 40.71897 61.04661 41.48916 61.2927 42.54645 61.59348 C 42.7014 61.83046 42.77887 62.05833 42.77887 62.27708 C 42.77887 62.65989 42.56468 62.98346 42.13629 63.24778 C 41.80817 63.4483 41.48916 63.54856 41.17926 63.54856 C 40.99697 63.54856 40.80556 63.51666 40.60504 63.45286 C 37.87978 62.71458 35.50543 61.57525 33.48199 60.03489 C 33.40908 60.8552 33.39085 61.61627 33.42731 62.31809 C 33.36351 62.72825 33.19033 63.07005 32.90778 63.34348 C 32.62522 63.60781 32.28343 63.73997 31.88239 63.73997 C 31.49046 63.73997 31.0803 63.53489 30.65192 63.12473 C 30.92535 58.99583 31.69554 55.09023 32.96246 51.40794 z M 33.89215 57.27317 C 34.50283 57.34609 35.30035 57.38255 36.28473 57.38255 C 38.74567 57.36432 40.36806 56.84023 41.15192 55.81028 C 41.31598 55.59153 41.39801 55.33176 41.39801 55.03098 C 41.39801 54.62994 41.24762 54.14687 40.94684 53.58176 C 40.35439 53.25364 39.68447 53.08958 38.93707 53.08958 C 38.12588 53.08958 36.84072 53.27187 35.0816 53.63645 C 34.5803 54.76666 34.18382 55.9789 33.89215 57.27317 z M 47.19489 60.74583 C 47.18577 60.90077 47.18577 60.97825 47.19489 60.97825 C 47.38629 61.01471 47.58226 61.04205 47.78278 61.06028 C 48.31142 61.197 48.94489 61.26536 49.68317 61.26536 C 50.8316 61.26536 51.85699 61.07395 52.75934 60.69114 C 53.90778 60.19895 54.61416 59.47434 54.87848 58.51731 C 54.96963 58.18919 54.59137 57.92486 53.74371 57.72434 C 53.2333 57.60585 52.70921 57.53294 52.17145 57.50559 C 51.98916 57.49648 51.75218 57.49192 51.46051 57.49192 C 49.72874 57.49192 48.52106 57.72434 47.83746 58.18919 C 47.81012 58.34413 47.68707 58.76796 47.46832 59.46067 C 47.30426 59.97109 47.21311 60.39947 47.19489 60.74583 z M 48.63043 55.31809 C 49.99762 55.12669 50.94098 54.95807 51.46051 54.81223 C 52.52692 54.52057 53.3609 54.06484 53.96246 53.44505 C 53.96246 53.43593 53.89866 53.40403 53.77106 53.34934 C 53.31533 53.16705 52.52236 53.0759 51.39215 53.0759 C 50.50804 53.0759 49.7652 53.14882 49.16364 53.29465 C 49.03603 53.92356 48.8583 54.59804 48.63043 55.31809 z M 50.66754 50.38255 C 52.15322 50.31874 53.48395 50.42356 54.65973 50.697 C 56.5191 51.11627 57.38955 51.89101 57.27106 53.02122 C 57.17991 53.91445 56.50543 54.6345 55.24762 55.18137 C 56.68772 55.6371 57.40778 56.62148 57.40778 58.1345 C 57.40778 58.6358 57.3303 59.18723 57.17535 59.7888 C 56.93838 60.68202 56.26845 61.44765 55.16559 62.08567 C 54.48199 62.48671 53.51129 62.88775 52.25348 63.2888 C 51.29645 63.39817 50.38499 63.45286 49.5191 63.45286 C 47.56858 63.45286 45.78668 63.14752 44.1734 62.53684 C 44.51064 60.94179 44.9208 59.36952 45.40387 57.82005 C 45.85048 56.38906 46.16038 54.94439 46.33356 53.48606 C 46.16038 53.10325 46.07379 52.77968 46.07379 52.51536 C 46.07379 52.169 46.25153 51.77708 46.60699 51.33958 C 47.97418 50.75624 49.3277 50.43723 50.66754 50.38255 z M 59.03473 56.31614 C 59.11676 55.94244 59.34007 55.06744 59.70465 53.69114 C 60.09658 52.21458 60.31989 51.45351 60.37457 51.40794 C 60.42926 51.48085 60.46116 51.52643 60.47028 51.54465 L 60.57965 51.16184 L 60.64801 51.14817 C 61.09462 50.71067 61.66884 50.49192 62.37067 50.49192 C 62.61676 50.49192 62.84007 50.52838 63.04059 50.6013 C 64.63564 50.33697 66.19879 50.20937 67.73004 50.21848 C 69.34332 50.2276 70.27757 50.51015 70.53278 51.06614 C 71.21637 52.57916 71.55817 53.8871 71.55817 54.98997 C 71.55817 56.34804 71.05231 57.39622 70.04059 58.1345 C 68.57314 59.19179 66.27627 59.72044 63.14996 59.72044 C 62.45726 59.72044 61.72809 59.69765 60.96246 59.65208 C 60.8622 60.56353 60.83486 61.45676 60.88043 62.33176 C 60.80752 62.73281 60.62978 63.07005 60.34723 63.34348 C 60.07379 63.60781 59.74111 63.73997 59.34918 63.73997 C 58.95726 63.73997 58.54254 63.53489 58.10504 63.12473 C 58.27822 60.70937 58.58811 58.43984 59.03473 56.31614 z M 61.34528 57.27317 C 61.95595 57.34609 62.74892 57.38255 63.72418 57.38255 C 66.19423 57.36432 67.82119 56.84023 68.60504 55.81028 C 68.7691 55.60064 68.85114 55.34544 68.85114 55.04465 C 68.85114 54.6345 68.70074 54.14687 68.39996 53.58176 C 67.81663 53.25364 67.14215 53.08958 66.37653 53.08958 C 65.55621 53.08958 64.28017 53.27187 62.5484 53.63645 C 62.01064 54.81223 61.6096 56.02447 61.34528 57.27317 z "
     id="path671" />
</svg>
