<?xml version="1.0" encoding="UTF-8" standalone="no"?>
<!DOCTYPE svg PUBLIC "-//W3C//DTD SVG 20010904//EN"
"http://www.w3.org/TR/2001/REC-SVG-20010904/DTD/svg10.dtd">
<!-- Created with Sodipodi ("http://www.sodipodi.com/") -->
<svg
   xmlns="http://www.w3.org/2000/svg"
   xmlns:xlink="http://www.w3.org/1999/xlink"
   version="1.0"
   x="0"
   y="0"
   width="90.0000000"
   height="90.0000000"
   id="svg604"
   xmlns:sodipodi="http://sodipodi.sourceforge.net/DTD/sodipodi-0.dtd"
   sodipodi:version="0.34"
   sodipodi:docname="/home/zeus/.icons/gartoon/scalable/mimetypes/gnome-mime-application-x-backup.svg"
   sodipodi:docbase="/home/zeus/.icons/gartoon/scalable/mimetypes/">
  <sodipodi:namedview
     id="base" />
  <defs
     id="defs606">
    <linearGradient
       id="linearGradient612">
      <stop
         style="stop-color:#7fa8e3;stop-opacity:0.7412;"
         offset="0"
         id="stop613" />
      <stop
         style="stop-color:#ffffff;stop-opacity:0;"
         offset="1"
         id="stop614" />
    </linearGradient>
    <linearGradient
       x1="50.64389"
       y1="5.367929"
       x2="35.75209"
       y2="68.04436"
       id="linearGradient615"
       xlink:href="#linearGradient612"
       gradientUnits="userSpaceOnUse"
       spreadMethod="pad" />
  </defs>
  <path
     d="M 12.81630 74.75300 C 10.38560 73.64810 7.071070 70.11260 8.838840 65.25120 C 9.722670 59.94800 25.63260 13.10210 29.16820 10.89240 C 31.37780 8.903680 34.58200 8.130260 39.11190 9.345610 C 42.86840 10.22950 76.67690 19.06840 78.66560 20.83610 C 80.65440 22.60390 82.20120 24.04020 80.65440 27.90720 C 79.54960 29.89590 66.40170 74.53200 66.18080 77.40470 C 65.29690 80.49830 62.75580 84.25480 58.55730 84.03380 C 54.35890 83.81280 15.90990 75.41590 12.81630 74.75300 z "
     transform="matrix(1.114903,0,0,1.114903,-5.305332,-3.889256)"
     style="font-size:12.000;fill-opacity:0.301471;fill-rule:evenodd;stroke-width:1;"
     id="path794" />
  <path
     d="M 12.81630 74.75300 C 10.38560 73.64810 7.071070 70.11260 8.838840 65.25120 C 9.722670 59.94800 25.63260 13.10210 29.16820 10.89240 C 31.37780 8.903680 34.58200 8.130260 39.11190 9.345610 C 42.86840 10.22950 76.67690 19.06840 78.66560 20.83610 C 80.65440 22.60390 82.20120 24.04020 80.65440 27.90720 C 79.54960 29.89590 66.40170 74.53200 66.18080 77.40470 C 65.29690 80.49830 62.75580 84.25480 58.55730 84.03380 C 54.35890 83.81280 15.90990 75.41590 12.81630 74.75300 z "
     transform="matrix(1.114903,0,0,1.114903,-8.162471,-8.460684)"
     style="font-size:12.000;fill:#3d4e67;fill-rule:evenodd;stroke-width:1;"
     id="path609" />
  <path
     d="M 17.89870 70.99650 C 15.35760 70.33360 11.71140 69.67060 13.03730 65.69320 C 15.46800 55.97050 27.84240 18.62640 33.14560 13.98600 C 34.36100 12.88110 38.44890 12.43920 46.18290 14.86990 C 55.02180 17.52150 72.92040 23.48770 74.68820 24.37160 C 76.45590 25.25550 77.11890 25.25550 75.79300 29.23300 C 73.80430 33.21050 64.96550 67.24000 62.75570 72.98520 C 61.20900 77.07320 60.87750 78.95140 58.22580 78.95140 "
     transform="matrix(1.114903,0,0,1.114903,-8.162471,-8.460684)"
     style="font-size:12.000;fill:#ffffff;fill-rule:evenodd;stroke-width:1;"
     id="path608" />
  <path
     d="M 28.75000 13.75000 C 28.75000 13.75000 31.87500 7.499950 39.68750 9.374950 C 47.50000 11.25000 78.12500 19.37500 77.81250 21.87500 C 77.50000 24.37500 71.87500 39.06250 71.56250 40.31250 C 71.25000 41.56250 42.50000 40.93750 31.56250 47.50000 C 20.62500 54.06250 12.50000 59.68750 12.50000 59.68750 C 12.50000 59.68750 23.75000 24.68750 28.75000 13.75000 z "
     transform="matrix(0.946780,0,0,0.946780,-0.480566,0.409517)"
     style="font-size:12.000;fill:url(#linearGradient615);fill-rule:evenodd;stroke-width:1;"
     id="path636" />
  <path
     transform="matrix(0.976119,0.217238,-0.217238,0.976119,0,0)"
     style="font-size:14;font-weight:bold;stroke-width:1;font-family:Kid Kosmic;fill:#3d4e67;fill-opacity:1;"
     d="M 27.01285 60.12606 C 27.01285 60.58179 26.7941 60.98283 26.3566 61.32919 C 25.92821 61.67554 25.46792 61.84872 24.97574 61.84872 C 24.79344 61.84872 24.62483 61.82137 24.46988 61.76669 C 24.01415 61.58439 23.78628 61.26083 23.78628 60.79598 C 23.78628 60.47697 23.90022 60.16708 24.12808 59.86629 C 24.56558 59.31031 25.11246 59.03231 25.76871 59.03231 C 25.96011 59.03231 26.1424 59.06421 26.31558 59.12801 C 26.78042 59.30119 27.01285 59.63387 27.01285 60.12606 z M 30.52652 59.68856 C 30.5174 59.84351 30.5174 59.92098 30.52652 59.92098 C 30.71792 59.95744 30.91389 59.98478 31.11441 60.00301 C 31.64305 60.13973 32.27652 60.20809 33.0148 60.20809 C 34.16324 60.20809 35.18863 60.01669 36.09097 59.63387 C 37.23941 59.14169 37.94579 58.41708 38.21011 57.46004 C 38.30126 57.13192 37.923 56.8676 37.07535 56.66708 C 36.56493 56.54859 36.04084 56.47567 35.50308 56.44833 C 35.32079 56.43921 35.08381 56.43465 34.79214 56.43465 C 33.06037 56.43465 31.85269 56.66708 31.1691 57.13192 C 31.14175 57.28687 31.01871 57.7107 30.79996 58.4034 C 30.63589 58.91382 30.54475 59.34221 30.52652 59.68856 z M 31.96206 54.26083 C 33.32925 54.06942 34.27261 53.9008 34.79214 53.75497 C 35.85855 53.4633 36.69253 53.00757 37.2941 52.38778 C 37.2941 52.37866 37.23029 52.34676 37.10269 52.29208 C 36.64696 52.10978 35.85399 52.01864 34.72378 52.01864 C 33.83967 52.01864 33.09683 52.09155 32.49527 52.23739 C 32.36766 52.86629 32.18993 53.54077 31.96206 54.26083 z M 33.99917 49.32528 C 35.48485 49.26148 36.81558 49.36629 37.99136 49.63973 C 39.85074 50.059 40.72118 50.83374 40.60269 51.96395 C 40.51154 52.85718 39.83707 53.57723 38.57925 54.12411 C 40.01936 54.57984 40.73941 55.56421 40.73941 57.07723 C 40.73941 57.57853 40.66193 58.12997 40.50699 58.73153 C 40.27001 59.62476 39.60009 60.39038 38.49722 61.0284 C 37.81363 61.42945 36.84292 61.83049 35.58511 62.23153 C 34.62808 62.3409 33.71662 62.39559 32.85074 62.39559 C 30.90022 62.39559 29.11831 62.09025 27.50503 61.47958 C 27.84227 59.88452 28.25243 58.31226 28.7355 56.76278 C 29.18212 55.33179 29.49201 53.88713 29.66519 52.42879 C 29.49201 52.04598 29.40542 51.72241 29.40542 51.45809 C 29.40542 51.11174 29.58316 50.71981 29.93863 50.28231 C 31.30581 49.69898 32.65933 49.37997 33.99917 49.32528 z M 45.11441 50.7745 C 45.61571 50.31877 46.72769 49.95419 48.45035 49.68075 C 49.89045 49.45288 51.15282 49.35262 52.23746 49.37997 C 53.12157 49.40731 53.74592 49.59416 54.1105 49.94051 C 54.15608 50.76994 54.17886 51.60392 54.17886 52.44247 C 54.17886 55.12215 53.95556 57.87932 53.50894 60.71395 C 53.39045 61.47046 52.99853 61.96721 52.33316 62.20419 C 52.08707 62.28622 51.87743 62.32723 51.70425 62.32723 C 51.33967 62.32723 51.09813 62.14494 50.97965 61.78036 C 51.36246 60.4952 51.61767 59.29663 51.74527 58.18465 L 44.21207 59.45614 C 44.06623 59.73869 43.79735 60.29924 43.40543 61.13778 C 43.23225 61.88517 42.78563 62.32723 42.06558 62.46395 C 41.88329 62.50041 41.75113 62.51864 41.6691 62.51864 C 41.2316 62.51864 41.01285 62.34546 41.01285 61.99911 C 41.01285 61.89885 41.03563 61.79403 41.08121 61.68465 C 42.81298 57.86564 44.15738 54.22892 45.11441 50.7745 z M 51.36246 52.59286 C 51.22574 52.27385 50.79735 52.11434 50.0773 52.11434 C 49.60334 52.11434 49.02001 52.20093 48.3273 52.37411 C 47.54345 52.57463 47.02392 52.80249 46.76871 53.0577 C 46.44058 54.17879 46.02131 55.3409 45.51089 56.54403 L 51.8273 55.19051 C 51.74527 54.32463 51.59032 53.45874 51.36246 52.59286 z M 57.3644 50.11825 C 57.84748 49.48023 58.5493 49.18856 59.46987 49.24325 C 59.77065 49.26148 60.0213 49.33895 60.22182 49.47567 C 60.4588 49.63062 60.57729 49.83114 60.57729 50.07723 C 60.57729 50.18661 60.55451 50.3051 60.50893 50.4327 C 59.36961 52.22827 58.58576 54.28361 58.15737 56.59872 C 62.1769 54.08309 65.04344 51.82267 66.75698 49.81747 C 67.24917 49.58049 67.673 49.462 68.02847 49.462 C 68.43862 49.462 68.75763 49.5896 68.9855 49.84481 C 69.21336 50.0909 69.32729 50.40536 69.32729 50.78817 C 69.32729 50.934 69.30906 51.08439 69.27261 51.23934 C 69.25438 51.3396 69.21792 51.47632 69.16323 51.6495 C 67.29474 53.32658 65.46727 54.79859 63.68081 56.06551 C 64.52847 58.60848 65.65867 59.99846 67.07143 60.23544 C 67.21727 60.51799 67.29018 60.78231 67.29018 61.0284 C 67.29018 61.43856 67.08966 61.7758 66.68862 62.04012 C 66.37873 62.24064 66.06427 62.3409 65.74526 62.3409 C 65.50828 62.3409 65.24396 62.28622 64.95229 62.17684 C 63.35724 61.0284 62.12222 59.52906 61.24722 57.67879 C 60.10789 58.38973 58.96401 59.03687 57.81557 59.6202 C 57.79735 60.14885 57.79735 60.63192 57.81557 61.06942 C 57.74266 61.47046 57.56492 61.8077 57.28237 62.08114 C 56.99982 62.34546 56.66258 62.47762 56.27065 62.47762 C 55.87873 62.47762 55.46857 62.27254 55.04018 61.86239 C 55.34097 57.65145 56.1157 53.73674 57.3644 50.11825 z "
     id="path673" />
</svg>
