/* XPM */
static char * test_xpm[] = {
"16 17 184 2",
"  	c None",
". 	c #101419",
"+ 	c #495A6D",
"@ 	c #4B5764",
"# 	c #0D1115",
"$ 	c #4D6075",
"% 	c #9BBBDD",
"& 	c #BDD7F4",
"* 	c #D0E3F7",
"= 	c #ADB6C0",
"- 	c #181819",
"; 	c #0C1014",
"> 	c #495C71",
", 	c #97B8DB",
"' 	c #B9D5F3",
") 	c #CDE1F7",
"! 	c #DEECFA",
"~ 	c #ECF4FC",
"{ 	c #F7FBFE",
"] 	c #999A9B",
"^ 	c #46596E",
"/ 	c #92B3D7",
"( 	c #B6D3F3",
"_ 	c #CADFF6",
": 	c #DCEAF9",
"< 	c #EAF3FC",
"[ 	c #F6FAFE",
"} 	c #FCFDFF",
"| 	c #F9FBFE",
"1 	c #E9F0F7",
"2 	c #25272A",
"3 	c #42556A",
"4 	c #8EB0D5",
"5 	c #B3D1F2",
"6 	c #C7DEF6",
"7 	c #D9E8F9",
"8 	c #E8F2FB",
"9 	c #F4F9FD",
"0 	c #FBFDFF",
"a 	c #FAFCFE",
"b 	c #F0F6FD",
"c 	c #E1EDFA",
"d 	c #CEE2F7",
"e 	c #4D5863",
"f 	c #193552",
"g 	c #18416D",
"h 	c #2C3E50",
"i 	c #ADC2D9",
"j 	c #D6E7F8",
"k 	c #E6F0FB",
"l 	c #F3F8FD",
"m 	c #FBFCFE",
"n 	c #F2F7FD",
"o 	c #E3EFFA",
"p 	c #D1E4F7",
"q 	c #A6CAF0",
"r 	c #43576C",
"s 	c #1D2F43",
"t 	c #5197E1",
"u 	c #357FCF",
"v 	c #1F5A9A",
"w 	c #2A3744",
"x 	c #E5EBF1",
"y 	c #F4F8FD",
"z 	c #D4E6F8",
"A 	c #C0D9F4",
"B 	c #AACCF1",
"C 	c #91BDED",
"D 	c #76ADE8",
"E 	c #2C4968",
"F 	c #35506D",
"G 	c #5F9FE4",
"H 	c #4186D0",
"I 	c #2461A2",
"J 	c #174373",
"K 	c #808183",
"L 	c #F5F9FE",
"M 	c #E8F1FB",
"N 	c #D7E7F8",
"O 	c #C4DCF5",
"P 	c #ADCEF1",
"Q 	c #95C0ED",
"R 	c #7BB0E8",
"S 	c #8C7BAD",
"T 	c #5D82C6",
"U 	c #1F4165",
"V 	c #3E5772",
"W 	c #6CA7E7",
"X 	c #4D8DD1",
"Y 	c #2B65A3",
"Z 	c #1C518A",
"` 	c #243342",
" .	c #D9E8F8",
"..	c #B1D0F2",
"+.	c #99C2EE",
"@.	c #7FB2EA",
"#.	c #8B8EBF",
"$.	c #C32A3D",
"%.	c #CD0000",
"&.	c #705C90",
"*.	c #1E4165",
"=.	c #445B73",
"-.	c #7AAFE9",
";.	c #5994D2",
">.	c #356AA4",
",.	c #1F538B",
"'.	c #0D2641",
").	c #A6C2DF",
"!.	c #91BDEC",
"~.	c #81B2E6",
"{.	c #88B5E6",
"].	c #B2C3D7",
"^.	c #B79496",
"/.	c #BF0000",
"(.	c #4B5F74",
"_.	c #87B7EB",
":.	c #659AD3",
"<.	c #3E70A5",
"[.	c #26578B",
"}.	c #0F2A47",
"|.	c #76A1CF",
"1.	c #569AE3",
"2.	c #93AECB",
"3.	c #AFB2B6",
"4.	c #637A92",
"5.	c #4D476B",
"6.	c #B80407",
"7.	c #636BA7",
"8.	c #516375",
"9.	c #95BFED",
"0.	c #71A1D4",
"a.	c #4875A6",
"b.	c #2E5C8D",
"c.	c #122C48",
"d.	c #4A86C7",
"e.	c #3687DD",
"f.	c #537AA4",
"g.	c #376CA4",
"h.	c #3F87D3",
"i.	c #4B5889",
"j.	c #7B2235",
"k.	c #3A5585",
"l.	c #3E85D0",
"m.	c #132941",
"n.	c #586776",
"o.	c #A2C7F0",
"p.	c #7EAAD8",
"q.	c #5886B6",
"r.	c #3F70A4",
"s.	c #183451",
"t.	c #3B7EC5",
"u.	c #3284DC",
"v.	c #3E85D1",
"w.	c #438FE0",
"x.	c #346FAE",
"y.	c #3067A1",
"z.	c #1E4064",
"A.	c #070F17",
"B.	c #5B6773",
"C.	c #AECDEF",
"D.	c #92BBE7",
"E.	c #76A7DB",
"F.	c #5589C2",
"G.	c #223F5E",
"H.	c #428FE0",
"I.	c #214770",
"J.	c #071019",
"K.	c #090A0B",
"L.	c #46515D",
"M.	c #83A1C2",
"N.	c #88B7E8",
"O.	c #6DA4DF",
"P.	c #2F4F71",
"Q.	c #4088D6",
"R.	c #244D79",
"S.	c #08121C",
"T.	c #2E3C4C",
"U.	c #5C83AD",
"V.	c #3A597B",
"W.	c #3878BC",
"X.	c #25507D",
"Y.	c #09131E",
"Z.	c #080C10",
"`.	c #070E16",
"                    . + @       ",
"                # $ % & * = -   ",
"            ; > , ' ) ! ~ { ]   ",
"          ^ / ( _ : < [ } | 1 2 ",
"      3 4 5 6 7 8 9 0 a b c d e ",
"  f g h i j k l 0 m n o p & q r ",
"s t u v w x a 0 y k z A B C D E ",
"F G H I J K L M N O P Q R S T U ",
"V W X Y Z `  .6 ..+.@.#.$.%.&.*.",
"=.-.;.>.,.'.).!.~.{.].^././.&.*.",
"(._.:.<.[.}.|.1.2.3.4.5./.6.7.*.",
"8.9.0.a.b.c.d.e.f.g.h.i.j.k.l.m.",
"n.o.p.q.r.s.t.u.v.w.w.x.y.z.A.  ",
"B.C.D.E.F.G.t.H.w.w.h.I.J.      ",
"K.L.M.N.O.P.t.w.Q.R.S.          ",
"      T.U.V.W.X.Y.              ",
"          Z.`.                  "};
