/* XPM */
static char * maximizeA_xpm[] = {
"17 42 82 1",
" 	c None",
".	c #B8D4F0",
"+	c #A9CBEC",
"@	c #A3C7EC",
"#	c #A5A5A5",
"$	c #666666",
"%	c #392931",
"&	c #101010",
"*	c #5A5A5A",
"=	c #ADADAD",
"-	c #A0C6EC",
";	c #8C6B6B",
">	c #8C524A",
",	c #A5948C",
"'	c #CCCCCC",
")	c #D6D6D6",
"!	c #C6C6BD",
"~	c #97BFEB",
"{	c #C67373",
"]	c #FFD6CE",
"^	c #EFE7E7",
"/	c #FFF7F7",
"(	c #D2928C",
"_	c #7B5A52",
":	c #96C0EB",
"<	c #999999",
"[	c #942921",
"}	c #AA6E4D",
"|	c #E6987B",
"1	c #F7C6A5",
"2	c #FFB59C",
"3	c #842929",
"4	c #91BDEB",
"5	c #B54A29",
"6	c #DE7B42",
"7	c #D68C31",
"8	c #DEA542",
"9	c #90BEEB",
"0	c #DA7921",
"a	c #E78C31",
"b	c #EFAD29",
"c	c #F7B531",
"d	c #68A7E6",
"e	c #FF9933",
"f	c #FFBD42",
"g	c #FFC64A",
"h	c #AF2925",
"i	c #71ACEB",
"j	c #FFDE63",
"k	c #79B3EF",
"l	c #8C5231",
"m	c #F7CE39",
"n	c #FFFF7B",
"o	c #7DB6F1",
"p	c #9B7836",
"q	c #FFFF99",
"r	c #84BDF7",
"s	c #948C8C",
"t	c #E7BD42",
"u	c #8AC2FE",
"v	c #DAD652",
"w	c #93CAFF",
"x	c #B5BDBD",
"y	c #8C8C8C",
"z	c #6B634A",
"A	c #736B31",
"B	c #9C9429",
"C	c #D6EF63",
"D	c #52634A",
"E	c #BDBDBD",
"F	c #99D0FF",
"G	c #4A4A42",
"H	c #9FD7FF",
"I	c #7B8484",
"J	c #7B7B7B",
"K	c #A4DAFD",
"L	c #BDBDC6",
"M	c #BDBDB5",
"N	c #D6D6CE",
"O	c #A6DDFA",
"P	c #A8DEF3",
"Q	c #0852B5",
".................",
"+++++++++++++++++",
"@@@@@#$%&%*=@@@@@",
"----;>,')!,>;----",
"~~~;>{]^/^](_;~~~",
"::<[}|11112|}3,::",
"44>56788888775>44",
"99[00abbbcba00[99",
"dd[7befgggfcbahdd",
"ii5ebfjjjjjcce5ii",
"kklemgjjnjjgmelkk",
"oop7gjnqnnnjj7_oo",
"rrsptjnqqqqjtp,rr",
"uu#_pvnqqqnvp_#uu",
"wwxyzABvCvBADyEww",
"FFFxy$DGGG*$y=FFF",
"HHHH'=<IJJy#'HHHH",
"KKKKK'LL=MENKKKKK",
"OOOOOOOOOOOOOOOOO",
"PPPPPPPPPPPPPPPPP",
"QQQQQQQQQQQQQQQQQ",
".................",
"+++++++++++++++++",
"@@@@@@@@@@@@@@@@@",
"-----#$%&%*=-----",
"~~~~;>,')!,>;~~~~",
":::;>{]^/^](_;:::",
"44<[}|11112|}3,44",
"99>56788888775>99",
"dd[00abbbcba00[dd",
"ii[7befgggfcbahii",
"kk5ebfjjjjjcce5kk",
"oolemgjjnjjgmeloo",
"rrp7gjnqnnnjj7_rr",
"uusptjnqqqqjtp,uu",
"ww#_pvnqqqnvp_#ww",
"FFFyzABvCvBADyFFF",
"HHHHy$DGGG*$yHHHH",
"KKKKK=<IJJy#KKKKK",
"OOOOOOOOOOOOOOOOO",
"PPPPPPPPPPPPPPPPP",
"QQQQQQQQQQQQQQQQQ"};
