<?xml version="1.0" encoding="UTF-8" standalone="no"?>
<!DOCTYPE svg PUBLIC "-//W3C//DTD SVG 20010904//EN"
"http://www.w3.org/TR/2001/REC-SVG-20010904/DTD/svg10.dtd">
<!-- Created with Sodipodi ("http://www.sodipodi.com/") -->
<svg
   width="17.036pt"
   height="17.036pt"
   viewBox="0 0 17.036 17.036"
   xml:space="preserve"
   id="svg559"
   sodipodi:version="0.33"
   sodipodi:docname="/usr/share/themes/Debian-BR/metacity-1/wm-close.svg"
   sodipodi:docbase="/usr/share/themes/Debian-BR/metacity-1/"
   xmlns="http://www.w3.org/2000/svg"
   xmlns:sodipodi="http://sodipodi.sourceforge.net/DTD/sodipodi-0.dtd"
   xmlns:xml="http://www.w3.org/XML/1998/namespace"
   xmlns:xlink="http://www.w3.org/1999/xlink"><defs
   id="defs587">
  <radialGradient
   id="aigrd1"
   cx="6.0088"
   cy="5.3652"
   r="10.6059"
   fx="6.0088"
   fy="5.3652"
   gradientUnits="userSpaceOnUse">
			<stop
   offset="0"
   style="stop-color:#2d47a7;stop-opacity:1.0000;"
   id="stop567" />


			<stop
   offset="1"
   style="stop-color:#ffffff;stop-opacity:1.0000;"
   id="stop569" />


			
		</radialGradient>

  <radialGradient
   xlink:href="#aigrd1"
   id="radialGradient1129"
   cx="8.714665"
   cy="8.660093"
   r="9.136143"
   fx="8.714665"
   fy="8.660093" />

<linearGradient
   xlink:href="#aigrd1"
   id="linearGradient587" />
</defs>

<sodipodi:namedview
   id="base" />


	
		<path
   style="font-size:12.000;fill:url(#linearGradient587);"
   d="M0,8.518c0,4.697,3.821,8.518,8.518,8.518c4.697,0,8.518-3.82,8.518-8.518C17.036,3.821,13.215,0,8.518,0C3.821,0,0,3.821,0,8.518z"
   id="path563" />


		
		<path
   style="font-size:12.000;fill:url(#radialGradient1129);fill-rule:evenodd;"
   d="M15.7,8.433c0,4.013-3.254,7.267-7.266,7.267c-4.014,0-7.268-3.254-7.268-7.267c0-4.013,3.253-7.267,7.268-7.267c4.012,0,7.266,3.253,7.266,7.267z"
   id="path574" />


		
	
<g
   id="close"
   style="font-size:12.000;fill:#ffffff;">
			<path
   style="opacity:0.5;fill:#000000;"
   d="M10.255,8.237l1.903-1.903c0.529-0.529,0.529-1.387,0-1.917s-1.388-0.529-1.917,0L8.339,6.321L6.436,4.418c-0.529-0.529-1.387-0.529-1.917,0s-0.529,1.387,0,1.917l1.903,1.903L4.52,10.139c-0.529,0.531-0.529,1.389,0,1.918     s1.387,0.529,1.917,0l1.903-1.902l1.903,1.902c0.529,0.529,1.388,0.529,1.917,0s0.529-1.389,0-1.918l-1.903-1.902z"
   id="path578" />




			<path
   style="opacity:0.6;"
   d="M10.764,8.746l1.902-1.903c0.529-0.529,0.529-1.387,0-1.917s-1.387-0.529-1.916,0L8.848,6.829L6.945,4.927c-0.529-0.53-1.388-0.53-1.917,0c-0.529,0.529-0.529,1.387,0,1.917l1.903,1.903l-1.903,1.903c-0.529,0.529-0.529,1.387,0,1.918     c0.53,0.529,1.388,0.529,1.917,0l1.903-1.904l1.902,1.902c0.529,0.531,1.387,0.531,1.916,0c0.529-0.529,0.529-1.387,0-1.916l-1.902-1.903z"
   id="path580" />




			<path
   d="M10.51,8.492l1.902-1.903c0.529-0.529,0.529-1.388,0-1.917s-1.387-0.529-1.916,0L8.593,6.575L6.69,4.672c-0.529-0.529-1.387-0.529-1.917,0s-0.529,1.388,0,1.917l1.903,1.903l-1.903,1.903c-0.529,0.529-0.529,1.387,0,1.916s1.387,0.529,1.917,0     l1.903-1.902l1.903,1.902c0.529,0.529,1.387,0.529,1.916,0s0.529-1.387,0-1.916L10.51,8.492z"
   id="path582" />




		</g>

</svg>
