<?xml version="1.0" encoding="UTF-8" standalone="no"?>
<!DOCTYPE svg PUBLIC "-//W3C//DTD SVG 20010904//EN"
"http://www.w3.org/TR/2001/REC-SVG-20010904/DTD/svg10.dtd">
<!-- Created with Sodipodi ("http://www.sodipodi.com/") -->
<svg
   id="svg604"
   sodipodi:version="0.32"
   width="72pt"
   height="72pt"
   sodipodi:docbase="/home/zeus/.icons/gartoon/scalable/mimetypes/"
   sodipodi:docname="/home/zeus/.icons/gartoon/scalable/mimetypes/gnome-mime-video-x-ms-asf.svg"
   xmlns="http://www.w3.org/2000/svg"
   xmlns:sodipodi="http://sodipodi.sourceforge.net/DTD/sodipodi-0.dtd"
   xmlns:xlink="http://www.w3.org/1999/xlink">
  <defs
     id="defs606">
    <linearGradient
       id="linearGradient575">
      <stop
         style="stop-color:#de8a17;stop-opacity:0.741176;"
         offset="0.000000"
         id="stop576" />
      <stop
         style="stop-color:#1ac5aa;stop-opacity:0.929412;"
         offset="1.000000"
         id="stop577" />
    </linearGradient>
    <linearGradient
       id="linearGradient612">
      <stop
         style="stop-color:#7fa8e3;stop-opacity:0.741176;"
         offset="0.000000"
         id="stop613" />
      <stop
         style="stop-color:#ffffff;stop-opacity:0;"
         offset="1.000000"
         id="stop614" />
    </linearGradient>
    <linearGradient
       xlink:href="#linearGradient612"
       id="linearGradient615"
       x1="50.6438866"
       y1="5.36792946"
       x2="35.7520943"
       y2="68.0443573"
       gradientUnits="userSpaceOnUse"
       spreadMethod="pad" />
    <linearGradient
       xlink:href="#linearGradient575"
       id="linearGradient574"
       x1="38.7992325"
       y1="47.4790993"
       x2="23.6706333"
       y2="51.0043793"
       gradientUnits="userSpaceOnUse"
       spreadMethod="pad"
       gradientTransform="scale(1.044094,0.957768)" />
    <linearGradient
       xlink:href="#linearGradient575"
       id="linearGradient578"
       x1="1.32557678"
       y1="0.18749924"
       x2="0.82945710"
       y2="0.34375003"
       gradientUnits="objectBoundingBox"
       spreadMethod="pad" />
  </defs>
  <sodipodi:namedview
     id="base" />
  <path
     style="fill:#000000;fill-rule:evenodd;stroke:none;stroke-opacity:1;stroke-width:1pt;stroke-linejoin:miter;stroke-linecap:butt;fill-opacity:0.301471;"
     d="M 12.8163 74.753 C 10.3856 73.6481 7.07107 70.1126 8.83884 65.2512 C 9.72267 59.948 25.6326 13.1021 29.1682 10.8924 C 31.3778 8.90368 34.582 8.13026 39.1119 9.34561 C 42.8684 10.2295 76.6769 19.0684 78.6656 20.8361 C 80.6544 22.6039 82.2012 24.0402 80.6544 27.9072 C 79.5496 29.8959 66.4017 74.532 66.1808 77.4047 C 65.2969 80.4983 62.7558 84.2548 58.5573 84.0338 C 54.3589 83.8128 15.9099 75.4159 12.8163 74.753 z "
     id="path794"
     sodipodi:nodetypes="ccccccccc"
     transform="matrix(1.114903,0.000000,0.000000,1.114903,-5.305332,-3.889256)" />
  <path
     style="fill:#3d4e67;fill-rule:evenodd;stroke:none;stroke-opacity:1;stroke-width:1pt;stroke-linejoin:miter;stroke-linecap:butt;fill-opacity:1;"
     d="M 12.8163 74.753 C 10.3856 73.6481 7.07107 70.1126 8.83884 65.2512 C 9.72267 59.948 25.6326 13.1021 29.1682 10.8924 C 31.3778 8.90368 34.582 8.13026 39.1119 9.34561 C 42.8684 10.2295 76.6769 19.0684 78.6656 20.8361 C 80.6544 22.6039 82.2012 24.0402 80.6544 27.9072 C 79.5496 29.8959 66.4017 74.532 66.1808 77.4047 C 65.2969 80.4983 62.7558 84.2548 58.5573 84.0338 C 54.3589 83.8128 15.9099 75.4159 12.8163 74.753 z "
     id="path609"
     sodipodi:nodetypes="ccccccccc"
     transform="matrix(1.114903,0.000000,0.000000,1.114903,-8.162471,-8.460684)" />
  <path
     style="fill:#ffffff;fill-rule:evenodd;stroke:none;stroke-opacity:1;stroke-width:1pt;stroke-linejoin:miter;stroke-linecap:butt;fill-opacity:1;"
     d="M 17.8987 70.9965 C 15.3576 70.3336 11.7114 69.6706 13.0373 65.6932 C 15.468 55.9705 27.8424 18.6264 33.1456 13.986 C 34.361 12.8811 38.4489 12.4392 46.1829 14.8699 C 55.0218 17.5215 72.9204 23.4877 74.6882 24.3716 C 76.4559 25.2555 77.1189 25.2555 75.793 29.233 C 73.8043 33.2105 64.9655 67.24 62.7557 72.9852 C 61.209 77.0732 60.8775 78.9514 58.2258 78.9514 "
     id="path608"
     sodipodi:nodetypes="cccccccs"
     transform="matrix(1.114903,0.000000,0.000000,1.114903,-8.162471,-8.460684)" />
  <path
     style="fill:url(#linearGradient615);fill-rule:evenodd;stroke:none;stroke-opacity:1;stroke-width:1pt;stroke-linejoin:miter;stroke-linecap:butt;fill-opacity:1;"
     d="M 28.75 13.75 C 28.75 13.75 31.875 7.49995 39.6875 9.37495 C 47.5 11.25 78.125 19.375 77.8125 21.875 C 77.5 24.375 71.875 39.0625 71.5625 40.3125 C 71.25 41.5625 42.5 40.9375 31.5625 47.5 C 20.625 54.0625 12.5 59.6875 12.5 59.6875 C 12.5 59.6875 23.75 24.6875 28.75 13.75 z "
     id="path636"
     transform="matrix(0.946780,0.000000,0.000000,0.946780,-0.480566,0.409517)" />
  <path
     style="font-size:12;fill-rule:evenodd;stroke-width:1pt;"
     d="M 67.7143 20.8571 C 67.9048 22 69.5094 24.7591 69.6999 25.9019 C 67.8904 26.5686 66.6869 27.5383 64.8774 28.205 C 66.4012 34.9669 67.319 38.7993 68.8428 45.5612 C 70.9612 45.2034 72.2713 44.0374 73.7836 42.6695 C 74.0693 44.2886 74.7591 46.6147 75.0448 48.2338 C 60.0003 57.6914 35.2584 67.149 12.2338 67.2122 C 11.7576 65.7836 12.1905 63.1428 11.7143 61.7143 C 13.9221 61.7489 14.6147 61.5816 16.5195 61.3132 C 15.3766 55.5989 14.6377 49.1776 13.4949 43.4633 C 11.2929 43.6307 10.404 43.4949 8.10106 43.5612 C 7.72009 41.5612 7.52382 40.2857 7.14286 38.2857 C 30.4762 36.1905 49.5238 30.9523 67.7143 20.8571 z "
     id="path559"
     sodipodi:nodetypes="ccccccccccccc"
     transform="translate(5.142860,-12.00001)" />
  <path
     style="font-size:12;fill:#f1e36c;fill-rule:evenodd;stroke-width:1pt;fill-opacity:1;"
     d="M 20.9102 59.3924 C 27.3752 59.7628 33.5371 57.9108 39.295 56.0588 C 38.0491 49.4591 37.0053 46.3951 35.7594 39.7954 C 30.3383 42.0851 24.21 43.2636 17.8797 43.533 "
     id="path560"
     sodipodi:nodetypes="cccc"
     transform="translate(5.142860,-12.00001)" />
  <path
     style="font-size:12;fill:#f1e36c;fill-rule:evenodd;stroke-width:1pt;fill-opacity:1;"
     d="M 22.2234 60.6046 C 30.4056 59.6618 35.6583 56.0926 40.8102 53.2304 C 39.5643 46.6307 38.2174 44.6778 36.9715 38.0781 C 31.2474 40.9739 24.4122 43.9706 18.2839 44.7451 "
     id="path561"
     sodipodi:nodetypes="cccc"
     transform="translate(27.97231,-18.06092)" />
  <path
     transform="matrix(0.989443,-0.144927,0.146771,0.989170,0.147348,-9.823467)"
     style="font-size:12;fill:#ffffff;fill-rule:evenodd;stroke-width:1pt;"
     d="M 17.3956 62.593 C 17.3956 63.8494 17.5098 64.9108 17.5098 66.1672 C 19.3789 66.1672 21.1337 66.3623 23.0229 66.0599 C 23.0229 64.8035 23.0027 63.8494 23.0027 62.593 C 21.2076 63.0027 19.2445 62.8954 17.3956 62.593 z "
     id="path563"
     sodipodi:nodetypes="ccccc" />
  <path
     transform="matrix(0.965794,-0.259313,0.261113,0.965308,3.265204,-8.097851)"
     style="font-size:12;fill:#ffffff;fill-rule:evenodd;stroke-width:1pt;"
     d="M 17.3956 62.593 C 17.3956 63.8494 17.5098 64.9108 17.5098 66.1672 C 19.3789 66.1672 21.1337 66.3623 23.0229 66.0599 C 23.0229 64.8035 23.0027 63.8494 23.0027 62.593 C 21.2076 63.0027 19.2445 62.8954 17.3956 62.593 z "
     id="path564"
     sodipodi:nodetypes="ccccc" />
  <path
     transform="matrix(0.965794,-0.259313,0.261113,0.965308,12.35658,-10.52221)"
     style="font-size:12;fill:#ffffff;fill-rule:evenodd;stroke-width:1pt;"
     d="M 17.3956 62.593 C 17.3956 63.8494 17.5098 64.9108 17.5098 66.1672 C 19.3789 66.1672 21.1337 66.3623 23.0229 66.0599 C 23.0229 64.8035 23.0027 63.8494 23.0027 62.593 C 21.2076 63.0027 19.2445 62.8954 17.3956 62.593 z "
     id="path565"
     sodipodi:nodetypes="ccccc" />
  <path
     transform="matrix(0.965794,-0.259313,0.261113,0.965308,21.44796,-13.24963)"
     style="font-size:12;fill:#ffffff;fill-rule:evenodd;stroke-width:1pt;"
     d="M 17.3956 62.593 C 17.3956 63.8494 17.5098 64.9108 17.5098 66.1672 C 19.3789 66.1672 21.1337 66.3623 23.0229 66.0599 C 23.0229 64.8035 23.0027 63.8494 23.0027 62.593 C 21.2076 63.0027 19.2445 62.8954 17.3956 62.593 z "
     id="path566"
     sodipodi:nodetypes="ccccc" />
  <path
     transform="matrix(0.965794,-0.259313,0.261113,0.965308,21.44796,-13.24963)"
     style="font-size:12;fill:#ffffff;fill-rule:evenodd;stroke-width:1pt;"
     d="M 17.3956 62.593 C 17.3956 63.8494 17.5098 64.9108 17.5098 66.1672 C 19.3789 66.1672 21.1337 66.3623 23.0229 66.0599 C 23.0229 64.8035 23.0027 63.8494 23.0027 62.593 C 21.2076 63.0027 19.2445 62.8954 17.3956 62.593 z "
     id="path567"
     sodipodi:nodetypes="ccccc" />
  <path
     transform="matrix(0.965794,-0.259313,0.261113,0.965308,30.03426,-16.78517)"
     style="font-size:12;fill:#ffffff;fill-rule:evenodd;stroke-width:1pt;"
     d="M 17.3956 62.593 C 17.3956 63.8494 17.5098 64.9108 17.5098 66.1672 C 19.3789 66.1672 21.1337 66.3623 23.0229 66.0599 C 23.0229 64.8035 23.0027 63.8494 23.0027 62.593 C 21.2076 63.0027 19.2445 62.8954 17.3956 62.593 z "
     id="path568"
     sodipodi:nodetypes="ccccc" />
  <path
     transform="matrix(0.989443,-0.144927,0.146771,0.989170,-4.297325,-32.65293)"
     style="font-size:12;fill:#ffffff;fill-rule:evenodd;stroke-width:1pt;"
     d="M 17.3956 62.593 C 17.3956 63.8494 17.5098 64.9108 17.5098 66.1672 C 19.3789 66.1672 21.1337 66.3623 23.0229 66.0599 C 23.0229 64.8035 23.0027 63.8494 23.0027 62.593 C 21.2076 63.0027 19.2445 62.8954 17.3956 62.593 z "
     id="path569"
     sodipodi:nodetypes="ccccc" />
  <path
     transform="matrix(0.965794,-0.259313,0.261113,0.965308,-1.179469,-30.92732)"
     style="font-size:12;fill:#ffffff;fill-rule:evenodd;stroke-width:1pt;"
     d="M 17.3956 62.593 C 17.3956 63.8494 17.5098 64.9108 17.5098 66.1672 C 19.3789 66.1672 21.1337 66.3623 23.0229 66.0599 C 23.0229 64.8035 23.0027 63.8494 23.0027 62.593 C 21.2076 63.0027 19.2445 62.8954 17.3956 62.593 z "
     id="path570"
     sodipodi:nodetypes="ccccc" />
  <path
     transform="matrix(0.965794,-0.259313,0.261113,0.965308,7.911911,-33.35167)"
     style="font-size:12;fill:#ffffff;fill-rule:evenodd;stroke-width:1pt;"
     d="M 17.3956 62.593 C 17.3956 63.8494 17.5098 64.9108 17.5098 66.1672 C 19.3789 66.1672 21.1337 66.3623 23.0229 66.0599 C 23.0229 64.8035 23.0027 63.8494 23.0027 62.593 C 21.2076 63.0027 19.2445 62.8954 17.3956 62.593 z "
     id="path571"
     sodipodi:nodetypes="ccccc" />
  <path
     transform="matrix(0.965794,-0.259313,0.261113,0.965308,17.00329,-36.07908)"
     style="font-size:12;fill:#ffffff;fill-rule:evenodd;stroke-width:1pt;"
     d="M 17.3956 62.593 C 17.3956 63.8494 17.5098 64.9108 17.5098 66.1672 C 19.3789 66.1672 21.1337 66.3623 23.0229 66.0599 C 23.0229 64.8035 23.0027 63.8494 23.0027 62.593 C 21.2076 63.0027 19.2445 62.8954 17.3956 62.593 z "
     id="path572"
     sodipodi:nodetypes="ccccc" />
  <path
     transform="matrix(0.965794,-0.259313,0.261113,0.965308,25.58959,-39.61462)"
     style="font-size:12;fill:#ffffff;fill-rule:evenodd;stroke-width:1pt;"
     d="M 17.3956 62.593 C 17.3956 63.8494 17.5098 64.9108 17.5098 66.1672 C 19.3789 66.1672 21.1337 66.3623 23.0229 66.0599 C 23.0229 64.8035 23.0027 63.8494 23.0027 62.593 C 21.2076 63.0027 19.2445 62.8954 17.3956 62.593 z "
     id="path573"
     sodipodi:nodetypes="ccccc" />
  <path
     transform="matrix(0.980295,0.197539,-0.197539,0.980295,0.000000,0.000000)"
     style="font-size:12;font-weight:bold;fill:#3d4e67;stroke-width:1pt;font-family:Kid Kosmic;"
     d="M 60.9161 57.0076 C 62.6896 56.6951 63.9201 56.3787 64.6076 56.0584 C 65.1857 56.2069 65.4747 56.5194 65.4747 56.9959 C 65.4747 57.074 65.4669 57.1561 65.4513 57.242 C 65.3419 57.8279 64.9904 58.2108 64.3966 58.3904 L 57.2013 59.7967 C 57.0294 60.1951 56.9435 60.5272 56.9435 60.7928 C 56.9435 60.9334 56.9669 61.0623 57.0138 61.1795 C 57.1154 61.4295 57.1661 61.699 57.1661 61.9881 C 57.1661 62.1912 57.1388 62.4061 57.0841 62.6326 C 56.881 63.0936 56.4982 63.3436 55.9357 63.3826 C 55.3654 63.4217 54.9982 63.2615 54.8341 62.9022 C 54.8341 61.4569 54.9982 59.9764 55.3263 58.4608 C 55.6466 56.9686 56.0958 55.2381 56.674 53.2694 C 57.5333 52.3865 60.3888 51.9764 65.2404 52.0389 C 65.8497 52.4061 66.1544 52.8319 66.1544 53.3162 C 66.1544 53.8631 65.7833 54.2967 65.0411 54.617 C 63.963 54.3748 62.9318 54.2537 61.9474 54.2537 C 60.9943 54.2615 59.8732 54.5936 58.5841 55.2498 C 58.2638 56.117 58.0138 56.8436 57.8341 57.4295 C 58.3966 57.4217 59.424 57.2811 60.9161 57.0076 z M 54.3302 54.1834 C 54.2677 54.449 54.1115 54.7069 53.8615 54.9569 C 53.5958 55.2303 53.3302 55.367 53.0646 55.367 C 52.8458 55.367 52.6661 55.2615 52.5255 55.0506 C 51.1818 54.6912 49.8693 54.535 48.588 54.5819 C 47.338 54.6209 46.6661 54.8006 46.5724 55.1209 C 46.549 55.1522 46.5333 55.1756 46.5255 55.1912 C 46.5021 55.3006 46.6857 55.4061 47.0763 55.5076 C 47.1935 55.5467 47.7677 55.6756 48.799 55.8944 C 49.2443 55.9881 49.9122 56.1404 50.8029 56.3514 C 51.6935 56.5623 52.3146 56.7967 52.6661 57.0545 C 53.2599 57.7186 53.5216 58.3084 53.4513 58.824 C 53.3888 59.3006 53.1935 59.8553 52.8654 60.4881 C 52.2638 61.2537 51.5646 61.8319 50.7677 62.2225 C 49.463 62.8631 48.1036 63.1834 46.6896 63.1834 C 44.9552 63.1834 43.4982 62.6639 42.3185 61.6248 C 42.1935 61.4686 42.131 61.2967 42.131 61.1092 C 42.131 60.8983 42.213 60.6639 42.3771 60.4061 C 42.6115 60.0467 42.881 59.867 43.1857 59.867 C 43.2794 59.867 43.3849 59.8865 43.5021 59.9256 C 44.0724 60.4178 44.7404 60.8162 45.506 61.1209 C 45.7872 61.2303 46.1271 61.285 46.5255 61.285 C 47.213 61.285 48.0763 61.1287 49.1154 60.8162 C 50.1466 60.3553 50.6896 59.9881 50.7443 59.7147 C 50.7911 59.5037 50.6349 59.2108 50.2755 58.8358 C 49.8146 58.5233 49.1076 58.2889 48.1544 58.1326 C 47.6076 58.0545 46.7951 57.9256 45.7169 57.7459 C 44.9279 57.5975 44.2755 57.3006 43.7599 56.8553 C 43.4474 56.5897 43.2911 56.2186 43.2911 55.742 C 43.2911 55.4061 43.3693 55.0233 43.5255 54.5936 C 43.924 53.7576 44.7872 53.1287 46.1154 52.7069 C 47.131 52.3944 48.2365 52.2381 49.4318 52.2381 C 51.7365 52.2381 53.3732 52.7342 54.3419 53.7264 C 54.3576 53.9061 54.3536 54.0584 54.3302 54.1834 z M 33.588 53.3514 C 34.0177 52.9608 34.9708 52.6483 36.4474 52.4139 C 37.6818 52.2186 38.7638 52.1326 39.6935 52.1561 C 40.4513 52.1795 40.9865 52.3397 41.299 52.6365 C 41.338 53.3475 41.3575 54.0623 41.3575 54.7811 C 41.3575 57.0779 41.1661 59.4412 40.7833 61.8709 C 40.6818 62.5194 40.3458 62.9451 39.7755 63.1483 C 39.5646 63.2186 39.3849 63.2537 39.2365 63.2537 C 38.924 63.2537 38.7169 63.0975 38.6154 62.785 C 38.9435 61.6834 39.1622 60.6561 39.2716 59.7029 L 32.8146 60.7928 C 32.6896 61.035 32.4591 61.5154 32.1232 62.2342 C 31.9747 62.8748 31.5919 63.2537 30.9747 63.3709 C 30.8185 63.4022 30.7052 63.4178 30.6349 63.4178 C 30.2599 63.4178 30.0724 63.2694 30.0724 62.9725 C 30.0724 62.8865 30.0919 62.7967 30.131 62.7029 C 31.6154 59.4295 32.7677 56.3123 33.588 53.3514 z M 38.9435 54.91 C 38.8263 54.6365 38.4591 54.4998 37.8419 54.4998 C 37.4357 54.4998 36.9357 54.574 36.3419 54.7225 C 35.67 54.8944 35.2247 55.0897 35.006 55.3084 C 34.7247 56.2694 34.3654 57.2654 33.9279 58.2967 L 39.3419 57.1365 C 39.2716 56.3944 39.1388 55.6522 38.9435 54.91 z M 29.6974 61.367 C 29.6974 61.7576 29.5099 62.1014 29.1349 62.3983 C 28.7677 62.6951 28.3732 62.8436 27.9513 62.8436 C 27.795 62.8436 27.6505 62.8201 27.5177 62.7733 C 27.1271 62.617 26.9318 62.3397 26.9318 61.9412 C 26.9318 61.6678 27.0294 61.4022 27.2247 61.1444 C 27.5997 60.6678 28.0685 60.4295 28.631 60.4295 C 28.795 60.4295 28.9513 60.4569 29.0997 60.5115 C 29.4982 60.66 29.6974 60.9451 29.6974 61.367 z "
     id="path620" />
</svg>
