<?xml version="1.0" encoding="UTF-8" standalone="no"?>
<!DOCTYPE svg PUBLIC "-//W3C//DTD SVG 20010904//EN"
"http://www.w3.org/TR/2001/REC-SVG-20010904/DTD/svg10.dtd">
<!-- Created with Sodipodi ("http://www.sodipodi.com/") -->
<svg
   xmlns="http://www.w3.org/2000/svg"
   xmlns:inkscape="http://www.inkscape.org/namespaces/inkscape"
   xmlns:sodipodi="http://sodipodi.sourceforge.net/DTD/sodipodi-0.dtd"
   xmlns:xlink="http://www.w3.org/1999/xlink"
   version="1"
   x="0.00000000"
   y="0.00000000"
   width="48pt"
   height="48pt"
   id="svg548"
   sodipodi:version="0.34"
   sodipodi:docname="/home/zeus/gartoon-stock.0.1/stock_close.svg"
   sodipodi:docbase="/home/zeus/gartoon-stock.0.1/"
   inkscape:version="0.37">
  <sodipodi:namedview
     id="base"
     inkscape:zoom="9.65625000"
     inkscape:cx="14.4094041"
     inkscape:cy="27.4301047"
     inkscape:window-width="1014"
     inkscape:window-height="696"
     inkscape:window-x="0"
     inkscape:window-y="0" />
  <defs
     id="defs550">
    <linearGradient
       x1="0.00000000"
       y1="0.00000000"
       x2="1.00000000"
       y2="0.00000000"
       id="linearGradient556"
       gradientUnits="objectBoundingBox"
       spreadMethod="pad">
      <stop
         style="stop-color:#ff8700;stop-opacity:1;"
         offset="0.00000000"
         id="stop557" />
      <stop
         style="stop-color:#ffff8d;stop-opacity:0;"
         offset="1.00000000"
         id="stop558" />
    </linearGradient>
    <linearGradient
       x1="0.00000000"
       y1="0.00000000"
       x2="1.00000000"
       y2="0.00000000"
       id="linearGradient559"
       xlink:href="#linearGradient556"
       gradientUnits="objectBoundingBox"
       spreadMethod="pad" />
  </defs>
  <path
     style="font-size:12;fill:#000000;fill-rule:evenodd;stroke:#0d3d07;stroke-width:0.81019;fill-opacity:1;"
     d="M 20.09828 9.221642 C 18.64837 7.797943 14.0368 11.49785 12.64134 12.97496 C 11.24588 14.45207 7.936298 19.13638 9.427092 20.5172 L 19.8382 30.16035 L 9.842287 40.7984 C 8.45081 42.27927 12.00263 46.51838 13.47974 47.91384 C 14.95684 49.3093 19.16969 52.40561 20.55858 50.92234 L 30.68527 40.10769 L 40.77436 49.91246 C 42.23162 51.32864 47.25284 48.46868 48.64829 46.99158 C 50.04375 45.51448 52.5962 40.822 51.13002 39.41505 L 40.21263 28.93883 L 49.97528 18.1599 C 51.33938 16.65378 49.04855 13.22287 47.57144 11.82741 C 46.09434 10.43195 41.48513 7.782153 40.08277 9.252707 L 30.43408 19.3705 L 20.09828 9.221642 z "
     id="path584"
     sodipodi:nodetypes="csscssscssscssscs" />
  <path
     style="font-size:12;fill:#ff1500;fill-rule:evenodd;stroke:none;stroke-width:0.83871pt;fill-opacity:1;"
     d="M 19.38852 12.02937 C 18.40656 11.10498 14.99821 13.34629 14.07208 14.32661 C 13.14595 15.30694 11.08818 18.3874 12.06772 19.31436 L 23.30394 29.94726 L 11.97379 41.97835 C 11.04921 42.96014 13.23715 45.72913 14.21747 46.65526 C 15.19778 47.58139 18.21296 49.94716 19.13653 48.9644 L 30.48082 36.89299 L 41.95429 47.54889 C 42.94246 48.46665 46.13245 46.47006 47.05858 45.48974 C 47.98471 44.50941 49.67517 41.10778 48.70862 40.16727 L 37.16766 28.93726 L 48.06843 17.64346 C 49.005 16.67309 46.88656 14.03849 45.90624 13.11237 C 44.92592 12.18622 41.99308 10.26899 41.03436 11.21745 L 30.05964 22.0747 L 19.38852 12.02937 z "
     id="path589"
     sodipodi:nodetypes="csscssscssscssscs" />
  <path
     style="font-size:12;fill:#7e0000;fill-rule:evenodd;stroke:none;stroke-width:0.83871pt;fill-opacity:1;"
     d="M 28.74697 33.08205 L 16.9284 45.77076 C 16.45941 46.27428 16.22842 46.76417 16.72859 47.2367 C 17.22878 47.70924 18.58643 48.28373 19.05516 47.77996 L 30.88096 35.07068 L 43.29721 46.96935 C 43.79401 47.44545 45.19611 46.87009 45.66864 46.36991 C 46.14118 45.86973 45.80247 45.31946 45.30642 44.84259 L 32.92137 32.93676 C 31.50887 31.57891 30.08239 31.64831 28.74697 33.08205 z "
     id="path592"
     sodipodi:nodetypes="cssscsssss" />
  <path
     style="font-size:12;fill:#ebf8e9;fill-rule:evenodd;stroke:none;stroke-width:0.83871pt;fill-opacity:1;"
     d="M 32.50653 26.30843 L 43.87895 14.25121 C 44.35109 13.75065 44.49944 13.18271 43.99926 12.71018 C 43.49908 12.23764 42.14456 11.66609 41.6727 12.16692 L 30.29306 24.24471 L 18.59219 13.02186 C 18.0956 12.54556 16.69328 13.12114 16.22074 13.62132 C 15.74822 14.1215 16.08717 14.67151 16.58297 15.14863 L 28.25265 26.37864 C 29.66444 27.73723 31.16216 27.73376 32.50653 26.30843 z "
     id="path594"
     sodipodi:nodetypes="cssscsssss" />
</svg>
