<?xml version="1.0" encoding="UTF-8" standalone="no"?>
<!DOCTYPE svg PUBLIC "-//W3C//DTD SVG 20010904//EN"
"http://www.w3.org/TR/2001/REC-SVG-20010904/DTD/svg10.dtd">
<!-- Created with Inkscape (http://www.inkscape.org/) -->
<svg
   id="svg604"
   sodipodi:version="0.32"
   width="72pt"
   height="72pt"
   sodipodi:docbase="/home/mula/Desktop/iconos"
   sodipodi:docname="filesaveas.svg"
   xmlns="http://www.w3.org/2000/svg"
   xmlns:sodipodi="http://sodipodi.sourceforge.net/DTD/sodipodi-0.dtd"
   xmlns:xlink="http://www.w3.org/1999/xlink"
   xmlns:inkscape="http://www.inkscape.org/namespaces/inkscape"
   inkscape:version="0.37">
  <defs
     id="defs606">
    <linearGradient
       id="linearGradient612">
      <stop
         style="stop-color:#7fa8e3;stop-opacity:0.741176;"
         offset="0.000000"
         id="stop613" />
      <stop
         style="stop-color:#ffffff;stop-opacity:0;"
         offset="1.000000"
         id="stop614" />
    </linearGradient>
    <linearGradient
       xlink:href="#linearGradient612"
       id="linearGradient615"
       x1="50.6438866"
       y1="5.36792946"
       x2="35.7520943"
       y2="68.0443573"
       gradientUnits="userSpaceOnUse"
       spreadMethod="pad" />
  </defs>
  <sodipodi:namedview
     id="base"
     inkscape:zoom="4.29166667"
     inkscape:cx="36.0000000"
     inkscape:cy="36.0000000"
     inkscape:window-width="1014"
     inkscape:window-height="696"
     inkscape:window-x="0"
     inkscape:window-y="0" />
  <g
     id="g614">
    <defs
       id="defs668">
      <linearGradient
         id="linearGradient689">
        <stop
           style="stop-color:#ffb700;stop-opacity:1;"
           offset="0.000000"
           id="stop690" />
        <stop
           style="stop-color:#fdffff;stop-opacity:0;"
           offset="1.000000"
           id="stop691" />
      </linearGradient>
      <linearGradient
         id="linearGradient684">
        <stop
           style="stop-color:#ffffff;stop-opacity:0.647059;"
           offset="0.000000"
           id="stop685" />
        <stop
           style="stop-color:#fdffff;stop-opacity:0;"
           offset="1.000000"
           id="stop686" />
      </linearGradient>
      <linearGradient
         id="linearGradient677">
        <stop
           style="stop-color:#000000;stop-opacity:1;"
           offset="0.000000"
           id="stop678" />
        <stop
           style="stop-color:#6a6762;stop-opacity:1;"
           offset="1.000000"
           id="stop679" />
      </linearGradient>
      <linearGradient
         xlink:href="#linearGradient677"
         id="linearGradient680"
         x1="68.3116760"
         y1="71.2960510"
         x2="52.5783653"
         y2="39.5797806"
         gradientUnits="userSpaceOnUse"
         spreadMethod="pad"
         gradientTransform="scale(1.011562,0.988570)" />
      <linearGradient
         xlink:href="#linearGradient684"
         id="linearGradient683"
         x1="49.0257645"
         y1="44.3401871"
         x2="56.4553261"
         y2="53.1827507"
         gradientUnits="userSpaceOnUse"
         spreadMethod="pad"
         gradientTransform="scale(1.017548,0.982755)" />
      <linearGradient
         xlink:href="#linearGradient689"
         id="linearGradient688"
         x1="26.2959213"
         y1="98.9529343"
         x2="31.7159863"
         y2="102.827583"
         gradientUnits="userSpaceOnUse"
         spreadMethod="pad"
         gradientTransform="scale(1.326975,0.753594)" />
      <linearGradient
         xlink:href="#linearGradient689"
         id="linearGradient693"
         x1="33.5794411"
         y1="53.8219566"
         x2="-14.0691185"
         y2="26.5526485"
         gradientUnits="userSpaceOnUse"
         spreadMethod="pad"
         gradientTransform="scale(0.780786,1.280761)" />
      <linearGradient
         xlink:href="#linearGradient689"
         id="linearGradient698" />
    </defs>
    <sodipodi:namedview
       id="namedview630" />
    <path
       style="fill:#000000;fill-rule:evenodd;stroke:none;stroke-opacity:1;stroke-width:1pt;stroke-linejoin:miter;stroke-linecap:butt;fill-opacity:0.298246;"
       d="M 1.43587 43.3341 C 1.43587 43.3341 13.9829 62.1334 24.4099 77.6156 C 26.361 79.271 38.7518 85.1307 41.6404 83.718 C 44.2164 82.1492 79.0892 55.3067 79.7142 52.1225 C 80.6982 48.5327 79.4883 46.2058 78.6141 44.411 C 77.8962 42.6161 54.5632 6.53978 53.6658 5.64236 C 52.7684 4.74493 50.2556 3.48854 47.2044 4.56545 C 39.4401 9.04617 15.007 24.332 2.58248 37.1683 C 0.96712 38.9632 1.25639 41.5392 1.43587 43.3341 z "
       id="path699"
       sodipodi:nodetypes="ccccccccc"
       transform="matrix(1.120973,0.000000,0.000000,0.970624,-0.312708,8.246927)" />
    <path
       style="fill:none;fill-rule:evenodd;stroke:black;stroke-opacity:1;stroke-width:1pt;stroke-linejoin:miter;stroke-linecap:butt;fill-opacity:1;"
       d="M 8.79473 37.4111 C 8.79473 37.4709 8.79473 37.5307 8.79473 37.5906 "
       id="path671" />
    <path
       style="fill:#261d14;fill-rule:evenodd;stroke:none;stroke-opacity:1;stroke-width:1pt;stroke-linejoin:miter;stroke-linecap:butt;fill-opacity:1;"
       d="M 1.43587 43.3341 C 1.43587 43.3341 13.9829 62.1334 24.4099 77.6156 C 26.361 79.271 38.7518 85.1307 41.6404 83.718 C 44.2164 82.1492 79.0892 55.3067 79.7142 52.1225 C 80.6982 48.5327 79.4883 46.2058 78.6141 44.411 C 77.8962 42.6161 54.5632 6.53978 53.6658 5.64236 C 52.7684 4.74493 50.2556 3.48854 47.2044 4.56545 C 39.4401 9.04617 15.007 24.332 2.58248 37.1683 C 0.96712 38.9632 1.25639 41.5392 1.43587 43.3341 z "
       id="path676"
       sodipodi:nodetypes="ccccccccc" />
    <path
       style="fill:#f1e36c;fill-rule:evenodd;stroke:none;stroke-opacity:1;stroke-width:1pt;stroke-linejoin:miter;stroke-linecap:butt;fill-opacity:1;"
       d="M 8.61525 37.5906 C 8.61525 37.5906 27.2816 66.8465 27.9995 68.1029 C 28.7175 69.3593 30.3329 71.1542 33.5636 72.0516 C 38.4097 74.0259 43.0762 75.8207 43.4352 75.8207 C 43.7942 75.8207 46.1275 73.6669 46.1275 73.6669 L 35.5379 60.3851 L 59.7683 39.2059 L 69.9989 54.1031 L 75.5629 49.616 C 75.5629 49.616 50.4351 8.69359 50.0761 8.69359 C 49.7172 8.69359 43.7942 12.2833 43.7942 12.2833 L 56.3581 31.3086 C 56.3581 31.3086 31.7687 49.4366 29.6149 51.2314 C 27.6406 51.2314 13.4613 33.4624 13.4613 33.4624 L 8.61525 37.5906 z "
       id="path672"
       sodipodi:nodetypes="ccccccccccccccc" />
    <path
       style="fill:#ffffff;fill-rule:evenodd;stroke:none;stroke-opacity:1;stroke-width:1pt;stroke-linejoin:miter;stroke-linecap:butt;fill-opacity:1;"
       d="M 14.8972 32.565 L 29.6149 49.2571 L 54.2043 30.7702 L 42.3583 12.8217 L 14.8972 32.565 z "
       id="path673"
       sodipodi:nodetypes="ccccc" />
    <path
       style="fill:url(#linearGradient680);fill-rule:evenodd;stroke:none;stroke-opacity:1;stroke-width:1pt;stroke-linejoin:miter;stroke-linecap:butt;fill-opacity:1;"
       d="M 37.5122 60.5646 L 47.0249 72.4105 L 49.3582 70.6157 L 41.1019 60.3851 C 41.1019 60.3851 43.7942 57.3338 45.589 57.1544 C 48.4608 59.8466 54.2043 67.026 54.2043 67.026 L 69.1015 55.7185 L 59.2298 41.5392 L 37.5122 60.5646 z "
       id="path674"
       sodipodi:nodetypes="ccccccccc" />
    <path
       style="fill:#f1e36c;fill-rule:evenodd;stroke:none;stroke-opacity:1;stroke-width:1pt;stroke-linejoin:miter;stroke-linecap:butt;fill-opacity:1;"
       d="M 7.92054 38.5345 C 7.20261 38.355 28.897 71.872 29.4355 71.872 C 29.9739 71.872 41.4609 76.7182 41.4609 76.7182 L 40.743 79.0514 L 28.7175 75.6413 L 5.40776 41.25 L 7.92054 38.5345 z "
       id="path675"
       sodipodi:nodetypes="ccccccc"
       transform="" />
    <path
       style="fill:#f1e36c;fill-rule:evenodd;stroke:none;stroke-opacity:1;stroke-width:1pt;stroke-linejoin:miter;stroke-linecap:butt;fill-opacity:1;"
       d="M 42.3583 60.2056 L 49.7172 69.7183 L 52.9479 67.026 L 45.2301 57.6928 L 42.3583 60.2056 z "
       id="path681" />
    <path
       style="fill:url(#linearGradient683);fill-rule:evenodd;stroke:none;stroke-opacity:1;stroke-width:1pt;stroke-linejoin:miter;stroke-linecap:butt;fill-opacity:1;"
       d="M 59.0625 42.5 L 45.1563 54.6875 C 46.3542 58.2291 50.3646 60.9895 52.0313 62.9687 C 54.5834 43.802 59.948 45.4166 65.3126 52.3437 L 59.0625 42.5 z "
       id="path682"
       sodipodi:nodetypes="ccccc" />
    <path
       style="fill:url(#linearGradient688);fill-rule:evenodd;stroke:none;stroke-opacity:1;stroke-width:1pt;stroke-linejoin:miter;stroke-linecap:butt;fill-opacity:1;"
       d="M 41.25 76.7187 L 40.625 79.0625 L 28.5938 75.9375 L 29.0625 71.875 L 41.25 76.7187 z "
       id="path687" />
    <path
       style="fill:url(#linearGradient693);fill-rule:evenodd;stroke:none;stroke-opacity:1;stroke-width:1pt;stroke-linejoin:miter;stroke-linecap:butt;fill-opacity:1;"
       d="M 28.5938 75.7812 L 29.375 72.1875 L 12.5 46.5625 L 11.5625 50 L 28.5938 75.7812 z "
       id="path692" />
    <path
       style="fill:#bae6ff;fill-rule:evenodd;stroke:none;stroke-opacity:1;stroke-width:1pt;stroke-linejoin:miter;stroke-linecap:butt;fill-opacity:1;"
       d="M 14.8438 32.5 L 21.0938 39.5312 L 47.8126 20.7812 L 42.3438 12.8125 L 14.8438 32.5 z "
       id="path697"
       sodipodi:nodetypes="ccccc" />
  </g>
  <g
     id="g677"
     transform="matrix(0.647806,0.261004,-0.261004,0.647806,43.57026,-15.96000)">
    <defs
       id="defs611">
      <linearGradient
         id="linearGradient626">
        <stop
           style="stop-color:#b5772d;stop-opacity:1;"
           offset="0.000000"
           id="stop627" />
        <stop
           style="stop-color:#ffffff;stop-opacity:0;"
           offset="1.000000"
           id="stop628" />
      </linearGradient>
      <linearGradient
         id="linearGradient619">
        <stop
           style="stop-color:#770000;stop-opacity:1;"
           offset="0.000000"
           id="stop620" />
        <stop
           style="stop-color:#ffffff;stop-opacity:0;"
           offset="1.000000"
           id="stop621" />
      </linearGradient>
      <linearGradient
         xlink:href="#linearGradient619"
         id="linearGradient622"
         x1="66.3316956"
         y1="23.2124691"
         x2="63.4654961"
         y2="20.9627991"
         gradientUnits="userSpaceOnUse"
         spreadMethod="pad"
         gradientTransform="scale(1.004516,0.995504)" />
      <linearGradient
         xlink:href="#linearGradient626"
         id="linearGradient625"
         x1="56.3276138"
         y1="43.3772469"
         x2="51.6545258"
         y2="39.7629089"
         gradientUnits="userSpaceOnUse"
         spreadMethod="pad"
         gradientTransform="scale(0.912664,1.095694)" />
    </defs>
    <sodipodi:namedview
       id="namedview687" />
    <path
       style="fill:#000000;fill-rule:evenodd;stroke:none;stroke-opacity:1;stroke-width:1pt;stroke-linejoin:miter;stroke-linecap:butt;fill-opacity:0.283186;"
       d="M 9.33685 82.1156 C 17.9129 79.7641 30.9112 77.5637 40.1097 71.8924 C 56.9851 62.0714 66.0118 41.6332 76.4551 25.5877 C 77.285 12.3086 64.1128 5.96872 59.1331 8.87345 C 46.4766 25.4722 37.5548 43.5235 23.4458 55.9725 C 19.0886 66.5542 9.12934 82.738 9.33685 82.1156 z "
       id="path632"
       sodipodi:nodetypes="cccccc"
       transform="translate(3.814559,2.934275)" />
    <path
       style="fill:#000000;fill-rule:evenodd;stroke:none;stroke-opacity:1;stroke-width:1pt;stroke-linejoin:miter;stroke-linecap:butt;fill-opacity:1;"
       d="M 9.33685 82.1156 C 17.9129 79.7641 28.5638 74.9228 37.7623 69.2516 C 54.6377 59.4306 64.2512 38.4055 74.6945 22.36 C 75.5244 9.08092 64.1128 5.96872 59.1331 8.87345 C 46.4766 25.4722 37.5548 43.5235 23.4458 55.9725 C 19.0886 66.5542 9.12934 82.738 9.33685 82.1156 z "
       id="path617"
       sodipodi:nodetypes="cccccc" />
    <path
       style="fill:#be6d6d;fill-rule:evenodd;stroke:none;stroke-opacity:1;stroke-width:1pt;stroke-linejoin:miter;stroke-linecap:butt;fill-opacity:1;"
       d="M 71.9972 20.9076 C 70.2682 23.3974 68.5391 25.8872 66.8101 28.377 C 64.5278 22.9824 61.8305 20.2851 54.9835 19.6627 C 57.1967 16.9654 59.4098 14.2681 61.623 11.5708 C 67.1559 10.9483 71.4439 15.7205 71.9972 20.9076 z "
       id="path613"
       sodipodi:nodetypes="ccccc" />
    <path
       style="fill:#ffbc24;fill-rule:evenodd;stroke:none;stroke-opacity:1;stroke-width:1pt;stroke-linejoin:miter;stroke-linecap:butt;fill-opacity:1;"
       d="M 54.776 20.9076 C 60.1706 20.5618 63.9053 24.5732 65.9801 29.207 C 57.5424 42.8318 50.5571 56.2492 36.3098 66.9692 C 36.3098 66.9692 32.7826 56.8024 27.5955 58.0474 C 34.0275 50.7854 48.9664 30.037 54.776 20.9076 z "
       id="path614"
       sodipodi:nodetypes="ccccc" />
    <path
       style="fill:#e9dbb9;fill-rule:evenodd;stroke:none;stroke-opacity:1;stroke-width:1pt;stroke-linejoin:miter;stroke-linecap:butt;fill-opacity:1;"
       d="M 27.0767 58.6698 C 31.7451 58.4277 35.6873 63.9953 34.6499 67.3842 C 32.6442 68.9057 29.3937 70.4273 27.388 71.9488 C 27.0422 69.1824 25.244 67.0384 21.3709 67.3842 C 23.0999 64.4102 25.3477 61.6438 27.0767 58.6698 z "
       id="path615"
       sodipodi:nodetypes="ccccc" />
    <path
       style="fill:#586f93;fill-rule:evenodd;stroke:none;stroke-opacity:1;stroke-width:1pt;stroke-linejoin:miter;stroke-linecap:butt;fill-opacity:1;"
       d="M 21.7859 66.9692 C 25.3477 66.1393 26.8347 69.6665 27.5955 71.7414 L 14.3164 77.7584 L 21.7859 66.9692 z "
       id="path616"
       sodipodi:nodetypes="cccc" />
    <path
       style="fill:url(#linearGradient622);fill-rule:evenodd;stroke:none;stroke-opacity:1;stroke-width:1pt;stroke-linejoin:miter;stroke-linecap:butt;fill-opacity:1;"
       d="M 71.9972 20.9076 C 70.2682 23.3974 68.5391 25.8872 66.8101 28.377 C 64.5278 22.9824 61.8305 20.2851 54.9835 19.6627 C 57.1967 16.9654 59.4098 14.2681 61.623 11.5708 C 67.1559 10.9483 71.4439 15.7205 71.9972 20.9076 z "
       id="path618"
       sodipodi:nodetypes="ccccc" />
    <path
       style="fill:#ffffff;fill-rule:evenodd;stroke:none;stroke-opacity:1;stroke-width:1pt;stroke-linejoin:miter;stroke-linecap:butt;fill-opacity:1;"
       d="M 62.8679 12.1932 L 57.4733 19.0402 L 60.3781 20.0776 L 65.7727 13.6456 L 62.8679 12.1932 z "
       id="path623"
       sodipodi:nodetypes="ccccc" />
    <path
       style="fill:url(#linearGradient625);fill-rule:evenodd;stroke:none;stroke-opacity:1;stroke-width:1pt;stroke-linejoin:miter;stroke-linecap:butt;fill-opacity:1;"
       d="M 54.776 20.9076 C 60.1706 20.5618 63.9053 24.5732 65.9801 29.207 C 57.5424 42.8318 50.5571 56.2492 36.3098 66.9692 C 36.3098 66.9692 32.7826 56.8024 27.5955 58.0474 C 34.0275 50.7854 48.9664 30.037 54.776 20.9076 z "
       id="path624"
       sodipodi:nodetypes="ccccc" />
    <path
       style="fill:#ffffff;fill-rule:evenodd;stroke:none;stroke-opacity:1;stroke-width:1pt;stroke-linejoin:miter;stroke-linecap:butt;fill-opacity:1;"
       d="M 29.6703 56.18 C 30.9152 56.9408 32.1601 57.7015 33.405 58.4623 C 42.5344 47.6039 46.6841 36.5381 58.9257 24.6423 C 57.7499 23.8815 56.5742 23.1208 55.3984 22.36 C 48.0673 35.0857 39.6987 47.3965 29.6703 56.18 z "
       id="path630"
       sodipodi:nodetypes="ccccc" />
    <path
       style="fill:#9c7850;fill-rule:evenodd;stroke:none;stroke-opacity:1;stroke-width:1pt;stroke-linejoin:miter;stroke-linecap:butt;fill-opacity:1;"
       d="M 34.7538 67.2805 C 34.9612 65.1019 34.4425 63.5457 33.3013 61.7821 C 31.7798 65.171 29.4283 67.6262 26.1431 68.4216 C 25.4169 69.044 27.388 70.3927 27.5955 71.6376 C 29.4629 70.4964 34.7538 67.9029 34.7538 67.2805 z "
       id="path631"
       sodipodi:nodetypes="ccccc" />
  </g>
</svg>
