<?xml version="1.0" encoding="UTF-8" standalone="no"?>
<!DOCTYPE svg PUBLIC "-//W3C//DTD SVG 1.0//EN"
"http://www.w3.org/TR/2001/REC-SVG-20010904/DTD/svg10.dtd">
<!-- Created with Sodipodi ("http://www.sodipodi.com/") -->
<svg
   id="svg830"
   sodipodi:version="0.34"
   xmlns="http://www.w3.org/2000/svg"
   xmlns:sodipodi="http://sodipodi.sourceforge.net/DTD/sodipodi-0.dtd"
   xmlns:xlink="http://www.w3.org/1999/xlink"
   width="72pt"
   height="72pt"
   xml:space="preserve"
   sodipodi:docbase="/home/zeus"
   sodipodi:docname="/home/zeus/gnome-panel.svg"><defs
   id="defs832"><linearGradient
   id="linearGradient940"><stop
   style="stop-color:#000000;stop-opacity:0.302;"
   offset="0"
   id="stop941" /><stop
   style="stop-color:#ffffff;stop-opacity:0;"
   offset="1"
   id="stop942" /></linearGradient><linearGradient
   xlink:href="#linearGradient940"
   id="linearGradient943"
   x1="26.5261593"
   y1="150.134308"
   x2="26.12854"
   y2="114.264252"
   gradientUnits="userSpaceOnUse"
   gradientTransform="scale(1.78596,0.559923)" /></defs><sodipodi:namedview
   id="base" /><rect
   style="font-size:12;fill:#000000;fill-rule:evenodd;stroke-width:1;fill-opacity:0.3761;"
   id="rect993"
   width="82.2011719"
   height="19.8873825"
   x="7.07106829"
   y="67.0190277" /><rect
   style="font-size:12;fill:#ffe6ba;fill-rule:evenodd;stroke-width:1;fill-opacity:1;"
   id="rect882"
   width="84.8528214"
   height="62.7557335"
   x="4.41941786"
   y="17.9634895" /><path
   style="fill:none;fill-rule:evenodd;stroke:#e9a93d;stroke-opacity:1;stroke-width:1pt;stroke-linejoin:miter;stroke-linecap:butt;fill-opacity:1;"
   d="M 20.77127 19.28931 L 20.32932 81.16116 "
   id="path883" /><path
   style="fill:none;fill-rule:evenodd;stroke:#ffffff;stroke-opacity:1;stroke-width:1pt;stroke-linejoin:miter;stroke-linecap:butt;fill-opacity:1;"
   d="M 22.09709 18.40543 L 21.2132 79.3934 "
   id="path884" /><path
   style="fill:none;fill-rule:evenodd;stroke:black;stroke-opacity:1;stroke-width:1pt;stroke-linejoin:miter;stroke-linecap:butt;fill-opacity:1;"
   d="M 88.8303 79.83534 L 5.303301 80.27728 L 5.745243 18.40543 "
   id="path885" /><path
   style="fill:none;fill-rule:evenodd;stroke:black;stroke-opacity:1;stroke-width:1pt;stroke-linejoin:miter;stroke-linecap:butt;fill-opacity:1;"
   d="M 5.303301 18.40543 L 87.94641 18.40543 "
   id="path886" /><path
   transform="translate(-0.883883,1.767769)"
   style="font-size:12;fill-rule:evenodd;"
   d="M 19.88738 46.91068 C 19.88738 50.20572 17.31515 52.87689 14.14214 52.87689 C 10.96913 52.87689 8.396894 50.20572 8.396894 46.91068 C 8.396894 43.61563 10.96913 40.94446 14.14214 40.94446 C 17.31515 40.94446 19.88738 43.61563 19.88738 46.91068 z "
   id="path889" /><path
   style="fill:url(#linearGradient943);fill-rule:evenodd;stroke:none;stroke-opacity:1;stroke-width:1pt;stroke-linejoin:miter;stroke-linecap:butt;fill-opacity:1;"
   d="M 6.187185 79.83534 L 88.8303 79.3934 L 89.27224 53.76077 L 6.187185 54.20272 L 6.187185 79.83534 z "
   id="path939"
   sodipodi:nodetypes="ccccc" /><g
   id="g944"
   transform="matrix(0.543468,0,0,0.543468,32.03396,22.38653)"><defs
   id="defs550"><linearGradient
   id="linearGradient589"><stop
   style="stop-color:#ffffff;stop-opacity:1;"
   offset="0.000000"
   id="stop590" /><stop
   style="stop-color:#ffffff;stop-opacity:0;"
   offset="1.000000"
   id="stop591" /></linearGradient><linearGradient
   xlink:href="#linearGradient589"
   id="linearGradient592"
   x1="38.4874878"
   y1="25.5889244"
   x2="50.0719948"
   y2="48.2551422"
   gradientUnits="userSpaceOnUse"
   gradientTransform="scale(0.608808,1.642555)"
   spreadMethod="pad" /><linearGradient
   xlink:href="#linearGradient589"
   id="linearGradient594"
   x1="-0.12901177"
   y1="0.02343532"
   x2="0.70967788"
   y2="0.96093744"
   gradientUnits="objectBoundingBox"
   spreadMethod="pad" /><linearGradient
   xlink:href="#linearGradient589"
   id="linearGradient596" /><linearGradient
   xlink:href="#linearGradient589"
   id="linearGradient629" /><linearGradient
   xlink:href="#linearGradient589"
   id="linearGradient631" /></defs><sodipodi:namedview
   id="namedview954" /><path
   style="font-size:12;fill-rule:evenodd;stroke-width:1pt;fill:#000000;fill-opacity:0.3;"
   d="M 54.9883 81.4569 C 47.957 81.8163 36.4181 82.8514 28.7969 65.6132 C 26.3673 59.4294 25.0586 48.4961 33.1836 37.8711 C 37.5586 32.4024 43.8322 28.0508 53.0509 29.9258 C 60.5275 29.7071 69.4258 40.617 64.7383 48.2733 C 60.0508 55.9295 51.6441 57.6483 53.3356 60.1173 C 55.7264 62.2114 62.5624 60.0079 65.7616 64.0939 C 67.4804 67.3752 61.7071 79.2694 54.9883 81.4569 z "
   id="path662"
   sodipodi:nodetypes="cccccccc"
   transform="matrix(1.259307,0.000000,0.000000,1.259307,-11.09589,-14.04155)" /><g
   id="g667"
   transform="matrix(0.972002,0.000000,0.000000,0.972002,0.967511,1.255798)"><path
   transform="matrix(-2.447984e-2,1.881981,1.881981,2.447849e-2,-42.67223,-5.662441)"
   style="font-size:12;fill-rule:evenodd;stroke-width:1pt;fill:#000000;fill-opacity:0.3;"
   d="M 28.5938 29.1406 C 28.5938 32.0299 27.1588 34.3749 25.3906 34.3749 C 23.6225 34.3749 22.1875 32.0299 22.1875 29.1406 C 22.1875 26.2512 23.6225 23.9062 25.3906 23.9062 C 27.1588 23.9062 28.5938 26.2512 28.5938 29.1406 z "
   id="path666" /><path
   transform="matrix(1.364979,-0.895700,0.895700,1.364979,-38.54071,9.130011)"
   style="font-size:12;fill-rule:evenodd;stroke-width:1pt;fill:#000000;fill-opacity:0.3;"
   d="M 28.5938 29.1406 C 28.5938 32.0299 27.1588 34.3749 25.3906 34.3749 C 23.6225 34.3749 22.1875 32.0299 22.1875 29.1406 C 22.1875 26.2512 23.6225 23.9062 25.3906 23.9062 C 27.1588 23.9062 28.5938 26.2512 28.5938 29.1406 z "
   id="path665" /><path
   transform="matrix(1.710329,-8.449190e-2,8.449188e-2,1.710329,-8.956360,-30.89149)"
   style="font-size:12;fill-rule:evenodd;stroke-width:1pt;fill:#000000;fill-opacity:0.3;"
   d="M 28.5938 29.1406 C 28.5938 32.0299 27.1588 34.3749 25.3906 34.3749 C 23.6225 34.3749 22.1875 32.0299 22.1875 29.1406 C 22.1875 26.2512 23.6225 23.9062 25.3906 23.9062 C 27.1588 23.9062 28.5938 26.2512 28.5938 29.1406 z "
   id="path664" /><path
   transform="matrix(2.056255,0.991635,-0.991636,2.056254,34.69159,-72.58045)"
   style="font-size:12;fill-rule:evenodd;stroke-width:1pt;fill:#000000;fill-opacity:0.3;"
   d="M 28.5938 29.1406 C 28.5938 32.0299 27.1588 34.3749 25.3906 34.3749 C 23.6225 34.3749 22.1875 32.0299 22.1875 29.1406 C 22.1875 26.2512 23.6225 23.9062 25.3906 23.9062 C 27.1588 23.9062 28.5938 26.2512 28.5938 29.1406 z "
   id="path663" /><path
   sodipodi:type="arc"
   style="font-size:12;fill-rule:evenodd;stroke-width:1pt;"
   id="path559"
   d="M 46.84584 44.47998 A 5.413788 7.292042 0 1 0 36.01826 44.47998 A 5.413788 7.292042 0 1 0  46.84584 44.47998 z"
   sodipodi:cx="41.432053"
   sodipodi:cy="44.479984"
   sodipodi:rx="5.413788"
   sodipodi:ry="7.292042"
   transform="matrix(1.766225,0.000000,0.000000,1.464769,-34.91358,-20.35575)" /><path
   transform="matrix(1.364979,-0.895700,0.895700,1.364979,-41.04071,8.192511)"
   style="font-size:12;fill-rule:evenodd;stroke-width:1pt;"
   d="M 28.5938 29.1406 C 28.5938 32.0299 27.1588 34.3749 25.3906 34.3749 C 23.6225 34.3749 22.1875 32.0299 22.1875 29.1406 C 22.1875 26.2512 23.6225 23.9062 25.3906 23.9062 C 27.1588 23.9062 28.5938 26.2512 28.5938 29.1406 z "
   id="path583" /><path
   style="font-size:12;fill-rule:evenodd;stroke-width:1pt;"
   d="M 54.9883 81.4569 C 47.957 81.8163 36.4181 82.8514 28.7969 65.6132 C 26.3673 59.4294 25.0586 48.4961 33.1836 37.8711 C 37.5586 32.4024 43.8322 28.0508 53.0509 29.9258 C 60.5275 29.7071 69.4258 40.617 64.7383 48.2733 C 60.0508 55.9295 51.6441 57.6483 53.3356 60.1173 C 55.7264 62.2114 62.5624 60.0079 65.7616 64.0939 C 67.4804 67.3752 61.7071 79.2694 54.9883 81.4569 z "
   id="path570"
   sodipodi:nodetypes="cccccccc"
   transform="matrix(1.259307,0.000000,0.000000,1.259307,-15.15840,-13.41655)" /><path
   style="font-size:12;fill:#487196;fill-rule:evenodd;stroke-width:1pt;"
   d="M 54.8438 80.1562 C 47.8125 81.0937 36.5626 81.4062 29.375 65.4687 C 27.5 60.7813 25.7812 49.2187 33.9062 38.5937 C 38.2812 33.125 44.8438 29.0624 54.0625 30.9374 C 61.2501 31.8749 68.1251 38.5937 63.4376 46.25 C 58.7501 53.9062 46.875 55.625 50.1562 61.5625 C 53.1251 68.2812 61.4063 62.0312 63.5938 66.4062 C 65.3126 69.6875 61.5626 77.9687 54.8438 80.1562 z "
   id="path569"
   sodipodi:nodetypes="cccccccc"
   transform="matrix(1.164757,0.000000,0.000000,1.164757,-10.76570,-8.169355)" /><path
   style="font-size:12;fill:url(#linearGradient592);fill-rule:evenodd;stroke-width:1pt;"
   d="M 42.5 76.5625 C 42.5 76.7187 30.4688 63.125 32.5 55 C 34.5313 46.875 35.9375 42.0312 35.9375 42.0312 C 35.9375 42.0312 28.5938 48.75 29.8438 58.2812 C 31.0938 67.8125 35.3125 74.5312 42.5 76.5625 z "
   id="path588"
   transform="matrix(1.164757,0.000000,0.000000,1.164757,-10.76570,-8.169355)" /><path
   style="font-size:12;fill-rule:evenodd;stroke-width:1pt;"
   d="M 42.8125 68.2812 C 42.8125 68.2812 45.1562 69.8438 50.6251 71.2499 C 55.3126 71.875 61.7188 72.0312 63.5938 70.4687 C 65.4688 68.5937 67.1876 65.4687 67.1876 65.4687 C 67.1876 65.4687 64.2188 72.5 62.8126 74.5312 C 61.4063 76.5625 59.6876 78.75 57.0313 79.6875 C 55.3126 80.3125 52.1876 81.0938 48.7501 78.5937 C 45.9376 76.25 43.75 74.8437 42.8125 68.2812 z "
   id="path567"
   sodipodi:nodetypes="cccccccc"
   transform="matrix(1.164757,0.000000,0.000000,1.164757,-10.76570,-8.169355)" /><path
   sodipodi:type="arc"
   style="font-size:12;fill-rule:evenodd;stroke-width:1pt;"
   id="path560"
   d="M 46.84584 44.47998 A 5.413788 7.292042 0 1 0 36.01826 44.47998 A 5.413788 7.292042 0 1 0  46.84584 44.47998 z"
   sodipodi:cx="41.432053"
   sodipodi:cy="44.479984"
   sodipodi:rx="5.413788"
   sodipodi:ry="7.292042"
   transform="matrix(1.411826,0.000000,0.000000,1.411826,-22.03179,-18.64424)" /><path
   sodipodi:type="arc"
   style="font-size:12;fill-rule:evenodd;stroke-width:1pt;"
   id="path561"
   d="M 46.84584 44.47998 A 5.413788 7.292042 0 1 0 36.01826 44.47998 A 5.413788 7.292042 0 1 0  46.84584 44.47998 z"
   sodipodi:cx="41.432053"
   sodipodi:cy="44.479984"
   sodipodi:rx="5.413788"
   sodipodi:ry="7.292042"
   transform="matrix(1.601990,0.000000,0.000000,1.601992,-15.49755,-29.67655)" /><path
   sodipodi:type="arc"
   style="font-size:12;fill:#ffffff;fill-rule:evenodd;stroke-width:1pt;"
   id="path562"
   d="M 46.84584 44.47998 A 5.413788 7.292042 0 1 0 36.01826 44.47998 A 5.413788 7.292042 0 1 0  46.84584 44.47998 z"
   sodipodi:cx="41.432053"
   sodipodi:cy="44.479984"
   sodipodi:rx="5.413788"
   sodipodi:ry="7.292042"
   transform="matrix(1.321643,0.000000,0.000000,1.321643,-3.882174,-17.20666)" /><path
   sodipodi:type="arc"
   style="font-size:12;fill:#ffffff;fill-rule:evenodd;stroke-width:1pt;"
   id="path558"
   d="M 46.84584 44.47998 A 5.413788 7.292042 0 1 0 36.01826 44.47998 A 5.413788 7.292042 0 1 0  46.84584 44.47998 z"
   sodipodi:cx="41.432053"
   sodipodi:cy="44.479984"
   sodipodi:rx="5.413788"
   sodipodi:ry="7.292042"
   transform="matrix(1.164757,0.000000,0.000000,1.164757,-11.79521,-7.654600)" /><path
   style="font-size:12;fill-rule:evenodd;stroke-width:1pt;"
   d="M 44.6361 46.3582 C 44.6361 48.1269 43.5472 49.5623 42.2055 49.5623 C 40.8637 49.5623 39.7748 48.1269 39.7748 46.3582 C 39.7748 44.5896 40.8637 43.1542 42.2055 43.1542 C 43.5472 43.1542 44.6361 44.5896 44.6361 46.3582 z "
   id="path555"
   transform="matrix(1.164757,0.000000,0.000000,1.164757,-12.76038,-9.391901)" /><path
   style="font-size:12;fill-rule:evenodd;stroke-width:1pt;"
   d="M 56.3476 44.48 C 56.3476 46.5536 54.9617 48.2365 53.254 48.2365 C 51.5463 48.2365 50.1604 46.5536 50.1604 44.48 C 50.1604 42.4064 51.5463 40.7235 53.254 40.7235 C 54.9617 40.7235 56.3476 42.4064 56.3476 44.48 z "
   id="path554"
   transform="matrix(1.164757,0.000000,0.000000,1.164757,-10.76570,-8.169355)" /><path
   sodipodi:type="arc"
   style="font-size:12;fill:#ffffff;fill-rule:evenodd;stroke-width:1pt;"
   id="path556"
   d="M 43.53128 45.03241 A 1.215342 1.43631 0 1 0 41.1006 45.03241 A 1.215342 1.43631 0 1 0  43.53128 45.03241 z"
   sodipodi:cx="42.315941"
   sodipodi:cy="45.032410"
   sodipodi:rx="1.215342"
   sodipodi:ry="1.436310"
   transform="matrix(1.164757,0.000000,0.000000,1.164757,-12.76038,-9.391901)" /><path
   sodipodi:type="arc"
   style="font-size:12;fill:#ffffff;fill-rule:evenodd;stroke-width:1pt;"
   id="path557"
   d="M 54.8008 43.5961 A 1.546799 1.546799 0 1 0 51.7072 43.5961 A 1.546799 1.546799 0 1 0  54.8008 43.5961 z"
   sodipodi:cx="53.253998"
   sodipodi:cy="43.596100"
   sodipodi:rx="1.546799"
   sodipodi:ry="1.546799"
   transform="matrix(1.076514,0.000000,0.000000,1.164757,-6.475862,-9.352312)" /><path
   style="font-size:12;fill:#ffffff;fill-rule:evenodd;stroke-width:1pt;"
   d="M 47.1875 71.0937 L 46.4063 75.1562 C 46.4063 75.1562 44.0625 71.4062 44.0625 70.1562 C 44.5312 69.2188 44.8438 71.0937 47.1875 71.0937 z "
   id="path563"
   sodipodi:nodetypes="cccc"
   transform="matrix(1.164757,0.000000,0.000000,1.164757,-10.76570,-8.169355)" /><path
   style="font-size:12;fill:#ffffff;fill-rule:evenodd;stroke-width:1pt;"
   d="M 48.2813 71.875 C 48.2813 71.875 47.8125 75.9374 47.9688 76.2499 C 48.125 76.5624 52.5 79.2187 53.125 78.2812 C 53.7501 77.3437 54.0626 72.9687 54.0626 72.9687 C 54.0626 72.9687 50.4688 73.2812 48.2813 71.875 z "
   id="path564"
   sodipodi:nodetypes="ccccc"
   transform="matrix(1.164757,0.000000,0.000000,1.164757,-10.76570,-8.169355)" /><path
   style="font-size:12;fill:#ffffff;fill-rule:evenodd;stroke-width:1pt;"
   d="M 55.4688 72.8125 L 54.8438 78.4375 C 54.8438 78.4375 56.5625 78.9062 58.1251 77.5 C 59.6876 76.0937 59.8438 72.8125 59.8438 72.8125 L 55.4688 72.8125 z "
   id="path565"
   sodipodi:nodetypes="ccccc"
   transform="matrix(1.164757,0.000000,0.000000,1.164757,-10.76570,-8.169355)" /><path
   style="font-size:12;fill:#ffffff;fill-rule:evenodd;stroke-width:1pt;"
   d="M 60.7813 72.1875 C 60.7813 72.3437 60.3126 76.2499 60.3126 76.2499 C 60.3126 76.2499 63.4376 71.7187 63.5938 71.7187 C 63.7501 71.7187 60.9376 72.1875 60.7813 72.1875 z "
   id="path566"
   sodipodi:nodetypes="cccc"
   transform="matrix(1.164757,0.000000,0.000000,1.164757,-10.76570,-8.169355)" /><path
   style="font-size:12;fill-rule:evenodd;stroke-width:1pt;"
   d="M 40.1563 71.7187 C 40.1563 71.25 40.9375 69.2187 43.125 68.2812 C 45.3125 67.3437 46.875 66.7187 46.875 66.7187 C 46.875 66.7187 39.2188 65.3125 40.1563 71.7187 z "
   id="path568"
   transform="matrix(1.164757,0.000000,0.000000,1.164757,-10.76570,-8.169355)" /><path
   transform="matrix(0.973815,-0.639018,0.639018,0.973815,-23.62893,13.07393)"
   style="font-size:12;fill:#476f93;fill-rule:evenodd;stroke-width:1pt;"
   d="M 28.5938 29.1406 C 28.5938 32.0299 27.1588 34.3749 25.3906 34.3749 C 23.6225 34.3749 22.1875 32.0299 22.1875 29.1406 C 22.1875 26.2512 23.6225 23.9062 25.3906 23.9062 C 27.1588 23.9062 28.5938 26.2512 28.5938 29.1406 z "
   id="path582" /><path
   transform="matrix(1.710329,-8.449190e-2,8.449188e-2,1.710329,-10.51886,-31.20400)"
   style="font-size:12;fill-rule:evenodd;stroke-width:1pt;"
   d="M 28.5938 29.1406 C 28.5938 32.0299 27.1588 34.3749 25.3906 34.3749 C 23.6225 34.3749 22.1875 32.0299 22.1875 29.1406 C 22.1875 26.2512 23.6225 23.9062 25.3906 23.9062 C 27.1588 23.9062 28.5938 26.2512 28.5938 29.1406 z "
   id="path581" /><path
   transform="matrix(1.163338,-5.747005e-2,5.747005e-2,1.163338,4.157015,-15.95047)"
   style="font-size:12;fill:#476f93;fill-rule:evenodd;stroke-width:1pt;"
   d="M 28.5938 29.1406 C 28.5938 32.0299 27.1588 34.3749 25.3906 34.3749 C 23.6225 34.3749 22.1875 32.0299 22.1875 29.1406 C 22.1875 26.2512 23.6225 23.9062 25.3906 23.9062 C 27.1588 23.9062 28.5938 26.2512 28.5938 29.1406 z "
   id="path580" /><path
   transform="matrix(2.056255,0.991635,-0.991636,2.056254,33.12909,-73.51795)"
   style="font-size:12;fill-rule:evenodd;stroke-width:1pt;"
   d="M 28.5938 29.1406 C 28.5938 32.0299 27.1588 34.3749 25.3906 34.3749 C 23.6225 34.3749 22.1875 32.0299 22.1875 29.1406 C 22.1875 26.2512 23.6225 23.9062 25.3906 23.9062 C 27.1588 23.9062 28.5938 26.2512 28.5938 29.1406 z "
   id="path579" /><path
   transform="matrix(1.549889,0.747436,-0.747436,1.549887,38.87003,-52.56182)"
   style="font-size:12;fill:#476f93;fill-rule:evenodd;stroke-width:1pt;"
   d="M 28.5938 29.1406 C 28.5938 32.0299 27.1588 34.3749 25.3906 34.3749 C 23.6225 34.3749 22.1875 32.0299 22.1875 29.1406 C 22.1875 26.2512 23.6225 23.9062 25.3906 23.9062 C 27.1588 23.9062 28.5938 26.2512 28.5938 29.1406 z "
   id="path578" /><path
   style="font-size:12;fill-rule:evenodd;stroke-width:1pt;"
   d="M 58.9063 24.2187 C 58.9063 24.2187 56.0938 19.9999 57.8126 17.6562 C 59.5313 15.3124 61.7188 15.9374 61.7188 15.9374 C 58.125 17.9687 57.9688 18.9062 59.6876 21.0938 C 60.1563 23.9062 58.9063 24.5312 58.9063 24.2187 z "
   id="path584"
   sodipodi:nodetypes="ccccc"
   transform="matrix(1.164757,0.000000,0.000000,1.164757,-12.64071,-7.544346)" /><path
   transform="matrix(-2.447984e-2,1.881981,1.881981,2.447849e-2,-43.29723,-8.474951)"
   style="font-size:12;fill-rule:evenodd;stroke-width:1pt;"
   d="M 28.5938 29.1406 C 28.5938 32.0299 27.1588 34.3749 25.3906 34.3749 C 23.6225 34.3749 22.1875 32.0299 22.1875 29.1406 C 22.1875 26.2512 23.6225 23.9062 25.3906 23.9062 C 27.1588 23.9062 28.5938 26.2512 28.5938 29.1406 z "
   id="path585" /><path
   transform="matrix(-1.807543e-2,1.389470,1.389471,1.807398e-2,-29.10785,4.216900)"
   style="font-size:12;fill:#476f93;fill-rule:evenodd;stroke-width:1pt;"
   d="M 28.5938 29.1406 C 28.5938 32.0299 27.1588 34.3749 25.3906 34.3749 C 23.6225 34.3749 22.1875 32.0299 22.1875 29.1406 C 22.1875 26.2512 23.6225 23.9062 25.3906 23.9062 C 27.1588 23.9062 28.5938 26.2512 28.5938 29.1406 z "
   id="path586" /><path
   style="font-size:12;fill-rule:evenodd;stroke-width:1pt;"
   d="M 58.9063 24.2187 C 58.9063 24.2187 56.0938 19.9999 57.8126 17.6562 C 59.5313 15.3124 61.7188 15.9374 61.7188 15.9374 C 58.125 17.9687 57.9688 18.9062 59.6876 21.0938 C 60.1563 23.9062 58.9063 24.5312 58.9063 24.2187 z "
   id="path587"
   sodipodi:nodetypes="ccccc"
   transform="matrix(-0.419572,0.841862,0.841862,0.419572,21.98523,-16.79764)" /><path
   style="font-size:12;fill:url(#linearGradient594);fill-rule:evenodd;stroke-width:1pt;"
   d="M 60.9376 10.3124 C 60.9376 10.3124 55.6251 12.6562 55.6251 16.5624 C 55.6251 20.4687 56.7188 13.5937 60.9376 10.3124 z "
   id="path593"
   transform="matrix(1.164757,0.000000,0.000000,1.164757,-12.64071,-7.544346)" /><path
   style="font-size:12;fill:url(#linearGradient596);fill-rule:evenodd;stroke-width:1pt;"
   d="M 21.875 40.3125 C 21.875 40.3125 14.375 37.9687 12.8125 40.1562 C 11.25 42.3437 13.4375 33.7499 21.875 40.3125 z "
   id="path595"
   transform="matrix(1.164757,0.000000,0.000000,1.164757,-9.203198,-7.856855)" /><path
   style="fill:url(#linearGradient629);fill-rule:evenodd;stroke:none;stroke-opacity:1;stroke-width:1pt;stroke-linejoin:miter;stroke-linecap:butt;fill-opacity:1;"
   d="M 35.3125 11.5624 C 35.3125 11.5624 32.1875 14.3749 33.4375 17.8124 C 34.6875 21.2499 33.4375 13.7499 35.3125 11.5624 z "
   id="path628"
   transform="translate(-0.312500,0.000000)" /><path
   style="fill:url(#linearGradient631);fill-rule:evenodd;stroke:none;stroke-opacity:1;stroke-width:1pt;stroke-linejoin:miter;stroke-linecap:butt;fill-opacity:1;"
   d="M 17.1875 20.9374 C 17.1875 20.9374 15.9375 24.6874 18.75 27.1874 C 21.5625 29.6874 17.8125 24.0624 17.1875 20.9374 z "
   id="path630"
   transform="translate(-0.312500,0.000000)" /></g></g></svg>
