<?xml version="1.0" encoding="UTF-8" standalone="no"?>
<!DOCTYPE svg PUBLIC "-//W3C//DTD SVG 20010904//EN"
"http://www.w3.org/TR/2001/REC-SVG-20010904/DTD/svg10.dtd">
<!-- Created with Inkscape (http://www.inkscape.org/) -->
<svg
   id="svg637"
   sodipodi:version="0.32"
   width="48pt"
   height="48pt"
   sodipodi:docbase="/home/mula/Desktop/Mis Iconos/48x48"
   sodipodi:docname="home-toolbar.svg"
   xmlns="http://www.w3.org/2000/svg"
   xmlns:sodipodi="http://sodipodi.sourceforge.net/DTD/sodipodi-0.dtd"
   xmlns:xlink="http://www.w3.org/1999/xlink"
   xmlns:inkscape="http://www.inkscape.org/namespaces/inkscape"
   inkscape:version="0.37">
  <defs
     id="defs639">
    <linearGradient
       id="linearGradient672">
      <stop
         style="stop-color:#ffffff;stop-opacity:0.992157;"
         offset="0.000000"
         id="stop673" />
      <stop
         style="stop-color:#3f0d00;stop-opacity:1;"
         offset="1.000000"
         id="stop674" />
    </linearGradient>
    <linearGradient
       id="linearGradient663">
      <stop
         style="stop-color:#ffb700;stop-opacity:1;"
         offset="0.000000"
         id="stop664" />
      <stop
         style="stop-color:#ffffff;stop-opacity:0;"
         offset="1.000000"
         id="stop665" />
    </linearGradient>
    <linearGradient
       id="linearGradient650">
      <stop
         style="stop-color:#820000;stop-opacity:0.992157;"
         offset="0.000000"
         id="stop651" />
      <stop
         style="stop-color:#eddd00;stop-opacity:0.521569;"
         offset="1.000000"
         id="stop652" />
    </linearGradient>
    <linearGradient
       xlink:href="#linearGradient650"
       id="linearGradient653"
       x1="24.4638729"
       y1="41.5107384"
       x2="25.7656593"
       y2="21.4785004"
       gradientUnits="userSpaceOnUse"
       spreadMethod="pad"
       gradientTransform="scale(1.382029,0.723574)" />
    <linearGradient
       xlink:href="#linearGradient663"
       id="linearGradient662"
       x1="37.8630333"
       y1="41.4659500"
       x2="35.1832123"
       y2="69.7389984"
       gradientUnits="userSpaceOnUse"
       spreadMethod="pad"
       gradientTransform="scale(0.896091,1.115958)" />
    <linearGradient
       xlink:href="#linearGradient663"
       id="linearGradient667"
       x1="76.0363464"
       y1="32.4178200"
       x2="75.5171967"
       y2="52.2799377"
       gradientUnits="userSpaceOnUse"
       spreadMethod="pad"
       gradientTransform="scale(0.802339,1.246356)" />
    <linearGradient
       xlink:href="#linearGradient672"
       id="linearGradient671"
       x1="56.5476303"
       y1="71.8326035"
       x2="57.0013962"
       y2="71.1855392"
       gradientUnits="userSpaceOnUse"
       gradientTransform="scale(1.027411,0.973321)"
       spreadMethod="pad" />
    <radialGradient
       xlink:href="#linearGradient672"
       id="radialGradient675"
       cx="56.6728058"
       cy="71.4012299"
       fx="56.6728058"
       fy="71.4012299"
       r="1.28315270"
       gradientUnits="userSpaceOnUse"
       gradientTransform="scale(1.027411,0.973321)"
       spreadMethod="pad" />
  </defs>
  <sodipodi:namedview
     id="base"
     inkscape:zoom="9.10399981"
     inkscape:cx="24.4987892"
     inkscape:cy="23.7149946"
     inkscape:window-width="1014"
     inkscape:window-height="696"
     inkscape:window-x="0"
     inkscape:window-y="0" />
  <path
     style="fill:#000000;fill-rule:evenodd;stroke:none;stroke-opacity:1;stroke-width:1pt;stroke-linejoin:miter;stroke-linecap:butt;fill-opacity:0.382353;"
     d="M 7.5786975 29.253184 C 7.3729179 28.635892 8.5289576 38.886914 8.7346667 45.985236 C 10.483579 47.322589 25.242932 56.097142 26.785982 56.30286 C 28.329133 56.508637 29.690463 56.817224 29.872263 56.405749 C 31.518202 55.994254 48.056646 53.095667 48.982525 51.758313 C 49.908384 50.42094 51.505824 36.20193 53.460671 33.162415 C 54.489418 34.911264 60.250407 35.219849 59.221639 29.355992 C 59.221639 25.138156 54.664581 6.5481437 49.829532 4.5935904 C 49.212199 3.4619445 19.820722 3.2259701 18.689092 3.5346384 C 7.9901863 5.1805916 3.1551311 21.949065 3.1551311 24.726661 C 2.7436363 27.710114 3.1551311 30.899123 7.5786975 29.253184 z "
     id="path766"
     sodipodi:nodetypes="ccccccccccc" />
  <path
     style="fill:#2e0000;fill-rule:evenodd;stroke:none;stroke-opacity:1;stroke-width:1pt;stroke-linejoin:miter;stroke-linecap:butt;fill-opacity:1;"
     d="M 5.0495462 27.38958 C 4.8437666 26.772328 6.7984585 35.825275 7.0041677 42.923595 C 8.7530802 44.260948 22.84686 52.902421 24.38991 53.108137 C 25.933041 53.313915 25.830172 53.622521 27.476171 53.211006 C 29.122151 52.799531 44.861924 50.433431 45.787802 49.096058 C 46.713681 47.758705 48.976671 34.338325 50.931498 31.298831 C 51.960266 33.047659 57.721254 33.356265 56.692487 27.492408 C 56.692487 23.274571 50.00564 4.5514694 45.170611 2.5969162 C 44.553258 1.465236 17.291586 1.3623814 16.159941 1.6710498 C 5.461035 3.317005 0.6259797 20.085461 0.6259797 22.863076 C 0.21448487 25.846509 0.6259797 29.035539 5.0495462 27.38958 z "
     id="path647"
     sodipodi:nodetypes="ccccccccccc" />
  <path
     style="fill:#f1e36c;fill-rule:evenodd;stroke:none;stroke-opacity:1;stroke-width:1pt;stroke-linejoin:miter;stroke-linecap:butt;fill-opacity:1;"
     d="M 26.72807 27.726428 C 25.253513 34.516142 24.93863 42.203454 24.595707 50.227654 C 19.554808 47.312913 14.616876 44.295284 9.4731689 41.483353 C 9.1302486 35.516608 8.6844413 30.831356 7.5185474 26.304853 C 12.628005 26.339148 20.281258 27.383505 26.72807 27.726428 z "
     id="path641"
     sodipodi:nodetypes="ccccc" />
  <path
     style="fill:#f1e36c;fill-rule:evenodd;stroke:none;stroke-opacity:1;stroke-width:1pt;stroke-linejoin:miter;stroke-linecap:butt;fill-opacity:1;"
     d="M 27.317182 27.595418 C 25.774051 34.693759 25.315789 50.330543 25.315789 50.330543 C 31.453935 49.130334 37.592142 47.930186 43.730288 46.729958 C 45.298321 39.329246 46.604335 32.976109 49.481842 27.670507 C 47.645755 21.924988 45.547769 17.488997 43.318793 12.791031 C 38.857704 17.604257 37.015623 20.977104 33.20926 26.052226 C 30.328575 28.574561 28.233586 28.346898 27.317182 27.595418 z "
     id="path642"
     sodipodi:nodetypes="ccccccc" />
  <path
     style="fill:url(#linearGradient667);fill-rule:evenodd;stroke:none;stroke-opacity:1;stroke-width:1pt;stroke-linejoin:miter;stroke-linecap:butt;fill-opacity:1;"
     d="M 27.317182 27.412974 C 25.774051 34.511314 25.315789 50.148098 25.315789 50.148098 C 31.453935 48.94787 37.592142 47.747721 43.730288 46.547513 C 45.298321 39.146801 46.604335 32.793645 49.481842 27.488043 C 47.645755 21.742524 45.547769 17.30653 43.318793 12.608565 C 38.857724 17.421794 37.015642 20.794639 33.20928 25.869782 C 30.328575 28.392117 28.233606 28.164454 27.317182 27.412974 z "
     id="path666"
     sodipodi:nodetypes="ccccccc" />
  <path
     style="fill:#2e0000;fill-rule:evenodd;stroke:none;stroke-opacity:1;stroke-width:1pt;stroke-linejoin:miter;stroke-linecap:butt;fill-opacity:1;"
     d="M 29.22502 49.71327 C 29.430817 43.609359 30.356676 37.711327 32.002635 31.40172 C 35.363186 30.681559 38.003637 30.57869 40.849784 30.784467 C 39.821037 36.13386 38.586593 42.615009 38.380814 47.861614 C 35.226041 48.410233 32.379854 48.958933 29.22502 49.71327 z "
     id="path643"
     sodipodi:nodetypes="ccccc" />
  <path
     style="fill:url(#linearGradient662);fill-rule:evenodd;stroke:none;stroke-opacity:1;stroke-width:1pt;stroke-linejoin:miter;stroke-linecap:butt;fill-opacity:1;"
     d="M 26.72807 27.361519 C 25.253513 34.151234 24.93861 41.838526 24.595707 49.862725 C 19.554808 46.948006 14.616874 43.930377 9.4731649 41.118445 C 9.1302445 35.1517 8.6844393 30.466447 7.5185413 25.939944 C 12.628001 25.97424 20.281258 27.018597 26.72807 27.361519 z "
     id="path661"
     sodipodi:nodetypes="ccccc" />
  <path
     style="fill:#ffffff;fill-rule:evenodd;stroke:none;stroke-opacity:1;stroke-width:1pt;stroke-linejoin:miter;stroke-linecap:butt;fill-opacity:1;"
     d="M 11.736389 28.624064 C 11.839279 32.22469 11.736389 36.13386 11.839279 40.248909 C 14.479667 41.174747 17.737394 41.997737 20.377791 42.923595 C 21.029358 40.797528 21.269393 33.116231 20.172073 28.521236 C 17.394476 27.972536 14.20539 28.246885 11.736389 28.624064 z "
     id="path644"
     sodipodi:nodetypes="ccccc" />
  <path
     style="fill:#cc4c4c;fill-rule:evenodd;stroke:none;stroke-opacity:1;stroke-width:1pt;stroke-linejoin:miter;stroke-linecap:butt;fill-opacity:1;"
     d="M 2.7863387 23.891823 C 10.947732 22.965964 18.903291 23.788954 27.887687 25.023479 C 30.665282 16.587804 37.660714 8.1521146 42.084349 5.065847 C 33.099954 4.8601378 24.11562 4.6543582 15.131256 4.448649 C 7.0041677 10.621114 3.7122051 18.028034 2.7863387 23.891823 z "
     id="path645"
     sodipodi:nodetypes="ccccc" />
  <path
     style="fill:#daa244;fill-rule:evenodd;stroke:none;stroke-opacity:1;stroke-width:1pt;stroke-linejoin:miter;stroke-linecap:butt;fill-opacity:1;"
     d="M 28.607828 24.406207 C 28.504938 25.434954 29.842312 26.772328 31.796918 25.023479 C 33.442877 22.451602 42.70154 9.2837586 43.52451 9.5923586 C 44.34754 9.9009585 50.82863 24.406287 52.577457 29.652811 C 53.914891 30.270003 55.252244 29.549983 55.149356 27.080994 C 54.634992 24.611984 48.668286 6.4032022 44.45045 4.4485806 C 39.409623 7.6376666 35.60326 10.723934 28.607828 24.406207 z "
     id="path648"
     sodipodi:nodetypes="ccccccc" />
  <path
     style="fill:url(#linearGradient653);fill-rule:evenodd;stroke:none;stroke-opacity:1;stroke-width:1pt;stroke-linejoin:miter;stroke-linecap:butt;fill-opacity:1;"
     d="M 2.7863387 23.891823 C 10.947732 22.965964 18.903291 23.788954 27.887687 25.023479 C 30.665282 16.587804 37.660714 8.1521146 42.084349 5.065847 C 33.099954 4.8601378 24.11562 4.6543582 15.131256 4.448649 C 7.0041677 10.621114 3.7122051 18.028034 2.7863387 23.891823 z "
     id="path649"
     sodipodi:nodetypes="ccccc" />
  <path
     style="font-size:12;fill:none;fill-rule:evenodd;stroke:#000000;stroke-width:1.10099;stroke-linejoin:round;"
     d="M 11.709756 28.421163 C 12.277235 32.349604 12.189912 36.278105 11.840744 40.206547 C 14.677948 41.166862 17.515221 42.127117 20.352445 43.087412 C 20.745273 38.504244 21.007172 33.920996 20.352365 28.944981 C 17.471494 28.770321 14.590627 28.595742 11.709756 28.421163 z "
     id="path658"
     sodipodi:nodetypes="ccccc" />
  <path
     style="font-size:12;fill:none;fill-rule:evenodd;stroke:#000000;stroke-width:1.10099;stroke-linejoin:round;"
     d="M 15.90017 28.944981 C 15.90017 29.206899 16.816818 38.635174 15.507273 40.992263 "
     id="path659" />
  <path
     style="font-size:12;fill:none;fill-rule:evenodd;stroke:#000000;stroke-width:1.17963;"
     d="M 12.495483 33.790087 L 20.352445 35.49245 "
     id="path660" />
  <path
     style="fill:#b62020;fill-rule:evenodd;stroke:none;stroke-opacity:1;stroke-width:1pt;stroke-linejoin:miter;stroke-linecap:butt;fill-opacity:1;"
     d="M 30.534533 49.249013 C 30.721785 43.69517 31.564206 37.935792 33.061837 32.194798 C 36.119534 31.539529 37.343479 31.445912 39.933178 31.633165 C 38.997122 36.500499 37.873914 42.921383 37.686682 47.695181 C 34.816195 48.194358 33.405061 48.562665 30.534533 49.249013 z "
     id="path668"
     sodipodi:nodetypes="ccccc" />
  <path
     style="font-size:12;fill-rule:evenodd;stroke-width:1pt;fill:url(#radialGradient675);"
     d="M 37.637642 41.516101 C 37.637642 42.166603 37.080353 42.694585 36.393663 42.694585 C 35.706954 42.694585 35.149604 42.166603 35.149604 41.516101 C 35.149604 40.865518 35.706954 40.337536 36.393663 40.337536 C 37.080353 40.337536 37.637642 40.865518 37.637642 41.516101 z "
     id="path670" />
  <path
     style="font-size:12;fill:none;fill-rule:evenodd;stroke:#2e0000;stroke-width:1.57283;"
     d="M 10.100431 8.4451516 C 10.100431 8.4451516 25.225894 7.0470266 36.919412 10.224659 "
     id="path703"
     sodipodi:nodetypes="cc" />
  <path
     style="font-size:12;fill:none;fill-rule:evenodd;stroke:#2e0000;stroke-width:1.57283;"
     d="M 4.2536213 17.596666 C 4.2536213 17.596666 11.371473 14.292015 31.19972 18.740624 "
     id="path704"
     sodipodi:nodetypes="cc" />
  <path
     style="font-size:12;fill:none;fill-rule:evenodd;stroke:#2e0000;stroke-width:1.57283;"
     d="M 19.379031 24.460317 C 19.887424 24.460317 21.793955 13.783549 34.63164 4.2507746 "
     id="path705"
     sodipodi:nodetypes="cc" />
  <path
     style="font-size:12;fill:none;fill-rule:evenodd;stroke:#2e0000;stroke-width:1.57283;stroke-opacity:0.999764;"
     d="M 9.5919648 24.206142 C 11.625643 15.308822 20.522981 3.9965417 24.971659 3.8693941 "
     id="path706"
     sodipodi:nodetypes="cc" />
</svg>
