<?xml version="1.0" encoding="UTF-8" standalone="no"?>
<!DOCTYPE svg PUBLIC "-//W3C//DTD SVG 20010904//EN"
"http://www.w3.org/TR/2001/REC-SVG-20010904/DTD/svg10.dtd">
<!-- Created with Sodipodi ("http://www.sodipodi.com/") -->
<svg
   id="svg596"
   sodipodi:version="0.32"
   width="72pt"
   height="72pt"
   sodipodi:docbase="/home/zeus/desktop/icons/gartoon/svg"
   sodipodi:docname="/home/zeus/desktop/icons/gartoon/svg/gnome-mime-image-x-applix-graphic.svg"
   xmlns="http://www.w3.org/2000/svg"
   xmlns:sodipodi="http://sodipodi.sourceforge.net/DTD/sodipodi-0.dtd"
   xmlns:xlink="http://www.w3.org/1999/xlink">
  <defs
     id="defs598">
    <linearGradient
       id="linearGradient612">
      <stop
         style="stop-color:#7fa8e3;stop-opacity:0.741176;"
         offset="0.000000"
         id="stop613" />
      <stop
         style="stop-color:#ffffff;stop-opacity:0;"
         offset="1.000000"
         id="stop614" />
    </linearGradient>
    <linearGradient
       id="linearGradient626">
      <stop
         style="stop-color:#ff0047;stop-opacity:1;"
         offset="0.000000"
         id="stop627" />
      <stop
         style="stop-color:#ab322d;stop-opacity:0;"
         offset="1.000000"
         id="stop628" />
    </linearGradient>
    <linearGradient
       id="linearGradient618">
      <stop
         style="stop-color:#956d47;stop-opacity:1;"
         offset="0.000000"
         id="stop619" />
      <stop
         style="stop-color:#ab322d;stop-opacity:0;"
         offset="1.000000"
         id="stop620" />
    </linearGradient>
    <linearGradient
       id="linearGradient614">
      <stop
         style="stop-color:#000;stop-opacity:1;"
         offset="0"
         id="stop615" />
      <stop
         style="stop-color:#fff;stop-opacity:1;"
         offset="1"
         id="stop616" />
    </linearGradient>
    <linearGradient
       xlink:href="#linearGradient618"
       id="linearGradient617"
       y2="0.52343726"
       x2="1.07843077"
       y1="0.57031226"
       x1="-0.19608469"
       spreadMethod="pad"
       gradientUnits="objectBoundingBox" />
    <linearGradient
       xlink:href="#linearGradient626"
       id="linearGradient625"
       x1="42.9995728"
       y1="77.3980103"
       x2="28.5382881"
       y2="63.0152588"
       gradientUnits="userSpaceOnUse"
       spreadMethod="pad"
       gradientTransform="matrix(0.934001,0.000000,0.000000,1.070663,-1.516226e-6,-1.716230e-7)" />
    <linearGradient
       xlink:href="#linearGradient612"
       id="linearGradient636"
       x1="16.4110699"
       y1="10.6072874"
       x2="24.6243172"
       y2="61.6665344"
       gradientUnits="userSpaceOnUse"
       spreadMethod="pad" />
  </defs>
  <sodipodi:namedview
     id="base" />
  <g
     id="g898"
     transform="translate(-1.146498,1.146498)">
    <path
       style="fill:#000000;fill-rule:evenodd;stroke:none;stroke-opacity:1;stroke-width:1pt;stroke-linejoin:miter;stroke-linecap:butt;fill-opacity:0.301471;"
       d="M 12.8163 74.753 C 10.3856 73.6481 7.07107 70.1126 8.83884 65.2512 C 9.72267 59.948 25.6326 13.1021 29.1682 10.8924 C 31.3778 8.90368 34.582 8.13026 39.1119 9.34561 C 42.8684 10.2295 76.6769 19.0684 78.6656 20.8361 C 80.6544 22.6039 82.2012 24.0402 80.6544 27.9072 C 79.5496 29.8959 66.4017 74.532 66.1808 77.4047 C 65.2969 80.4983 62.7558 84.2548 58.5573 84.0338 C 54.3589 83.8128 15.9099 75.4159 12.8163 74.753 z "
       id="path794"
       sodipodi:nodetypes="ccccccccc"
       transform="matrix(1.114903,0.000000,0.000000,1.114903,1.287023,-5.035753)" />
    <path
       style="fill:#3d4e67;fill-rule:evenodd;stroke:none;stroke-opacity:1;stroke-width:1pt;stroke-linejoin:miter;stroke-linecap:butt;fill-opacity:1;"
       d="M 12.8163 74.753 C 10.3856 73.6481 7.07107 70.1126 8.83884 65.2512 C 9.72267 59.948 25.6326 13.1021 29.1682 10.8924 C 31.3778 8.90368 34.582 8.13026 39.1119 9.34561 C 42.8684 10.2295 76.6769 19.0684 78.6656 20.8361 C 80.6544 22.6039 82.2012 24.0402 80.6544 27.9072 C 79.5496 29.8959 66.4017 74.532 66.1808 77.4047 C 65.2969 80.4983 62.7558 84.2548 58.5573 84.0338 C 54.3589 83.8128 15.9099 75.4159 12.8163 74.753 z "
       id="path895"
       sodipodi:nodetypes="ccccccccc"
       transform="matrix(1.114903,0.000000,0.000000,1.114903,-1.570116,-9.607182)" />
    <path
       style="fill:#ffffff;fill-rule:evenodd;stroke:none;stroke-opacity:1;stroke-width:1pt;stroke-linejoin:miter;stroke-linecap:butt;fill-opacity:1;"
       d="M 17.8987 70.9965 C 15.3576 70.3336 11.7114 69.6706 13.0373 65.6932 C 15.468 55.9705 27.8424 18.6264 33.1456 13.986 C 34.361 12.8811 38.4489 12.4392 46.1829 14.8699 C 55.0218 17.5215 72.9204 23.4877 74.6882 24.3716 C 76.4559 25.2555 77.1189 25.2555 75.793 29.233 C 73.8043 33.2105 64.9655 67.24 62.7557 72.9852 C 61.209 77.0732 60.8775 78.9514 58.2258 78.9514 "
       id="path896"
       sodipodi:nodetypes="cccccccs"
       transform="matrix(1.114903,0.000000,0.000000,1.114903,-1.570116,-9.607182)" />
    <path
       style="fill:url(#linearGradient636);fill-rule:evenodd;stroke:none;stroke-opacity:1;stroke-width:1pt;stroke-linejoin:miter;stroke-linecap:butt;fill-opacity:1;"
       d="M 28.75 13.75 C 28.75 13.75 31.875 7.49995 39.6875 9.37495 C 47.5 11.25 78.125 19.375 77.8125 21.875 C 77.5 24.375 71.875 39.0625 71.5625 40.3125 C 71.25 41.5625 42.5 40.9375 31.5625 47.5 C 20.625 54.0625 12.5 59.6875 12.5 59.6875 C 12.5 59.6875 23.75 24.6875 28.75 13.75 z "
       id="path636"
       transform="matrix(0.946780,0.000000,0.000000,0.946780,6.111789,-0.736980)" />
  </g>
  <path
     style="font-size:12;fill:#470000;fill-rule:evenodd;stroke-width:1pt;"
     d="M 67.911 66.4866 C 67.911 68.1832 66.4512 69.56 64.6525 69.56 C 62.8537 69.56 61.3939 68.1832 61.3939 66.4866 C 61.3939 64.7901 62.8537 63.4132 64.6525 63.4132 C 66.4512 63.4132 67.911 64.7901 67.911 66.4866 z "
     id="path613"
     transform="matrix(0.665098,0.000000,0.000000,0.665098,26.75834,4.099827)" />
  <path
     style="font-size:12;fill:#470000;fill-rule:evenodd;stroke-width:1pt;"
     d="M 61.2458 74.2998 C 59.6905 72.5223 57.1726 73.4851 56.3579 74.7441 C 55.4692 77.8545 56.8764 80.6687 60.5793 79.3357 C 64.2822 78.0026 65.6152 75.929 65.6152 76.0771 C 65.6152 76.2253 62.6529 84.0754 58.2094 84.6678 C 53.7659 85.2603 51.322 85.4084 46.4342 85.4825 C 41.3983 86.3712 38.9544 86.2971 38.9544 86.2971 L 45.1752 77.4102 C 45.1752 77.4102 46.8045 76.5215 49.4706 72.078 C 52.1367 67.6346 56.8763 66.5977 59.2462 68.0789 C 61.3939 68.9675 62.5788 70.1525 63.1713 72.4483 C 63.0232 74.9662 62.5788 75.929 61.2458 74.2998 z "
     id="path610"
     sodipodi:nodetypes="cccccccccccc"
     transform="matrix(0.665098,0.000000,0.000000,0.665098,26.75834,4.099827)" />
  <path
     style="font-size:12;fill:#230000;fill-opacity:0.99899;fill-rule:evenodd;stroke-width:1pt;"
     d="M 37.9176 76.4474 C 40.1393 77.0399 37.5473 80.2243 36.1402 78.0026 C 35.0293 79.5578 35.5477 75.7809 35.5477 75.7809 L 30.808 85.7046 C 30.808 85.7046 38.9544 88.667 42.0648 84.3716 C 45.1752 80.0763 45.5456 77.8545 43.8423 76.0771 C 41.8426 73.3371 40.0652 74.4479 39.3247 74.8922 C 38.5841 75.3366 38.2879 75.6328 37.9176 76.4474 z "
     id="path609"
     sodipodi:nodetypes="cccccccc"
     transform="matrix(0.665098,0.000000,0.000000,0.665098,26.95536,4.099827)" />
  <path
     style="font-size:12;fill:#230000;fill-rule:evenodd;stroke-width:1pt;"
     d="M 36.1402 62.0062 C 36.1402 62.0062 37.0288 56.674 36.7326 53.8598 C 36.2883 47.787 23.5503 -3.31281 14.071 5.57413 C 3.11042 9.86949 16.1446 58.8957 17.7739 61.7099 C 19.4031 64.5241 21.773 66.5977 21.773 66.5977 C 21.773 66.5977 18.07 83.483 31.9189 85.8527 C 36.9549 76.5215 40.5087 72.8006 39.695 68.5973 C 39.2506 66.2275 38.6582 64.0057 36.1402 62.0062 z "
     id="path608"
     sodipodi:nodetypes="cccccccc"
     transform="matrix(0.665098,0.000000,0.000000,0.665098,26.75834,4.099827)" />
  <path
     style="font-size:12;fill:#f2962c;fill-rule:evenodd;stroke-width:1pt;"
     d="M 19.4031 58.3033 C 22.0692 55.0448 25.0315 52.6749 32.5854 53.4155 C 30.2156 40.2331 21.773 4.68543 15.7002 7.94398 C 8.88697 9.12891 15.2559 48.8239 19.4031 58.3033 z "
     id="path600"
     sodipodi:nodetypes="cccc"
     transform="matrix(0.665098,0.000000,0.000000,0.665098,26.75834,4.099827)" />
  <path
     style="font-size:12;fill:#8b8b8b;fill-rule:evenodd;stroke-width:1pt;"
     d="M 19.8475 59.6363 C 19.8475 59.6363 21.1805 63.9316 24.7353 64.2279 C 26.3646 61.7099 30.0675 61.2656 33.1779 61.4137 C 33.9185 58.5995 34.5109 55.1928 33.326 55.0447 C 31.8449 54.156 23.5504 52.5268 19.8475 59.6363 z "
     id="path601"
     sodipodi:nodetypes="ccccc"
     transform="matrix(0.665098,0.000000,0.000000,0.665098,26.75834,4.099827)" />
  <path
     style="font-size:12;fill:#65532d;fill-rule:evenodd;stroke-width:1pt;"
     d="M 24.8834 66.4496 C 25.624 63.1911 31.2524 60.9694 33.7703 63.6354 C 39.8431 67.0421 37.177 75.4847 34.5109 75.6328 C 33.7703 86.149 40.8799 80.3724 40.7318 78.1508 C 46.0639 77.4102 41.7686 84.9641 38.2138 84.5197 C 33.326 85.2603 20.2918 80.8169 24.8834 66.4496 z "
     id="path602"
     sodipodi:nodetypes="cccccc"
     transform="matrix(0.665098,0.000000,0.000000,0.665098,26.75834,4.099827)" />
  <path
     style="font-size:12;fill:#bc0000;fill-rule:evenodd;stroke-width:1pt;"
     d="M 44.5828 81.2612 C 44.7309 81.4093 46.6564 81.2612 47.6932 79.4838 C 48.73 77.7064 52.2848 70.4487 54.8028 70.3006 C 60.8755 68.0789 60.8755 72.2261 60.8755 72.2261 C 60.8755 72.2261 55.2471 70.1525 54.6546 73.7073 C 54.0622 77.2621 53.0254 79.3357 59.8386 82.1499 C 55.9877 83.4829 43.966 83.74 43.2253 83.74 C 42.4847 83.74 44.7309 81.1131 44.5828 81.2612 z "
     id="path603"
     sodipodi:nodetypes="cccccccc"
     transform="matrix(0.665098,0.000000,0.000000,0.665098,26.75834,4.099827)" />
  <path
     style="font-size:12;fill:#470000;fill-rule:evenodd;stroke-width:1pt;"
     d="M 46.6564 67.6346 C 48.4338 64.9685 54.5806 66.3015 57.3947 65.7091 C 60.8014 64.8204 59.02 58.5954 55.169 58.5955 C 52.5142 58.0648 46.9527 58.1551 46.6564 67.6346 z "
     id="path611"
     sodipodi:nodetypes="cccc"
     transform="matrix(0.665098,0.000000,0.000000,0.665098,26.75834,4.099827)" />
  <path
     style="font-size:12;fill:#bc0000;fill-rule:evenodd;stroke-width:1pt;"
     d="M 48.1376 64.8204 C 48.1376 64.8204 54.5065 64.2279 56.1358 64.2279 C 58.0613 64.6397 58.1915 61.7181 56.5801 60.6731 C 53.766 58.7476 49.9149 58.5995 48.1376 64.8204 z "
     id="path604"
     sodipodi:nodetypes="cccc"
     transform="matrix(0.665098,0.000000,0.000000,0.665098,26.75834,4.099827)" />
  <path
     style="font-size:12;fill:#bc0000;fill-rule:evenodd;stroke-width:1pt;"
     d="M 66.8001 66.5977 C 66.8001 67.7424 65.838 68.6714 64.6524 68.6714 C 63.4669 68.6714 62.5048 67.7424 62.5048 66.5977 C 62.5048 65.4531 63.4669 64.5241 64.6524 64.5241 C 65.838 64.5241 66.8001 65.4531 66.8001 66.5977 z "
     id="path606"
     transform="matrix(0.665098,0.000000,0.000000,0.665098,26.75834,4.099827)" />
  <path
     style="font-size:12;fill:url(#linearGradient617);fill-rule:evenodd;stroke-width:1pt;"
     d="M 19.4031 58.3033 C 22.0692 55.0448 25.0315 52.6749 32.5854 53.4155 C 30.2156 40.2331 21.773 4.68543 15.7002 7.94398 C 8.88697 9.12891 15.2559 48.8239 19.4031 58.3033 z "
     id="path621"
     sodipodi:nodetypes="cccc"
     transform="matrix(0.665098,0.000000,0.000000,0.665098,26.75834,4.099827)" />
  <path
     style="font-size:12;fill:#f2d0a8;fill-rule:evenodd;stroke-width:1pt;"
     d="M 28.4382 52.5267 C 25.1369 52.6775 14.6017 8.00417 18.6625 10.462 C 19.6179 11.1298 34.3749 52.522 28.4382 52.5267 z "
     id="path622"
     sodipodi:nodetypes="css"
     transform="matrix(0.665098,0.000000,0.000000,0.665098,26.75834,4.099827)" />
  <path
     style="font-size:12;fill:#f2f2f2;fill-rule:evenodd;stroke-width:1pt;"
     d="M 30.5118 54.4523 L 31.1043 61.2656 L 27.6976 62.0062 L 26.2165 54.6003 C 26.2165 54.6003 30.2156 54.1561 30.5118 54.4523 z "
     id="path623"
     sodipodi:nodetypes="ccccc"
     transform="matrix(0.665098,0.000000,0.000000,0.665098,26.75834,4.099827)" />
  <path
     style="font-size:12;fill:url(#linearGradient625);fill-rule:nonzero;stroke-width:1pt;"
     d="M 24.8834 66.4496 C 25.624 63.1911 31.2524 60.9694 33.7703 63.6354 C 39.8431 67.0421 37.177 75.4847 34.5109 75.6328 C 33.7703 86.149 40.8799 80.3724 40.7318 78.1508 C 46.0639 77.4102 41.7686 84.9641 38.2138 84.5197 C 33.326 85.2603 20.2918 80.8169 24.8834 66.4496 z "
     id="path624"
     sodipodi:nodetypes="cccccc"
     transform="matrix(0.665098,0.000000,0.000000,0.665098,26.75834,4.099827)" />
  <path
     style="font-size:12;fill:none;fill-rule:evenodd;stroke:#3d4e67;stroke-width:1.3625;stroke-linejoin:round;stroke-opacity:1;"
     d="M 31.8153 50.4459 L 31.8153 55.6051 L 36.9745 55.6051 L 36.9745 50.4459 L 31.8153 50.4459 z "
     id="path1064" />
  <path
     style="font-size:12;fill:none;fill-rule:evenodd;stroke:#3d4e67;stroke-width:1.3625;stroke-linejoin:round;stroke-opacity:1;"
     d="M 31.8153 50.4459 L 31.8153 55.6051 L 36.9745 55.6051 L 36.9745 50.4459 L 31.8153 50.4459 z "
     id="path1065"
     transform="translate(-4.299364,-21.21019)" />
  <path
     style="font-size:12;fill:none;fill-rule:evenodd;stroke:#3d4e67;stroke-width:1pt;stroke-opacity:1;"
     d="M 32.3885 32.6752 L 38.4076 42.9936 L 34.1083 50.1592 "
     id="path1066" />
  <path
     style="font-size:12;fill:none;fill-rule:evenodd;stroke:#3d4e67;stroke-width:1.3625;stroke-linejoin:round;stroke-opacity:1;"
     d="M 31.8153 50.4459 L 31.8153 55.6051 L 36.9745 55.6051 L 36.9745 50.4459 L 31.8153 50.4459 z "
     id="path1072"
     transform="matrix(-0.977600,0.424534,0.398324,0.917245,70.71647,-27.10711)" />
  <path
     style="font-size:12;fill:none;fill-rule:evenodd;stroke:#3d4e67;stroke-width:1.3625;stroke-linejoin:round;stroke-opacity:1;"
     d="M 31.8153 50.4459 L 31.8153 55.6051 L 36.9745 55.6051 L 36.9745 50.4459 L 31.8153 50.4459 z "
     id="path1073"
     transform="matrix(-0.977600,0.424534,0.398324,0.917245,64.75126,-47.52740)" />
  <path
     style="font-size:12;fill:none;fill-rule:evenodd;stroke:#3d4e67;stroke-width:1pt;stroke-opacity:1;"
     d="M 32.3885 32.6752 L 38.4076 42.9936 L 34.1083 50.1592 "
     id="path1074"
     transform="matrix(-0.977600,0.424534,0.398324,0.917245,68.99673,-26.24723)" />
  <path
     transform="matrix(0.974455,0.224584,-0.224584,0.974455,0.000000,0.000000)"
     style="font-size:13;font-weight:bold;fill:#3a4a62;fill-opacity:0.948813;stroke-width:1pt;font-family:Kid Kosmic;"
     d="M 66.8011 54.4081 C 66.7333 54.7466 66.5175 55.0259 66.1536 55.2459 C 65.8235 55.4575 65.4765 55.5633 65.1126 55.5633 C 64.6555 55.5633 64.3128 55.3221 64.0843 54.8397 C 63.9404 54.425 63.7923 54.0145 63.6399 53.6083 C 61.4733 53.6083 59.8144 54.1542 58.6634 55.2459 C 57.4954 56.3716 56.8945 57.4549 56.8606 58.4959 C 56.8352 59.5116 57.3684 60.2267 58.4602 60.6415 C 58.7226 60.743 59.0146 60.7938 59.3362 60.7938 C 60.4111 60.7938 61.8583 60.2733 63.678 59.2323 C 63.7034 59.1476 63.733 59.0292 63.7669 58.8768 C 63.5299 58.6483 63.1321 58.534 62.5735 58.534 C 61.541 58.534 60.6142 58.7456 59.7932 59.1688 C 59.3108 59.1265 59.0019 58.8599 58.8665 58.369 C 58.8411 58.2759 58.8284 58.187 58.8284 58.1024 C 58.8284 57.73 59.0273 57.3999 59.4251 57.1122 C 59.9244 56.5536 60.847 56.2743 62.1927 56.2743 C 62.5989 56.2743 63.111 56.3039 63.7288 56.3631 C 64.5413 56.4308 64.9856 56.4689 65.0618 56.4774 C 65.9674 56.9344 66.4202 57.4465 66.4202 58.0135 C 66.4202 58.2844 66.3398 58.661 66.179 59.1434 C 65.942 59.8882 65.6035 60.3876 65.1634 60.6415 C 64.2916 61.3016 63.2718 61.8348 62.1038 62.2411 C 60.9104 62.6558 59.7805 62.8631 58.7141 62.8631 C 57.1569 62.8631 55.9973 62.3723 55.2356 61.3905 C 54.5839 60.5441 54.2581 59.6131 54.2581 58.5975 C 54.2581 58.1489 54.3173 57.6919 54.4358 57.2264 C 54.9775 55.1359 56.3232 53.5448 58.4729 52.453 C 60.3011 51.5135 62.3873 51.0692 64.7317 51.12 C 65.5273 51.23 66.0774 51.5051 66.3821 51.9452 C 66.6276 52.3091 66.763 52.9142 66.7884 53.7606 C 66.8391 54.006 66.8434 54.2219 66.8011 54.4081 z M 44.5716 52.161 C 45.0371 51.7378 46.0696 51.3993 47.6692 51.1454 C 49.0065 50.9338 50.1787 50.8407 51.1858 50.8661 C 52.0068 50.8915 52.5865 51.065 52.9251 51.3866 C 52.9674 52.1568 52.9886 52.9312 52.9886 53.7098 C 52.9886 56.1981 52.7812 58.7583 52.3665 61.3905 C 52.2565 62.093 51.8925 62.5542 51.2747 62.7743 C 51.0462 62.8504 50.8515 62.8885 50.6907 62.8885 C 50.3522 62.8885 50.1279 62.7193 50.0179 62.3807 C 50.3733 61.1874 50.6103 60.0744 50.7288 59.0418 L 43.7337 60.2225 C 43.5983 60.4849 43.3486 61.0054 42.9846 61.784 C 42.8238 62.478 42.4091 62.8885 41.7405 63.0155 C 41.5712 63.0493 41.4485 63.0663 41.3723 63.0663 C 40.9661 63.0663 40.763 62.9055 40.763 62.5838 C 40.763 62.4907 40.7841 62.3934 40.8264 62.2918 C 42.4345 58.7456 43.6829 55.3687 44.5716 52.161 z M 50.3733 53.8495 C 50.2464 53.5532 49.8486 53.4051 49.18 53.4051 C 48.7399 53.4051 48.1982 53.4855 47.555 53.6463 C 46.8271 53.8325 46.3447 54.0441 46.1077 54.2811 C 45.803 55.3221 45.4137 56.4012 44.9397 57.5184 L 50.805 56.2616 C 50.7288 55.4575 50.5849 54.6535 50.3733 53.8495 z M 40.3567 60.8446 C 40.3567 61.2678 40.1536 61.6402 39.7473 61.9618 C 39.3496 62.2834 38.9221 62.4442 38.4651 62.4442 C 38.2958 62.4442 38.1393 62.4188 37.9954 62.368 C 37.5722 62.1987 37.3606 61.8983 37.3606 61.4667 C 37.3606 61.1704 37.4664 60.8827 37.678 60.6034 C 38.0843 60.0871 38.5921 59.829 39.2014 59.829 C 39.3792 59.829 39.5485 59.8586 39.7093 59.9178 C 40.1409 60.0786 40.3567 60.3876 40.3567 60.8446 z "
     id="path1230" />
</svg>
