New debian package release 15:7-2018-q2-7

4 jobs for new-release in 16 minutes and 59 seconds (queued for 4 seconds)
latest
Status Job ID Name Coverage
  Build
failed #126679
build

00:16:59

 
  Test
skipped #126681
autopkgtest
skipped #126680
lintian
skipped #126682
piuparts
 
Name Stage Failure
failed
build Build
make[1]: *** [debian/rules:92: override_dh_auto_build] Error 2
make[1]: Leaving directory '/tmp/building/package'
make: *** [debian/rules:71: build] Error 2
dpkg-buildpackage: error: debian/rules build subprocess returned exit status 2
+ cleanup
+ docker rm -f b5320ac693ebb5f71861133f986d5aae63728d874dc1164a31005603f8086937
b5320ac693ebb5f71861133f986d5aae63728d874dc1164a31005603f8086937
gbp:error: 'docker-build.sh registry.salsa.debian.org/salsa-ci-team/images/dockerbuilder:unstable' failed: it exited with 1
ERROR: Job failed: exit code 1