Bump up Standards-Version

1 job for master in 4 minutes and 55 seconds
latest
Status Job ID Name Coverage
  Deploy
failed #132889
pages

00:04:55

 
Name Stage Failure
failed
pages Deploy
pymongo.errors.ConfigurationError: Private key doesn't match certificate: [SSL: CA_MD_TOO_WEAK] ca md too weak (_ssl.c:2815)
E: pybuild pybuild:338: test: plugin distutils failed with: exit code=1: python2.7 setup.py test
dh_auto_test: pybuild --test -i python{version} -p 2.7 returned exit code 13
make: *** [debian/rules:8: build] Error 25
dpkg-buildpackage: error: debian/rules build subprocess returned exit status 2
debuild: fatal error at line 1182:
dpkg-buildpackage -us -uc -ui -i -I failed
gbp:error: 'debuild -i -I -uc -us' failed: it exited with 29
ERROR: Job failed: exit code 1