prepare debian release to experimental

5 jobs for debian/experimental in 7 minutes and 51 seconds (queued for 2 seconds)
latest
Status Job ID Name Coverage
  Build
failed #170899
build

00:07:51

 
  Test
skipped #170902
autopkgtest
skipped #170901
lintian
skipped #170903
piuparts
skipped #170900
reprotest
 
Name Stage Failure
failed
build Build
make[1]: *** [debian/rules:181: override_dh_auto_test] Error 2
make[1]: Leaving directory '/tmp/building/package'
make: *** [debian/rules:54: build] Error 2
dpkg-buildpackage: error: debian/rules build subprocess returned exit status 2
+ cleanup
+ docker rm -f 2ee1a940a360e669f9cbd386772033e15701f6ee2ae91491a86b00dc4f28e1af
2ee1a940a360e669f9cbd386772033e15701f6ee2ae91491a86b00dc4f28e1af
gbp:error: 'docker-build.sh registry.salsa.debian.org/salsa-ci-team/images/dockerbuilder:unstable' failed: it exited with 1
ERROR: Job failed: exit code 1