<?xml version="1.0" encoding="UTF-8" standalone="no"?>
<!-- Created with Sodipodi ("http://www.sodipodi.com/") -->
<svg
   xmlns:dc="http://purl.org/dc/elements/1.1/"
   xmlns:cc="http://web.resource.org/cc/"
   xmlns:rdf="http://www.w3.org/1999/02/22-rdf-syntax-ns#"
   xmlns:svg="http://www.w3.org/2000/svg"
   xmlns="http://www.w3.org/2000/svg"
   xmlns:sodipodi="http://sodipodi.sourceforge.net/DTD/sodipodi-0.dtd"
   xmlns:inkscape="http://www.inkscape.org/namespaces/inkscape"
   version="1"
   x="0"
   y="0"
   width="125"
   height="125"
   id="svg101"
   sodipodi:version="0.32"
   inkscape:version="0.45.1"
   sodipodi:docname="arginine.svg"
   sodipodi:docbase="/home/rusconi/devel/massxpert/data/pol-chem-defs/protein-1-letter"
   inkscape:output_extension="org.inkscape.output.svg.inkscape">
  <metadata
     id="metadata2238">
    <rdf:RDF>
      <cc:Work
         rdf:about="">
        <dc:format>image/svg+xml</dc:format>
        <dc:type
           rdf:resource="http://purl.org/dc/dcmitype/StillImage" />
      </cc:Work>
    </rdf:RDF>
  </metadata>
  <sodipodi:namedview
     inkscape:window-height="571"
     inkscape:window-width="745"
     inkscape:pageshadow="2"
     inkscape:pageopacity="0.0"
     guidetolerance="10.0"
     gridtolerance="10.0"
     objecttolerance="10.0"
     borderopacity="1.0"
     bordercolor="#666666"
     pagecolor="#ffffff"
     id="base"
     inkscape:zoom="3.024"
     inkscape:cx="62.5"
     inkscape:cy="62.5"
     inkscape:window-x="755"
     inkscape:window-y="0"
     inkscape:current-layer="svg101" />
  <defs
     id="defs103" />
  <path
     id="path378"
     style="font-size:26px;font-weight:bold;fill:#00ff00;stroke-width:1pt;font-family:Helvetica"
     d="M 40.392936,74.286103 L 65.596436,74.286103 C 75.120972,74.286103 79.223849,78.258151 79.223849,87.577185 C 79.223849,88.493812 79.223849,90.021522 79.077318,92.007546 C 78.930786,94.910196 78.930786,97.660075 78.930786,99.340557 C 78.930786,109.72899 79.516912,113.08995 82.301007,118.43694 L 105.89255,118.43694 L 105.89255,114.31212 C 102.52233,112.3261 101.20355,110.03453 101.20355,105.14586 C 100.61742,72.300079 100.0313,70.772369 86.403884,64.661526 C 98.419452,59.772852 104.42724,50.75936 104.42724,37.162736 C 104.42724,28.302014 101.49661,20.205148 96.368013,14.70539 C 91.53248,9.5111736 84.792039,7.0668367 75.707097,7.0668367 L 18.413238,7.0668367 L 18.413238,118.43694 L 40.392936,118.43694 L 40.392936,74.286103 z M 40.392936,55.189721 L 40.392936,26.163219 L 66.915218,26.163219 C 73.216065,26.163219 75.853629,26.774303 78.491192,29.065869 C 81.128756,31.357435 82.447538,35.176712 82.447538,40.370928 C 82.447538,45.717915 80.982225,49.995505 78.491192,52.28707 C 76.146691,54.425865 73.216065,55.189721 66.915218,55.189721 L 40.392936,55.189721 z " />
</svg>
