<?xml version="1.0" encoding="UTF-8" standalone="no"?>
<!-- Created with Sodipodi ("http://www.sodipodi.com/") -->
<svg
   xmlns:dc="http://purl.org/dc/elements/1.1/"
   xmlns:cc="http://web.resource.org/cc/"
   xmlns:rdf="http://www.w3.org/1999/02/22-rdf-syntax-ns#"
   xmlns:svg="http://www.w3.org/2000/svg"
   xmlns="http://www.w3.org/2000/svg"
   xmlns:sodipodi="http://sodipodi.sourceforge.net/DTD/sodipodi-0.dtd"
   xmlns:inkscape="http://www.inkscape.org/namespaces/inkscape"
   version="1"
   x="0"
   y="0"
   width="100pt"
   height="100pt"
   id="svg101"
   sodipodi:version="0.32"
   sodipodi:docname="lyxose.svg"
   sodipodi:docbase="/home/rusconi/devel/massxpert/data/pol-chem-defs/saccharide"
   inkscape:version="0.44.1">
  <metadata
     id="metadata38">
    <rdf:RDF>
      <cc:Work
         rdf:about="">
        <dc:format>image/svg+xml</dc:format>
        <dc:type
           rdf:resource="http://purl.org/dc/dcmitype/StillImage" />
      </cc:Work>
    </rdf:RDF>
  </metadata>
  <sodipodi:namedview
     id="base"
     inkscape:zoom="5.2689208"
     inkscape:cx="51.932023"
     inkscape:cy="58.38825"
     inkscape:window-width="1187"
     inkscape:window-height="933"
     inkscape:window-x="0"
     inkscape:window-y="30"
     inkscape:current-layer="svg101"
     showguides="true"
     inkscape:guide-bbox="true">
    <sodipodi:guide
       orientation="horizontal"
       position="71.562508"
       id="guide147" />
    <sodipodi:guide
       orientation="vertical"
       position="62.062045"
       id="guide3149" />
  </sodipodi:namedview>
  <defs
     id="defs103" />
  <path
     style="font-size:12px;fill:#84c48c;fill-rule:evenodd;stroke-width:0pt"
     d="M 6.2796001,6.742805 L 118.71786,6.742805 L 118.71786,118.76839 L 6.2796001,118.76839 L 6.2796001,6.742805 z "
     id="inner-frame" />
  <path
     style="font-size:12px;font-style:normal;font-weight:normal;fill:black;fill-opacity:1;stroke:none;stroke-width:1px;stroke-linecap:butt;stroke-linejoin:miter;stroke-opacity:1;font-family:Bitstream Vera Sans"
     d="M 65.473083,16.876682 L 65.473083,18.124729 C 65.074639,17.753643 64.648858,17.476299 64.19574,17.292698 C 63.746515,17.109112 63.268,17.017315 62.760193,17.017307 C 61.760189,17.017315 60.994565,17.323956 60.463318,17.937229 C 59.932066,18.546611 59.666441,19.429422 59.666443,20.585667 C 59.666441,21.738014 59.932066,22.620825 60.463318,23.234104 C 60.994565,23.84348 61.760189,24.148167 62.760193,24.148167 C 63.268,24.148167 63.746515,24.056371 64.19574,23.872776 C 64.648858,23.689184 65.074639,23.41184 65.473083,23.040745 L 65.473083,24.277073 C 65.059014,24.558323 64.619561,24.769261 64.154724,24.909885 C 63.693781,25.05051 63.2055,25.120823 62.68988,25.120823 C 61.365658,25.120823 60.32269,24.716526 59.560974,23.907932 C 58.799254,23.095434 58.418395,21.988013 58.418396,20.585667 C 58.418395,19.179422 58.799254,18.072002 59.560974,17.263401 C 60.32269,16.45091 61.365658,16.04466 62.68988,16.044651 C 63.213312,16.04466 63.705499,16.114972 64.166443,16.255589 C 64.63128,16.392316 65.066826,16.599347 65.473083,16.876682 M 67.312927,16.202854 L 68.496521,16.202854 L 68.496521,19.788792 L 72.797302,19.788792 L 72.797302,16.202854 L 73.980896,16.202854 L 73.980896,24.950901 L 72.797302,24.950901 L 72.797302,20.784885 L 68.496521,20.784885 L 68.496521,24.950901 L 67.312927,24.950901 L 67.312927,16.202854 M 79.887146,17.005589 C 79.027767,17.005596 78.344174,17.325909 77.836365,17.966526 C 77.332456,18.607157 77.080503,19.480203 77.080505,20.585667 C 77.080503,21.687232 77.332456,22.558325 77.836365,23.198948 C 78.344174,23.839574 79.027767,24.159886 79.887146,24.159885 C 80.746515,24.159886 81.426202,23.839574 81.926208,23.198948 C 82.430107,22.558325 82.68206,21.687232 82.682068,20.585667 C 82.68206,19.480203 82.430107,18.607157 81.926208,17.966526 C 81.426202,17.325909 80.746515,17.005596 79.887146,17.005589 M 79.887146,16.044651 C 81.113703,16.04466 82.09417,16.456769 82.828552,17.280979 C 83.562919,18.101299 83.930106,19.20286 83.930115,20.585667 C 83.930106,21.964576 83.562919,23.066137 82.828552,23.890354 C 82.09417,24.710667 81.113703,25.120823 79.887146,25.120823 C 78.656674,25.120823 77.6723,24.710667 76.934021,23.890354 C 76.199645,23.070044 75.832458,21.968482 75.832458,20.585667 C 75.832458,19.20286 76.199645,18.101299 76.934021,17.280979 C 77.6723,16.456769 78.656674,16.04466 79.887146,16.044651"
     id="text1902" />
  <path
     style="font-size:12px;font-style:normal;font-weight:normal;fill:black;fill-opacity:1;stroke:none;stroke-width:1px;stroke-linecap:butt;stroke-linejoin:miter;stroke-opacity:1;font-family:Bitstream Vera Sans"
     d="M 27.401905,36.798607 L 28.585499,36.798607 L 28.585499,40.384544 L 32.88628,40.384544 L 32.88628,36.798607 L 34.069874,36.798607 L 34.069874,45.546654 L 32.88628,45.546654 L 32.88628,41.380638 L 28.585499,41.380638 L 28.585499,45.546654 L 27.401905,45.546654 L 27.401905,36.798607 M 39.976124,37.601341 C 39.116745,37.601349 38.433152,37.921661 37.925343,38.562279 C 37.421434,39.20291 37.169481,40.075956 37.169483,41.181419 C 37.169481,42.282985 37.421434,43.154078 37.925343,43.794701 C 38.433152,44.435327 39.116745,44.755639 39.976124,44.755638 C 40.835493,44.755639 41.51518,44.435327 42.015186,43.794701 C 42.519085,43.154078 42.771038,42.282985 42.771046,41.181419 C 42.771038,40.075956 42.519085,39.20291 42.015186,38.562279 C 41.51518,37.921661 40.835493,37.601349 39.976124,37.601341 M 39.976124,36.640404 C 41.20268,36.640413 42.183148,37.052522 42.91753,37.876732 C 43.651897,38.697051 44.019084,39.798613 44.019093,41.181419 C 44.019084,42.560329 43.651897,43.66189 42.91753,44.486107 C 42.183148,45.30642 41.20268,45.716575 39.976124,45.716576 C 38.745652,45.716575 37.761278,45.30642 37.022999,44.486107 C 36.288623,43.665796 35.921436,42.564235 35.921436,41.181419 C 35.921436,39.798613 36.288623,38.697051 37.022999,37.876732 C 37.761278,37.052522 38.745652,36.640413 39.976124,36.640404"
     id="text1906" />
  <path
     style="font-size:12px;font-style:normal;font-weight:normal;fill:black;fill-opacity:1;stroke:none;stroke-width:1px;stroke-linecap:butt;stroke-linejoin:miter;stroke-opacity:1;font-family:Bitstream Vera Sans"
     d="M 83.983604,79.862381 C 83.124226,79.862389 82.440632,80.182701 81.932823,80.823318 C 81.428915,81.46395 81.176962,82.336996 81.176964,83.442459 C 81.176962,84.544025 81.428915,85.415118 81.932823,86.05574 C 82.440632,86.696366 83.124226,87.016679 83.983604,87.016678 C 84.842974,87.016679 85.522661,86.696366 86.022667,86.05574 C 86.526566,85.415118 86.778519,84.544025 86.778526,83.442459 C 86.778519,82.336996 86.526566,81.46395 86.022667,80.823318 C 85.522661,80.182701 84.842974,79.862389 83.983604,79.862381 M 83.983604,78.901443 C 85.210161,78.901452 86.190629,79.313561 86.925011,80.137772 C 87.659377,80.958091 88.026564,82.059652 88.026573,83.442459 C 88.026564,84.821368 87.659377,85.92293 86.925011,86.747147 C 86.190629,87.567459 85.210161,87.977615 83.983604,87.977615 C 82.753132,87.977615 81.768758,87.567459 81.030479,86.747147 C 80.296103,85.926836 79.928916,84.825275 79.928917,83.442459 C 79.928916,82.059652 80.296103,80.958091 81.030479,80.137772 C 81.768758,79.313561 82.753132,78.901452 83.983604,78.901443 M 89.878136,79.059647 L 91.061729,79.059647 L 91.061729,82.645584 L 95.362511,82.645584 L 95.362511,79.059647 L 96.546104,79.059647 L 96.546104,87.807693 L 95.362511,87.807693 L 95.362511,83.641678 L 91.061729,83.641678 L 91.061729,87.807693 L 89.878136,87.807693 L 89.878136,79.059647"
     id="text1914" />
  <path
     style="font-size:12px;font-style:normal;font-weight:normal;fill:black;fill-opacity:1;stroke:none;stroke-width:1px;stroke-linecap:butt;stroke-linejoin:miter;stroke-opacity:1;font-family:Bitstream Vera Sans"
     d="M 37.304668,79.242386 L 38.488262,79.242386 L 38.488262,82.828323 L 42.789043,82.828323 L 42.789043,79.242386 L 43.972637,79.242386 L 43.972637,87.990433 L 42.789043,87.990433 L 42.789043,83.824417 L 38.488262,83.824417 L 38.488262,87.990433 L 37.304668,87.990433 L 37.304668,79.242386"
     id="text1926" />
  <path
     style="font-size:12px;font-style:normal;font-weight:normal;fill:black;fill-opacity:1;stroke:none;stroke-width:1px;stroke-linecap:butt;stroke-linejoin:miter;stroke-opacity:1;font-family:Bitstream Vera Sans"
     d="M 65.791717,98.857873 L 65.791717,100.10592 C 65.393272,99.734833 64.967492,99.457493 64.514374,99.273893 C 64.065149,99.090303 63.586634,98.998513 63.078827,98.998503 C 62.078823,98.998513 61.313198,99.305153 60.781952,99.918423 C 60.250699,100.5278 59.985075,101.41061 59.985077,102.56686 C 59.985075,103.7192 60.250699,104.60202 60.781952,105.21529 C 61.313198,105.82467 62.078823,106.12936 63.078827,106.12936 C 63.586634,106.12936 64.065149,106.03756 64.514374,105.85397 C 64.967492,105.67037 65.393272,105.39303 65.791717,105.02193 L 65.791717,106.25826 C 65.377647,106.53951 64.938195,106.75045 64.473358,106.89108 C 64.012414,107.0317 63.524134,107.10201 63.008514,107.10201 C 61.684292,107.10201 60.641324,106.69772 59.879608,105.88912 C 59.117888,105.07662 58.737029,103.9692 58.73703,102.56686 C 58.737029,101.16061 59.117888,100.05319 59.879608,99.244593 C 60.641324,98.432103 61.684292,98.025853 63.008514,98.025843 C 63.531946,98.025853 64.024133,98.096163 64.485077,98.236783 C 64.949913,98.373513 65.38546,98.580543 65.791717,98.857873 M 67.631561,98.184043 L 68.815155,98.184043 L 68.815155,101.76998 L 73.115936,101.76998 L 73.115936,98.184043 L 74.29953,98.184043 L 74.29953,106.93209 L 73.115936,106.93209 L 73.115936,102.76608 L 68.815155,102.76608 L 68.815155,106.93209 L 67.631561,106.93209 L 67.631561,98.184043 M 76.692466,110.1197 L 80.823326,110.1197 L 80.823326,111.11579 L 75.268638,111.11579 L 75.268638,110.1197 C 75.717856,109.65486 76.329183,109.03181 77.102623,108.25056 C 77.879963,107.4654 78.368244,106.95955 78.567466,106.73298 C 78.946368,106.3072 79.21004,105.94783 79.358482,105.65485 C 79.510821,105.35798 79.586993,105.06697 79.586998,104.78181 C 79.586993,104.31697 79.42293,103.93806 79.09481,103.64509 C 78.770587,103.35213 78.346759,103.20564 77.823326,103.20564 C 77.452229,103.20564 77.059651,103.2701 76.645591,103.39899 C 76.235433,103.52791 75.795981,103.72322 75.327232,103.98493 L 75.327232,102.78962 C 75.803793,102.59822 76.249105,102.45369 76.66317,102.35603 C 77.077229,102.25838 77.456135,102.20955 77.799888,102.20954 C 78.706134,102.20955 79.42879,102.43611 79.967857,102.88923 C 80.506913,103.34236 80.776444,103.94783 80.776451,104.70564 C 80.776444,105.06502 80.708085,105.40681 80.571373,105.73103 C 80.438554,106.05134 80.194414,106.43025 79.838951,106.86774 C 79.741289,106.98103 79.430743,107.30915 78.90731,107.85212 C 78.383869,108.39118 77.645588,109.14704 76.692466,110.1197 M 85.498588,98.983603 C 84.639209,98.983613 83.955616,99.303923 83.447807,99.944543 C 82.943899,100.58517 82.691946,101.45822 82.691948,102.56368 C 82.691946,103.66525 82.943899,104.53634 83.447807,105.17696 C 83.955616,105.81759 84.639209,106.1379 85.498588,106.1379 C 86.357958,106.1379 87.037645,105.81759 87.537651,105.17696 C 88.04155,104.53634 88.293503,103.66525 88.29351,102.56368 C 88.293503,101.45822 88.04155,100.58517 87.537651,99.944543 C 87.037645,99.303923 86.357958,98.983613 85.498588,98.983603 M 85.498588,98.022673 C 86.725145,98.022683 87.705613,98.434783 88.439995,99.259003 C 89.174361,100.07931 89.541548,101.18088 89.541557,102.56368 C 89.541548,103.94259 89.174361,105.04415 88.439995,105.86837 C 87.705613,106.68868 86.725145,107.09884 85.498588,107.09884 C 84.268116,107.09884 83.283742,106.68868 82.545463,105.86837 C 81.811087,105.04806 81.4439,103.9465 81.443901,102.56368 C 81.4439,101.18088 81.811087,100.07931 82.545463,99.259003 C 83.283742,98.434783 84.268116,98.022683 85.498588,98.022673 M 91.39312,98.180873 L 92.576713,98.180873 L 92.576713,101.76681 L 96.877495,101.76681 L 96.877495,98.180873 L 98.061089,98.180873 L 98.061089,106.92892 L 96.877495,106.92892 L 96.877495,102.7629 L 92.576713,102.7629 L 92.576713,106.92892 L 91.39312,106.92892 L 91.39312,98.180873"
     id="text1922" />
  <path
     style="font-size:12px;fill:none;fill-rule:evenodd;stroke:black;stroke-width:0.96485538pt"
     d="M 62.22477,26.171832 L 62.22477,97.265571"
     id="path3151" />
  <path
     style="font-size:12px;fill:none;fill-rule:evenodd;stroke:black;stroke-width:1pt"
     d="M 44.86715,83.5691 L 79.24215,83.5691"
     id="path3155" />
  <path
     style="font-size:12px;fill:none;fill-rule:evenodd;stroke:black;stroke-width:1pt"
     d="M 44.86715,41.45841 L 79.24215,41.45841"
     id="path3159" />
  <path
     style="font-size:12px;font-style:normal;font-weight:normal;fill:black;fill-opacity:1;stroke:none;stroke-width:1px;stroke-linecap:butt;stroke-linejoin:miter;stroke-opacity:1;font-family:Bitstream Vera Sans"
     d="M 80.197701,37.108524 L 81.381294,37.108524 L 81.381294,40.694462 L 85.682076,40.694462 L 85.682076,37.108524 L 86.865669,37.108524 L 86.865669,45.856571 L 85.682076,45.856571 L 85.682076,41.690556 L 81.381294,41.690556 L 81.381294,45.856571 L 80.197701,45.856571 L 80.197701,37.108524"
     id="text3323" />
  <path
     style="font-size:12px;font-style:normal;font-weight:normal;fill:black;fill-opacity:1;stroke:none;stroke-width:1px;stroke-linecap:butt;stroke-linejoin:miter;stroke-opacity:1;font-family:Bitstream Vera Sans"
     d="M 27.401905,57.367973 L 28.585499,57.367973 L 28.585499,60.953911 L 32.88628,60.953911 L 32.88628,57.367973 L 34.069874,57.367973 L 34.069874,66.11602 L 32.88628,66.11602 L 32.88628,61.950005 L 28.585499,61.950005 L 28.585499,66.11602 L 27.401905,66.11602 L 27.401905,57.367973 M 39.976124,58.170708 C 39.116745,58.170716 38.433152,58.491028 37.925343,59.131645 C 37.421434,59.772277 37.169481,60.645323 37.169483,61.750786 C 37.169481,62.852352 37.421434,63.723444 37.925343,64.364067 C 38.433152,65.004693 39.116745,65.325005 39.976124,65.325005 C 40.835493,65.325005 41.51518,65.004693 42.015186,64.364067 C 42.519085,63.723444 42.771038,62.852352 42.771046,61.750786 C 42.771038,60.645323 42.519085,59.772277 42.015186,59.131645 C 41.51518,58.491028 40.835493,58.170716 39.976124,58.170708 M 39.976124,57.20977 C 41.20268,57.209779 42.183148,57.621888 42.91753,58.446098 C 43.651897,59.266418 44.019084,60.367979 44.019093,61.750786 C 44.019084,63.129695 43.651897,64.231256 42.91753,65.055473 C 42.183148,65.875786 41.20268,66.285942 39.976124,66.285942 C 38.745652,66.285942 37.761278,65.875786 37.022999,65.055473 C 36.288623,64.235163 35.921436,63.133601 35.921436,61.750786 C 35.921436,60.367979 36.288623,59.266418 37.022999,58.446098 C 37.761278,57.621888 38.745652,57.209779 39.976124,57.20977"
     id="text4757" />
  <path
     style="font-size:12px;fill:none;fill-rule:evenodd;stroke:black;stroke-width:1pt"
     d="M 44.86715,62.027786 L 79.24215,62.027786"
     id="path4761" />
  <path
     style="font-size:12px;font-style:normal;font-weight:normal;fill:black;fill-opacity:1;stroke:none;stroke-width:1px;stroke-linecap:butt;stroke-linejoin:miter;stroke-opacity:1;font-family:Bitstream Vera Sans"
     d="M 80.197701,57.677887 L 81.381294,57.677887 L 81.381294,61.263824 L 85.682076,61.263824 L 85.682076,57.677887 L 86.865669,57.677887 L 86.865669,66.425934 L 85.682076,66.425934 L 85.682076,62.259918 L 81.381294,62.259918 L 81.381294,66.425934 L 80.197701,66.425934 L 80.197701,57.677887"
     id="text4763" />
</svg>
