<?xml version="1.0" encoding="UTF-8" standalone="no"?>
<!DOCTYPE svg PUBLIC "-//W3C//DTD SVG 20010904//EN"
"http://www.w3.org/TR/2001/REC-SVG-20010904/DTD/svg10.dtd"
[
 <!ATTLIST svg
  xmlns:xlink CDATA #FIXED "http://www.w3.org/1999/xlink">
]>
<!-- Created with Sodipodi ("http://www.sodipodi.com/") -->
<svg
   xmlns="http://www.w3.org/2000/svg"
   xmlns:xlink="http://www.w3.org/1999/xlink"
   version="1"
   x="0"
   y="0"
   width="125"
   height="125"
   id="svg101">
  <defs
     id="defs103" />
  <g
     style="font-size:12;"
     id="g165">
    <path
       d="M 6.2796 6.74281 L 6.2796 118.768 L 118.718 118.768 L 118.718 6.74281 L 6.2796 6.74281 z "
       style="fill:#999999;fill-rule:evenodd;stroke-width:0pt;"
       id="path164" />
    <path
       d="M 17.6583 7.9972 C 17.5283 6.3592 17.1903 5.3192 16.3843 4.2532 C 14.9283 2.3292 12.5883 1.2632 9.75431 1.2632 C 4.39831 1.2632 1.07031 5.0852 1.07031 11.2212 C 1.07031 17.3052 4.37231 21.1272 9.65031 21.1272 C 14.3563 21.1272 17.5023 18.3972 17.7363 14.0552 L 13.9403 14.0552 C 13.7063 16.4732 12.1723 17.8512 9.75431 17.8512 C 6.73831 17.8512 4.97031 15.4072 4.97031 11.2732 C 4.97031 7.0872 6.81631 4.5912 9.88431 4.5912 C 11.2363 4.5912 12.3543 5.0592 13.0823 5.9692 C 13.4983 6.4892 13.7063 6.9832 13.9403 7.9972 L 17.6583 7.9972 z "
       transform="scale(6.69663,5.61443)"
       style="font-size:26;font-weight:bold;fill:#2d2dc8;stroke-width:1pt;font-family:Helvetica;"
       id="path163" />
  </g>
</svg>
