<?xml version="1.0" encoding="UTF-8" standalone="no"?>
<!DOCTYPE svg PUBLIC "-//W3C//DTD SVG 20010904//EN"
"http://www.w3.org/TR/2001/REC-SVG-20010904/DTD/svg10.dtd"
[
 <!ATTLIST svg
  xmlns:xlink CDATA #FIXED "http://www.w3.org/1999/xlink">
]>
<!-- Created with Sodipodi ("http://www.sodipodi.com/") -->
<svg
   xmlns="http://www.w3.org/2000/svg"
   xmlns:xlink="http://www.w3.org/1999/xlink"
   width="62.5"
   height="62.5"
   id="svg1">
  <defs
     id="defs3" />
  <g
     style="font-size:12;"
     id="g134">
    <path
       d="M 1e-06 0.168121 L 1e-06 5.49012 L 62.4931 5.49012 L 62.4931 0.168121 L 1e-06 0.168121 z "
       style="fill:#808080;fill-rule:evenodd;stroke-width:1pt;"
       id="path131" />
    <path
       d="M 33.9514 2.26495 L 28.6294 2.26467 L 28.6259 59.9196 L 33.9479 59.9198 L 33.9514 2.26495 z "
       style="fill:#808080;fill-rule:evenodd;stroke-width:1pt;"
       id="path132" />
    <path
       d="M 1e-06 57.2586 L 1e-06 62.5806 L 62.4931 62.5806 L 62.4931 57.2586 L 1e-06 57.2586 z "
       style="fill:#808080;fill-rule:evenodd;stroke-width:1pt;"
       id="path133" />
  </g>
</svg>
