<?xml version="1.0" encoding="UTF-8" standalone="no"?>
<!DOCTYPE svg PUBLIC "-//W3C//DTD SVG 20010904//EN"
"http://www.w3.org/TR/2001/REC-SVG-20010904/DTD/svg10.dtd"
[
 <!ATTLIST svg
  xmlns:xlink CDATA #FIXED "http://www.w3.org/1999/xlink">
]>
<!-- Created with Sodipodi ("http://www.sodipodi.com/") -->
<svg
   xmlns="http://www.w3.org/2000/svg"
   xmlns:xlink="http://www.w3.org/1999/xlink"
   version="1"
   x="0"
   y="0"
   width="125"
   height="125"
   id="svg101">
  <defs
     id="defs103" />
  <g
     style="font-size:12;"
     id="g494">
    <path
       d="M 6.2796 6.74281 L 6.2796 118.768 L 118.718 118.768 L 118.718 6.74281 L 6.2796 6.74281 z "
       style="fill:#999999;fill-rule:evenodd;stroke-width:0pt;"
       id="path492" />
    <path
       d="M 35.7931 17.9072 C 31.5031 17.9072 28.8771 20.7412 28.8771 25.3432 C 28.8771 29.9712 31.5031 32.7792 35.8191 32.7792 C 40.0831 32.7792 42.7611 29.9452 42.7611 25.4472 C 42.7611 20.6892 40.1871 17.9072 35.7931 17.9072 z M 35.8191 20.8452 C 37.8211 20.8452 39.1211 22.6392 39.1211 25.3952 C 39.1211 28.0212 37.7691 29.8412 35.8191 29.8412 C 33.8431 29.8412 32.5171 28.0212 32.5171 25.3432 C 32.5171 22.6652 33.8431 20.8452 35.8191 20.8452 z M 19.4911 18.1412 L 19.4911 32.1812 L 23.1311 32.1812 L 23.1311 24.7192 C 23.1311 22.5872 24.1971 21.5212 26.3291 21.5212 C 26.7191 21.5212 26.9791 21.5472 27.4731 21.6252 L 27.4731 17.9332 C 27.2651 17.9072 27.1351 17.9072 27.0311 17.9072 C 25.3671 17.9072 23.9111 18.9992 23.1311 20.8972 L 23.1311 18.1412 L 19.4911 18.1412 z M 6.38709 25.4212 L 11.2491 25.4212 C 14.7331 25.4212 16.9691 22.9512 16.9691 19.1032 C 16.9691 15.3072 14.8111 13.2272 10.8591 13.2272 L 2.48709 13.2272 L 2.48709 32.1812 L 6.38709 32.1812 L 6.38709 25.4212 z M 6.38709 22.1712 L 6.38709 16.4772 L 10.0271 16.4772 C 12.1071 16.4772 13.0691 17.3872 13.0691 19.3372 C 13.0691 21.2612 12.1071 22.1712 10.0271 22.1712 L 6.38709 22.1712 z "
       transform="scale(2.75921,2.75231)"
       style="font-size:26;font-weight:bold;fill:#e2bd00;stroke-width:1pt;font-family:Helvetica;"
       id="path493" />
  </g>
</svg>
