ci: no variables

1 job for master in 8 minutes and 15 seconds (queued for 1 second)
Status Job ID Name Coverage
  Test
failed #143997
test

00:08:15

 
Name Stage Failure
failed
test Test
make[1]: *** [Makefile:858: test] Error 2
make[1]: Leaving directory '/builds/dexter/pkg-fakechroot'
dh_auto_test: make -j1 test VERBOSE=1 returned exit code 2
make: *** [debian/rules:11: build] Error 2
dpkg-buildpackage: error: debian/rules build subprocess returned exit status 2
debuild: fatal error at line 1182:
dpkg-buildpackage -us -uc -ui -i^\.git/|^\.gitignore$|^\.gitlab-ci.yml$|^README\.md$ -I failed
gbp:error: 'debuild --no-lintian -i'^\.git/|^\.gitignore$|^\.gitlab-ci.yml$|^README\.md$' -I -uc -us' failed: it exited with 29
ERROR: Job failed: exit code 1