; wzf: integrity-checks = none
;
; wzf: soa_refresh = 30m
; wzf: soa_retry = 10m
; wzf: soa_negttl = 10m
;
; ds-in-parent = yes

$TTL 8h

@		IN	NS	dns4.easydns.info.
@		IN	NS	sec1.rcode0.net.
@		IN	NS	sec2.rcode0.net.
@		IN	NS	nsp.dnsnode.net.

$TTL 8h

@		IN	MX	10 mailly.debian.org.
		IN	MX	10 mitropoulos.debian.org.
		IN	MX	10 muffat.debian.org.

; A records for @, from www
$INCLUDE "/srv/dns.debian.org/var/services-auto/all"

$TTL 1h

$INCLUDE "/var/lib/misc/thishost/dns-zone"
$INCLUDE "/srv/dns.debian.org/puppet-extra/include-debian.org"
$INCLUDE "/srv/letsencrypt.debian.org/var/hook/snippet"
$INCLUDE "/srv/dehydrated/var/hook/snippet"

; manually added by weasel 20150820,
; per request of paulproteus.
; updated by adsb 20201118 for paddatrapper
*.storm.debian.net.	IN	CNAME	storm


; owned by the gitdoadm role
pages		IN	A	209.87.16.45
		IN	AAAA	2607:f8f0:614:1::1274:45
		IN	MX	0 .
*.pages		IN	CNAME	pages

k01._domainkey.mentors	IN	TXT	( "v=DKIM1; h=sha256; k=rsa; "
	 "p=MIIBIjANBgkqhkiG9w0BAQEFAAOCAQ8AMIIBCgKCAQEAvf9v718qiO6DGLxKISAvEUqDFeVJwjBSB93AehgS49bmAJGQswCQU+8V1dmzE/T4cN4W8xQeEsZzJUCQn3y6ab/BXUEnrl8wJZvdsGg32GiP0YbksBs2U3VPhDYTN2LssluSPhKnFBWj9msJJF+c0v/dF+ZAh3fOSeRGUcJN2PPil0RYuR8GEFccB9hTb1y95FR6y75K1qro0Hb"
	 "XeLldodik7bCMawr9QPYQwbC19or90YikmSVfjdMNaja5Vwfq/CWgd/piRzS4+X7ZYreH0G0pUuFsjAmXLtr7ivbcCuX0U3QhpElIbxlufZV2fINm0WyaVkBvHombxu7dYly2gwIDAQAB" )  ; ----- See RT8767 - Google denies mails from mentors.d.n, and ud-generate is too strict for now

; publicsuffix authorization tokens for
;  https://github.com/publicsuffix/list/pull/516
; per https://github.com/publicsuffix/list/wiki/Guidelines

_psl	60	IN	TXT	"https://github.com/publicsuffix/list/pull/516"

; vim: syn=dns:
