module debian.org/dsa/domains/scripts

go 1.23.4

require (
	github.com/spf13/cobra v1.8.1
	gopkg.in/yaml.v3 v3.0.1
)

require (
	github.com/goccy/go-yaml v1.15.13 // indirect
	github.com/inconshreveable/mousetrap v1.1.0 // indirect
	github.com/spf13/pflag v1.0.5 // indirect
)
