simple diode test 
V1 ( 1 0 )  DC  10.  AC  1.
R1 ( 1 2 )  100.K
D1 ( 2 0 )  ddd 1
.model ddd d ( tnom=NA( 27.) is=10.f rs=0. n=1. tt=0. cjo=1.p pb=1. mj=0.5 egap=1.11 xti=3. kf=0. af=1. fc=0.5 bv=50 ibv=0.001)
#           v(1)       v(2)       i(V1)      i(R1)      id(D1)     vd(D1)     req(D1)    cd(D1)     z(D1)      zraw(D1)   gd(D1)     z(2)      
 27.        10.        0.59396   -94.061u    94.06u     94.06u     0.59396    274.97     1.5471p    100.K      274.22     0.0036367  274.22    
#           v(1)       v(2)       i(V1)      i(R1)      id(D1)     vd(D1)     req(D1)    cd(D1)     z(D1)      zraw(D1)   gd(D1)     z(2)       iter(0)   
-10.       -10.       -10.        0.        -10.01p    -10.f      -10.        2.119E180  301.51f    100.K      100.K      0.         100.K      5.        
-8.        -8.        -8.         0.        -8.01p     -10.f      -8.         553.9E144  333.33f    100.K      100.K      0.         100.K      4.        
-6.        -6.        -6.         0.        -6.01p     -10.f      -6.         144.8E111  377.96f    100.K      100.K      0.         100.K      4.        
-4.        -4.        -4.         0.        -4.01p     -10.f      -4.         37.85E+78  447.21f    100.K      100.K      0.         100.K      4.        
-2.        -2.        -2.         0.        -2.01p     -10.f      -2.         9.894E+45  577.35f    100.K      100.K      0.         100.K      4.        
 0.         0.         0.         0.         0.         0.         0.         2.586E+12  1.p        100.K      100.K      386.64f    100.K      5.        
 2.         2.         0.54568   -14.543u    14.543u    14.543u    0.54568    1.7784K    1.4788p    100.K      1.7474K    562.29u    1.7474K    10.       
 4.         4.         0.56789   -34.321u    34.321u    34.321u    0.56789    753.59     1.5102p    100.K      747.96     0.001327   747.96     5.        
 6.         6.         0.5797    -54.203u    54.203u    54.203u    0.5797     477.17     1.5269p    100.K      474.91     0.0020957  474.91     5.        
 8.         8.         0.5878    -74.122u    74.122u    74.122u    0.5878     348.94     1.5384p    100.K      347.73     0.0028658  347.73     5.        
 10.        10.        0.59396   -94.061u    94.06u     94.06u     0.59396    274.97     1.5471p    100.K      274.22     0.0036367  274.22     5.        
Gnucap   System status
iterations: op=9, dc=56, tran=0, fourier=0, total=65
transient timesteps: accepted=0, rejected=0, total=0
nodes: user=2, subckt=0, model=0, total=2
dctran density=100.0%, ac density=100.0%
#           v(1)       v(2)       i(V1)      i(R1)      id(D1)     vd(D1)     req(D1)    cd(D1)     z(D1)      zraw(D1)   gd(D1)     z(2)      
 27.        10.        0.59396   -94.061u    94.06u     94.06u     0.59396    274.97     1.5471p    100.K      274.22     0.0036367  274.22    
Gnucap   System status
iterations: op=9, dc=56, tran=0, fourier=0, total=74
transient timesteps: accepted=0, rejected=0, total=0
nodes: user=2, subckt=0, model=0, total=2
dctran density=100.0%, ac density=100.0%
