G04 all macro aperture primitives *
%MOMM*%
%FSLAX23Y23*%
%LNTOP*%

%AMP1*
1,1,5,0.0,0.0,0*
%

%AMP20*
20,1,0.5,0,0,3,5,45*
%


%AMP21*
21,1,0.8,0.5,1,2,45*
%

%AMP4*
4,1,3,1,1,6,1,8,0,1,1,45*
%

%AMP5*
5,1,3,0,0,2,15*
%

%AMP6*
6,1,1,4,0.1,0.5,3,0.05,7,45*
%


%AMP7*
7,1,1,3,2.5,0.1,20*
%


%ADD11P1*%
%ADD12P20*%
%ADD13P21*%
%ADD14P4*%
%ADD15P5*%
%ADD16P6*%
%ADD17P7*%


G54D11*X10000Y00000D03*
G54D12*X20000Y00000D03*
G54D13*X30000Y00000D03*
G54D14*X40000Y00000D03*
G54D15*X50000Y00000D03*
G54D16*X60000Y00000D03*
G54D17*X70000Y00000D03*


M02*
