G04 #@! TF.GenerationSoftware,KiCad,Pcbnew,5.1.2*
G04 #@! TF.CreationDate,2019-06-10T10:04:51+01:00*
G04 #@! TF.ProjectId,camv,63616d76-2e6b-4696-9361-645f70636258,rev?*
G04 #@! TF.SameCoordinates,Original*
G04 #@! TF.FileFunction,Copper,L1,Top*
G04 #@! TF.FilePolarity,Positive*
%FSLAX46Y46*%
G04 Gerber Fmt 4.6, Leading zero omitted, Abs format (unit mm)*
G04 Created by KiCad (PCBNEW 5.1.2) date 2019-06-10 10:04:51*
%MOMM*%
%LPD*%
G04 APERTURE LIST*
%ADD10C,0.800000*%
%ADD11C,0.254000*%
G04 APERTURE END LIST*
D10*
X127000000Y-81900000D03*
X133300000Y-87900000D03*
X139200000Y-94000000D03*
D11*
G36*
X142873000Y-97873000D02*
G01*
X123127000Y-97873000D01*
X123127000Y-93898061D01*
X138165000Y-93898061D01*
X138165000Y-94101939D01*
X138204774Y-94301898D01*
X138282795Y-94490256D01*
X138396063Y-94659774D01*
X138540226Y-94803937D01*
X138709744Y-94917205D01*
X138898102Y-94995226D01*
X139098061Y-95035000D01*
X139301939Y-95035000D01*
X139501898Y-94995226D01*
X139690256Y-94917205D01*
X139859774Y-94803937D01*
X140003937Y-94659774D01*
X140117205Y-94490256D01*
X140195226Y-94301898D01*
X140235000Y-94101939D01*
X140235000Y-93898061D01*
X140195226Y-93698102D01*
X140117205Y-93509744D01*
X140003937Y-93340226D01*
X139859774Y-93196063D01*
X139690256Y-93082795D01*
X139501898Y-93004774D01*
X139301939Y-92965000D01*
X139098061Y-92965000D01*
X138898102Y-93004774D01*
X138709744Y-93082795D01*
X138540226Y-93196063D01*
X138396063Y-93340226D01*
X138282795Y-93509744D01*
X138204774Y-93698102D01*
X138165000Y-93898061D01*
X123127000Y-93898061D01*
X123127000Y-87798061D01*
X132265000Y-87798061D01*
X132265000Y-88001939D01*
X132304774Y-88201898D01*
X132382795Y-88390256D01*
X132496063Y-88559774D01*
X132640226Y-88703937D01*
X132809744Y-88817205D01*
X132998102Y-88895226D01*
X133198061Y-88935000D01*
X133401939Y-88935000D01*
X133601898Y-88895226D01*
X133790256Y-88817205D01*
X133959774Y-88703937D01*
X134103937Y-88559774D01*
X134217205Y-88390256D01*
X134295226Y-88201898D01*
X134335000Y-88001939D01*
X134335000Y-87798061D01*
X134295226Y-87598102D01*
X134217205Y-87409744D01*
X134103937Y-87240226D01*
X133959774Y-87096063D01*
X133790256Y-86982795D01*
X133601898Y-86904774D01*
X133401939Y-86865000D01*
X133198061Y-86865000D01*
X132998102Y-86904774D01*
X132809744Y-86982795D01*
X132640226Y-87096063D01*
X132496063Y-87240226D01*
X132382795Y-87409744D01*
X132304774Y-87598102D01*
X132265000Y-87798061D01*
X123127000Y-87798061D01*
X123127000Y-81798061D01*
X125965000Y-81798061D01*
X125965000Y-82001939D01*
X126004774Y-82201898D01*
X126082795Y-82390256D01*
X126196063Y-82559774D01*
X126340226Y-82703937D01*
X126509744Y-82817205D01*
X126698102Y-82895226D01*
X126898061Y-82935000D01*
X127101939Y-82935000D01*
X127301898Y-82895226D01*
X127490256Y-82817205D01*
X127659774Y-82703937D01*
X127803937Y-82559774D01*
X127917205Y-82390256D01*
X127995226Y-82201898D01*
X128035000Y-82001939D01*
X128035000Y-81798061D01*
X127995226Y-81598102D01*
X127917205Y-81409744D01*
X127803937Y-81240226D01*
X127659774Y-81096063D01*
X127490256Y-80982795D01*
X127301898Y-80904774D01*
X127101939Y-80865000D01*
X126898061Y-80865000D01*
X126698102Y-80904774D01*
X126509744Y-80982795D01*
X126340226Y-81096063D01*
X126196063Y-81240226D01*
X126082795Y-81409744D01*
X126004774Y-81598102D01*
X125965000Y-81798061D01*
X123127000Y-81798061D01*
X123127000Y-78127000D01*
X142873000Y-78127000D01*
X142873000Y-97873000D01*
X142873000Y-97873000D01*
G37*
X142873000Y-97873000D02*
X123127000Y-97873000D01*
X123127000Y-93898061D01*
X138165000Y-93898061D01*
X138165000Y-94101939D01*
X138204774Y-94301898D01*
X138282795Y-94490256D01*
X138396063Y-94659774D01*
X138540226Y-94803937D01*
X138709744Y-94917205D01*
X138898102Y-94995226D01*
X139098061Y-95035000D01*
X139301939Y-95035000D01*
X139501898Y-94995226D01*
X139690256Y-94917205D01*
X139859774Y-94803937D01*
X140003937Y-94659774D01*
X140117205Y-94490256D01*
X140195226Y-94301898D01*
X140235000Y-94101939D01*
X140235000Y-93898061D01*
X140195226Y-93698102D01*
X140117205Y-93509744D01*
X140003937Y-93340226D01*
X139859774Y-93196063D01*
X139690256Y-93082795D01*
X139501898Y-93004774D01*
X139301939Y-92965000D01*
X139098061Y-92965000D01*
X138898102Y-93004774D01*
X138709744Y-93082795D01*
X138540226Y-93196063D01*
X138396063Y-93340226D01*
X138282795Y-93509744D01*
X138204774Y-93698102D01*
X138165000Y-93898061D01*
X123127000Y-93898061D01*
X123127000Y-87798061D01*
X132265000Y-87798061D01*
X132265000Y-88001939D01*
X132304774Y-88201898D01*
X132382795Y-88390256D01*
X132496063Y-88559774D01*
X132640226Y-88703937D01*
X132809744Y-88817205D01*
X132998102Y-88895226D01*
X133198061Y-88935000D01*
X133401939Y-88935000D01*
X133601898Y-88895226D01*
X133790256Y-88817205D01*
X133959774Y-88703937D01*
X134103937Y-88559774D01*
X134217205Y-88390256D01*
X134295226Y-88201898D01*
X134335000Y-88001939D01*
X134335000Y-87798061D01*
X134295226Y-87598102D01*
X134217205Y-87409744D01*
X134103937Y-87240226D01*
X133959774Y-87096063D01*
X133790256Y-86982795D01*
X133601898Y-86904774D01*
X133401939Y-86865000D01*
X133198061Y-86865000D01*
X132998102Y-86904774D01*
X132809744Y-86982795D01*
X132640226Y-87096063D01*
X132496063Y-87240226D01*
X132382795Y-87409744D01*
X132304774Y-87598102D01*
X132265000Y-87798061D01*
X123127000Y-87798061D01*
X123127000Y-81798061D01*
X125965000Y-81798061D01*
X125965000Y-82001939D01*
X126004774Y-82201898D01*
X126082795Y-82390256D01*
X126196063Y-82559774D01*
X126340226Y-82703937D01*
X126509744Y-82817205D01*
X126698102Y-82895226D01*
X126898061Y-82935000D01*
X127101939Y-82935000D01*
X127301898Y-82895226D01*
X127490256Y-82817205D01*
X127659774Y-82703937D01*
X127803937Y-82559774D01*
X127917205Y-82390256D01*
X127995226Y-82201898D01*
X128035000Y-82001939D01*
X128035000Y-81798061D01*
X127995226Y-81598102D01*
X127917205Y-81409744D01*
X127803937Y-81240226D01*
X127659774Y-81096063D01*
X127490256Y-80982795D01*
X127301898Y-80904774D01*
X127101939Y-80865000D01*
X126898061Y-80865000D01*
X126698102Y-80904774D01*
X126509744Y-80982795D01*
X126340226Y-81096063D01*
X126196063Y-81240226D01*
X126082795Y-81409744D01*
X126004774Y-81598102D01*
X125965000Y-81798061D01*
X123127000Y-81798061D01*
X123127000Y-78127000D01*
X142873000Y-78127000D01*
X142873000Y-97873000D01*
M02*
