G04 test AM set *
%MOMM*%
%FSLAX23Y23*%
%LNTOP*%
%AMFOO*
0, comment *
$2=1*
$3=$1+1*
$4=$1-1*
1,1,0.5,0.0,0.0,0*
1,1,$2,$3,$4,0*
%
%AMBAR*
%
%ADD11FOO,1*%
%ADD12FOO,-1*%
G54D11*X10000Y00000D03*
G54D12*X20000Y00000D03*

M02*
