G04 test whether SR goes in x-y or y-x order, by checking overlaps *
G04 conclusion: inner loop should be y, from 0 up *
%MOMM*%
%FSLAX23Y23*%
%LNTOP*%
%ADD11C,0.7000*%
%ADD12C,0.3000*%

%LPD*%

%SRX3Y2I0.25J0.75*%
G54D11*X10000Y01000D02*Y02000D01*
%LPC*%
G54D12*X10000Y01000D02*Y02000D01*
%SR*%

M02*
