 pt 10.000000;10.000000 cop;clr=2.000000;1.000000
 pt 50.000000;50.000000 cop;clr=2.000000;1.000000
  seg convex 0:
   arc cvx use=0 2.000000:0.374085 -> 2.204092 [0.374085 2.578177]
   arc cvx use=1 4.000000:0.374085 -> 2.204092 [0.374085 2.578177] tn=26
   arc cvx use=1 7.000000:0.503040 -> 1.977216 [0.503040 2.480256] tn=12
   arc cvx use=1 10.000000:1.520522 -> 0.090414 [1.520522 1.610936] tn=8
 pt 80.000000;10.000000 cop;clr=2.000000;1.000000
 pt 20.000000;10.000000 cop;clr=2.000000;1.000000
 pt 70.000000;10.000000 cop;clr=2.000000;1.000000
 pt 0.000000;58.000000 cop;clr=2.000000;1.000000
 pt 90.000000;58.000000 cop;clr=2.000000;1.000000
 twonet 8
  arc cvx use=1 center=90.000000;58.000000 r=0.000000 a=3.091319;0.000000
  line 90.000000;58.000000 .. 50.502527;59.987365
  arc cvx use=1 center=50.000000;50.000000 r=10.000000 a=1.520522;0.090414
  line 49.598711;59.991945 .. 0.000000;58.000000
  arc cvx use=1 center=0.000000;58.000000 r=0.000000 a=0.040140;0.000000
 twonet 12
  arc cvx use=1 center=80.000000;10.000000 r=0.000000 a=2.073836;0.000000
  line 80.000000;10.000000 .. 56.132848;53.374636
  arc cvx use=1 center=50.000000;50.000000 r=7.000000 a=0.503040;1.977216
  line 44.475795;54.299205 .. 10.000000;10.000000
  arc cvx use=1 center=10.000000;10.000000 r=0.000000 a=0.909460;0.000000
 twonet 26
  arc cvx use=1 center=70.000000;10.000000 r=0.000000 a=1.944882;0.000000
  line 70.000000;10.000000 .. 53.723369;51.461685
  arc cvx use=1 center=50.000000;50.000000 r=4.000000 a=0.374085;2.204092
  line 46.618256;52.136308 .. 20.000000;10.000000
  arc cvx use=1 center=20.000000;10.000000 r=0.000000 a=1.007381;0.000000
