 pt 10.000000;10.000000 cop;clr=2.000000;1.000000
 pt 30.000000;10.000000 cop;clr=2.000000;1.000000
 pt 50.000000;10.000000 cop;clr=2.000000;1.000000
 pt 20.000000;50.000000 cop;clr=2.000000;1.000000
 twonet 5
