 pt 34.925000;2.540000 cop;clr=0.500000;0.000000
 pt 65.405000;1.270000 cop;clr=0.127000;0.000000
 pt 54.715833;1.270000 cop;clr=0.127000;0.000000
 pt 44.026667;1.270000 cop;clr=0.127000;0.000000
 twonet 5
  arc cvx use=1 center=54.715833;1.270000 r=0.000000 a=0.000000;0.000000
  line 54.715833;1.270000 .. 65.405000;1.270000
  arc cvx use=1 center=65.405000;1.270000 r=0.000000 a=3.141593;0.000000
 twonet 9
  arc cvx use=1 center=44.026667;1.270000 r=0.000000 a=0.000000;0.000000
  line 44.026667;1.270000 .. 54.715833;1.270000
  arc cvx use=1 center=54.715833;1.270000 r=0.000000 a=3.141593;0.000000
 twonet 13
