 pt 50.000000;50.000000 cop;clr=2.000000;2.000000
  seg convex 0:
   arc cvx use=0 2.000000:2.602271 -> 4.324416 [2.602271 6.926686]
   arc cvx use=1 6.000000:6.926686 -> -4.324416 [2.602271 6.926686] tn=4
 pt 46.000000;55.000000 cop;clr=2.000000;2.000000
 pt 50.000000;60.000000 cop;clr=2.000000;2.000000
 twonet 4
  arc cvx use=1 center=50.000000;60.000000 r=0.000000 a=-0.927295;0.000000
  line 50.000000;60.000000 .. 54.800000;53.600000
  arc cvx use=1 center=50.000000;50.000000 r=6.000000 a=6.926686;-4.324416
  line 44.851658;53.081326 .. 46.000000;55.000000
  arc cvx use=1 center=46.000000;55.000000 r=0.000000 a=-2.110118;0.000000
