<?xml version="1.0"?>
<svg xmlns="http://www.w3.org/2000/svg" version="1.0">
<g id='8.bottom_copper' opacity='0.800000'>
	<polygon points=' 1512.570000,902.970000 1573.530000,902.970000 1573.530000,963.930000 1512.570000,963.930000' style='fill:#3a5fcd'/>
	<line x1='1543.050000' y1='1009.650000' x2='1543.050000' y2='1009.650000' stroke-width='60.960000' stroke='#3a5fcd' stroke-linecap='round'/>
	<line x1='1543.050000' y1='1085.850000' x2='1543.050000' y2='1085.850000' stroke-width='60.960000' stroke='#3a5fcd' stroke-linecap='round'/>
	<line x1='1543.050000' y1='1162.050000' x2='1543.050000' y2='1162.050000' stroke-width='60.960000' stroke='#3a5fcd' stroke-linecap='round'/>
	<line x1='1771.650000' y1='933.450000' x2='1771.650000' y2='933.450000' stroke-width='60.960000' stroke='#3a5fcd' stroke-linecap='round'/>
	<line x1='1771.650000' y1='1009.650000' x2='1771.650000' y2='1009.650000' stroke-width='60.960000' stroke='#3a5fcd' stroke-linecap='round'/>
	<line x1='1771.650000' y1='1085.850000' x2='1771.650000' y2='1085.850000' stroke-width='60.960000' stroke='#3a5fcd' stroke-linecap='round'/>
	<line x1='1771.650000' y1='1162.050000' x2='1771.650000' y2='1162.050000' stroke-width='60.960000' stroke='#3a5fcd' stroke-linecap='round'/>
</g>
<g id='3.top_copper' opacity='0.800000'>
	<polygon points=' 1512.570000,902.970000 1573.530000,902.970000 1573.530000,963.930000 1512.570000,963.930000' style='fill:#8b2323'/>
	<line x1='1771.650000' y1='933.450000' x2='1771.650000' y2='933.450000' stroke-width='60.960000' stroke='#8b2323' stroke-linecap='round'/>
	<line x1='1543.050000' y1='1009.650000' x2='1543.050000' y2='1009.650000' stroke-width='60.960000' stroke='#8b2323' stroke-linecap='round'/>
	<line x1='1771.650000' y1='1009.650000' x2='1771.650000' y2='1009.650000' stroke-width='60.960000' stroke='#8b2323' stroke-linecap='round'/>
	<line x1='1771.650000' y1='1085.850000' x2='1866.900000' y2='1085.850000' stroke-width='7.620000' stroke='#8b2323' stroke-linecap='round'/>
	<line x1='1866.900000' y1='1085.850000' x2='1866.900000' y2='933.450000' stroke-width='7.620000' stroke='#8b2323' stroke-linecap='round'/>
	<line x1='1866.900000' y1='933.450000' x2='1771.650000' y2='933.450000' stroke-width='7.620000' stroke='#8b2323' stroke-linecap='round'/>
	<line x1='1543.050000' y1='1085.850000' x2='1543.050000' y2='1085.850000' stroke-width='60.960000' stroke='#8b2323' stroke-linecap='round'/>
	<line x1='1771.650000' y1='1085.850000' x2='1771.650000' y2='1085.850000' stroke-width='60.960000' stroke='#8b2323' stroke-linecap='round'/>
	<line x1='1543.050000' y1='1162.050000' x2='1543.050000' y2='1162.050000' stroke-width='60.960000' stroke='#8b2323' stroke-linecap='round'/>
	<line x1='1771.650000' y1='1162.050000' x2='1771.650000' y2='1162.050000' stroke-width='60.960000' stroke='#8b2323' stroke-linecap='round'/>
</g>
<g id='vias' opacity='0.800000'>
	<circle cx='1543.050000' cy='933.450000' r='15.000015' stroke-width='0.1' stroke='#777777' fill='#111111'/>
	<circle cx='1543.050000' cy='1009.650000' r='15.000015' stroke-width='0.1' stroke='#777777' fill='#111111'/>
	<circle cx='1543.050000' cy='1085.850000' r='15.000015' stroke-width='0.1' stroke='#777777' fill='#111111'/>
	<circle cx='1543.050000' cy='1162.050000' r='15.000015' stroke-width='0.1' stroke='#777777' fill='#111111'/>
	<circle cx='1771.650000' cy='933.450000' r='15.000015' stroke-width='0.1' stroke='#777777' fill='#111111'/>
	<circle cx='1771.650000' cy='1009.650000' r='15.000015' stroke-width='0.1' stroke='#777777' fill='#111111'/>
	<circle cx='1771.650000' cy='1085.850000' r='15.000015' stroke-width='0.1' stroke='#777777' fill='#111111'/>
	<circle cx='1771.650000' cy='1162.050000' r='15.000015' stroke-width='0.1' stroke='#777777' fill='#111111'/>
	<circle cx='1626.824021' cy='1172.075025' r='45.000000' stroke-width='0.1' stroke='#777777' fill='#111111'/>
</g><g id='laa' opacity='0.800000'>
	<line x1='1543.050000' y1='1085.850000' x2='1543.050000' y2='1009.650000' stroke-width='0.300000' stroke='#888888' stroke-linecap='round'/>
	<line x1='1362.570000' y1='963.930000' x2='1543.050000' y2='1085.850000' stroke-width='0.300000' stroke='#888888' stroke-linecap='round'/>
	<line x1='1362.570000' y1='963.930000' x2='1543.050000' y2='1162.050000' stroke-width='0.300000' stroke='#888888' stroke-linecap='round'/>
	<line x1='1362.570000' y1='1342.530000' x2='1362.570000' y2='963.930000' stroke-width='3.000000' stroke='#888888' stroke-linecap='round'/>
	<line x1='1543.050000' y1='1162.050000' x2='1543.050000' y2='1085.850000' stroke-width='0.300000' stroke='#888888' stroke-linecap='round'/>
	<line x1='1362.570000' y1='1342.530000' x2='1543.050000' y2='1162.050000' stroke-width='0.300000' stroke='#888888' stroke-linecap='round'/>
	<line x1='1362.570000' y1='1342.530000' x2='1626.824010' y2='1342.530000' stroke-width='3.000000' stroke='#888888' stroke-linecap='round'/>
	<text x='1543.050000' y='1162.050000' font-size='15.000000' stroke-width='0.300000' stroke='#888888' fill='#888888'>P3</text>
	<text x='1584.693630' y='1120.406370' font-size='15.000000' stroke-width='0.300000' stroke='#888888' fill='#888888'>P13</text>
	<line x1='1543.050000' y1='963.930000' x2='1573.530000' y2='963.930000' stroke-width='3.000000' stroke='#888888' stroke-linecap='round'/>
	<line x1='1543.050000' y1='1009.650000' x2='1543.050000' y2='963.930000' stroke-width='3.000000' stroke='#888888' stroke-linecap='round'/>
	<text x='1543.050000' y='1009.650000' font-size='15.000000' stroke-width='0.300000' stroke='#888888' fill='#888888'>P1</text>
	<text x='1543.050000' y='1085.850000' font-size='15.000000' stroke-width='0.300000' stroke='#888888' fill='#888888'>P2</text>
	<line x1='1512.570000' y1='963.930000' x2='1543.050000' y2='963.930000' stroke-width='3.000000' stroke='#888888' stroke-linecap='round'/>
	<text x='1362.570000' y='1342.530000' font-size='15.000000' stroke-width='0.300000' stroke='#888888' fill='#888888'>P16</text>
	<line x1='1573.530000' y1='752.970000' x2='2020.710000' y2='752.970000' stroke-width='3.000000' stroke='#888888' stroke-linecap='round'/>
	<line x1='1573.530000' y1='752.970000' x2='1771.650000' y2='933.450000' stroke-width='0.300000' stroke='#888888' stroke-linecap='round'/>
	<line x1='1573.530000' y1='902.970000' x2='1573.530000' y2='752.970000' stroke-width='3.000000' stroke='#888888' stroke-linecap='round'/>
	<line x1='1771.650000' y1='1085.850000' x2='1771.650000' y2='1009.650000' stroke-width='0.300000' stroke='#888888' stroke-linecap='round'/>
	<line x1='1771.650000' y1='1085.850000' x2='2020.710000' y2='1009.650000' stroke-width='0.300000' stroke='#888888' stroke-linecap='round'/>
	<line x1='1771.650000' y1='1009.650000' x2='2020.710000' y2='1009.650000' stroke-width='3.000000' stroke='#888888' stroke-linecap='round'/>
	<line x1='1771.650000' y1='933.450000' x2='2020.710000' y2='1009.650000' stroke-width='0.300000' stroke='#888888' stroke-linecap='round'/>
	<text x='1771.650000' y='1009.650000' font-size='15.000000' stroke-width='0.300000' stroke='#888888' fill='#888888'>P5</text>
	<line x1='2020.710000' y1='1009.650000' x2='2020.710000' y2='752.970000' stroke-width='3.000000' stroke='#888888' stroke-linecap='round'/>
	<line x1='1573.530000' y1='933.450000' x2='1573.530000' y2='902.970000' stroke-width='3.000000' stroke='#888888' stroke-linecap='round'/>
	<line x1='1573.530000' y1='933.450000' x2='1771.650000' y2='933.450000' stroke-width='3.000000' stroke='#888888' stroke-linecap='round'/>
	<text x='1771.650000' y='933.450000' font-size='15.000000' stroke-width='0.300000' stroke='#888888' fill='#888888'>P4</text>
	<line x1='1573.530000' y1='963.930000' x2='1573.530000' y2='933.450000' stroke-width='3.000000' stroke='#888888' stroke-linecap='round'/>
	<line x1='1771.650000' y1='933.450000' x2='2020.710000' y2='752.970000' stroke-width='0.300000' stroke='#888888' stroke-linecap='round'/>
	<line x1='1771.650000' y1='1009.650000' x2='1771.650000' y2='933.450000' stroke-width='0.300000' stroke='#888888' stroke-linecap='round'/>
	<text x='2020.710000' y='752.970000' font-size='15.000000' stroke-width='0.300000' stroke='#888888' fill='#888888'>P15</text>
	<text x='2020.710000' y='1009.650000' font-size='15.000000' stroke-width='0.300000' stroke='#888888' fill='#888888'>P20</text>
	<line x1='1771.650000' y1='1162.050000' x2='1771.650000' y2='1085.850000' stroke-width='0.300000' stroke='#888888' stroke-linecap='round'/>
	<line x1='1771.650000' y1='1162.050000' x2='2020.710000' y2='1009.650000' stroke-width='0.300000' stroke='#888888' stroke-linecap='round'/>
	<text x='1771.650000' y='1085.850000' font-size='15.000000' stroke-width='0.300000' stroke='#888888' fill='#888888'>P6</text>
	<line x1='1771.650000' y1='1162.050000' x2='2020.710000' y2='1342.530000' stroke-width='0.300000' stroke='#888888' stroke-linecap='round'/>
	<line x1='2020.710000' y1='1342.530000' x2='2020.710000' y2='1009.650000' stroke-width='3.000000' stroke='#888888' stroke-linecap='round'/>
	<line x1='1626.824010' y1='1342.530000' x2='2020.710000' y2='1342.530000' stroke-width='3.000000' stroke='#888888' stroke-linecap='round'/>
	<text x='2020.710000' y='1342.530000' font-size='15.000000' stroke-width='0.300000' stroke='#888888' fill='#888888'>P17</text>
	<text x='1771.650000' y='1162.050000' font-size='15.000000' stroke-width='0.300000' stroke='#888888' fill='#888888'>P7</text>
	<line x1='1543.050000' y1='1085.850000' x2='1584.693630' y2='1120.406370' stroke-width='0.300000' stroke='#888888' stroke-linecap='round'/>
	<line x1='1543.050000' y1='1009.650000' x2='1584.693630' y2='1120.406370' stroke-width='0.300000' stroke='#888888' stroke-linecap='round'/>
	<line x1='1543.050000' y1='1162.050000' x2='1584.693630' y2='1120.406370' stroke-width='0.300000' stroke='#888888' stroke-linecap='round'/>
	<line x1='1543.050000' y1='1162.050000' x2='1626.824010' y2='1172.075040' stroke-width='0.300000' stroke='#888888' stroke-linecap='round'/>
	<line x1='1584.693630' y1='1120.406370' x2='1626.824010' y2='1172.075040' stroke-width='0.300000' stroke='#888888' stroke-linecap='round'/>
	<line x1='1543.050000' y1='1162.050000' x2='1626.824010' y2='1342.530000' stroke-width='0.300000' stroke='#888888' stroke-linecap='round'/>
	<line x1='1626.824010' y1='1342.530000' x2='1626.824010' y2='1172.075040' stroke-width='3.000000' stroke='#888888' stroke-linecap='round'/>
	<line x1='1573.530000' y1='902.970000' x2='1771.650000' y2='933.450000' stroke-width='0.300000' stroke='#888888' stroke-linecap='round'/>
	<line x1='1573.530000' y1='963.930000' x2='1771.650000' y2='933.450000' stroke-width='0.300000' stroke='#888888' stroke-linecap='round'/>
	<line x1='1573.530000' y1='963.930000' x2='1584.693630' y2='1120.406370' stroke-width='0.300000' stroke='#888888' stroke-linecap='round'/>
	<line x1='1584.693630' y1='1120.406370' x2='1771.650000' y2='1085.850000' stroke-width='0.300000' stroke='#888888' stroke-linecap='round'/>
	<line x1='1626.824010' y1='1172.075040' x2='1771.650000' y2='1085.850000' stroke-width='0.300000' stroke='#888888' stroke-linecap='round'/>
	<line x1='1626.824010' y1='1172.075040' x2='1771.650000' y2='1162.050000' stroke-width='0.300000' stroke='#888888' stroke-linecap='round'/>
	<line x1='1573.530000' y1='963.930000' x2='1771.650000' y2='1009.650000' stroke-width='0.300000' stroke='#888888' stroke-linecap='round'/>
	<line x1='1584.693630' y1='1120.406370' x2='1771.650000' y2='1009.650000' stroke-width='0.300000' stroke='#888888' stroke-linecap='round'/>
	<line x1='1626.824010' y1='1342.530000' x2='1771.650000' y2='1162.050000' stroke-width='0.300000' stroke='#888888' stroke-linecap='round'/>
	<text x='1626.824010' y='1172.075040' font-size='15.000000' stroke-width='0.300000' stroke='#888888' fill='#888888'>P8</text>
	<text x='1626.824010' y='1342.530000' font-size='15.000000' stroke-width='0.300000' stroke='#888888' fill='#888888'>P21</text>
	<line x1='1362.570000' y1='752.970000' x2='1512.570000' y2='902.970000' stroke-width='0.300000' stroke='#888888' stroke-linecap='round'/>
	<line x1='1362.570000' y1='963.930000' x2='1512.570000' y2='902.970000' stroke-width='0.300000' stroke='#888888' stroke-linecap='round'/>
	<line x1='1362.570000' y1='752.970000' x2='1573.530000' y2='752.970000' stroke-width='3.000000' stroke='#888888' stroke-linecap='round'/>
	<line x1='1543.050000' y1='933.450000' x2='1573.530000' y2='933.450000' stroke-width='0.300000' stroke='#888888' stroke-linecap='round'/>
	<text x='1543.050000' y='933.450000' font-size='15.000000' stroke-width='0.300000' stroke='#888888' fill='#888888'>P0</text>
	<text x='1512.570000' y='902.970000' font-size='15.000000' stroke-width='0.300000' stroke='#888888' fill='#888888'>P10</text>
	<line x1='1512.570000' y1='902.970000' x2='1543.050000' y2='933.450000' stroke-width='0.300000' stroke='#888888' stroke-linecap='round'/>
	<line x1='1512.570000' y1='963.930000' x2='1512.570000' y2='902.970000' stroke-width='3.000000' stroke='#888888' stroke-linecap='round'/>
	<line x1='1543.050000' y1='963.930000' x2='1543.050000' y2='933.450000' stroke-width='0.300000' stroke='#888888' stroke-linecap='round'/>
	<text x='1362.570000' y='752.970000' font-size='15.000000' stroke-width='0.300000' stroke='#888888' fill='#888888'>P14</text>
	<text x='1362.570000' y='963.930000' font-size='15.000000' stroke-width='0.300000' stroke='#888888' fill='#888888'>P18</text>
	<text x='1573.530000' y='752.970000' font-size='15.000000' stroke-width='0.300000' stroke='#888888' fill='#888888'>P19</text>
	<text x='1543.050000' y='963.930000' font-size='15.000000' stroke-width='0.300000' stroke='#888888' fill='#888888'>P22</text>
	<text x='1573.530000' y='933.450000' font-size='15.000000' stroke-width='0.300000' stroke='#888888' fill='#888888'>P23</text>
	<line x1='1512.570000' y1='963.930000' x2='1543.050000' y2='933.450000' stroke-width='0.300000' stroke='#888888' stroke-linecap='round'/>
	<line x1='1543.050000' y1='933.450000' x2='1573.530000' y2='902.970000' stroke-width='0.300000' stroke='#888888' stroke-linecap='round'/>
	<line x1='1512.570000' y1='902.970000' x2='1573.530000' y2='902.970000' stroke-width='3.000000' stroke='#888888' stroke-linecap='round'/>
	<line x1='1512.570000' y1='963.930000' x2='1543.050000' y2='1009.650000' stroke-width='0.300000' stroke='#888888' stroke-linecap='round'/>
	<line x1='1543.050000' y1='1009.650000' x2='1573.530000' y2='963.930000' stroke-width='0.300000' stroke='#888888' stroke-linecap='round'/>
	<line x1='1543.050000' y1='933.450000' x2='1573.530000' y2='963.930000' stroke-width='0.300000' stroke='#888888' stroke-linecap='round'/>
	<text x='1512.570000' y='963.930000' font-size='15.000000' stroke-width='0.300000' stroke='#888888' fill='#888888'>P9</text>
	<text x='1573.530000' y='902.970000' font-size='15.000000' stroke-width='0.300000' stroke='#888888' fill='#888888'>P11</text>
	<text x='1573.530000' y='963.930000' font-size='15.000000' stroke-width='0.300000' stroke='#888888' fill='#888888'>P12</text>
	<line x1='1362.570000' y1='963.930000' x2='1362.570000' y2='752.970000' stroke-width='3.000000' stroke='#888888' stroke-linecap='round'/>
	<line x1='1362.570000' y1='963.930000' x2='1512.570000' y2='963.930000' stroke-width='3.000000' stroke='#888888' stroke-linecap='round'/>
	<line x1='1362.570000' y1='963.930000' x2='1543.050000' y2='1009.650000' stroke-width='0.300000' stroke='#888888' stroke-linecap='round'/>
	<line x1='1512.570000' y1='902.970000' x2='1573.530000' y2='752.970000' stroke-width='0.300000' stroke='#888888' stroke-linecap='round'/>
</g>
<g id='laa' opacity='0.800000'>
	<line x1='1362.570000' y1='963.930000' x2='1512.570000' y2='963.930000' stroke-width='6.000000' stroke='#6666aa' stroke-linecap='round'/>
	<line x1='1573.530000' y1='752.970000' x2='1573.530000' y2='902.970000' stroke-width='6.000000' stroke='#6666aa' stroke-linecap='round'/>
	<line x1='2020.710000' y1='1009.650000' x2='1771.650000' y2='1009.650000' stroke-width='6.000000' stroke='#6666aa' stroke-linecap='round'/>
	<line x1='1626.824010' y1='1342.530000' x2='1626.824010' y2='1172.075040' stroke-width='6.000000' stroke='#6666aa' stroke-linecap='round'/>
	<line x1='1543.050000' y1='963.930000' x2='1543.050000' y2='1009.650000' stroke-width='6.000000' stroke='#6666aa' stroke-linecap='round'/>
	<line x1='1573.530000' y1='933.450000' x2='1771.650000' y2='933.450000' stroke-width='6.000000' stroke='#6666aa' stroke-linecap='round'/>
</g>
<g id='crossings' opacity='0.800000'>
	<text x='1515.427500' y='961.072500' font-size='7.500000' stroke-width='0.150000' stroke='#ff0000' fill='#ff0000'>169</text>
	<text x='1538.287500' y='938.212500' font-size='7.500000' stroke-width='0.150000' stroke='#ff0000' fill='#ff0000'>170</text>
	<text x='1515.427500' y='968.216250' font-size='7.500000' stroke-width='0.150000' stroke='#ff0000' fill='#ff0000'>171</text>
	<text x='1515.427500' y='963.930000' font-size='7.500000' stroke-width='0.150000' stroke='#ff0000' fill='#ff0000'>259</text>
	<text x='1538.287500' y='963.930000' font-size='7.500000' stroke-width='0.150000' stroke='#ff0000' fill='#ff0000'>260</text>
	<text x='1568.767500' y='959.167500' font-size='7.500000' stroke-width='0.150000' stroke='#ff0000' fill='#ff0000'>188</text>
	<text x='1573.593448' y='963.920239' font-size='7.500000' stroke-width='0.150000' stroke='#ff0000' fill='#ff0000'>270</text>
	<text x='1573.595208' y='963.945048' font-size='7.500000' stroke-width='0.150000' stroke='#ff0000' fill='#ff0000'>269</text>
	<text x='1573.530000' y='962.501250' font-size='7.500000' stroke-width='0.150000' stroke='#ff0000' fill='#ff0000'>265</text>
	<text x='1573.530000' y='963.834554' font-size='7.500000' stroke-width='0.150000' stroke='#ff0000' fill='#ff0000'>271</text>
	<text x='1568.767500' y='971.073750' font-size='7.500000' stroke-width='0.150000' stroke='#ff0000' fill='#ff0000'>186</text>
	<text x='1582.816875' y='962.501250' font-size='7.500000' stroke-width='0.150000' stroke='#ff0000' fill='#ff0000'>189</text>
	<text x='1582.816875' y='966.073125' font-size='7.500000' stroke-width='0.150000' stroke='#ff0000' fill='#ff0000'>191</text>
	<text x='1568.767500' y='963.930000' font-size='7.500000' stroke-width='0.150000' stroke='#ff0000' fill='#ff0000'>256</text>
	<text x='1574.576590' y='978.599660' font-size='7.500000' stroke-width='0.150000' stroke='#ff0000' fill='#ff0000'>197</text>
	<text x='1543.050000' y='961.072500' font-size='7.500000' stroke-width='0.150000' stroke='#ff0000' fill='#ff0000'>253</text>
	<text x='1543.050000' y='971.073750' font-size='7.500000' stroke-width='0.150000' stroke='#ff0000' fill='#ff0000'>258</text>
	<text x='1543.050000' y='938.212500' font-size='7.500000' stroke-width='0.150000' stroke='#ff0000' fill='#ff0000'>254</text>
	<text x='1573.530000' y='939.641250' font-size='7.500000' stroke-width='0.150000' stroke='#ff0000' fill='#ff0000'>266</text>
	<text x='1545.907500' y='963.930000' font-size='7.500000' stroke-width='0.150000' stroke='#ff0000' fill='#ff0000'>255</text>
	<text x='1543.050000' y='1021.556250' font-size='7.500000' stroke-width='0.150000' stroke='#ff0000' fill='#ff0000'>148</text>
	<text x='1538.287500' y='1002.506250' font-size='7.500000' stroke-width='0.150000' stroke='#ff0000' fill='#ff0000'>172</text>
	<text x='1545.907500' y='1005.363750' font-size='7.500000' stroke-width='0.150000' stroke='#ff0000' fill='#ff0000'>185</text>
	<text x='1543.050000' y='1005.363750' font-size='7.500000' stroke-width='0.150000' stroke='#ff0000' fill='#ff0000'>257</text>
	<text x='1543.050000' y='1078.706250' font-size='7.500000' stroke-width='0.150000' stroke='#ff0000' fill='#ff0000'>147</text>
	<text x='1543.050000' y='1097.756250' font-size='7.500000' stroke-width='0.150000' stroke='#ff0000' fill='#ff0000'>150</text>
	<text x='1546.954090' y='1089.089660' font-size='7.500000' stroke-width='0.150000' stroke='#ff0000' fill='#ff0000'>193</text>
	<text x='1578.186813' y='1115.006937' font-size='7.500000' stroke-width='0.150000' stroke='#ff0000' fill='#ff0000'>194</text>
	<text x='1578.186813' y='1103.100687' font-size='7.500000' stroke-width='0.150000' stroke='#ff0000' fill='#ff0000'>196</text>
	<text x='1546.954090' y='1020.033410' font-size='7.500000' stroke-width='0.150000' stroke='#ff0000' fill='#ff0000'>195</text>
	<text x='1582.949313' y='1095.956937' font-size='7.500000' stroke-width='0.150000' stroke='#ff0000' fill='#ff0000'>198</text>
	<text x='1602.220790' y='1110.022960' font-size='7.500000' stroke-width='0.150000' stroke='#ff0000' fill='#ff0000'>199</text>
	<text x='1602.220790' y='1117.166710' font-size='7.500000' stroke-width='0.150000' stroke='#ff0000' fill='#ff0000'>201</text>
	<text x='1588.643353' y='1125.250308' font-size='7.500000' stroke-width='0.150000' stroke='#ff0000' fill='#ff0000'>203</text>
	<text x='1578.186813' y='1126.913187' font-size='7.500000' stroke-width='0.150000' stroke='#ff0000' fill='#ff0000'>206</text>
	<text x='1564.005000' y='902.970000' font-size='7.500000' stroke-width='0.150000' stroke='#ff0000' fill='#ff0000'>184</text>
	<text x='1615.453125' y='752.970000' font-size='7.500000' stroke-width='0.150000' stroke='#ff0000' fill='#ff0000'>221</text>
	<text x='1592.103750' y='769.890000' font-size='7.500000' stroke-width='0.150000' stroke='#ff0000' fill='#ff0000'>223</text>
	<text x='1573.530000' y='888.907500' font-size='7.500000' stroke-width='0.150000' stroke='#ff0000' fill='#ff0000'>225</text>
	<text x='1573.530000' y='776.407500' font-size='7.500000' stroke-width='0.150000' stroke='#ff0000' fill='#ff0000'>226</text>
	<text x='1564.005000' y='776.407500' font-size='7.500000' stroke-width='0.150000' stroke='#ff0000' fill='#ff0000'>228</text>
	<text x='1515.427500' y='905.827500' font-size='7.500000' stroke-width='0.150000' stroke='#ff0000' fill='#ff0000'>173</text>
	<text x='1592.103750' y='905.827500' font-size='7.500000' stroke-width='0.150000' stroke='#ff0000' fill='#ff0000'>179</text>
	<text x='1568.767500' y='907.732500' font-size='7.500000' stroke-width='0.150000' stroke='#ff0000' fill='#ff0000'>182</text>
	<text x='1573.530000' y='907.732500' font-size='7.500000' stroke-width='0.150000' stroke='#ff0000' fill='#ff0000'>262</text>
	<text x='1518.285000' y='888.907500' font-size='7.500000' stroke-width='0.150000' stroke='#ff0000' fill='#ff0000'>227</text>
	<text x='1540.567500' y='752.970000' font-size='7.500000' stroke-width='0.150000' stroke='#ff0000' fill='#ff0000'>230</text>
	<text x='1538.287500' y='928.687500' font-size='7.500000' stroke-width='0.150000' stroke='#ff0000' fill='#ff0000'>174</text>
	<text x='1545.907500' y='930.592500' font-size='7.500000' stroke-width='0.150000' stroke='#ff0000' fill='#ff0000'>181</text>
	<text x='1545.907500' y='933.450000' font-size='7.500000' stroke-width='0.150000' stroke='#ff0000' fill='#ff0000'>267</text>
	<text x='1545.907500' y='936.307500' font-size='7.500000' stroke-width='0.150000' stroke='#ff0000' fill='#ff0000'>187</text>
	<text x='1573.530000' y='930.592500' font-size='7.500000' stroke-width='0.150000' stroke='#ff0000' fill='#ff0000'>261</text>
	<text x='1592.103750' y='933.450000' font-size='7.500000' stroke-width='0.150000' stroke='#ff0000' fill='#ff0000'>263</text>
	<text x='1568.767500' y='933.450000' font-size='7.500000' stroke-width='0.150000' stroke='#ff0000' fill='#ff0000'>268</text>
	<text x='1512.570000' y='958.215000' font-size='7.500000' stroke-width='0.150000' stroke='#ff0000' fill='#ff0000'>175</text>
	<text x='1514.850000' y='1002.506250' font-size='7.500000' stroke-width='0.150000' stroke='#ff0000' fill='#ff0000'>214</text>
	<text x='1514.850000' y='1066.800000' font-size='7.500000' stroke-width='0.150000' stroke='#ff0000' fill='#ff0000'>216</text>
	<text x='1514.850000' y='1131.093750' font-size='7.500000' stroke-width='0.150000' stroke='#ff0000' fill='#ff0000'>218</text>
	<text x='1512.570000' y='912.495000' font-size='7.500000' stroke-width='0.150000' stroke='#ff0000' fill='#ff0000'>176</text>
	<text x='1794.999375' y='916.530000' font-size='7.500000' stroke-width='0.150000' stroke='#ff0000' fill='#ff0000'>153</text>
	<text x='1771.650000' y='945.356250' font-size='7.500000' stroke-width='0.150000' stroke='#ff0000' fill='#ff0000'>156</text>
	<text x='1740.693750' y='928.687500' font-size='7.500000' stroke-width='0.150000' stroke='#ff0000' fill='#ff0000'>180</text>
	<text x='1731.406875' y='939.641250' font-size='7.500000' stroke-width='0.150000' stroke='#ff0000' fill='#ff0000'>190</text>
	<text x='1794.999375' y='940.593750' font-size='7.500000' stroke-width='0.150000' stroke='#ff0000' fill='#ff0000'>235</text>
	<text x='1740.693750' y='933.450000' font-size='7.500000' stroke-width='0.150000' stroke='#ff0000' fill='#ff0000'>264</text>
	<text x='1771.650000' y='1002.506250' font-size='7.500000' stroke-width='0.150000' stroke='#ff0000' fill='#ff0000'>155</text>
	<text x='1771.650000' y='1078.706250' font-size='7.500000' stroke-width='0.150000' stroke='#ff0000' fill='#ff0000'>157</text>
	<text x='1771.650000' y='1021.556250' font-size='7.500000' stroke-width='0.150000' stroke='#ff0000' fill='#ff0000'>158</text>
	<text x='1731.406875' y='1000.363125' font-size='7.500000' stroke-width='0.150000' stroke='#ff0000' fill='#ff0000'>192</text>
	<text x='1742.438067' y='1026.955683' font-size='7.500000' stroke-width='0.150000' stroke='#ff0000' fill='#ff0000'>200</text>
	<text x='1740.693750' y='905.250000' font-size='7.500000' stroke-width='0.150000' stroke='#ff0000' fill='#ff0000'>224</text>
	<text x='1794.999375' y='1078.706250' font-size='7.500000' stroke-width='0.150000' stroke='#ff0000' fill='#ff0000'>231</text>
	<text x='1794.999375' y='1009.650000' font-size='7.500000' stroke-width='0.150000' stroke='#ff0000' fill='#ff0000'>233</text>
	<text x='1771.650000' y='1154.906250' font-size='7.500000' stroke-width='0.150000' stroke='#ff0000' fill='#ff0000'>159</text>
	<text x='1749.020939' y='1163.616413' font-size='7.500000' stroke-width='0.150000' stroke='#ff0000' fill='#ff0000'>168</text>
	<text x='1749.020939' y='1190.250000' font-size='7.500000' stroke-width='0.150000' stroke='#ff0000' fill='#ff0000'>248</text>
	<text x='1771.650000' y='1097.756250' font-size='7.500000' stroke-width='0.150000' stroke='#ff0000' fill='#ff0000'>160</text>
	<text x='1749.020939' y='1099.322662' font-size='7.500000' stroke-width='0.150000' stroke='#ff0000' fill='#ff0000'>166</text>
	<text x='1742.438067' y='1091.249433' font-size='7.500000' stroke-width='0.150000' stroke='#ff0000' fill='#ff0000'>202</text>
	<text x='1794.999375' y='1178.970000' font-size='7.500000' stroke-width='0.150000' stroke='#ff0000' fill='#ff0000'>161</text>
	<text x='1794.999375' y='1147.762500' font-size='7.500000' stroke-width='0.150000' stroke='#ff0000' fill='#ff0000'>241</text>
	<text x='1550.903813' y='1162.989847' font-size='7.500000' stroke-width='0.150000' stroke='#ff0000' fill='#ff0000'>163</text>
	<text x='1613.734321' y='1170.508627' font-size='7.500000' stroke-width='0.150000' stroke='#ff0000' fill='#ff0000'>164</text>
	<text x='1546.954090' y='1158.145910' font-size='7.500000' stroke-width='0.150000' stroke='#ff0000' fill='#ff0000'>205</text>
	<text x='1550.903813' y='1178.970000' font-size='7.500000' stroke-width='0.150000' stroke='#ff0000' fill='#ff0000'>243</text>
	<text x='1640.401447' y='1163.991442' font-size='7.500000' stroke-width='0.150000' stroke='#ff0000' fill='#ff0000'>165</text>
	<text x='1640.401447' y='1171.135192' font-size='7.500000' stroke-width='0.150000' stroke='#ff0000' fill='#ff0000'>167</text>
	<text x='1620.241138' y='1164.001810' font-size='7.500000' stroke-width='0.150000' stroke='#ff0000' fill='#ff0000'>204</text>
	<text x='1613.734321' y='1314.330000' font-size='7.500000' stroke-width='0.150000' stroke='#ff0000' fill='#ff0000'>244</text>
	<text x='1626.824010' y='1326.549847' font-size='7.500000' stroke-width='0.150000' stroke='#ff0000' fill='#ff0000'>245</text>
	<text x='1585.534321' y='1342.530000' font-size='7.500000' stroke-width='0.150000' stroke='#ff0000' fill='#ff0000'>252</text>
	<text x='1626.824010' y='1198.708627' font-size='7.500000' stroke-width='0.150000' stroke='#ff0000' fill='#ff0000'>246</text>
	<text x='1640.401447' y='1325.610000' font-size='7.500000' stroke-width='0.150000' stroke='#ff0000' fill='#ff0000'>247</text>
	<text x='1663.750822' y='1342.530000' font-size='7.500000' stroke-width='0.150000' stroke='#ff0000' fill='#ff0000'>249</text>
	<text x='1376.632500' y='767.032500' font-size='7.500000' stroke-width='0.150000' stroke='#ff0000' fill='#ff0000'>177</text>
	<text x='1489.132500' y='879.532500' font-size='7.500000' stroke-width='0.150000' stroke='#ff0000' fill='#ff0000'>178</text>
	<text x='1362.570000' y='785.932500' font-size='7.500000' stroke-width='0.150000' stroke='#ff0000' fill='#ff0000'>208</text>
	<text x='1382.347500' y='752.970000' font-size='7.500000' stroke-width='0.150000' stroke='#ff0000' fill='#ff0000'>229</text>
	<text x='1518.285000' y='902.970000' font-size='7.500000' stroke-width='0.150000' stroke='#ff0000' fill='#ff0000'>183</text>
	<text x='1362.570000' y='944.152500' font-size='7.500000' stroke-width='0.150000' stroke='#ff0000' fill='#ff0000'>207</text>
	<text x='1489.132500' y='912.495000' font-size='7.500000' stroke-width='0.150000' stroke='#ff0000' fill='#ff0000'>210</text>
	<text x='1543.050000' y='1154.906250' font-size='7.500000' stroke-width='0.150000' stroke='#ff0000' fill='#ff0000'>149</text>
	<text x='1379.490000' y='1325.610000' font-size='7.500000' stroke-width='0.150000' stroke='#ff0000' fill='#ff0000'>151</text>
	<text x='1514.850000' y='1190.250000' font-size='7.500000' stroke-width='0.150000' stroke='#ff0000' fill='#ff0000'>152</text>
	<text x='1362.570000' y='1307.036250' font-size='7.500000' stroke-width='0.150000' stroke='#ff0000' fill='#ff0000'>219</text>
	<text x='1387.343813' y='1342.530000' font-size='7.500000' stroke-width='0.150000' stroke='#ff0000' fill='#ff0000'>251</text>
	<text x='1376.632500' y='958.215000' font-size='7.500000' stroke-width='0.150000' stroke='#ff0000' fill='#ff0000'>209</text>
	<text x='1376.632500' y='963.930000' font-size='7.500000' stroke-width='0.150000' stroke='#ff0000' fill='#ff0000'>211</text>
	<text x='1489.132500' y='963.930000' font-size='7.500000' stroke-width='0.150000' stroke='#ff0000' fill='#ff0000'>212</text>
	<text x='1379.490000' y='968.216250' font-size='7.500000' stroke-width='0.150000' stroke='#ff0000' fill='#ff0000'>213</text>
	<text x='1379.490000' y='975.360000' font-size='7.500000' stroke-width='0.150000' stroke='#ff0000' fill='#ff0000'>215</text>
	<text x='1379.490000' y='982.503750' font-size='7.500000' stroke-width='0.150000' stroke='#ff0000' fill='#ff0000'>217</text>
	<text x='1362.570000' y='1023.086250' font-size='7.500000' stroke-width='0.150000' stroke='#ff0000' fill='#ff0000'>220</text>
	<text x='1981.794375' y='781.170000' font-size='7.500000' stroke-width='0.150000' stroke='#ff0000' fill='#ff0000'>154</text>
	<text x='1950.838125' y='752.970000' font-size='7.500000' stroke-width='0.150000' stroke='#ff0000' fill='#ff0000'>222</text>
	<text x='1981.794375' y='997.743750' font-size='7.500000' stroke-width='0.150000' stroke='#ff0000' fill='#ff0000'>236</text>
	<text x='2020.710000' y='985.586250' font-size='7.500000' stroke-width='0.150000' stroke='#ff0000' fill='#ff0000'>237</text>
	<text x='2020.710000' y='793.076250' font-size='7.500000' stroke-width='0.150000' stroke='#ff0000' fill='#ff0000'>238</text>
	<text x='1981.794375' y='1314.330000' font-size='7.500000' stroke-width='0.150000' stroke='#ff0000' fill='#ff0000'>162</text>
	<text x='1981.794375' y='1021.556250' font-size='7.500000' stroke-width='0.150000' stroke='#ff0000' fill='#ff0000'>232</text>
	<text x='1981.794375' y='1009.650000' font-size='7.500000' stroke-width='0.150000' stroke='#ff0000' fill='#ff0000'>234</text>
	<text x='1981.794375' y='1033.462500' font-size='7.500000' stroke-width='0.150000' stroke='#ff0000' fill='#ff0000'>242</text>
	<text x='2020.710000' y='1311.322500' font-size='7.500000' stroke-width='0.150000' stroke='#ff0000' fill='#ff0000'>239</text>
	<text x='2020.710000' y='1061.662500' font-size='7.500000' stroke-width='0.150000' stroke='#ff0000' fill='#ff0000'>240</text>
	<text x='1959.165314' y='1342.530000' font-size='7.500000' stroke-width='0.150000' stroke='#ff0000' fill='#ff0000'>250</text>
</g>
<g id='route' opacity='0.800000'>
	<line x1='1543.050000' y1='933.450000' x2='1573.530000' y2='963.834554' stroke-width='6.000000' stroke='#00ff00' stroke-linecap='round'/>
	<line x1='1573.530000' y1='963.834554' x2='1573.530000' y2='963.834554' stroke-width='6.000000' stroke='#00ff00' stroke-linecap='round'/>
	<line x1='1573.530000' y1='963.834554' x2='1573.593448' y2='963.920239' stroke-width='6.000000' stroke='#00ff00' stroke-linecap='round'/>
	<line x1='1573.593448' y1='963.920239' x2='1573.595208' y2='963.945048' stroke-width='6.000000' stroke='#00ff00' stroke-linecap='round'/>
	<line x1='1584.693630' y1='1120.406370' x2='1573.595208' y2='963.945048' stroke-width='6.000000' stroke='#00ff00' stroke-linecap='round'/>
</g>
</svg>