 pt 40.000000;10.000000 cop;clr=1.500000;1.000000
 pt 50.000000;60.000000 cop;clr=1.500000;1.000000
 pt 60.000000;10.000000 cop;clr=1.500000;1.000000
 pt 50.000000;68.000000 cop;clr=1.500000;2.000000
 twonet 5
