 pt 10.000000;10.000000 cop;clr=2.000000;1.000000
 pt 30.000000;10.000000 cop;clr=2.000000;1.000000
  seg convex 0:
   arc cvx use=0 2.000000:3.191304 -> 1.722443 [3.191304 4.913747]
   arc cvx use=1 4.000000:4.913747 -> -1.722443 [3.191304 4.913747] tn=5
 pt 50.000000;10.000000 cop;clr=2.000000;1.000000
 pt 20.000000;50.000000 cop;clr=2.000000;1.000000
  seg convex 0:
   arc cvx use=0 2.000000:0.049712 -> 2.944069 [0.049712 2.993781]
   arc cvx use=1 4.000000:0.049712 -> 2.944069 [0.049712 2.993781] tn=5
 twonet 5
  arc cvx use=1 center=50.000000;10.000000 r=0.000000 a=-2.940235;0.000000
  line 50.000000;10.000000 .. 30.800000;6.080816
  arc cvx use=1 center=30.000000;10.000000 r=4.000000 a=4.913747;-1.722443
  line 26.004941;9.801235 .. 23.995059;50.198765
  arc cvx use=1 center=20.000000;50.000000 r=4.000000 a=0.049712;2.944069
  line 16.043617;50.589096 .. 10.000000;10.000000
  arc cvx use=1 center=10.000000;10.000000 r=0.000000 a=1.422985;0.000000
