 pt 50.000000;10.000000 cop;clr=2.000000;1.000000
 pt 50.000000;30.000000 cop;clr=2.000000;1.000000
  seg convex 0:
   arc cvx use=0 2.000000:6.081827 -> 0.335090 [6.081827 6.416917]
   arc cvx use=1 4.000000:6.416917 -> -0.335090 [6.081827 6.416917] tn=4
  seg convex 1:
   arc cvx use=0 2.000000:3.007861 -> 0.335090 [3.007861 3.342951]
   arc cvx use=1 4.000000:3.007861 -> 0.335090 [3.007861 3.342951] tn=11
 pt 50.000000;60.000000 cop;clr=2.000000;1.000000
 twonet 4
  arc cvx use=1 center=50.000000;60.000000 r=0.000000 a=-1.437065;0.000000
  line 50.000000;60.000000 .. 53.964285;30.533333
  arc cvx use=1 center=50.000000;30.000000 r=4.000000 a=6.416917;-0.335090
  line 53.919184;29.200000 .. 50.000000;10.000000
  arc cvx use=1 center=50.000000;10.000000 r=0.000000 a=1.369438;0.000000
 twonet 11
  arc cvx use=1 center=50.000000;60.000000 r=0.000000 a=-1.704528;0.000000
  line 50.000000;60.000000 .. 46.035715;30.533333
  arc cvx use=1 center=50.000000;30.000000 r=4.000000 a=3.007861;0.335090
  line 46.080816;29.200000 .. 50.000000;10.000000
  arc cvx use=1 center=50.000000;10.000000 r=0.000000 a=1.772154;0.000000
