digraph cases {

	conflict [shape=square]
	switch [label="switch\nlayer" shape=square]
	stay [label="stay on\nlayer" shape=square]

	via0 [label="V1\nno new vias,\nswitch on\nendpoints"]
	via1 [label="V2\none new via,\nswitch on\n1 endpoint"]
	via2 [label="V3\ntwo\nnew\nvias"]

	in0 [label="both ends\noutside" shape=square]
	in1 [label="one end\noutside" shape=square]
	in2 [label="both ends\ninside" shape=square]

	cross0 [label="S1\ncrossing\nor too\nclose to\nobstacle\nCW or CCW"]
	cross1 [label="S2\ncrossing\nobstacle\nCW or CCW"]
	cross2 [label="S3\ncrossing\nor too\nclose to\nobstacle\n"]


	conflict -> switch
	conflict -> stay

	switch -> via0
	switch -> via1
	switch -> via2

	stay -> in0
	stay -> in1
	stay -> in2

	in0 -> cross0
	in1 -> cross1
	in2 -> cross2
}
