 pt 100.000000;100.000000 cop;clr=4.000000;4.000000
  seg concave 0:
   arc cnc use=0 4.000000:0.785398 -> 0.430492 [0.785398 1.215890]
   arc cnc use=1 12.600000:0.785398 -> 0.430492 [0.785398 1.215890] tn=11
 pt 30.000000;160.000000 cop;clr=4.000000;4.000000
 pt 70.000000;160.000000 cop;clr=4.000000;4.000000
  seg concave 0:
   arc cnc use=0 4.000000:0.405199 -> 1.165597 [0.405199 1.570796]
   arc cnc use=1 12.600000:0.405199 -> 1.165597 [0.405199 1.570796] tn=11
 pt 70.000000;200.000000 cop;clr=4.000000;4.000000
 pt 160.000000;160.000000 cop;clr=4.000000;4.000000
 pt 160.000000;200.000000 cop;clr=4.000000;4.000000
 twonet 7
  arc cvx use=1 center=100.000000;100.000000 r=0.000000 a=2.034444;0.000000
  line 100.000000;100.000000 .. 70.000000;160.000000
  arc cvx use=1 center=70.000000;160.000000 r=0.000000 a=-1.107149;0.000000
 twonet 11
  arc cvx use=1 center=160.000000;160.000000 r=0.000000 a=-2.356194;0.000000
  line 160.000000;160.000000 .. 108.909545;108.909545
  arc cnc use=1 center=100.000000;100.000000 r=12.600000 a=0.785398;0.430492
  line 104.378535;111.814755 .. 81.579702;164.966940
  arc cnc use=1 center=70.000000;160.000000 r=12.600000 a=0.405199;1.165597
  line 70.000000;172.600000 .. 70.000000;200.000000
  arc cvx use=1 center=70.000000;200.000000 r=0.000000 a=-1.570796;0.000000
