 pt 50.000000;50.000000 cop;clr=2.000000;2.000000
  seg convex 0:
   arc cvx use=0 2.000000:3.729595 -> 1.826464 [3.729595 5.556059]
   arc cvx use=1 6.000000:3.729595 -> 1.826464 [3.729595 5.556059] tn=17
  seg concave 0:
   arc cnc use=0 2.000000:0.815606 -> 1.343193 [0.815606 2.158799]
   arc cnc use=1 6.000000:0.815606 -> 1.343193 [0.815606 2.158799] tn=7
   arc cnc use=1 11.000000:0.982794 -> 0.897706 [0.982794 1.880499] tn=17
 pt 30.000000;80.000000 cop;clr=2.000000;2.000000
  seg convex 0:
   arc cvx use=0 2.000000:3.729595 -> 0.000000 [3.729595 3.729595]
   arc cvx use=1 6.000000:3.729595 -> -0.000000 [3.729595 3.729595] tn=17
 pt 70.000000;80.000000 cop;clr=2.000000;2.000000
  seg convex 0:
   arc cvx use=0 2.000000:5.527995 -> 1.267835 [5.527995 6.795830]
   arc cvx use=1 6.000000:6.795830 -> -1.267835 [5.527995 6.795830] tn=7
   arc cvx use=1 11.000000:-0.727126 -> 1.207657 [-0.727126 0.480531] tn=17
 pt 42.000000;75.000000 cop;clr=2.000000;2.000000
 pt 70.000000;80.000000 cop;clr=2.000000;2.000000
  seg concave 0:
   arc cnc use=0 2.000000:-4.199744 -> 2.040946 [-4.199744 -2.158799]
   arc cnc use=1 6.000000:-4.199744 -> 2.040946 [-4.199744 -2.158799] tn=17
 pt 60.000000;110.000000 cop;clr=2.000000;2.000000
  seg convex 0:
   arc cvx use=0 2.000000:0.480531 -> 3.173706 [0.480531 3.654237]
   arc cvx use=1 6.000000:0.480531 -> 3.173706 [0.480531 3.654237] tn=17
 twonet 7
  arc cvx use=1 center=60.000000;110.000000 r=0.000000 a=-1.058152;0.000000
  line 60.000000;110.000000 .. 75.228703;82.942901
  arc cvx use=1 center=70.000000;80.000000 r=6.000000 a=6.795830;-1.267835
  line 74.368846;75.887436 .. 54.112564;54.368846
  arc cnc use=1 center=50.000000;50.000000 r=6.000000 a=0.815606;1.343193
  line 46.671799;54.992302 .. 30.000000;80.000000
  arc cvx use=1 center=30.000000;80.000000 r=0.000000 a=-0.982794;0.000000
 twonet 17
  arc cvx use=1 center=30.000000;80.000000 r=6.000000 a=3.729595;-0.000000
  line 25.007698;76.671799 .. 45.007698;46.671799
  arc cvx use=1 center=50.000000;50.000000 r=6.000000 a=3.729595;1.826464
  line 54.482527;46.011648 .. 78.217967;72.688022
  arc cvx use=1 center=70.000000;80.000000 r=11.000000 a=-0.727126;1.207657
  line 79.754247;85.084749 .. 65.320498;112.773499
  arc cvx use=1 center=60.000000;110.000000 r=6.000000 a=0.480531;3.173706
  line 54.771297;107.057099 .. 67.057099;85.228703
  arc cnc use=1 center=70.000000;80.000000 r=6.000000 a=-4.199744;2.040946
  line 66.671799;75.007698 .. 56.101702;59.152553
  arc cnc use=1 center=50.000000;50.000000 r=11.000000 a=0.982794;0.897706
  line 46.647467;60.476666 .. 42.000000;75.000000
  arc cvx use=1 center=42.000000;75.000000 r=0.000000 a=-1.261093;0.000000
