 pt 10.000000;100.000000 cop;clr=1.500000;1.000000
 pt 30.000000;50.000000 cop;clr=1.500000;1.000000
 pt 60.000000;50.000000 cop;clr=1.500000;1.000000
 pt 90.000000;100.000000 cop;clr=1.500000;1.000000
 pt 100.000000;105.000000 cop;clr=1.500000;1.000000
 pt 50.000000;70.000000 cop;clr=1.500000;1.000000
 pt 50.000000;170.000000 cop;clr=1.500000;1.000000
 twonet 8
  arc cvx use=1 center=50.000000;170.000000 r=0.000000 a=-1.570796;0.000000
  line 50.000000;170.000000 .. 50.000000;70.000000
  arc cvx use=1 center=50.000000;70.000000 r=0.000000 a=1.570796;0.000000
 twonet 12
