 pt 100.000000;100.000000 cop;clr=4.000000;4.000000
 pt 50.000000;160.000000 cop;clr=4.000000;4.000000
 pt 70.000000;160.000000 cop;clr=4.000000;4.000000
 pt 140.000000;160.000000 cop;clr=4.000000;4.000000
 pt 130.000000;220.000000 cop;clr=4.000000;4.000000
 pt 110.000000;220.000000 cop;clr=4.000000;4.000000
 twonet 7
 twonet 10
