 pt 0.000000;50.000000 cop;clr=3.000000;1.000000
 pt 10.000000;50.000000 cop;clr=3.000000;1.000000
  seg convex 0:
   arc cvx use=0 3.000000:1.245067 -> 0.826384 [1.245067 2.071451]
   arc cvx use=1 4.800000:1.245067 -> 0.826384 [1.245067 2.071451] tn=16
 pt 40.000000;50.000000 cop;clr=3.000000;1.000000
  seg convex 0:
   arc cvx use=0 3.000000:4.386659 -> 0.651459 [4.386659 5.038118]
   arc cvx use=1 4.800000:5.038118 -> -0.651459 [4.386659 5.038118] tn=16
   arc cvx use=1 7.400000:4.799165 -> -0.336015 [4.463150 4.799165] tn=6
 pt 70.000000;50.000000 cop;clr=3.000000;1.000000
  seg convex 0:
   arc cvx use=0 3.000000:4.799165 -> 0.073915 [4.799165 4.873080]
   arc cvx use=1 4.800000:4.873080 -> -0.073915 [4.799165 4.873080] tn=6
  seg convex 1:
   arc cvx use=0 3.000000:1.410106 -> 0.486420 [1.410106 1.896526]
   arc cvx use=1 4.800000:1.410106 -> 0.486420 [1.410106 1.896526] tn=16
 pt 100.000000;50.000000 cop;clr=3.000000;1.000000
 twonet 6
  arc cvx use=1 center=100.000000;50.000000 r=0.000000 a=-2.980902;0.000000
  line 100.000000;50.000000 .. 70.768000;45.261838
  arc cvx use=1 center=70.000000;50.000000 r=4.800000 a=4.873080;-0.073915
  line 70.416000;45.218061 .. 40.641333;42.627843
  arc cvx use=1 center=40.000000;50.000000 r=7.400000 a=4.799165;-0.336015
  line 38.174667;42.828657 .. 10.000000;50.000000
  arc cvx use=1 center=10.000000;50.000000 r=0.000000 a=-0.249239;0.000000
 twonet 16
  arc cvx use=1 center=100.000000;50.000000 r=0.000000 a=2.980902;0.000000
  line 100.000000;50.000000 .. 70.768000;54.738162
  arc cvx use=1 center=70.000000;50.000000 r=4.800000 a=1.410106;0.486420
  line 68.464000;54.547604 .. 41.536000;45.452396
  arc cvx use=1 center=40.000000;50.000000 r=4.800000 a=5.038118;-0.651459
  line 38.464000;45.452396 .. 11.536000;54.547604
  arc cvx use=1 center=10.000000;50.000000 r=4.800000 a=1.245067;0.826384
  line 7.696000;54.210889 .. 0.000000;50.000000
  arc cvx use=1 center=0.000000;50.000000 r=0.000000 a=0.500655;0.000000
