 pt 50.000000;50.000000 cop;clr=2.000000;2.000000
  seg convex 0:
   arc cvx use=0 2.000000:3.713235 -> 1.998309 [3.713235 5.711543]
   arc cvx use=1 6.000000:5.711543 -> -1.998309 [3.713235 5.711543] tn=6
  seg concave 0:
   arc cnc use=0 2.000000:-2.158799 -> 1.176005 [-2.158799 -0.982794]
   arc cnc use=1 11.000000:-0.982794 -> -1.176005 [-2.158799 -0.982794] tn=13
 pt 30.000000;20.000000 cop;clr=2.000000;2.000000
 pt 70.000000;20.000000 cop;clr=2.000000;2.000000
 pt 30.000000;70.000000 cop;clr=2.000000;2.000000
 pt 70.000000;70.000000 cop;clr=2.000000;2.000000
 twonet 6
  arc cvx use=1 center=70.000000;70.000000 r=0.000000 a=-2.142438;0.000000
  line 70.000000;70.000000 .. 55.046082;46.753918
  arc cvx use=1 center=50.000000;50.000000 r=6.000000 a=5.711543;-1.998309
  line 44.953918;46.753918 .. 30.000000;70.000000
  arc cvx use=1 center=30.000000;70.000000 r=0.000000 a=-0.999154;0.000000
 twonet 13
  arc cvx use=1 center=70.000000;20.000000 r=0.000000 a=2.158799;0.000000
  line 70.000000;20.000000 .. 56.101702;40.847447
  arc cnc use=1 center=50.000000;50.000000 r=11.000000 a=-0.982794;-1.176005
  line 43.898298;40.847447 .. 30.000000;20.000000
  arc cvx use=1 center=30.000000;20.000000 r=0.000000 a=0.982794;0.000000
