 pt 10.000000;10.000000 cop;clr=2.000000;1.000000
 pt 50.000000;50.000000 cop;clr=2.000000;1.000000
 pt 80.000000;10.000000 cop;clr=2.000000;1.000000
 pt 0.000000;55.000000 cop;clr=2.000000;1.000000
 pt 90.000000;55.000000 cop;clr=2.000000;1.000000
 twonet 6
  arc cvx use=1 center=90.000000;55.000000 r=0.000000 a=3.091414;0.000000
  line 90.000000;55.000000 .. 0.000000;55.000000
  arc cvx use=1 center=0.000000;55.000000 r=0.000000 a=0.040091;0.000000
