 pt 20.000000;20.000000 cop;clr=2.000000;3.000000
 pt 20.000000;40.000000 cop;clr=2.000000;3.000000
 pt 5.000000;40.000000 cop;clr=2.000000;3.000000
 pt 30.000000;40.000000 cop;clr=2.000000;3.000000
 twonet 5
  arc cvx use=1 center=20.000000;40.000000 r=0.000000 a=-1.570796;0.000000
  line 20.000000;40.000000 .. 20.000000;20.000000
  arc cvx use=1 center=20.000000;20.000000 r=0.000000 a=1.570796;0.000000
 twonet 9
