.title sch-rnd export using export_spice

*** circuit ***
V1 in 0 DC 5V
R1 in out1 2.2k
R2 out1 out2 1k
R3 out2 0 1k

*** sch-rnd/export_spice: commands ***
.control

op
print v(out1) v(out2)


.endc
.end
