<?xml version="1.0" encoding="UTF-8" standalone="no"?>
<!DOCTYPE svg PUBLIC "-//W3C//DTD SVG 1.1//EN"
 "http://www.w3.org/Graphics/SVG/1.1/DTD/svg11.dtd">
<!-- Generated by graphviz version 2.40.1 (20161225.0304)
 -->
<!-- Title: plugin_deps Pages: 1 -->
<svg width="1845pt" height="1993pt"
 viewBox="0.00 0.00 1844.63 1993.48" xmlns="http://www.w3.org/2000/svg" xmlns:xlink="http://www.w3.org/1999/xlink">
<g id="graph0" class="graph" transform="scale(1 1) rotate(0) translate(4 1989.4792)">
<title>plugin_deps</title>
<polygon fill="#ffffff" stroke="transparent" points="-4,4 -4,-1989.4792 1840.6307,-1989.4792 1840.6307,4 -4,4"/>
<!-- user -->
<g id="node1" class="node">
<title>user</title>
<ellipse fill="none" stroke="#000000" cx="395.1704" cy="-947.915" rx="27" ry="18"/>
<text text-anchor="middle" x="395.1704" y="-944.215" font-family="Times,serif" font-size="14.00" fill="#000000">user</text>
</g>
<!-- act_draw -->
<g id="node2" class="node">
<title>act_draw</title>
<ellipse fill="#d3d3d3" stroke="#000000" cx="1793.7345" cy="-926.6172" rx="42.7926" ry="18"/>
<text text-anchor="middle" x="1793.7345" y="-922.9172" font-family="Times,serif" font-size="14.00" fill="#000000">act_draw</text>
</g>
<!-- user&#45;&gt;act_draw -->
<g id="edge1" class="edge">
<title>user&#45;&gt;act_draw</title>
<path fill="none" stroke="#a0a0a0" d="M422.1691,-947.5039C591.6599,-944.9228 1509.163,-930.9507 1740.6667,-927.4253"/>
<polygon fill="#a0a0a0" stroke="#a0a0a0" points="1740.904,-930.9222 1750.8495,-927.2703 1740.7974,-923.923 1740.904,-930.9222"/>
</g>
<!-- act_read -->
<g id="node3" class="node">
<title>act_read</title>
<ellipse fill="#d3d3d3" stroke="#000000" cx="1773.9962" cy="-1054.4064" rx="40.0939" ry="18"/>
<text text-anchor="middle" x="1773.9962" y="-1050.7064" font-family="Times,serif" font-size="14.00" fill="#000000">act_read</text>
</g>
<!-- user&#45;&gt;act_read -->
<g id="edge2" class="edge">
<title>user&#45;&gt;act_read</title>
<path fill="none" stroke="#a0a0a0" d="M422.0947,-949.9945C590.5677,-963.0062 1499.8044,-1033.2297 1724.0069,-1050.5456"/>
<polygon fill="#a0a0a0" stroke="#a0a0a0" points="1723.9198,-1054.0492 1734.1597,-1051.3297 1724.4589,-1047.07 1723.9198,-1054.0492"/>
</g>
<!-- backann -->
<g id="node4" class="node">
<title>backann</title>
<ellipse fill="#d3d3d3" stroke="#000000" cx="1734.9824" cy="-1177.685" rx="40.0939" ry="18"/>
<text text-anchor="middle" x="1734.9824" y="-1173.985" font-family="Times,serif" font-size="14.00" fill="#000000">backann</text>
</g>
<!-- user&#45;&gt;backann -->
<g id="edge3" class="edge">
<title>user&#45;&gt;backann</title>
<path fill="none" stroke="#a0a0a0" d="M421.3329,-952.4017C585.2273,-980.5087 1470.5829,-1132.342 1687.1568,-1169.4832"/>
<polygon fill="#a0a0a0" stroke="#a0a0a0" points="1686.8054,-1172.974 1697.2532,-1171.2147 1687.9887,-1166.0747 1686.8054,-1172.974"/>
</g>
<!-- construct -->
<g id="node5" class="node">
<title>construct</title>
<ellipse fill="#d3d3d3" stroke="#000000" cx="1677.6073" cy="-1293.5634" rx="42.7926" ry="18"/>
<text text-anchor="middle" x="1677.6073" y="-1289.8634" font-family="Times,serif" font-size="14.00" fill="#000000">construct</text>
</g>
<!-- user&#45;&gt;construct -->
<g id="edge4" class="edge">
<title>user&#45;&gt;construct</title>
<path fill="none" stroke="#a0a0a0" d="M420.2125,-954.6645C577.0884,-996.9464 1424.5303,-1225.3529 1631.8298,-1281.2252"/>
<polygon fill="#a0a0a0" stroke="#a0a0a0" points="1630.9275,-1284.6069 1641.4938,-1283.8299 1632.7492,-1277.848 1630.9275,-1284.6069"/>
</g>
<!-- diag -->
<g id="node6" class="node">
<title>diag</title>
<ellipse fill="#d3d3d3" stroke="#000000" cx="1603.216" cy="-1399.3255" rx="27" ry="18"/>
<text text-anchor="middle" x="1603.216" y="-1395.6255" font-family="Times,serif" font-size="14.00" fill="#000000">diag</text>
</g>
<!-- user&#45;&gt;diag -->
<g id="edge5" class="edge">
<title>user&#45;&gt;diag</title>
<path fill="none" stroke="#a0a0a0" d="M418.7599,-956.7297C569.1652,-1012.9317 1393.4341,-1320.9362 1569.938,-1386.8905"/>
<polygon fill="#a0a0a0" stroke="#a0a0a0" points="1568.8827,-1390.2325 1579.4752,-1390.4543 1571.333,-1383.6753 1568.8827,-1390.2325"/>
</g>
<!-- export_abst -->
<g id="node7" class="node">
<title>export_abst</title>
<ellipse fill="#a0ffff" stroke="#000000" cx="1513.5519" cy="-1492.4922" rx="51.9908" ry="18"/>
<text text-anchor="middle" x="1513.5519" y="-1488.7922" font-family="Times,serif" font-size="14.00" fill="#000000">export_abst</text>
</g>
<!-- user&#45;&gt;export_abst -->
<g id="edge6" class="edge">
<title>user&#45;&gt;export_abst</title>
<path fill="none" stroke="#a0a0a0" d="M417.009,-958.549C553.9874,-1025.2483 1294.6957,-1385.9239 1474.3049,-1473.3816"/>
<polygon fill="#a0a0a0" stroke="#a0a0a0" points="1472.8773,-1476.5793 1483.4004,-1477.8104 1475.9419,-1470.2857 1472.8773,-1476.5793"/>
</g>
<!-- export_bom -->
<g id="node8" class="node">
<title>export_bom</title>
<ellipse fill="#a0ffff" stroke="#000000" cx="1410.7169" cy="-1570.88" rx="53.8905" ry="18"/>
<text text-anchor="middle" x="1410.7169" y="-1567.18" font-family="Times,serif" font-size="14.00" fill="#000000">export_bom</text>
</g>
<!-- user&#45;&gt;export_bom -->
<g id="edge7" class="edge">
<title>user&#45;&gt;export_bom</title>
<path fill="none" stroke="#a0a0a0" d="M415.4563,-960.359C541.2531,-1037.5263 1214.7164,-1450.6478 1375.9949,-1549.5806"/>
<polygon fill="#a0a0a0" stroke="#a0a0a0" points="1374.2316,-1552.6049 1384.5857,-1554.8504 1377.8918,-1546.6381 1374.2316,-1552.6049"/>
</g>
<!-- export_lpr -->
<g id="node9" class="node">
<title>export_lpr</title>
<ellipse fill="#a0ffff" stroke="#000000" cx="1499.8735" cy="-733.6705" rx="47.3916" ry="18"/>
<text text-anchor="middle" x="1499.8735" y="-729.9705" font-family="Times,serif" font-size="14.00" fill="#000000">export_lpr</text>
</g>
<!-- user&#45;&gt;export_lpr -->
<g id="edge9" class="edge">
<title>user&#45;&gt;export_lpr</title>
<path fill="none" stroke="#a0a0a0" d="M421.1191,-942.8826C563.5144,-915.2666 1250.7328,-781.9885 1447.2694,-743.8725"/>
<polygon fill="#a0a0a0" stroke="#a0a0a0" points="1448.1912,-747.259 1457.3418,-741.919 1446.8584,-740.387 1448.1912,-747.259"/>
</g>
<!-- export_ps -->
<g id="node10" class="node">
<title>export_ps</title>
<ellipse fill="#a0ffff" stroke="#000000" cx="670.9259" cy="-883.5156" rx="45.4919" ry="18"/>
<text text-anchor="middle" x="670.9259" y="-879.8156" font-family="Times,serif" font-size="14.00" fill="#000000">export_ps</text>
</g>
<!-- user&#45;&gt;export_ps -->
<g id="edge13" class="edge">
<title>user&#45;&gt;export_ps</title>
<path fill="none" stroke="#a0a0a0" d="M421.1128,-941.8565C466.9931,-931.1417 563.1384,-908.6881 621.8626,-894.9738"/>
<polygon fill="#a0a0a0" stroke="#a0a0a0" points="622.7197,-898.3679 631.6617,-892.6853 621.1278,-891.5513 622.7197,-898.3679"/>
</g>
<!-- export_png -->
<g id="node11" class="node">
<title>export_png</title>
<ellipse fill="#a0ffff" stroke="#000000" cx="1297.1211" cy="-1632.6514" rx="50.8918" ry="18"/>
<text text-anchor="middle" x="1297.1211" y="-1628.9514" font-family="Times,serif" font-size="14.00" fill="#000000">export_png</text>
</g>
<!-- user&#45;&gt;export_png -->
<g id="edge11" class="edge">
<title>user&#45;&gt;export_png</title>
<path fill="none" stroke="#a0a0a0" d="M413.1872,-961.5929C525.1768,-1046.6123 1125.8745,-1502.6456 1267.291,-1610.0052"/>
<polygon fill="#a0a0a0" stroke="#a0a0a0" points="1265.4798,-1613.0245 1275.5609,-1616.2835 1269.7124,-1607.4491 1265.4798,-1613.0245"/>
</g>
<!-- export_spice -->
<g id="node14" class="node">
<title>export_spice</title>
<ellipse fill="#a0ffff" stroke="#000000" cx="1175.4274" cy="-1676.3586" rx="55.7903" ry="18"/>
<text text-anchor="middle" x="1175.4274" y="-1672.6586" font-family="Times,serif" font-size="14.00" fill="#000000">export_spice</text>
</g>
<!-- user&#45;&gt;export_spice -->
<g id="edge15" class="edge">
<title>user&#45;&gt;export_spice</title>
<path fill="none" stroke="#a0a0a0" d="M411.1099,-962.7961C508.9158,-1054.1071 1027.6744,-1538.4172 1149.707,-1652.3461"/>
<polygon fill="#a0a0a0" stroke="#a0a0a0" points="1147.4645,-1655.0408 1157.1626,-1659.3067 1152.2415,-1649.9241 1147.4645,-1655.0408"/>
</g>
<!-- lib_netlist_exp -->
<g id="node15" class="node">
<title>lib_netlist_exp</title>
<ellipse fill="#a0ffff" stroke="#000000" cx="1048.4879" cy="-1700.977" rx="63.0888" ry="18"/>
<text text-anchor="middle" x="1048.4879" y="-1697.277" font-family="Times,serif" font-size="14.00" fill="#000000">lib_netlist_exp</text>
</g>
<!-- user&#45;&gt;lib_netlist_exp -->
<g id="edge36" class="edge">
<title>user&#45;&gt;lib_netlist_exp</title>
<path fill="none" stroke="#a0a0a0" d="M408.8159,-963.6438C491.3094,-1058.7319 923.2923,-1556.6673 1026.3815,-1675.4955"/>
<polygon fill="#a0a0a0" stroke="#a0a0a0" points="1024.0293,-1678.1252 1033.2262,-1683.3853 1029.3169,-1673.5381 1024.0293,-1678.1252"/>
</g>
<!-- export_svg -->
<g id="node16" class="node">
<title>export_svg</title>
<ellipse fill="#a0ffff" stroke="#000000" cx="1232.3302" cy="-840.4141" rx="50.0912" ry="18"/>
<text text-anchor="middle" x="1232.3302" y="-836.7141" font-family="Times,serif" font-size="14.00" fill="#000000">export_svg</text>
</g>
<!-- user&#45;&gt;export_svg -->
<g id="edge17" class="edge">
<title>user&#45;&gt;export_svg</title>
<path fill="none" stroke="#a0a0a0" d="M422.0761,-944.46C539.7458,-929.3499 1010.5496,-868.8933 1175.1602,-847.7554"/>
<polygon fill="#a0a0a0" stroke="#a0a0a0" points="1175.6181,-851.2254 1185.0909,-846.4802 1174.7265,-844.2824 1175.6181,-851.2254"/>
</g>
<!-- export_tedax -->
<g id="node17" class="node">
<title>export_tedax</title>
<ellipse fill="#a0ffff" stroke="#000000" cx="919.2782" cy="-1705.9297" rx="56.59" ry="18"/>
<text text-anchor="middle" x="919.2782" y="-1702.2297" font-family="Times,serif" font-size="14.00" fill="#000000">export_tedax</text>
</g>
<!-- user&#45;&gt;export_tedax -->
<g id="edge19" class="edge">
<title>user&#45;&gt;export_tedax</title>
<path fill="none" stroke="#a0a0a0" d="M406.6046,-964.4522C473.9307,-1061.8256 818.5568,-1560.2569 901.3687,-1680.0273"/>
<polygon fill="#a0a0a0" stroke="#a0a0a0" points="898.5193,-1682.0606 907.0854,-1688.2954 904.2771,-1678.0796 898.5193,-1682.0606"/>
</g>
<!-- gui -->
<g id="node18" class="node">
<title>gui</title>
<ellipse fill="#d3d3d3" stroke="#000000" cx="790.8266" cy="-1691.1006" rx="27" ry="18"/>
<text text-anchor="middle" x="790.8266" y="-1687.4006" font-family="Times,serif" font-size="14.00" fill="#000000">gui</text>
</g>
<!-- user&#45;&gt;gui -->
<g id="edge21" class="edge">
<title>user&#45;&gt;gui</title>
<path fill="none" stroke="#a0a0a0" d="M404.3681,-965.1917C456.3942,-1062.9154 713.6981,-1546.2254 776.8247,-1664.7998"/>
<polygon fill="#a0a0a0" stroke="#a0a0a0" points="773.8905,-1666.7364 781.6793,-1673.9187 780.0694,-1663.4468 773.8905,-1666.7364"/>
</g>
<!-- io_altium -->
<g id="node20" class="node">
<title>io_altium</title>
<ellipse fill="#ffa0a0" stroke="#000000" cx="666.1442" cy="-1656.8373" rx="44.6926" ry="18"/>
<text text-anchor="middle" x="666.1442" y="-1653.1373" font-family="Times,serif" font-size="14.00" fill="#000000">io_altium</text>
</g>
<!-- user&#45;&gt;io_altium -->
<g id="edge23" class="edge">
<title>user&#45;&gt;io_altium</title>
<path fill="none" stroke="#a0a0a0" d="M401.8687,-965.439C438.1414,-1060.3359 611.048,-1512.6945 655.6355,-1629.3444"/>
<polygon fill="#a0a0a0" stroke="#a0a0a0" points="652.4749,-1630.8786 659.3147,-1638.9698 659.0135,-1628.3793 652.4749,-1630.8786"/>
</g>
<!-- lib_alien -->
<g id="node21" class="node">
<title>lib_alien</title>
<ellipse fill="#ffa0a0" stroke="#000000" cx="548.1532" cy="-1603.9428" rx="41.6928" ry="18"/>
<text text-anchor="middle" x="548.1532" y="-1600.2428" font-family="Times,serif" font-size="14.00" fill="#000000">lib_alien</text>
</g>
<!-- user&#45;&gt;lib_alien -->
<g id="edge35" class="edge">
<title>user&#45;&gt;lib_alien</title>
<path fill="none" stroke="#a0a0a0" d="M399.3417,-965.8024C420.473,-1056.4189 515.7147,-1464.8383 541.6272,-1575.9576"/>
<polygon fill="#a0a0a0" stroke="#a0a0a0" points="538.234,-1576.8185 543.9136,-1585.7623 545.0511,-1575.2287 538.234,-1576.8185"/>
</g>
<!-- io_geda -->
<g id="node22" class="node">
<title>io_geda</title>
<ellipse fill="#ffa0a0" stroke="#000000" cx="439.6194" cy="-1533.657" rx="38.1938" ry="18"/>
<text text-anchor="middle" x="439.6194" y="-1529.957" font-family="Times,serif" font-size="14.00" fill="#000000">io_geda</text>
</g>
<!-- user&#45;&gt;io_geda -->
<g id="edge25" class="edge">
<title>user&#45;&gt;io_geda</title>
<path fill="none" stroke="#a0a0a0" d="M396.5494,-966.0874C402.9328,-1050.2068 429.6329,-1402.057 437.4564,-1505.1535"/>
<polygon fill="#a0a0a0" stroke="#a0a0a0" points="433.9878,-1505.7009 438.2345,-1515.4074 440.9677,-1505.1712 433.9878,-1505.7009"/>
</g>
<!-- io_lihata -->
<g id="node23" class="node">
<title>io_lihata</title>
<ellipse fill="#ffa0a0" stroke="#000000" cx="343.0866" cy="-1447.6273" rx="41.6928" ry="18"/>
<text text-anchor="middle" x="343.0866" y="-1443.9273" font-family="Times,serif" font-size="14.00" fill="#000000">io_lihata</text>
</g>
<!-- user&#45;&gt;io_lihata -->
<g id="edge26" class="edge">
<title>user&#45;&gt;io_lihata</title>
<path fill="none" stroke="#a0a0a0" d="M393.2859,-965.9953C385.4698,-1040.9865 355.5652,-1327.9026 346.0278,-1419.4082"/>
<polygon fill="#a0a0a0" stroke="#a0a0a0" points="342.5241,-1419.2624 344.9685,-1429.5714 349.4864,-1419.9881 342.5241,-1419.2624"/>
</g>
<!-- io_ngrp_fawk -->
<g id="node24" class="node">
<title>io_ngrp_fawk</title>
<ellipse fill="#ffa0a0" stroke="#000000" cx="260.8175" cy="-1347.8702" rx="59.5901" ry="18"/>
<text text-anchor="middle" x="260.8175" y="-1344.1702" font-family="Times,serif" font-size="14.00" fill="#000000">io_ngrp_fawk</text>
</g>
<!-- user&#45;&gt;io_ngrp_fawk -->
<g id="edge29" class="edge">
<title>user&#45;&gt;io_ngrp_fawk</title>
<path fill="none" stroke="#a0a0a0" d="M389.2241,-965.6167C368.0285,-1028.7139 296.0618,-1242.9515 270.1832,-1319.9894"/>
<polygon fill="#a0a0a0" stroke="#a0a0a0" points="266.7142,-1319.3252 266.8476,-1329.9192 273.3498,-1321.5542 266.7142,-1319.3252"/>
</g>
<!-- lib_ngrp -->
<g id="node25" class="node">
<title>lib_ngrp</title>
<ellipse fill="#ffa0a0" stroke="#000000" cx="194.7404" cy="-1236.7238" rx="40.0939" ry="18"/>
<text text-anchor="middle" x="194.7404" y="-1233.0238" font-family="Times,serif" font-size="14.00" fill="#000000">lib_ngrp</text>
</g>
<!-- user&#45;&gt;lib_ngrp -->
<g id="edge37" class="edge">
<title>user&#45;&gt;lib_ngrp</title>
<path fill="none" stroke="#a0a0a0" d="M383.8202,-964.2701C350.5011,-1012.281 252.7858,-1153.0836 212.4589,-1211.1924"/>
<polygon fill="#a0a0a0" stroke="#a0a0a0" points="209.5446,-1209.2529 206.7186,-1219.4639 215.2955,-1213.2439 209.5446,-1209.2529"/>
</g>
<!-- io_ngrp_tedax -->
<g id="node27" class="node">
<title>io_ngrp_tedax</title>
<ellipse fill="#ffa0a0" stroke="#000000" cx="146.4041" cy="-1116.7934" rx="61.99" ry="18"/>
<text text-anchor="middle" x="146.4041" y="-1113.0934" font-family="Times,serif" font-size="14.00" fill="#000000">io_ngrp_tedax</text>
</g>
<!-- user&#45;&gt;io_ngrp_tedax -->
<g id="edge31" class="edge">
<title>user&#45;&gt;io_ngrp_tedax</title>
<path fill="none" stroke="#a0a0a0" d="M376.0632,-960.8862C333.8161,-989.5662 232.0505,-1058.6512 179.3195,-1094.4484"/>
<polygon fill="#a0a0a0" stroke="#a0a0a0" points="177.2953,-1091.5922 170.9875,-1100.1046 181.227,-1097.3837 177.2953,-1091.5922"/>
</g>
<!-- io_tinycad -->
<g id="node28" class="node">
<title>io_tinycad</title>
<ellipse fill="#ffa0a0" stroke="#000000" cx="116.9416" cy="-990.8901" rx="48.1917" ry="18"/>
<text text-anchor="middle" x="116.9416" y="-987.1901" font-family="Times,serif" font-size="14.00" fill="#000000">io_tinycad</text>
</g>
<!-- user&#45;&gt;io_tinycad -->
<g id="edge33" class="edge">
<title>user&#45;&gt;io_tinycad</title>
<path fill="none" stroke="#a0a0a0" d="M368.7445,-951.9968C323.6725,-958.9586 231.0492,-973.2651 171.5774,-982.4511"/>
<polygon fill="#a0a0a0" stroke="#a0a0a0" points="170.9529,-979.006 161.6044,-983.9915 172.0215,-985.9239 170.9529,-979.006"/>
</g>
<!-- query -->
<g id="node29" class="node">
<title>query</title>
<ellipse fill="#d3d3d3" stroke="#000000" cx="107.0434" cy="-861.9649" rx="30.5947" ry="18"/>
<text text-anchor="middle" x="107.0434" y="-858.2649" font-family="Times,serif" font-size="14.00" fill="#000000">query</text>
</g>
<!-- user&#45;&gt;query -->
<g id="edge43" class="edge">
<title>user&#45;&gt;query</title>
<path fill="none" stroke="#a0a0a0" d="M370.3555,-940.5126C319.6438,-925.385 203.892,-890.8554 144.186,-873.0447"/>
<polygon fill="#a0a0a0" stroke="#a0a0a0" points="144.9932,-869.6332 134.41,-870.1285 142.9922,-876.3411 144.9932,-869.6332"/>
</g>
<!-- lib_plot -->
<g id="node30" class="node">
<title>lib_plot</title>
<ellipse fill="#d3d3d3" stroke="#000000" cx="116.9416" cy="-733.0396" rx="38.1938" ry="18"/>
<text text-anchor="middle" x="116.9416" y="-729.3396" font-family="Times,serif" font-size="14.00" fill="#000000">lib_plot</text>
</g>
<!-- user&#45;&gt;lib_plot -->
<g id="edge39" class="edge">
<title>user&#45;&gt;lib_plot</title>
<path fill="none" stroke="#a0a0a0" d="M377.3427,-934.1467C330.3412,-897.8476 202.7381,-799.3001 145.4527,-755.0587"/>
<polygon fill="#a0a0a0" stroke="#a0a0a0" points="147.2607,-752.0327 137.2068,-748.6904 142.982,-757.5729 147.2607,-752.0327"/>
</g>
<!-- lib_target -->
<g id="node31" class="node">
<title>lib_target</title>
<ellipse fill="#a0ffff" stroke="#000000" cx="146.4041" cy="-607.1363" rx="44.393" ry="18"/>
<text text-anchor="middle" x="146.4041" y="-603.4363" font-family="Times,serif" font-size="14.00" fill="#000000">lib_target</text>
</g>
<!-- user&#45;&gt;lib_target -->
<g id="edge40" class="edge">
<title>user&#45;&gt;lib_target</title>
<path fill="none" stroke="#a0a0a0" d="M383.1719,-931.4786C343.1387,-876.6381 213.9389,-699.6506 165.2253,-632.9189"/>
<polygon fill="#a0a0a0" stroke="#a0a0a0" points="167.889,-630.6316 159.1659,-624.6184 162.2351,-634.7589 167.889,-630.6316"/>
</g>
<!-- place -->
<g id="node32" class="node">
<title>place</title>
<ellipse fill="#d3d3d3" stroke="#000000" cx="194.7404" cy="-487.2059" rx="29.4969" ry="18"/>
<text text-anchor="middle" x="194.7404" y="-483.5059" font-family="Times,serif" font-size="14.00" fill="#000000">place</text>
</g>
<!-- user&#45;&gt;place -->
<g id="edge41" class="edge">
<title>user&#45;&gt;place</title>
<path fill="none" stroke="#a0a0a0" d="M387.5581,-930.4173C357.0187,-860.2193 243.2618,-598.7375 206.3709,-513.9398"/>
<polygon fill="#a0a0a0" stroke="#a0a0a0" points="209.5591,-512.4947 202.3603,-504.7211 203.1403,-515.2872 209.5591,-512.4947"/>
</g>
<!-- propedit -->
<g id="node33" class="node">
<title>propedit</title>
<ellipse fill="#d3d3d3" stroke="#000000" cx="260.8175" cy="-376.0596" rx="40.0939" ry="18"/>
<text text-anchor="middle" x="260.8175" y="-372.3596" font-family="Times,serif" font-size="14.00" fill="#000000">propedit</text>
</g>
<!-- user&#45;&gt;propedit -->
<g id="edge42" class="edge">
<title>user&#45;&gt;propedit</title>
<path fill="none" stroke="#a0a0a0" d="M390.9276,-929.856C371.4987,-847.1594 290.9572,-504.3453 267.3486,-403.8586"/>
<polygon fill="#a0a0a0" stroke="#a0a0a0" points="270.7558,-403.0573 265.0613,-394.1229 263.9413,-404.6584 270.7558,-403.0573"/>
</g>
<!-- renumber -->
<g id="node34" class="node">
<title>renumber</title>
<ellipse fill="#d3d3d3" stroke="#000000" cx="343.0866" cy="-276.3024" rx="44.6926" ry="18"/>
<text text-anchor="middle" x="343.0866" y="-272.6024" font-family="Times,serif" font-size="14.00" fill="#000000">renumber</text>
</g>
<!-- user&#45;&gt;renumber -->
<g id="edge44" class="edge">
<title>user&#45;&gt;renumber</title>
<path fill="none" stroke="#a0a0a0" d="M393.7503,-929.6027C386.5481,-836.7316 354.0593,-417.7932 345.2794,-304.579"/>
<polygon fill="#a0a0a0" stroke="#a0a0a0" points="348.7682,-304.2978 344.5054,-294.5984 341.7892,-304.8391 348.7682,-304.2978"/>
</g>
<!-- sch_dialogs -->
<g id="node35" class="node">
<title>sch_dialogs</title>
<ellipse fill="#d3d3d3" stroke="#000000" cx="439.6194" cy="-190.2727" rx="51.9908" ry="18"/>
<text text-anchor="middle" x="439.6194" y="-186.5727" font-family="Times,serif" font-size="14.00" fill="#000000">sch_dialogs</text>
</g>
<!-- user&#45;&gt;sch_dialogs -->
<g id="edge46" class="edge">
<title>user&#45;&gt;sch_dialogs</title>
<path fill="none" stroke="#a0a0a0" d="M396.2471,-929.5621C402.1671,-828.6545 430.7496,-341.4597 437.9633,-218.5012"/>
<polygon fill="#a0a0a0" stroke="#a0a0a0" points="441.4651,-218.572 438.5568,-208.3841 434.4771,-218.1619 441.4651,-218.572"/>
</g>
<!-- sim -->
<g id="node36" class="node">
<title>sim</title>
<ellipse fill="#d3d3d3" stroke="#000000" cx="548.1532" cy="-119.9869" rx="27" ry="18"/>
<text text-anchor="middle" x="548.1532" y="-116.2869" font-family="Times,serif" font-size="14.00" fill="#000000">sim</text>
</g>
<!-- user&#45;&gt;sim -->
<g id="edge47" class="edge">
<title>user&#45;&gt;sim</title>
<path fill="none" stroke="#a0a0a0" d="M398.5079,-929.8526C418.1646,-823.4726 518.802,-278.8331 542.9431,-148.1839"/>
<polygon fill="#a0a0a0" stroke="#a0a0a0" points="546.4188,-148.6353 544.7942,-138.1657 539.5354,-147.3633 546.4188,-148.6353"/>
</g>
<!-- sim_gui -->
<g id="node37" class="node">
<title>sim_gui</title>
<ellipse fill="#d3d3d3" stroke="#000000" cx="666.1442" cy="-67.0924" rx="39.7935" ry="18"/>
<text text-anchor="middle" x="666.1442" y="-63.3924" font-family="Times,serif" font-size="14.00" fill="#000000">sim_gui</text>
</g>
<!-- user&#45;&gt;sim_gui -->
<g id="edge51" class="edge">
<title>user&#45;&gt;sim_gui</title>
<path fill="none" stroke="#a0a0a0" d="M400.706,-929.9211C434.7941,-819.1151 616.1195,-229.7017 657.6604,-94.6697"/>
<polygon fill="#a0a0a0" stroke="#a0a0a0" points="661.0222,-95.6449 660.6174,-85.0578 654.3317,-93.5865 661.0222,-95.6449"/>
</g>
<!-- sim_ngspice -->
<g id="node38" class="node">
<title>sim_ngspice</title>
<ellipse fill="#d3d3d3" stroke="#000000" cx="790.8266" cy="-32.8291" rx="55.4913" ry="18"/>
<text text-anchor="middle" x="790.8266" y="-29.1291" font-family="Times,serif" font-size="14.00" fill="#000000">sim_ngspice</text>
</g>
<!-- user&#45;&gt;sim_ngspice -->
<g id="edge54" class="edge">
<title>user&#45;&gt;sim_ngspice</title>
<path fill="none" stroke="#a0a0a0" d="M402.7209,-930.4521C451.2384,-818.2393 719.0253,-198.8934 778.9346,-60.3334"/>
<polygon fill="#a0a0a0" stroke="#a0a0a0" points="782.2789,-61.4176 783.0351,-50.8497 775.8538,-58.6395 782.2789,-61.4176"/>
</g>
<!-- target_spice -->
<g id="node39" class="node">
<title>target_spice</title>
<ellipse fill="#d3d3d3" stroke="#000000" cx="919.2782" cy="-18" rx="53.0913" ry="18"/>
<text text-anchor="middle" x="919.2782" y="-14.3" font-family="Times,serif" font-size="14.00" fill="#000000">target_spice</text>
</g>
<!-- user&#45;&gt;target_spice -->
<g id="edge65" class="edge">
<title>user&#45;&gt;target_spice</title>
<path fill="none" stroke="#a0a0a0" d="M404.7147,-930.9808C467.9146,-818.8463 825.9781,-183.5407 904.1886,-44.7731"/>
<polygon fill="#a0a0a0" stroke="#a0a0a0" points="907.2686,-46.4366 909.1296,-36.0065 901.1705,-42.9996 907.2686,-46.4366"/>
</g>
<!-- std_cschem -->
<g id="node40" class="node">
<title>std_cschem</title>
<ellipse fill="#d3d3d3" stroke="#000000" cx="1048.4879" cy="-22.9527" rx="51.9908" ry="18"/>
<text text-anchor="middle" x="1048.4879" y="-19.2527" font-family="Times,serif" font-size="14.00" fill="#000000">std_cschem</text>
</g>
<!-- user&#45;&gt;std_cschem -->
<g id="edge55" class="edge">
<title>user&#45;&gt;std_cschem</title>
<path fill="none" stroke="#a0a0a0" d="M406.7872,-931.468C484.9342,-820.828 933.808,-185.3157 1030.2428,-48.784"/>
<polygon fill="#a0a0a0" stroke="#a0a0a0" points="1033.167,-50.7106 1036.0775,-40.5233 1027.4494,-46.6721 1033.167,-50.7106"/>
</g>
<!-- std_devmap -->
<g id="node41" class="node">
<title>std_devmap</title>
<ellipse fill="#d3d3d3" stroke="#000000" cx="1175.4274" cy="-47.5712" rx="53.8905" ry="18"/>
<text text-anchor="middle" x="1175.4274" y="-43.8712" font-family="Times,serif" font-size="14.00" fill="#000000">std_devmap</text>
</g>
<!-- user&#45;&gt;std_devmap -->
<g id="edge56" class="edge">
<title>user&#45;&gt;std_devmap</title>
<path fill="none" stroke="#a0a0a0" d="M408.7132,-932.2879C501.0806,-825.7045 1038.1093,-206.0234 1153.5668,-72.7963"/>
<polygon fill="#a0a0a0" stroke="#a0a0a0" points="1156.3523,-74.9263 1160.2565,-65.077 1151.0623,-70.3419 1156.3523,-74.9263"/>
</g>
<!-- std_forge -->
<g id="node42" class="node">
<title>std_forge</title>
<ellipse fill="#d3d3d3" stroke="#000000" cx="1297.1211" cy="-91.2783" rx="44.393" ry="18"/>
<text text-anchor="middle" x="1297.1211" y="-87.5783" font-family="Times,serif" font-size="14.00" fill="#000000">std_forge</text>
</g>
<!-- user&#45;&gt;std_forge -->
<g id="edge57" class="edge">
<title>user&#45;&gt;std_forge</title>
<path fill="none" stroke="#a0a0a0" d="M410.8255,-933.0465C517.7055,-831.5361 1139.6245,-240.8623 1272.2488,-114.9011"/>
<polygon fill="#a0a0a0" stroke="#a0a0a0" points="1274.7435,-117.3587 1279.5841,-107.9343 1269.9229,-112.2831 1274.7435,-117.3587"/>
</g>
<!-- std_tools -->
<g id="node43" class="node">
<title>std_tools</title>
<ellipse fill="#d3d3d3" stroke="#000000" cx="1410.7169" cy="-153.0497" rx="42.4939" ry="18"/>
<text text-anchor="middle" x="1410.7169" y="-149.3497" font-family="Times,serif" font-size="14.00" fill="#000000">std_tools</text>
</g>
<!-- user&#45;&gt;std_tools -->
<g id="edge58" class="edge">
<title>user&#45;&gt;std_tools</title>
<path fill="none" stroke="#a0a0a0" d="M412.7971,-934.1186C532.9995,-840.0366 1231.7717,-293.1095 1382.1937,-175.3747"/>
<polygon fill="#a0a0a0" stroke="#a0a0a0" points="1384.412,-178.0831 1390.1295,-169.1634 1380.0975,-172.5708 1384.412,-178.0831"/>
</g>
<!-- symlib_fs -->
<g id="node44" class="node">
<title>symlib_fs</title>
<ellipse fill="#a0a0a0" stroke="#000000" cx="1513.5519" cy="-231.4375" rx="46.2923" ry="18"/>
<text text-anchor="middle" x="1513.5519" y="-227.7375" font-family="Times,serif" font-size="14.00" fill="#000000">symlib_fs</text>
</g>
<!-- user&#45;&gt;symlib_fs -->
<g id="edge59" class="edge">
<title>user&#45;&gt;symlib_fs</title>
<path fill="none" stroke="#a0a0a0" d="M415.0567,-935.1751C548.4366,-849.7269 1312.6933,-360.1151 1480.8372,-252.3958"/>
<polygon fill="#a0a0a0" stroke="#a0a0a0" points="1482.9729,-255.1843 1489.5051,-246.8428 1479.1968,-249.2901 1482.9729,-255.1843"/>
</g>
<!-- symlib_local -->
<g id="node45" class="node">
<title>symlib_local</title>
<ellipse fill="#a0a0a0" stroke="#000000" cx="1603.216" cy="-324.6043" rx="56.59" ry="18"/>
<text text-anchor="middle" x="1603.216" y="-320.9043" font-family="Times,serif" font-size="14.00" fill="#000000">symlib_local</text>
</g>
<!-- user&#45;&gt;symlib_local -->
<g id="edge60" class="edge">
<title>user&#45;&gt;symlib_local</title>
<path fill="none" stroke="#a0a0a0" d="M416.651,-936.8318C559.8498,-862.946 1376.2559,-441.708 1564.4997,-344.5805"/>
<polygon fill="#a0a0a0" stroke="#a0a0a0" points="1566.2082,-347.6375 1573.4901,-339.9418 1562.9984,-341.4168 1566.2082,-347.6375"/>
</g>
<!-- target_none -->
<g id="node46" class="node">
<title>target_none</title>
<ellipse fill="#d3d3d3" stroke="#000000" cx="1677.6073" cy="-430.3663" rx="51.9908" ry="18"/>
<text text-anchor="middle" x="1677.6073" y="-426.6663" font-family="Times,serif" font-size="14.00" fill="#000000">target_none</text>
</g>
<!-- user&#45;&gt;target_none -->
<g id="edge61" class="edge">
<title>user&#45;&gt;target_none</title>
<path fill="none" stroke="#a0a0a0" d="M418.5242,-938.4902C571.4999,-876.7543 1430.4966,-530.092 1634.2556,-447.8617"/>
<polygon fill="#a0a0a0" stroke="#a0a0a0" points="1635.7699,-451.0249 1643.7334,-444.0367 1633.1502,-444.5335 1635.7699,-451.0249"/>
</g>
<!-- target_pcb -->
<g id="node47" class="node">
<title>target_pcb</title>
<ellipse fill="#d3d3d3" stroke="#000000" cx="1734.9824" cy="-546.2447" rx="48.1917" ry="18"/>
<text text-anchor="middle" x="1734.9824" y="-542.5447" font-family="Times,serif" font-size="14.00" fill="#000000">target_pcb</text>
</g>
<!-- user&#45;&gt;target_pcb -->
<g id="edge63" class="edge">
<title>user&#45;&gt;target_pcb</title>
<path fill="none" stroke="#a0a0a0" d="M419.859,-940.5135C579.9482,-892.5194 1471.1172,-625.3504 1687.5923,-560.4521"/>
<polygon fill="#a0a0a0" stroke="#a0a0a0" points="1688.8113,-563.7406 1697.385,-557.5162 1686.8011,-557.0354 1688.8113,-563.7406"/>
</g>
<!-- export_lpr&#45;&gt;export_ps -->
<g id="edge8" class="edge">
<title>export_lpr&#45;&gt;export_ps</title>
<path fill="none" stroke="#000000" d="M1456.7625,-741.4635C1316.5818,-766.8033 874.013,-846.8045 722.4406,-874.2036"/>
<polygon fill="#000000" stroke="#000000" points="721.6786,-870.7845 712.4607,-876.0076 722.9238,-877.6729 721.6786,-870.7845"/>
</g>
<!-- lib_exp_text -->
<g id="node13" class="node">
<title>lib_exp_text</title>
<ellipse fill="none" stroke="#000000" cx="951.6281" cy="-861.9649" rx="54.6905" ry="18"/>
<text text-anchor="middle" x="951.6281" y="-858.2649" font-family="Times,serif" font-size="14.00" fill="#000000">lib_exp_text</text>
</g>
<!-- export_ps&#45;&gt;lib_exp_text -->
<g id="edge12" class="edge">
<title>export_ps&#45;&gt;lib_exp_text</title>
<path fill="none" stroke="#000000" d="M715.7144,-880.077C762.295,-876.5008 835.6199,-870.8713 888.1579,-866.8378"/>
<polygon fill="#000000" stroke="#000000" points="888.6715,-870.3087 898.3742,-866.0534 888.1356,-863.3293 888.6715,-870.3087"/>
</g>
<!-- lib_exp_pixmap -->
<g id="node12" class="node">
<title>lib_exp_pixmap</title>
<ellipse fill="none" stroke="#000000" cx="1412.2855" cy="-1889.5469" rx="68.4888" ry="18"/>
<text text-anchor="middle" x="1412.2855" y="-1885.8469" font-family="Times,serif" font-size="14.00" fill="#000000">lib_exp_pixmap</text>
</g>
<!-- export_png&#45;&gt;lib_exp_pixmap -->
<g id="edge10" class="edge">
<title>export_png&#45;&gt;lib_exp_pixmap</title>
<path fill="none" stroke="#000000" d="M1305.2193,-1650.7158C1325.0842,-1695.0281 1376.3259,-1809.3323 1399.982,-1862.1017"/>
<polygon fill="#000000" stroke="#000000" points="1396.9118,-1863.8092 1404.1963,-1871.5025 1403.2993,-1860.9457 1396.9118,-1863.8092"/>
</g>
<!-- export_spice&#45;&gt;lib_netlist_exp -->
<g id="edge14" class="edge">
<title>export_spice&#45;&gt;lib_netlist_exp</title>
<path fill="none" stroke="#000000" d="M1127.437,-1685.6657C1121.9958,-1686.721 1116.3929,-1687.8076 1110.8021,-1688.8919"/>
<polygon fill="#000000" stroke="#000000" points="1109.9396,-1685.4939 1100.7889,-1690.8338 1111.2724,-1692.3658 1109.9396,-1685.4939"/>
</g>
<!-- export_svg&#45;&gt;lib_exp_text -->
<g id="edge16" class="edge">
<title>export_svg&#45;&gt;lib_exp_text</title>
<path fill="none" stroke="#000000" d="M1183.1144,-844.1926C1136.4836,-847.7727 1066.2064,-853.1682 1015.3218,-857.0748"/>
<polygon fill="#000000" stroke="#000000" points="1014.7978,-853.6046 1005.0951,-857.86 1015.3337,-860.5841 1014.7978,-853.6046"/>
</g>
<!-- export_tedax&#45;&gt;lib_netlist_exp -->
<g id="edge18" class="edge">
<title>export_tedax&#45;&gt;lib_netlist_exp</title>
<path fill="none" stroke="#000000" d="M975.5756,-1703.7718C975.6818,-1703.7677 975.7881,-1703.7637 975.8944,-1703.7596"/>
<polygon fill="#000000" stroke="#000000" points="975.9731,-1707.2592 985.8317,-1703.3787 975.7049,-1700.2644 975.9731,-1707.2592"/>
</g>
<!-- lib_hid_common -->
<g id="node19" class="node">
<title>lib_hid_common</title>
<ellipse fill="none" stroke="#000000" cx="737.2262" cy="-1967.4792" rx="71.4873" ry="18"/>
<text text-anchor="middle" x="737.2262" y="-1963.7792" font-family="Times,serif" font-size="14.00" fill="#000000">lib_hid_common</text>
</g>
<!-- gui&#45;&gt;lib_hid_common -->
<g id="edge20" class="edge">
<title>gui&#45;&gt;lib_hid_common</title>
<path fill="none" stroke="#000000" d="M787.3098,-1709.2346C778.1857,-1756.2807 753.7031,-1882.5198 742.7064,-1939.2216"/>
<polygon fill="#000000" stroke="#000000" points="739.224,-1938.795 740.756,-1949.2785 746.096,-1940.1278 739.224,-1938.795"/>
</g>
<!-- io_altium&#45;&gt;lib_alien -->
<g id="edge22" class="edge">
<title>io_altium&#45;&gt;lib_alien</title>
<path fill="none" stroke="#000000" d="M636.0648,-1643.3529C620.9969,-1636.5981 602.5857,-1628.3445 586.5126,-1621.139"/>
<polygon fill="#000000" stroke="#000000" points="587.919,-1617.9339 577.3622,-1617.037 585.0554,-1624.3215 587.919,-1617.9339"/>
</g>
<!-- lib_alien&#45;&gt;query -->
<g id="edge34" class="edge">
<title>lib_alien&#45;&gt;query</title>
<path fill="none" stroke="#000000" d="M537.6844,-1586.3335C479.125,-1487.8324 192.2837,-1005.3451 122.4109,-887.8141"/>
<polygon fill="#000000" stroke="#000000" points="125.3391,-885.8904 117.2204,-879.0833 119.3221,-889.4676 125.3391,-885.8904"/>
</g>
<!-- io_geda&#45;&gt;lib_alien -->
<g id="edge24" class="edge">
<title>io_geda&#45;&gt;lib_alien</title>
<path fill="none" stroke="#000000" d="M462.3716,-1548.3912C477.9338,-1558.4692 498.7875,-1571.9739 516.0367,-1583.1444"/>
<polygon fill="#000000" stroke="#000000" points="514.3852,-1586.2446 524.6813,-1588.7426 518.1902,-1580.3691 514.3852,-1586.2446"/>
</g>
<!-- io_ngrp_fawk&#45;&gt;lib_ngrp -->
<g id="edge27" class="edge">
<title>io_ngrp_fawk&#45;&gt;lib_ngrp</title>
<path fill="none" stroke="#000000" d="M250.2011,-1330.0126C239.3963,-1311.8382 222.5337,-1283.4742 210.2372,-1262.7906"/>
<polygon fill="#000000" stroke="#000000" points="213.2314,-1260.9778 205.1126,-1254.1706 207.2144,-1264.5549 213.2314,-1260.9778"/>
</g>
<!-- script -->
<g id="node26" class="node">
<title>script</title>
<ellipse fill="none" stroke="#000000" cx="30.5473" cy="-1509.8386" rx="30.5947" ry="18"/>
<text text-anchor="middle" x="30.5473" y="-1506.1386" font-family="Times,serif" font-size="14.00" fill="#000000">script</text>
</g>
<!-- io_ngrp_fawk&#45;&gt;script -->
<g id="edge28" class="edge">
<title>io_ngrp_fawk&#45;&gt;script</title>
<path fill="none" stroke="#000000" d="M237.0418,-1364.5936C194.1849,-1394.7385 104.1935,-1458.037 58.4784,-1490.1923"/>
<polygon fill="#000000" stroke="#000000" points="56.3814,-1487.3881 50.2157,-1496.0041 60.4087,-1493.1136 56.3814,-1487.3881"/>
</g>
<!-- io_ngrp_tedax&#45;&gt;lib_ngrp -->
<g id="edge30" class="edge">
<title>io_ngrp_tedax&#45;&gt;lib_ngrp</title>
<path fill="none" stroke="#000000" d="M153.6405,-1134.7482C161.5783,-1154.4431 174.413,-1186.2881 183.6286,-1209.1536"/>
<polygon fill="#000000" stroke="#000000" points="180.47,-1210.6796 187.4545,-1218.6463 186.9625,-1208.0629 180.47,-1210.6796"/>
</g>
<!-- io_tinycad&#45;&gt;lib_alien -->
<g id="edge32" class="edge">
<title>io_tinycad&#45;&gt;lib_alien</title>
<path fill="none" stroke="#000000" d="M129.3819,-1008.5764C190.366,-1095.2774 457.7125,-1475.3634 530.051,-1578.2069"/>
<polygon fill="#000000" stroke="#000000" points="527.2532,-1580.3129 535.8692,-1586.4786 532.9787,-1576.2857 527.2532,-1580.3129"/>
</g>
<!-- lib_plot&#45;&gt;query -->
<g id="edge38" class="edge">
<title>lib_plot&#45;&gt;query</title>
<path fill="none" stroke="#000000" d="M115.5444,-751.238C113.8938,-772.738 111.129,-808.75 109.2022,-833.8461"/>
<polygon fill="#000000" stroke="#000000" points="105.7093,-833.6204 108.4335,-843.859 112.6888,-834.1563 105.7093,-833.6204"/>
</g>
<!-- sch_dialogs&#45;&gt;lib_hid_common -->
<g id="edge45" class="edge">
<title>sch_dialogs&#45;&gt;lib_hid_common</title>
<path fill="none" stroke="#000000" d="M442.6618,-208.4413C471.5279,-380.8197 696.8508,-1726.3711 732.4865,-1939.1753"/>
<polygon fill="#000000" stroke="#000000" points="729.0676,-1939.9514 734.1712,-1949.236 735.9715,-1938.7952 729.0676,-1939.9514"/>
</g>
<!-- sim_gui&#45;&gt;lib_plot -->
<g id="edge48" class="edge">
<title>sim_gui&#45;&gt;lib_plot</title>
<path fill="none" stroke="#000000" d="M652.0164,-84.2234C577.0724,-175.0983 226.1105,-600.6645 137.3683,-708.2708"/>
<polygon fill="#000000" stroke="#000000" points="134.6382,-706.0802 130.9759,-716.022 140.0386,-710.5339 134.6382,-706.0802"/>
</g>
<!-- sim_gui&#45;&gt;sch_dialogs -->
<g id="edge50" class="edge">
<title>sim_gui&#45;&gt;sch_dialogs</title>
<path fill="none" stroke="#000000" d="M640.5992,-80.9833C600.547,-102.7631 522.7873,-145.0474 476.6138,-170.1558"/>
<polygon fill="#000000" stroke="#000000" points="474.6561,-167.2363 467.543,-175.0883 478.0002,-173.3859 474.6561,-167.2363"/>
</g>
<!-- sim_gui&#45;&gt;sim -->
<g id="edge49" class="edge">
<title>sim_gui&#45;&gt;sim</title>
<path fill="none" stroke="#000000" d="M637.8824,-79.762C620.5101,-87.5499 598.2048,-97.5492 580.1796,-105.6297"/>
<polygon fill="#000000" stroke="#000000" points="578.3577,-102.6108 570.6644,-109.8953 581.2212,-108.9983 578.3577,-102.6108"/>
</g>
<!-- sim_ngspice&#45;&gt;sim -->
<g id="edge53" class="edge">
<title>sim_ngspice&#45;&gt;sim</title>
<path fill="none" stroke="#000000" d="M753.7056,-46.1614C706.7992,-63.0081 626.7597,-91.7549 581.6432,-107.9588"/>
<polygon fill="#000000" stroke="#000000" points="580.2637,-104.7352 572.0354,-111.4095 582.6299,-111.3232 580.2637,-104.7352"/>
</g>
<!-- sim_ngspice&#45;&gt;target_spice -->
<g id="edge52" class="edge">
<title>sim_ngspice&#45;&gt;target_spice</title>
<path fill="none" stroke="#000000" d="M843.0728,-26.7975C848.2366,-26.2014 853.5074,-25.5929 858.7455,-24.9882"/>
<polygon fill="#000000" stroke="#000000" points="859.2086,-28.4581 868.7412,-23.8342 858.4057,-21.5043 859.2086,-28.4581"/>
</g>
<!-- target_spice&#45;&gt;lib_target -->
<g id="edge64" class="edge">
<title>target_spice&#45;&gt;lib_target</title>
<path fill="none" stroke="#000000" d="M897.3925,-34.6827C787.8899,-118.1529 299.8233,-490.19 175.3648,-585.0605"/>
<polygon fill="#000000" stroke="#000000" points="173.2018,-582.3084 167.3706,-591.1542 177.4454,-587.8754 173.2018,-582.3084"/>
</g>
<!-- target_pcb&#45;&gt;lib_target -->
<g id="edge62" class="edge">
<title>target_pcb&#45;&gt;lib_target</title>
<path fill="none" stroke="#000000" d="M1687.0066,-548.0837C1454.6001,-556.992 446.9515,-595.616 200.8006,-605.0512"/>
<polygon fill="#000000" stroke="#000000" points="200.5283,-601.559 190.6697,-605.4395 200.7965,-608.5539 200.5283,-601.559"/>
</g>
</g>
</svg>
