<?xml version="1.0" encoding="UTF-8" standalone="no"?>
<!DOCTYPE svg PUBLIC "-//W3C//DTD SVG 1.1//EN"
 "http://www.w3.org/Graphics/SVG/1.1/DTD/svg11.dtd">
<!-- Generated by graphviz version 2.40.1 (20161225.0304)
 -->
<!-- Title: target Pages: 1 -->
<svg width="735pt" height="91pt"
 viewBox="0.00 0.00 734.87 91.00" xmlns="http://www.w3.org/2000/svg" xmlns:xlink="http://www.w3.org/1999/xlink">
<g id="graph0" class="graph" transform="scale(1 1) rotate(0) translate(4 87)">
<title>target</title>
<polygon fill="#ffffff" stroke="transparent" points="-4,4 -4,-87 730.8721,-87 730.8721,4 -4,4"/>
<!-- concrete -->
<g id="node1" class="node">
<title>concrete</title>
<polygon fill="none" stroke="#000000" points="110,-83 0,-83 0,0 110,0 110,-83"/>
<text text-anchor="middle" x="55" y="-67.8" font-family="Times,serif" font-size="14.00" fill="#000000">terminal in the</text>
<text text-anchor="middle" x="55" y="-52.8" font-family="Times,serif" font-size="14.00" fill="#000000">concrete model</text>
<text text-anchor="middle" x="55" y="-37.8" font-family="Times,serif" font-size="14.00" fill="#000000">attr: pcb_pinnum</text>
<text text-anchor="middle" x="55" y="-22.8" font-family="Times,serif" font-size="14.00" fill="#000000">nattr: pinnum</text>
<text text-anchor="middle" x="55" y="-7.8" font-family="Times,serif" font-size="14.00" fill="#000000">attr: name</text>
</g>
<!-- target_pcb -->
<g id="node2" class="node">
<title>target_pcb</title>
<ellipse fill="none" stroke="#000000" cx="213.1751" cy="-41.5" rx="67.3507" ry="26.7407"/>
<text text-anchor="middle" x="213.1751" y="-45.3" font-family="Times,serif" font-size="14.00" fill="#000000">engine plugin:</text>
<text text-anchor="middle" x="213.1751" y="-30.3" font-family="Times,serif" font-size="14.00" fill="#000000">target_pcb</text>
</g>
<!-- concrete&#45;&gt;target_pcb -->
<g id="edge1" class="edge">
<title>concrete&#45;&gt;target_pcb</title>
<path fill="none" stroke="#000000" d="M110.322,-41.5C118.5821,-41.5 127.2236,-41.5 135.8373,-41.5"/>
<polygon fill="#000000" stroke="#000000" points="135.9119,-45.0001 145.9119,-41.5 135.9118,-38.0001 135.9119,-45.0001"/>
</g>
<!-- abstract -->
<g id="node3" class="node">
<title>abstract</title>
<polygon fill="none" stroke="#000000" points="431.3503,-68 316.3503,-68 316.3503,-15 431.3503,-15 431.3503,-68"/>
<text text-anchor="middle" x="373.8503" y="-52.8" font-family="Times,serif" font-size="14.00" fill="#000000">port in the</text>
<text text-anchor="middle" x="373.8503" y="-37.8" font-family="Times,serif" font-size="14.00" fill="#000000">abstract model</text>
<text text-anchor="middle" x="373.8503" y="-22.8" font-family="Times,serif" font-size="14.00" fill="#000000">attr: display/name</text>
</g>
<!-- target_pcb&#45;&gt;abstract -->
<g id="edge2" class="edge">
<title>target_pcb&#45;&gt;abstract</title>
<path fill="none" stroke="#000000" d="M280.3849,-41.5C288.8829,-41.5 297.5823,-41.5 306.0888,-41.5"/>
<polygon fill="#000000" stroke="#000000" points="306.3428,-45.0001 316.3428,-41.5 306.3427,-38.0001 306.3428,-45.0001"/>
</g>
<!-- export_tedax -->
<g id="node4" class="node">
<title>export_tedax</title>
<ellipse fill="none" stroke="#000000" cx="533.1112" cy="-41.5" rx="65.5227" ry="26.7407"/>
<text text-anchor="middle" x="533.1112" y="-45.3" font-family="Times,serif" font-size="14.00" fill="#000000">export plugin:</text>
<text text-anchor="middle" x="533.1112" y="-30.3" font-family="Times,serif" font-size="14.00" fill="#000000">export_tedax</text>
</g>
<!-- abstract&#45;&gt;export_tedax -->
<g id="edge3" class="edge">
<title>abstract&#45;&gt;export_tedax</title>
<path fill="none" stroke="#000000" d="M431.7977,-41.5C439.9543,-41.5 448.4395,-41.5 456.8739,-41.5"/>
<polygon fill="#000000" stroke="#000000" points="457.1113,-45.0001 467.1112,-41.5 457.1112,-38.0001 457.1113,-45.0001"/>
</g>
<!-- netlist -->
<g id="node5" class="node">
<title>netlist</title>
<polygon fill="none" stroke="#000000" points="726.8721,-60.5 634.8721,-60.5 634.8721,-22.5 726.8721,-22.5 726.8721,-60.5"/>
<text text-anchor="middle" x="680.8721" y="-45.3" font-family="Times,serif" font-size="14.00" fill="#000000">netlist output:</text>
<text text-anchor="middle" x="680.8721" y="-30.3" font-family="Times,serif" font-size="14.00" fill="#000000">foo.tdx</text>
</g>
<!-- export_tedax&#45;&gt;netlist -->
<g id="edge4" class="edge">
<title>export_tedax&#45;&gt;netlist</title>
<path fill="none" stroke="#000000" d="M599.2124,-41.5C607.6408,-41.5 616.2058,-41.5 624.462,-41.5"/>
<polygon fill="#000000" stroke="#000000" points="624.7212,-45.0001 634.7211,-41.5 624.7211,-38.0001 624.7212,-45.0001"/>
</g>
</g>
</svg>
