cschem abstract model v1
components
 S0
  OMIT
  attributes
  ports
 S0/foo1
  attributes
   spice/omit=yes
   role=symbol
   name=foo1
   loc_l1=1
  ports
   1
    attributes
     role=terminal
     display/name=1
     name=1
 foo1
  attributes
   loc_l2=1
   spice/omit=yes
   role=symbol
   loc_l0=1
   name=foo1
  ports
   1
    attributes
     role=terminal
     display/name=1
     name=1
 foo2
  attributes
   loc_l2=1
   spice/omit=yes
   role=symbol
   loc_l0=1
   name=foo2
  ports
   1
    attributes
     role=terminal
     display/name=1
     name=1
 S0/foo2
  attributes
   spice/omit=yes
   role=symbol
   name=foo2
   loc_l1=1
  ports
   1
    attributes
     role=terminal
     display/name=1
     name=1
 S0/S1
  OMIT
  attributes
  ports
nets
 foo
  attributes
   role=wire-net
   name=foo
  conns 2
   foo1-1
   foo2-1
