<?xml version="1.0" encoding="UTF-8" standalone="no"?>
<!DOCTYPE svg PUBLIC "-//W3C//DTD SVG 1.1//EN"
 "http://www.w3.org/Graphics/SVG/1.1/DTD/svg11.dtd">
<!-- Generated by graphviz version 2.40.1 (20161225.0304)
 -->
<!-- Title: ha:group_ref.ID Pages: 1 -->
<svg width="728pt" height="335pt"
 viewBox="0.00 0.00 728.37 335.20" xmlns="http://www.w3.org/2000/svg" xmlns:xlink="http://www.w3.org/1999/xlink">
<g id="graph0" class="graph" transform="scale(1 1) rotate(0) translate(4 331.2031)">
<title>ha:group_ref.ID</title>
<polygon fill="#ffffff" stroke="transparent" points="-4,4 -4,-331.2031 724.3675,-331.2031 724.3675,4 -4,4"/>
<!-- /lht_tree_doc/comm/group_ref.ID -->
<g id="node1" class="node">
<title>/lht_tree_doc/comm/group_ref.ID</title>
<g id="a_node1"><a xlink:href="tree.html#/lht_tree_doc/comm/group_ref.ID" xlink:title=" Group reference to a concrete object within the same sheet or buffer ">
<ellipse fill="none" stroke="#000000" cx="296.1838" cy="-299.6259" rx="73.5782" ry="27.6545"/>
<text text-anchor="middle" x="296.1838" y="-303.9259" font-family="Times,serif" font-size="14.00" fill="#000000">ha:group_ref.ID</text>
</a>
</g>
</g>
<!-- /lht_tree_doc/comm/group_ref.ID/children/ref -->
<g id="node2" class="node">
<title>/lht_tree_doc/comm/group_ref.ID/children/ref</title>
<g id="a_node2"><a xlink:href="tree.html#/lht_tree_doc/comm/group_ref.ID/children/ref" xlink:title="path relative to sheet root, to the referee (should be a group) ">
<ellipse fill="none" stroke="#000000" cx="171.1838" cy="-208.4716" rx="40.1111" ry="26.7407"/>
<text text-anchor="middle" x="171.1838" y="-212.2716" font-family="Times,serif" font-size="14.00" fill="#000000">ref</text>
<text text-anchor="middle" x="171.1838" y="-197.2716" font-family="Times,serif" font-size="14.00" fill="#000000">oidpath</text>
</a>
</g>
</g>
<!-- /lht_tree_doc/comm/group_ref.ID&#45;&gt;/lht_tree_doc/comm/group_ref.ID/children/ref -->
<g id="edge1" class="edge">
<title>/lht_tree_doc/comm/group_ref.ID&#45;&gt;/lht_tree_doc/comm/group_ref.ID/children/ref</title>
<path fill="none" stroke="#000000" d="M262.357,-274.9583C245.2075,-262.4523 224.3809,-247.2648 206.9644,-234.5641"/>
<polygon fill="#000000" stroke="#000000" points="208.8616,-231.6158 198.7195,-228.5516 204.7371,-237.2717 208.8616,-231.6158"/>
</g>
<!-- /lht_tree_doc/comm/group_ref.ID/children/child_xform -->
<g id="node3" class="node">
<title>/lht_tree_doc/comm/group_ref.ID/children/child_xform</title>
<g id="a_node3"><a xlink:href="tree.html#/lht_tree_doc/comm/group_ref.ID/children/child_xform" xlink:title=" List of child object transformation to be performed after placement ">
<ellipse fill="none" stroke="#000000" cx="296.1838" cy="-208.4716" rx="67.3507" ry="27.6545"/>
<text text-anchor="middle" x="296.1838" y="-212.7716" font-family="Times,serif" font-size="14.00" fill="#000000">li:child_xform</text>
</a>
</g>
</g>
<!-- /lht_tree_doc/comm/group_ref.ID&#45;&gt;/lht_tree_doc/comm/group_ref.ID/children/child_xform -->
<g id="edge2" class="edge">
<title>/lht_tree_doc/comm/group_ref.ID&#45;&gt;/lht_tree_doc/comm/group_ref.ID/children/child_xform</title>
<path fill="none" stroke="#000000" d="M296.1838,-271.7813C296.1838,-263.7412 296.1838,-254.8289 296.1838,-246.2909"/>
<polygon fill="#000000" stroke="#000000" points="299.6839,-246.1457 296.1838,-236.1457 292.6839,-246.1457 299.6839,-246.1457"/>
</g>
<!-- dup15_/lht_tree_doc/comm/attrib -->
<g id="node11" class="node">
<title>dup15_/lht_tree_doc/comm/attrib</title>
<g id="a_node11"><a xlink:href="tree.html#/lht_tree_doc/comm/attrib" xlink:title=" a hash of attributes &#160;">
<ellipse fill="none" stroke="#000000" cx="436.1838" cy="-208.4716" rx="43.6818" ry="27.6545"/>
<text text-anchor="middle" x="436.1838" y="-212.7716" font-family="Times,serif" font-size="14.00" fill="#000000">ha:attrib</text>
</a>
</g>
</g>
<!-- /lht_tree_doc/comm/group_ref.ID&#45;&gt;dup15_/lht_tree_doc/comm/attrib -->
<g id="edge10" class="edge">
<title>/lht_tree_doc/comm/group_ref.ID&#45;&gt;dup15_/lht_tree_doc/comm/attrib</title>
<path fill="none" stroke="#000000" d="M332.9671,-275.6762C352.586,-262.9023 376.7366,-247.1778 396.7433,-234.1514"/>
<polygon fill="#000000" stroke="#000000" points="398.8543,-236.9535 405.3248,-228.564 395.0348,-231.0873 398.8543,-236.9535"/>
</g>
<!-- /lht_tree_doc/comm/group_ref.ID/children/child_xform/children/OIDPATH -->
<g id="node4" class="node">
<title>/lht_tree_doc/comm/group_ref.ID/children/child_xform/children/OIDPATH</title>
<g id="a_node4"><a xlink:href="tree.html#/lht_tree_doc/comm/group_ref.ID/children/child_xform/children/OIDPATH" xlink:title="list of transformations to be performed on referee children objects after placement; OIDPATH is relative to the referee group ">
<ellipse fill="none" stroke="#000000" cx="286.1838" cy="-117.3173" rx="53.9813" ry="27.6545"/>
<text text-anchor="middle" x="286.1838" y="-121.6173" font-family="Times,serif" font-size="14.00" fill="#000000">OIDPATH</text>
</a>
</g>
</g>
<!-- /lht_tree_doc/comm/group_ref.ID/children/child_xform&#45;&gt;/lht_tree_doc/comm/group_ref.ID/children/child_xform/children/OIDPATH -->
<g id="edge3" class="edge">
<title>/lht_tree_doc/comm/group_ref.ID/children/child_xform&#45;&gt;/lht_tree_doc/comm/group_ref.ID/children/child_xform/children/OIDPATH</title>
<path fill="none" stroke="#000000" d="M293.1291,-180.627C292.2471,-172.5869 291.2694,-163.6746 290.3327,-155.1365"/>
<polygon fill="#000000" stroke="#000000" points="293.7894,-154.55 289.2197,-144.9914 286.8312,-155.3134 293.7894,-154.55"/>
</g>
<!-- /lht_tree_doc/comm/group_ref.ID/children/child_xform/children/OIDPATH/children/movex -->
<g id="node5" class="node">
<title>/lht_tree_doc/comm/group_ref.ID/children/child_xform/children/OIDPATH/children/movex</title>
<g id="a_node5"><a xlink:href="tree.html#/lht_tree_doc/comm/group_ref.ID/children/child_xform/children/OIDPATH/children/movex" xlink:title="xform: move child in x (horizontal) direction ">
<ellipse fill="none" stroke="#000000" cx="38.1838" cy="-26.8701" rx="38.3684" ry="26.7407"/>
<text text-anchor="middle" x="38.1838" y="-30.6701" font-family="Times,serif" font-size="14.00" fill="#000000">movex</text>
<text text-anchor="middle" x="38.1838" y="-15.6701" font-family="Times,serif" font-size="14.00" fill="#000000">coord</text>
</a>
</g>
</g>
<!-- /lht_tree_doc/comm/group_ref.ID/children/child_xform/children/OIDPATH&#45;&gt;/lht_tree_doc/comm/group_ref.ID/children/child_xform/children/OIDPATH/children/movex -->
<g id="edge4" class="edge">
<title>/lht_tree_doc/comm/group_ref.ID/children/child_xform/children/OIDPATH&#45;&gt;/lht_tree_doc/comm/group_ref.ID/children/child_xform/children/OIDPATH/children/movex</title>
<path fill="none" stroke="#000000" d="M237.6167,-105.0843C196.2382,-93.9289 135.6386,-75.8405 85.1838,-53.7401 82.1705,-52.4202 79.1026,-50.959 76.0514,-49.4197"/>
<polygon fill="#000000" stroke="#000000" points="77.4937,-46.2229 67.0191,-44.6312 74.2148,-52.4075 77.4937,-46.2229"/>
</g>
<!-- /lht_tree_doc/comm/group_ref.ID/children/child_xform/children/OIDPATH/children/movey -->
<g id="node6" class="node">
<title>/lht_tree_doc/comm/group_ref.ID/children/child_xform/children/OIDPATH/children/movey</title>
<g id="a_node6"><a xlink:href="tree.html#/lht_tree_doc/comm/group_ref.ID/children/child_xform/children/OIDPATH/children/movey" xlink:title="xform: move child in y (vertical) direction ">
<ellipse fill="none" stroke="#000000" cx="132.1838" cy="-26.8701" rx="38.3684" ry="26.7407"/>
<text text-anchor="middle" x="132.1838" y="-30.6701" font-family="Times,serif" font-size="14.00" fill="#000000">movey</text>
<text text-anchor="middle" x="132.1838" y="-15.6701" font-family="Times,serif" font-size="14.00" fill="#000000">coord</text>
</a>
</g>
</g>
<!-- /lht_tree_doc/comm/group_ref.ID/children/child_xform/children/OIDPATH&#45;&gt;/lht_tree_doc/comm/group_ref.ID/children/child_xform/children/OIDPATH/children/movey -->
<g id="edge5" class="edge">
<title>/lht_tree_doc/comm/group_ref.ID/children/child_xform/children/OIDPATH&#45;&gt;/lht_tree_doc/comm/group_ref.ID/children/child_xform/children/OIDPATH/children/movey</title>
<path fill="none" stroke="#000000" d="M250.466,-96.3395C226.4088,-82.2103 194.7187,-63.598 170.1956,-49.1952"/>
<polygon fill="#000000" stroke="#000000" points="171.9078,-46.1418 161.5125,-44.0954 168.3627,-52.1777 171.9078,-46.1418"/>
</g>
<!-- /lht_tree_doc/comm/group_ref.ID/children/child_xform/children/OIDPATH/children/rot -->
<g id="node7" class="node">
<title>/lht_tree_doc/comm/group_ref.ID/children/child_xform/children/OIDPATH/children/rot</title>
<g id="a_node7"><a xlink:href="tree.html#/lht_tree_doc/comm/group_ref.ID/children/child_xform/children/OIDPATH/children/rot" xlink:title="xform: rotate child ">
<ellipse fill="none" stroke="#000000" cx="221.1838" cy="-26.8701" rx="32.5538" ry="26.7407"/>
<text text-anchor="middle" x="221.1838" y="-30.6701" font-family="Times,serif" font-size="14.00" fill="#000000">rot</text>
<text text-anchor="middle" x="221.1838" y="-15.6701" font-family="Times,serif" font-size="14.00" fill="#000000">angle</text>
</a>
</g>
</g>
<!-- /lht_tree_doc/comm/group_ref.ID/children/child_xform/children/OIDPATH&#45;&gt;/lht_tree_doc/comm/group_ref.ID/children/child_xform/children/OIDPATH/children/rot -->
<g id="edge6" class="edge">
<title>/lht_tree_doc/comm/group_ref.ID/children/child_xform/children/OIDPATH&#45;&gt;/lht_tree_doc/comm/group_ref.ID/children/child_xform/children/OIDPATH/children/rot</title>
<path fill="none" stroke="#000000" d="M267.3831,-91.1562C260.0459,-80.9466 251.5686,-69.1505 243.8945,-58.4719"/>
<polygon fill="#000000" stroke="#000000" points="246.6273,-56.2772 237.9493,-50.1992 240.943,-60.3623 246.6273,-56.2772"/>
</g>
<!-- /lht_tree_doc/comm/group_ref.ID/children/child_xform/children/OIDPATH/children/mirx -->
<g id="node8" class="node">
<title>/lht_tree_doc/comm/group_ref.ID/children/child_xform/children/OIDPATH/children/mirx</title>
<g id="a_node8"><a xlink:href="tree.html#/lht_tree_doc/comm/group_ref.ID/children/child_xform/children/OIDPATH/children/mirx" xlink:title="xform: mirror child left/right ">
<ellipse fill="none" stroke="#000000" cx="302.1838" cy="-26.8701" rx="30.3115" ry="26.7407"/>
<text text-anchor="middle" x="302.1838" y="-30.6701" font-family="Times,serif" font-size="14.00" fill="#000000">mirx</text>
<text text-anchor="middle" x="302.1838" y="-15.6701" font-family="Times,serif" font-size="14.00" fill="#000000">bool</text>
</a>
</g>
</g>
<!-- /lht_tree_doc/comm/group_ref.ID/children/child_xform/children/OIDPATH&#45;&gt;/lht_tree_doc/comm/group_ref.ID/children/child_xform/children/OIDPATH/children/mirx -->
<g id="edge7" class="edge">
<title>/lht_tree_doc/comm/group_ref.ID/children/child_xform/children/OIDPATH&#45;&gt;/lht_tree_doc/comm/group_ref.ID/children/child_xform/children/OIDPATH/children/mirx</title>
<path fill="none" stroke="#000000" d="M291.0712,-89.6887C292.5244,-81.4739 294.1399,-72.3415 295.6789,-63.6418"/>
<polygon fill="#000000" stroke="#000000" points="299.1405,-64.1657 297.436,-53.7088 292.2475,-62.9462 299.1405,-64.1657"/>
</g>
<!-- /lht_tree_doc/comm/group_ref.ID/children/child_xform/children/OIDPATH/children/miry -->
<g id="node9" class="node">
<title>/lht_tree_doc/comm/group_ref.ID/children/child_xform/children/OIDPATH/children/miry</title>
<g id="a_node9"><a xlink:href="tree.html#/lht_tree_doc/comm/group_ref.ID/children/child_xform/children/OIDPATH/children/miry" xlink:title="xform: mirror child up/down ">
<ellipse fill="none" stroke="#000000" cx="381.1838" cy="-26.8701" rx="30.3115" ry="26.7407"/>
<text text-anchor="middle" x="381.1838" y="-30.6701" font-family="Times,serif" font-size="14.00" fill="#000000">miry</text>
<text text-anchor="middle" x="381.1838" y="-15.6701" font-family="Times,serif" font-size="14.00" fill="#000000">bool</text>
</a>
</g>
</g>
<!-- /lht_tree_doc/comm/group_ref.ID/children/child_xform/children/OIDPATH&#45;&gt;/lht_tree_doc/comm/group_ref.ID/children/child_xform/children/OIDPATH/children/miry -->
<g id="edge8" class="edge">
<title>/lht_tree_doc/comm/group_ref.ID/children/child_xform/children/OIDPATH&#45;&gt;/lht_tree_doc/comm/group_ref.ID/children/child_xform/children/OIDPATH/children/miry</title>
<path fill="none" stroke="#000000" d="M312.1429,-92.6022C324.8179,-80.5346 340.0891,-65.9953 353.0429,-53.6623"/>
<polygon fill="#000000" stroke="#000000" points="355.5359,-56.1214 360.365,-46.6911 350.7091,-51.0517 355.5359,-56.1214"/>
</g>
<!-- /lht_tree_doc/comm/group_ref.ID/children/child_xform/children/OIDPATH/children/remove -->
<g id="node10" class="node">
<title>/lht_tree_doc/comm/group_ref.ID/children/child_xform/children/OIDPATH/children/remove</title>
<g id="a_node10"><a xlink:href="tree.html#/lht_tree_doc/comm/group_ref.ID/children/child_xform/children/OIDPATH/children/remove" xlink:title="xform: mirror child up/down ">
<ellipse fill="none" stroke="#000000" cx="470.1838" cy="-26.8701" rx="41.0244" ry="26.7407"/>
<text text-anchor="middle" x="470.1838" y="-30.6701" font-family="Times,serif" font-size="14.00" fill="#000000">remove</text>
<text text-anchor="middle" x="470.1838" y="-15.6701" font-family="Times,serif" font-size="14.00" fill="#000000">bool</text>
</a>
</g>
</g>
<!-- /lht_tree_doc/comm/group_ref.ID/children/child_xform/children/OIDPATH&#45;&gt;/lht_tree_doc/comm/group_ref.ID/children/child_xform/children/OIDPATH/children/remove -->
<g id="edge9" class="edge">
<title>/lht_tree_doc/comm/group_ref.ID/children/child_xform/children/OIDPATH&#45;&gt;/lht_tree_doc/comm/group_ref.ID/children/child_xform/children/OIDPATH/children/remove</title>
<path fill="none" stroke="#000000" d="M326.3094,-98.9195C353.0659,-86.4951 388.9309,-69.5394 420.1838,-53.7401 423.2674,-52.1812 426.4443,-50.5453 429.6311,-48.8827"/>
<polygon fill="#000000" stroke="#000000" points="431.3569,-51.9295 438.5689,-44.1683 428.091,-45.7381 431.3569,-51.9295"/>
</g>
<!-- dup15_/lht_tree_doc/comm/attrib/children/simple&#45;attrib&#45;key -->
<g id="node12" class="node">
<title>dup15_/lht_tree_doc/comm/attrib/children/simple&#45;attrib&#45;key</title>
<g id="a_node12"><a xlink:href="tree.html#/lht_tree_doc/comm/attrib/children/simple-attrib-key" xlink:title="attribute value without metadata (text node)">
<ellipse fill="none" stroke="#000000" cx="436.1838" cy="-117.3173" rx="77.5641" ry="26.7407"/>
<text text-anchor="middle" x="436.1838" y="-121.1173" font-family="Times,serif" font-size="14.00" fill="#000000">simple&#45;attrib&#45;key</text>
<text text-anchor="middle" x="436.1838" y="-106.1173" font-family="Times,serif" font-size="14.00" fill="#000000">string</text>
</a>
</g>
</g>
<!-- dup15_/lht_tree_doc/comm/attrib&#45;&gt;dup15_/lht_tree_doc/comm/attrib/children/simple&#45;attrib&#45;key -->
<g id="edge11" class="edge">
<title>dup15_/lht_tree_doc/comm/attrib&#45;&gt;dup15_/lht_tree_doc/comm/attrib/children/simple&#45;attrib&#45;key</title>
<path fill="none" stroke="#000000" d="M436.1838,-180.627C436.1838,-172.348 436.1838,-163.1443 436.1838,-154.3765"/>
<polygon fill="#000000" stroke="#000000" points="439.6839,-154.3658 436.1838,-144.3659 432.6839,-154.3659 439.6839,-154.3658"/>
</g>
<!-- dup15_/lht_tree_doc/comm/attrib/children/detailed&#45;attrib -->
<g id="node13" class="node">
<title>dup15_/lht_tree_doc/comm/attrib/children/detailed&#45;attrib</title>
<g id="a_node13"><a xlink:href="tree.html#/lht_tree_doc/comm/attrib/children/detailed-attrib" xlink:title=" attribute with metadata (hash node) ">
<ellipse fill="none" stroke="#000000" cx="609.1838" cy="-117.3173" rx="77.1494" ry="27.6545"/>
<text text-anchor="middle" x="609.1838" y="-121.6173" font-family="Times,serif" font-size="14.00" fill="#000000">ha:detailed&#45;attrib</text>
</a>
</g>
</g>
<!-- dup15_/lht_tree_doc/comm/attrib&#45;&gt;dup15_/lht_tree_doc/comm/attrib/children/detailed&#45;attrib -->
<g id="edge12" class="edge">
<title>dup15_/lht_tree_doc/comm/attrib&#45;&gt;dup15_/lht_tree_doc/comm/attrib/children/detailed&#45;attrib</title>
<path fill="none" stroke="#000000" d="M469.9506,-190.6797C494.6174,-177.6827 528.5358,-159.811 556.7191,-144.9611"/>
<polygon fill="#000000" stroke="#000000" points="558.4335,-148.014 565.649,-140.2559 555.1704,-141.821 558.4335,-148.014"/>
</g>
<!-- dup15_/lht_tree_doc/comm/attrib/children/detailed&#45;attrib/children/value -->
<g id="node14" class="node">
<title>dup15_/lht_tree_doc/comm/attrib/children/detailed&#45;attrib/children/value</title>
<g id="a_node14"><a xlink:href="tree.html#/lht_tree_doc/comm/attrib/children/detailed-attrib/children/value" xlink:title="attribute value">
<ellipse fill="none" stroke="#000000" cx="593.1838" cy="-26.8701" rx="33.4697" ry="26.7407"/>
<text text-anchor="middle" x="593.1838" y="-30.6701" font-family="Times,serif" font-size="14.00" fill="#000000">value</text>
<text text-anchor="middle" x="593.1838" y="-15.6701" font-family="Times,serif" font-size="14.00" fill="#000000">string</text>
</a>
</g>
</g>
<!-- dup15_/lht_tree_doc/comm/attrib/children/detailed&#45;attrib&#45;&gt;dup15_/lht_tree_doc/comm/attrib/children/detailed&#45;attrib/children/value -->
<g id="edge13" class="edge">
<title>dup15_/lht_tree_doc/comm/attrib/children/detailed&#45;attrib&#45;&gt;dup15_/lht_tree_doc/comm/attrib/children/detailed&#45;attrib/children/value</title>
<path fill="none" stroke="#000000" d="M604.2963,-89.6887C602.8431,-81.4739 601.2276,-72.3415 599.6886,-63.6418"/>
<polygon fill="#000000" stroke="#000000" points="603.12,-62.9462 597.9315,-53.7088 596.227,-64.1657 603.12,-62.9462"/>
</g>
<!-- dup15_/lht_tree_doc/comm/attrib/children/detailed&#45;attrib/children/prio -->
<g id="node15" class="node">
<title>dup15_/lht_tree_doc/comm/attrib/children/detailed&#45;attrib/children/prio</title>
<g id="a_node15"><a xlink:href="tree.html#/lht_tree_doc/comm/attrib/children/detailed-attrib/children/prio" xlink:title="priority value">
<ellipse fill="none" stroke="#000000" cx="682.1838" cy="-26.8701" rx="38.3684" ry="26.7407"/>
<text text-anchor="middle" x="682.1838" y="-30.6701" font-family="Times,serif" font-size="14.00" fill="#000000">prio</text>
<text text-anchor="middle" x="682.1838" y="-15.6701" font-family="Times,serif" font-size="14.00" fill="#000000">integer</text>
</a>
</g>
</g>
<!-- dup15_/lht_tree_doc/comm/attrib/children/detailed&#45;attrib&#45;&gt;dup15_/lht_tree_doc/comm/attrib/children/detailed&#45;attrib/children/prio -->
<g id="edge14" class="edge">
<title>dup15_/lht_tree_doc/comm/attrib/children/detailed&#45;attrib&#45;&gt;dup15_/lht_tree_doc/comm/attrib/children/detailed&#45;attrib/children/prio</title>
<path fill="none" stroke="#000000" d="M630.6913,-90.6693C638.9358,-80.4544 648.4155,-68.709 656.976,-58.1026"/>
<polygon fill="#000000" stroke="#000000" points="659.7503,-60.2379 663.3073,-50.258 654.3031,-55.8415 659.7503,-60.2379"/>
</g>
</g>
</svg>
