cschem abstract model v1
components
 anon_comp_11
  attributes
   sym-copyright=(C) 2022 Tibor 'Igor2' Palinkas
   sym-license-dist=GPLv2+
   role=symbol
   sym-license-use=Public Domain
   sym-source=sch-rnd default symbol lib
   connect []
    1:GND
  ports
   1
    attributes
     role=terminal
     display/name=1
     name=1
 anon_comp_12
  attributes
   sym-copyright=(C) 2022 Tibor 'Igor2' Palinkas
   sym-license-dist=GPLv2+
   role=symbol
   sym-license-use=Public Domain
   sym-source=sch-rnd default symbol lib
   connect []
    1:GND
  ports
   1
    attributes
     role=terminal
     display/name=1
     name=1
 anon_comp_3
  attributes
   sym-copyright=(C) 2022 Tibor 'Igor2' Palinkas
   sym-license-dist=GPLv2+
   role=symbol
   sym-license-use=Public Domain
   sym-source=sch-rnd default symbol lib
   connect []
    1:GND
  ports
   1
    attributes
     role=terminal
     display/name=1
     name=1
 CONN1
  attributes
   role=symbol
   footprint=connector(2,1)
   name=CONN1
  ports
   1
    attributes
     role=terminal
     display/name=1
     name=1
   2
    attributes
     role=terminal
     display/name=2
     name=2
 CONN2
  attributes
   role=symbol
   footprint=connector(2,1)
   name=CONN2
  ports
   1
    attributes
     role=terminal
     display/name=1
     name=1
   2
    attributes
     role=terminal
     display/name=2
     name=2
 anon_comp_7
  attributes
   sym-copyright=(C) 2022 Tibor 'Igor2' Palinkas
   sym-license-dist=GPLv2+
   role=symbol
   sym-license-use=Public Domain
   sym-source=sch-rnd default symbol lib
   connect []
    1:GND
  ports
   1
    attributes
     role=terminal
     display/name=1
     name=1
 U1
  attributes
   footprint=TO220
   role=symbol
   sym-source=sch-rnd default symbol lib
   symbol_generator=boxsym-rnd
   sym-copyright=(C) 2022 Tibor 'Igor2' Palinkas
   sym-license-use=Public Domain
   name=U1
   sym-license-dist=GPLv2+
  ports
   out
    attributes
     display/name=3
     role=terminal
     pinnum=3
     name=out
   in
    attributes
     display/name=1
     role=terminal
     pinnum=1
     name=in
   gnd
    attributes
     display/name=2
     role=terminal
     pinnum=2
     name=gnd
 anon_comp_9
  attributes
   sym-copyright=(C) 2022 Tibor 'Igor2' Palinkas
   sym-license-dist=GPLv2+
   role=symbol
   sym-license-use=Public Domain
   sym-source=sch-rnd default symbol lib
   connect []
    1:GND
  ports
   1
    attributes
     role=terminal
     display/name=1
     name=1
 C1
  attributes
   portmap []
    N->pcb/pinnum=1
    P->pcb/pinnum=2
   footprint=rcy(300)
   role=symbol
   sym-source=sch-rnd default symbol lib
   sym-copyright=(C) 2022 Tibor 'Igor2' Palinkas
   value=10u
   sym-license-use=Public Domain
   name=C1
   sym-license-dist=GPLv2+
  ports
   N
    attributes
     pcb/pinnum=1
     role=terminal
     display/name=1
     name=N
   P
    attributes
     pcb/pinnum=2
     role=terminal
     display/name=2
     name=P
 C2
  attributes
   footprint=1206
   role=symbol
   sym-source=sch-rnd default symbol lib
   sym-copyright=(C) 2022 Tibor 'Igor2' Palinkas
   value=100n
   sym-license-use=Public Domain
   name=C2
   sym-license-dist=GPLv2+
  ports
   1
    attributes
     role=terminal
     display/name=1
     name=1
   2
    attributes
     role=terminal
     display/name=2
     name=2
 C3
  attributes
   footprint=1206
   role=symbol
   sym-source=sch-rnd default symbol lib
   sym-copyright=(C) 2022 Tibor 'Igor2' Palinkas
   value=100n
   sym-license-use=Public Domain
   name=C3
   sym-license-dist=GPLv2+
  ports
   1
    attributes
     role=terminal
     display/name=1
     name=1
   2
    attributes
     role=terminal
     display/name=2
     name=2
 anon_comp_10
  attributes
   sym-copyright=(C) 2022 Tibor 'Igor2' Palinkas
   sym-license-dist=GPLv2+
   role=symbol
   sym-license-use=Public Domain
   sym-source=sch-rnd default symbol lib
   connect []
    1:GND
  ports
   1
    attributes
     role=terminal
     display/name=1
     name=1
nets
 GND
  attributes
   role=wire-net
  conns 12
   CONN1-1
   anon_comp_3-1
   CONN2-1
   anon_comp_7-1
   anon_comp_9-1
   C3-2
   C2-2
   anon_comp_10-1
   C1-N
   anon_comp_11-1
   U1-gnd
   anon_comp_12-1
 anon_net_3
  attributes
   role=wire-net
  conns 4
   CONN1-2
   U1-in
   C1-P
   C2-1
 anon_net_4
  attributes
   role=wire-net
  conns 3
   U1-out
   CONN2-2
   C3-1
