<?xml version="1.0" encoding="UTF-8" standalone="no"?>
<!DOCTYPE svg PUBLIC "-//W3C//DTD SVG 1.1//EN"
 "http://www.w3.org/Graphics/SVG/1.1/DTD/svg11.dtd">
<!-- Generated by graphviz version 2.40.1 (20161225.0304)
 -->
<!-- Title: ha:pen.NAME Pages: 1 -->
<svg width="833pt" height="153pt"
 viewBox="0.00 0.00 832.92 152.89" xmlns="http://www.w3.org/2000/svg" xmlns:xlink="http://www.w3.org/1999/xlink">
<g id="graph0" class="graph" transform="scale(1 1) rotate(0) translate(4 148.8944)">
<title>ha:pen.NAME</title>
<polygon fill="#ffffff" stroke="transparent" points="-4,4 -4,-148.8944 828.9239,-148.8944 828.9239,4 -4,4"/>
<!-- /lht_tree_doc/comm/pen.NAME -->
<g id="node1" class="node">
<title>/lht_tree_doc/comm/pen.NAME</title>
<g id="a_node1"><a xlink:href="tree.html#/lht_tree_doc/comm/pen.NAME" xlink:title=" Logical object: a named pen used for drawing; names are unique within a group ">
<ellipse fill="none" stroke="#000000" cx="369.234" cy="-117.3173" rx="68.6788" ry="27.6545"/>
<text text-anchor="middle" x="369.234" y="-121.6173" font-family="Times,serif" font-size="14.00" fill="#000000">ha:pen.NAME</text>
</a>
</g>
</g>
<!-- /lht_tree_doc/comm/pen.NAME/children/shape -->
<g id="node2" class="node">
<title>/lht_tree_doc/comm/pen.NAME/children/shape</title>
<g id="a_node2"><a xlink:href="tree.html#/lht_tree_doc/comm/pen.NAME/children/shape" xlink:title="pen tip shape)">
<ellipse fill="none" stroke="#000000" cx="33.234" cy="-26.8701" rx="33.4697" ry="26.7407"/>
<text text-anchor="middle" x="33.234" y="-30.6701" font-family="Times,serif" font-size="14.00" fill="#000000">shape</text>
<text text-anchor="middle" x="33.234" y="-15.6701" font-family="Times,serif" font-size="14.00" fill="#000000">shape</text>
</a>
</g>
</g>
<!-- /lht_tree_doc/comm/pen.NAME&#45;&gt;/lht_tree_doc/comm/pen.NAME/children/shape -->
<g id="edge1" class="edge">
<title>/lht_tree_doc/comm/pen.NAME&#45;&gt;/lht_tree_doc/comm/pen.NAME/children/shape</title>
<path fill="none" stroke="#000000" d="M303.0001,-109.8448C242.0598,-101.3918 150.0666,-84.593 75.234,-53.7401 72.5331,-52.6265 69.8143,-51.3396 67.1294,-49.9443"/>
<polygon fill="#000000" stroke="#000000" points="68.6302,-46.7716 58.2061,-44.8776 65.1739,-52.8588 68.6302,-46.7716"/>
</g>
<!-- /lht_tree_doc/comm/pen.NAME/children/size -->
<g id="node3" class="node">
<title>/lht_tree_doc/comm/pen.NAME/children/size</title>
<g id="a_node3"><a xlink:href="tree.html#/lht_tree_doc/comm/pen.NAME/children/size" xlink:title="diameter or side length">
<ellipse fill="none" stroke="#000000" cx="117.234" cy="-26.8701" rx="33.4697" ry="26.7407"/>
<text text-anchor="middle" x="117.234" y="-30.6701" font-family="Times,serif" font-size="14.00" fill="#000000">size</text>
<text text-anchor="middle" x="117.234" y="-15.6701" font-family="Times,serif" font-size="14.00" fill="#000000">coord</text>
</a>
</g>
</g>
<!-- /lht_tree_doc/comm/pen.NAME&#45;&gt;/lht_tree_doc/comm/pen.NAME/children/size -->
<g id="edge2" class="edge">
<title>/lht_tree_doc/comm/pen.NAME&#45;&gt;/lht_tree_doc/comm/pen.NAME/children/size</title>
<path fill="none" stroke="#000000" d="M309.2524,-103.8414C266.3542,-93.091 207.847,-76.1269 159.234,-53.7401 156.5804,-52.5181 153.8965,-51.1513 151.2364,-49.6991"/>
<polygon fill="#000000" stroke="#000000" points="152.7632,-46.5377 142.3625,-44.519 149.2343,-52.5831 152.7632,-46.5377"/>
</g>
<!-- /lht_tree_doc/comm/pen.NAME/children/color -->
<g id="node4" class="node">
<title>/lht_tree_doc/comm/pen.NAME/children/color</title>
<g id="a_node4"><a xlink:href="tree.html#/lht_tree_doc/comm/pen.NAME/children/color" xlink:title="ink color ">
<ellipse fill="none" stroke="#000000" cx="199.234" cy="-26.8701" rx="31.2258" ry="26.7407"/>
<text text-anchor="middle" x="199.234" y="-30.6701" font-family="Times,serif" font-size="14.00" fill="#000000">color</text>
<text text-anchor="middle" x="199.234" y="-15.6701" font-family="Times,serif" font-size="14.00" fill="#000000">color</text>
</a>
</g>
</g>
<!-- /lht_tree_doc/comm/pen.NAME&#45;&gt;/lht_tree_doc/comm/pen.NAME/children/color -->
<g id="edge3" class="edge">
<title>/lht_tree_doc/comm/pen.NAME&#45;&gt;/lht_tree_doc/comm/pen.NAME/children/color</title>
<path fill="none" stroke="#000000" d="M323.3198,-96.7378C298.07,-84.957 266.438,-69.4313 239.234,-53.7401 236.9513,-52.4234 234.6247,-51.024 232.2996,-49.582"/>
<polygon fill="#000000" stroke="#000000" points="233.742,-46.349 223.4353,-43.8951 229.9621,-52.2408 233.742,-46.349"/>
</g>
<!-- /lht_tree_doc/comm/pen.NAME/children/font_height -->
<g id="node5" class="node">
<title>/lht_tree_doc/comm/pen.NAME/children/font_height</title>
<g id="a_node5"><a xlink:href="tree.html#/lht_tree_doc/comm/pen.NAME/children/font_height" xlink:title="height of text font for non&#45;bbox&#45;defined text">
<ellipse fill="none" stroke="#000000" cx="304.234" cy="-26.8701" rx="55.7232" ry="26.7407"/>
<text text-anchor="middle" x="304.234" y="-30.6701" font-family="Times,serif" font-size="14.00" fill="#000000">font_height</text>
<text text-anchor="middle" x="304.234" y="-15.6701" font-family="Times,serif" font-size="14.00" fill="#000000">coord</text>
</a>
</g>
</g>
<!-- /lht_tree_doc/comm/pen.NAME&#45;&gt;/lht_tree_doc/comm/pen.NAME/children/font_height -->
<g id="edge4" class="edge">
<title>/lht_tree_doc/comm/pen.NAME&#45;&gt;/lht_tree_doc/comm/pen.NAME/children/font_height</title>
<path fill="none" stroke="#000000" d="M350.0834,-90.6693C343.296,-81.2246 335.5683,-70.4716 328.4167,-60.5201"/>
<polygon fill="#000000" stroke="#000000" points="331.2562,-58.4738 322.5781,-52.3958 325.5718,-62.5589 331.2562,-58.4738"/>
</g>
<!-- /lht_tree_doc/comm/pen.NAME/children/font_family -->
<g id="node6" class="node">
<title>/lht_tree_doc/comm/pen.NAME/children/font_family</title>
<g id="a_node6"><a xlink:href="tree.html#/lht_tree_doc/comm/pen.NAME/children/font_family" xlink:title="family hint for the font selector">
<ellipse fill="none" stroke="#000000" cx="435.234" cy="-26.8701" rx="57.0522" ry="26.7407"/>
<text text-anchor="middle" x="435.234" y="-30.6701" font-family="Times,serif" font-size="14.00" fill="#000000">font_family</text>
<text text-anchor="middle" x="435.234" y="-15.6701" font-family="Times,serif" font-size="14.00" fill="#000000">string</text>
</a>
</g>
</g>
<!-- /lht_tree_doc/comm/pen.NAME&#45;&gt;/lht_tree_doc/comm/pen.NAME/children/font_family -->
<g id="edge5" class="edge">
<title>/lht_tree_doc/comm/pen.NAME&#45;&gt;/lht_tree_doc/comm/pen.NAME/children/font_family</title>
<path fill="none" stroke="#000000" d="M388.6792,-90.6693C395.5711,-81.2246 403.4177,-70.4716 410.6793,-60.5201"/>
<polygon fill="#000000" stroke="#000000" points="413.5404,-62.5369 416.6077,-52.3958 407.8858,-58.4107 413.5404,-62.5369"/>
</g>
<!-- /lht_tree_doc/comm/pen.NAME/children/font_style -->
<g id="node7" class="node">
<title>/lht_tree_doc/comm/pen.NAME/children/font_style</title>
<g id="a_node7"><a xlink:href="tree.html#/lht_tree_doc/comm/pen.NAME/children/font_style" xlink:title="style hint for the font selector">
<ellipse fill="none" stroke="#000000" cx="560.234" cy="-26.8701" rx="50.41" ry="26.7407"/>
<text text-anchor="middle" x="560.234" y="-30.6701" font-family="Times,serif" font-size="14.00" fill="#000000">font_style</text>
<text text-anchor="middle" x="560.234" y="-15.6701" font-family="Times,serif" font-size="14.00" fill="#000000">string</text>
</a>
</g>
</g>
<!-- /lht_tree_doc/comm/pen.NAME&#45;&gt;/lht_tree_doc/comm/pen.NAME/children/font_style -->
<g id="edge6" class="edge">
<title>/lht_tree_doc/comm/pen.NAME&#45;&gt;/lht_tree_doc/comm/pen.NAME/children/font_style</title>
<path fill="none" stroke="#000000" d="M414.015,-96.1114C443.8924,-81.9631 483.1,-63.3965 513.3937,-49.0511"/>
<polygon fill="#000000" stroke="#000000" points="514.9489,-52.1873 522.4888,-44.7442 511.9529,-45.8608 514.9489,-52.1873"/>
</g>
<!-- /lht_tree_doc/comm/pen.NAME/children/dash -->
<g id="node8" class="node">
<title>/lht_tree_doc/comm/pen.NAME/children/dash</title>
<g id="a_node8"><a xlink:href="tree.html#/lht_tree_doc/comm/pen.NAME/children/dash" xlink:title="dash pattern ">
<ellipse fill="none" stroke="#000000" cx="659.234" cy="-26.8701" rx="30.3115" ry="26.7407"/>
<text text-anchor="middle" x="659.234" y="-30.6701" font-family="Times,serif" font-size="14.00" fill="#000000">dash</text>
<text text-anchor="middle" x="659.234" y="-15.6701" font-family="Times,serif" font-size="14.00" fill="#000000">hex4</text>
</a>
</g>
</g>
<!-- /lht_tree_doc/comm/pen.NAME&#45;&gt;/lht_tree_doc/comm/pen.NAME/children/dash -->
<g id="edge7" class="edge">
<title>/lht_tree_doc/comm/pen.NAME&#45;&gt;/lht_tree_doc/comm/pen.NAME/children/dash</title>
<path fill="none" stroke="#000000" d="M433.3909,-107.2608C485.1197,-97.6919 558.9256,-80.6919 619.234,-53.7401 621.8834,-52.5561 624.5492,-51.1996 627.1783,-49.7392"/>
<polygon fill="#000000" stroke="#000000" points="629.1481,-52.6384 635.8987,-44.4726 625.5292,-46.6464 629.1481,-52.6384"/>
</g>
<!-- /lht_tree_doc/comm/pen.NAME/children/dash_period -->
<g id="node9" class="node">
<title>/lht_tree_doc/comm/pen.NAME/children/dash_period</title>
<g id="a_node9"><a xlink:href="tree.html#/lht_tree_doc/comm/pen.NAME/children/dash_period" xlink:title="dash pattern length">
<ellipse fill="none" stroke="#000000" cx="766.234" cy="-26.8701" rx="58.8803" ry="26.7407"/>
<text text-anchor="middle" x="766.234" y="-30.6701" font-family="Times,serif" font-size="14.00" fill="#000000">dash_period</text>
<text text-anchor="middle" x="766.234" y="-15.6701" font-family="Times,serif" font-size="14.00" fill="#000000">coord</text>
</a>
</g>
</g>
<!-- /lht_tree_doc/comm/pen.NAME&#45;&gt;/lht_tree_doc/comm/pen.NAME/children/dash_period -->
<g id="edge8" class="edge">
<title>/lht_tree_doc/comm/pen.NAME&#45;&gt;/lht_tree_doc/comm/pen.NAME/children/dash_period</title>
<path fill="none" stroke="#000000" d="M434.3795,-108.377C501.3695,-98.3376 608.3141,-79.9482 698.234,-53.7401 703.2096,-52.2899 708.3278,-50.6188 713.4165,-48.8342"/>
<polygon fill="#000000" stroke="#000000" points="714.9279,-52.0084 723.1207,-45.2906 712.5268,-45.4331 714.9279,-52.0084"/>
</g>
</g>
</svg>
