<?xml version="1.0" encoding="UTF-8" standalone="no"?>
<!DOCTYPE svg PUBLIC "-//W3C//DTD SVG 1.1//EN"
 "http://www.w3.org/Graphics/SVG/1.1/DTD/svg11.dtd">
<!-- Generated by graphviz version 2.40.1 (20161225.0304)
 -->
<!-- Title: ha:connection.ID Pages: 1 -->
<svg width="164pt" height="244pt"
 viewBox="0.00 0.00 163.56 244.05" xmlns="http://www.w3.org/2000/svg" xmlns:xlink="http://www.w3.org/1999/xlink">
<g id="graph0" class="graph" transform="scale(1 1) rotate(0) translate(4 240.0488)">
<title>ha:connection.ID</title>
<polygon fill="#ffffff" stroke="transparent" points="-4,4 -4,-240.0488 159.5635,-240.0488 159.5635,4 -4,4"/>
<!-- /lht_tree_doc/comm/connection.ID -->
<g id="node1" class="node">
<title>/lht_tree_doc/comm/connection.ID</title>
<g id="a_node1"><a xlink:href="tree.html#/lht_tree_doc/comm/connection.ID" xlink:title=" Logical object: connection between different groups ">
<ellipse fill="none" stroke="#000000" cx="77.7817" cy="-208.4716" rx="77.5641" ry="27.6545"/>
<text text-anchor="middle" x="77.7817" y="-212.7716" font-family="Times,serif" font-size="14.00" fill="#000000">ha:connection.ID</text>
</a>
</g>
</g>
<!-- /lht_tree_doc/comm/connection.ID/children/conn -->
<g id="node2" class="node">
<title>/lht_tree_doc/comm/connection.ID/children/conn</title>
<g id="a_node2"><a xlink:href="tree.html#/lht_tree_doc/comm/connection.ID/children/conn" xlink:title=" list of objects participating in the connection (at least 2)">
<ellipse fill="none" stroke="#000000" cx="77.7817" cy="-117.3173" rx="38.3684" ry="27.6545"/>
<text text-anchor="middle" x="77.7817" y="-121.6173" font-family="Times,serif" font-size="14.00" fill="#000000">li:conn</text>
</a>
</g>
</g>
<!-- /lht_tree_doc/comm/connection.ID&#45;&gt;/lht_tree_doc/comm/connection.ID/children/conn -->
<g id="edge1" class="edge">
<title>/lht_tree_doc/comm/connection.ID&#45;&gt;/lht_tree_doc/comm/connection.ID/children/conn</title>
<path fill="none" stroke="#000000" d="M77.7817,-180.627C77.7817,-172.5869 77.7817,-163.6746 77.7817,-155.1365"/>
<polygon fill="#000000" stroke="#000000" points="81.2818,-154.9913 77.7817,-144.9914 74.2818,-154.9914 81.2818,-154.9913"/>
</g>
<!-- /lht_tree_doc/comm/connection.ID/children/conn/children/OIDPATH -->
<g id="node3" class="node">
<title>/lht_tree_doc/comm/connection.ID/children/conn/children/OIDPATH</title>
<g id="a_node3"><a xlink:href="tree.html#/lht_tree_doc/comm/connection.ID/children/conn/children/OIDPATH" xlink:title="drawing object making the connection )">
<ellipse fill="none" stroke="#000000" cx="77.7817" cy="-26.8701" rx="53.9813" ry="26.7407"/>
<text text-anchor="middle" x="77.7817" y="-30.6701" font-family="Times,serif" font-size="14.00" fill="#000000">OIDPATH</text>
<text text-anchor="middle" x="77.7817" y="-15.6701" font-family="Times,serif" font-size="14.00" fill="#000000">oidpath</text>
</a>
</g>
</g>
<!-- /lht_tree_doc/comm/connection.ID/children/conn&#45;&gt;/lht_tree_doc/comm/connection.ID/children/conn/children/OIDPATH -->
<g id="edge2" class="edge">
<title>/lht_tree_doc/comm/connection.ID/children/conn&#45;&gt;/lht_tree_doc/comm/connection.ID/children/conn/children/OIDPATH</title>
<path fill="none" stroke="#000000" d="M77.7817,-89.6887C77.7817,-81.6371 77.7817,-72.704 77.7817,-64.1607"/>
<polygon fill="#000000" stroke="#000000" points="81.2818,-64.0187 77.7817,-54.0187 74.2818,-64.0187 81.2818,-64.0187"/>
</g>
</g>
</svg>
