%!PS-Adobe-3.0 EPSF-3.0
%%Creator: cairo 1.12.14 (http://cairographics.org)
%%CreationDate: Sun Dec 10 03:23:33 2017
%%Pages: 1
%%DocumentData: Clean7Bit
%%LanguageLevel: 2
%%BoundingBox: 0 -1 103 103
%%EndComments
%%BeginProlog
save
50 dict begin
/q { gsave } bind def
/Q { grestore } bind def
/cm { 6 array astore concat } bind def
/w { setlinewidth } bind def
/J { setlinecap } bind def
/j { setlinejoin } bind def
/M { setmiterlimit } bind def
/d { setdash } bind def
/m { moveto } bind def
/l { lineto } bind def
/c { curveto } bind def
/h { closepath } bind def
/re { exch dup neg 3 1 roll 5 3 roll moveto 0 rlineto
      0 exch rlineto 0 rlineto closepath } bind def
/S { stroke } bind def
/f { fill } bind def
/f* { eofill } bind def
/n { newpath } bind def
/W { clip } bind def
/W* { eoclip } bind def
/BT { } bind def
/ET { } bind def
/pdfmark where { pop globaldict /?pdfmark /exec load put }
    { globaldict begin /?pdfmark /pop load def /pdfmark
    /cleartomark load def end } ifelse
/BDC { mark 3 1 roll /BDC pdfmark } bind def
/EMC { mark /EMC pdfmark } bind def
/cairo_store_point { /cairo_point_y exch def /cairo_point_x exch def } def
/Tj { show currentpoint cairo_store_point } bind def
/TJ {
  {
    dup
    type /stringtype eq
    { show } { -0.001 mul 0 cairo_font_matrix dtransform rmoveto } ifelse
  } forall
  currentpoint cairo_store_point
} bind def
/cairo_selectfont { cairo_font_matrix aload pop pop pop 0 0 6 array astore
    cairo_font exch selectfont cairo_point_x cairo_point_y moveto } bind def
/Tf { pop /cairo_font exch def /cairo_font_matrix where
      { pop cairo_selectfont } if } bind def
/Td { matrix translate cairo_font_matrix matrix concatmatrix dup
      /cairo_font_matrix exch def dup 4 get exch 5 get cairo_store_point
      /cairo_font where { pop cairo_selectfont } if } bind def
/Tm { 2 copy 8 2 roll 6 array astore /cairo_font_matrix exch def
      cairo_store_point /cairo_font where { pop cairo_selectfont } if } bind def
/g { setgray } bind def
/rg { setrgbcolor } bind def
/d1 { setcachedevice } bind def
%%EndProlog
%%Page: 1 1
%%BeginPageSetup
%%PageBoundingBox: 0 -1 103 103
%%EndPageSetup
q 0 -1 103 104 rectclip q
0.847059 0.968627 0.984314 rg
0.562 102.4 m 101.836 102.4 l 102.148 102.4 102.398 102.15 102.398 101.838
 c 102.398 0.564 l 102.398 0.252 102.148 0.002 101.836 0.002 c 0.562 0.002
 l 0.25 0.002 0 0.252 0 0.564 c 0 101.838 l 0 102.15 0.25 102.4 0.562 102.4
 c h
f
0.00784314 g
14.984 16.982 m 14.984 15.33 13.645 13.986 11.988 13.986 c 10.332 13.986
 8.992 15.33 8.992 16.982 c 8.992 18.638 10.332 19.982 11.988 19.982 c 13.645
 19.982 14.984 18.638 14.984 16.982 c h
f
14.984 86.916 m 14.984 85.259 13.645 83.92 11.988 83.92 c 10.332 83.92 
8.992 85.259 8.992 86.916 c 8.992 88.572 10.332 89.912 11.988 89.912 c 13.645
 89.912 14.984 88.572 14.984 86.916 c h
f
92.91 17.982 m 92.91 16.326 91.566 14.986 89.914 14.986 c 88.258 14.986
 86.914 16.326 86.914 17.982 c 86.914 19.638 88.258 20.978 89.914 20.978
 c 91.566 20.978 92.91 19.638 92.91 17.982 c h
f
92.91 86.916 m 92.91 85.259 91.566 83.92 89.914 83.92 c 88.258 83.92 86.914
 85.259 86.914 86.916 c 86.914 88.572 88.258 89.912 89.914 89.912 c 91.566
 89.912 92.91 88.572 92.91 86.916 c h
f
0 g
2.997073 w
1 J
0 j
[] 0.0 d
4 M q 1 0 0 -1 0 102.400002 cm
81.922 15.484 m 89.914 15.484 l 21.98 15.484 m 11.988 15.484 l 81.922 15.484
 m 75.926 24.477 l 63.938 6.492 m 75.926 24.477 l 63.938 6.492 m 51.949 
24.477 l 39.961 6.492 m 51.949 24.477 l 39.961 6.492 m 27.973 24.477 l 21.98
 15.484 m 27.973 24.477 l S Q
q 1 0 0 -1 0 102.400002 cm
11.988 15.484 m 11.988 46.953 l 2.496 46.953 m 21.48 46.953 l S Q
q 1 0 0 -1 0 102.400002 cm
11.988 85.418 m 11.988 54.945 l 2.496 54.945 m 21.48 54.945 l S Q
q 1 0 0 -1 0 102.400002 cm
65.938 84.418 m 71.93 76.426 72.93 76.426 74.926 84.418 c 89.914 84.418
 l 28.973 85.418 m 11.988 85.418 l 52.949 85.418 m 61.941 74.426 60.941 
76.426 64.938 85.418 c 73.93 101.402 52.949 99.402 65.938 84.418 c 40.961
 85.418 m 49.953 74.426 48.953 76.426 52.949 85.418 c 61.941 101.402 40.961
 99.402 53.949 84.418 c 28.973 85.418 m 37.965 74.426 36.965 76.426 40.961
 85.418 c 49.953 101.402 28.973 99.402 41.961 84.418 c S Q
0.00784314 g
93.91 39.963 m 93.91 37.755 92.121 35.966 89.914 35.966 c 87.707 35.966
 85.918 37.755 85.918 39.963 c 85.918 42.17 87.707 43.959 89.914 43.959 
c 92.121 43.959 93.91 42.17 93.91 39.963 c h
f
0 g
0.0532813 w
q 1 0 0 -1 0 102.400002 cm
93.91 62.438 m 93.91 64.645 92.121 66.434 89.914 66.434 c 87.707 66.434
 85.918 64.645 85.918 62.438 c 85.918 60.23 87.707 58.441 89.914 58.441 
c 92.121 58.441 93.91 60.23 93.91 62.438 c h
S Q
0.0666667 0.584314 0.662745 rg
3.996098 w
1 M q 1 0 0 -1 0 102.400002 cm
65.938 35.734 m 62.668 33.066 58.496 31.469 53.949 31.469 c 43.465 31.469
 34.965 39.969 34.965 50.449 c 34.965 60.934 43.465 69.434 53.949 69.434
 c 58.496 69.434 62.668 67.832 65.938 65.168 c S Q
73.43 61.939 m 57.227 62.599 l 61.723 69.591 l 73.43 61.939 m 66.219 76.088
 l 61.723 69.591 l f
0 g
2.997073 w
4 M q 1 0 0 -1 0 102.400002 cm
89.914 84.418 m 89.914 62.438 l S Q
0.00784314 g
93.91 62.439 m 93.91 64.646 92.121 66.435 89.914 66.435 c 87.707 66.435
 85.918 64.646 85.918 62.439 c 85.918 60.232 87.707 58.443 89.914 58.443
 c 92.121 58.443 93.91 60.232 93.91 62.439 c h
f
0 g
0.0532813 w
q 1 0 0 1 0 102.400002 cm
93.91 -39.961 m 93.91 -37.754 92.121 -35.965 89.914 -35.965 c 87.707 -35.965
 85.918 -37.754 85.918 -39.961 c 85.918 -42.168 87.707 -43.957 89.914 -43.957
 c 92.121 -43.957 93.91 -42.168 93.91 -39.961 c h
S Q
2.997073 w
q 1 0 0 -1 0 102.400002 cm
89.914 15.484 m 89.914 39.961 l S Q
Q Q
showpage
%%Trailer
end restore
%%EOF
