<?xml version="1.0" encoding="UTF-8" standalone="no"?>
<!DOCTYPE svg PUBLIC "-//W3C//DTD SVG 1.1//EN"
 "http://www.w3.org/Graphics/SVG/1.1/DTD/svg11.dtd">
<!-- Generated by graphviz version 2.40.1 (20161225.0304)
 -->
<!-- Title: li:cschem&#45;buffer&#45;v* Pages: 1 -->
<svg width="234pt" height="154pt"
 viewBox="0.00 0.00 233.50 154.15" xmlns="http://www.w3.org/2000/svg" xmlns:xlink="http://www.w3.org/1999/xlink">
<g id="graph0" class="graph" transform="scale(1 1) rotate(0) translate(4 150.1543)">
<title>li:cschem&#45;buffer&#45;v*</title>
<polygon fill="#ffffff" stroke="transparent" points="-4,4 -4,-150.1543 229.5,-150.1543 229.5,4 -4,4"/>
<!-- /lht_tree_doc/roots/cschem&#45;buffer&#45;v* -->
<g id="node1" class="node">
<title>/lht_tree_doc/roots/cschem&#45;buffer&#45;v*</title>
<g id="a_node1"><a xlink:href="tree.html#/lht_tree_doc/roots/cschem-buffer-v*" xlink:title="Buffer content (direct/indirect: same meaning as schematic sheet)">
<ellipse fill="none" stroke="#000000" cx="115.5" cy="-118.5772" rx="88.2768" ry="27.6545"/>
<text text-anchor="middle" x="115.5" y="-122.8772" font-family="Times,serif" font-size="14.00" fill="#000000">li:cschem&#45;buffer&#45;v*</text>
</a>
</g>
</g>
<!-- dup1_/lht_tree_doc/roots/cschem&#45;buffer&#45;v*/children/obj_indirect.1 -->
<g id="node2" class="node">
<title>dup1_/lht_tree_doc/roots/cschem&#45;buffer&#45;v*/children/obj_indirect.1</title>
<g id="a_node2"><a xlink:href="group.ID.svg" xlink:title="obj_indirect.1 &#45;&gt;\n\n\n">
<text text-anchor="middle" x="54.5" y="-39.8" font-family="Times,serif" font-size="14.00" fill="#000000">obj_indirect.1 &#45;&gt;</text>
</a>
</g>
</g>
<!-- /lht_tree_doc/roots/cschem&#45;buffer&#45;v*&#45;&gt;dup1_/lht_tree_doc/roots/cschem&#45;buffer&#45;v*/children/obj_indirect.1 -->
<g id="edge1" class="edge">
<title>/lht_tree_doc/roots/cschem&#45;buffer&#45;v*&#45;&gt;dup1_/lht_tree_doc/roots/cschem&#45;buffer&#45;v*/children/obj_indirect.1</title>
<path fill="none" stroke="#000000" d="M97.198,-91.251C91.4004,-82.5948 84.8988,-72.8875 78.7511,-63.7086"/>
<polygon fill="#000000" stroke="#000000" points="81.4728,-61.4826 72.9999,-55.1217 75.6567,-65.378 81.4728,-61.4826"/>
</g>
<!-- dup2_/lht_tree_doc/roots/cschem&#45;buffer&#45;v*/children/obj_direct.2 -->
<g id="node3" class="node">
<title>dup2_/lht_tree_doc/roots/cschem&#45;buffer&#45;v*/children/obj_direct.2</title>
<g id="a_node3"><a xlink:href="group.ID.svg" xlink:title="obj_direct.2 &#45;&gt;\n\n\n">
<text text-anchor="middle" x="176.5" y="-39.8" font-family="Times,serif" font-size="14.00" fill="#000000">obj_direct.2 &#45;&gt;</text>
</a>
</g>
</g>
<!-- /lht_tree_doc/roots/cschem&#45;buffer&#45;v*&#45;&gt;dup2_/lht_tree_doc/roots/cschem&#45;buffer&#45;v*/children/obj_direct.2 -->
<g id="edge2" class="edge">
<title>/lht_tree_doc/roots/cschem&#45;buffer&#45;v*&#45;&gt;dup2_/lht_tree_doc/roots/cschem&#45;buffer&#45;v*/children/obj_direct.2</title>
<path fill="none" stroke="#000000" d="M133.802,-91.251C139.5996,-82.5948 146.1012,-72.8875 152.2489,-63.7086"/>
<polygon fill="#000000" stroke="#000000" points="155.3433,-65.378 158.0001,-55.1217 149.5272,-61.4826 155.3433,-65.378"/>
</g>
</g>
</svg>
