<?xml version="1.0"?>
<svg xmlns="http://www.w3.org/2000/svg" xmlns:xlink="http://www.w3.org/1999/xlink" version="1.0" width="1314.8160" height="1755.1360" viewBox="-2.1280 -2.0000 87.1760 114.6960">
<g id="layer_1_TODO:layer_name">
<!--normal-->
 <polygon points="0.0000,109.5680 81.9200,109.5680 81.9200,89.0880 0.0000,89.0880 0.0000,109.5680 " stroke-width="0.010" stroke="#bbffbb" fill="#bbffbb"/>
 <line x1="0.0000" y1="109.5680" x2="81.9200" y2="109.5680" stroke-width="0.2560" stroke="#777777" stroke-linecap="round"/>
 <line x1="81.9200" y1="109.5680" x2="81.9200" y2="89.0880" stroke-width="0.2560" stroke="#777777" stroke-linecap="round"/>
 <line x1="81.9200" y1="89.0880" x2="0.0000" y2="89.0880" stroke-width="0.2560" stroke="#777777" stroke-linecap="round"/>
 <line x1="0.0000" y1="89.0880" x2="0.0000" y2="109.5680" stroke-width="0.2560" stroke="#777777" stroke-linecap="round"/>
 <line x1="20.4800" y1="3.0720" x2="28.6720" y2="3.0720" stroke-width="0.2560" stroke="#2222bb" stroke-linecap="round"/>
 <line x1="24.6477" y1="0.3927" x2="24.6477" y2="0.4998" stroke-width="0.1429" stroke="#2222bb" stroke-linecap="round"/>
 <line x1="24.6477" y1="1.0000" x2="24.6477" y2="2.2146" stroke-width="0.1429" stroke="#2222bb" stroke-linecap="round"/>
 <line x1="25.0406" y1="1.0000" x2="25.5408" y2="1.0000" stroke-width="0.1429" stroke="#2222bb" stroke-linecap="round"/>
 <line x1="25.8623" y1="1.3215" x2="25.8623" y2="2.2146" stroke-width="0.1429" stroke="#2222bb" stroke-linecap="round"/>
 <line x1="25.0406" y1="1.0000" x2="25.0406" y2="2.2146" stroke-width="0.1429" stroke="#2222bb" stroke-linecap="round"/>
 <path d="M 25.86230900 1.32150800 A 0.3215 0.3215 0 0 0 25.5408 1.0000" stroke-width="0.1429" stroke="#2222bb" stroke-linecap="round" fill="none"/>
 <line x1="20.4800" y1="7.1680" x2="24.5760" y2="7.1680" stroke-width="0.2560" stroke="#2222bb" stroke-linecap="round"/>
 <line x1="24.5760" y1="7.1680" x2="24.5760" y2="60.4160" stroke-width="0.2560" stroke="#2222bb" stroke-linecap="round"/>
 <line x1="53.2480" y1="7.1680" x2="53.2480" y2="3.0720" stroke-width="0.2560" stroke="#2222bb" stroke-linecap="round"/>
 <line x1="61.5834" y1="1.8216" x2="61.5834" y2="1.3930" stroke-width="0.1429" stroke="#2222bb" stroke-linecap="round"/>
 <line x1="62.3980" y1="1.3930" x2="62.3980" y2="1.8216" stroke-width="0.1429" stroke="#2222bb" stroke-linecap="round"/>
 <path d="M 62.39799800 1.82164900 A 0.4073 0.4073 0 0 1 61.5834 1.8216" stroke-width="0.1429" stroke="#2222bb" stroke-linecap="round" fill="none"/>
 <path d="M 62.39799800 1.39295700 A 0.4073 0.4073 0 0 0 61.5834 1.3930" stroke-width="0.1429" stroke="#2222bb" stroke-linecap="round" fill="none"/>
 <line x1="62.6481" y1="1.0000" x2="62.6481" y2="1.9645" stroke-width="0.1429" stroke="#2222bb" stroke-linecap="round"/>
 <line x1="62.8981" y1="2.2146" x2="63.4697" y2="2.2146" stroke-width="0.1429" stroke="#2222bb" stroke-linecap="round"/>
 <line x1="63.4697" y1="2.2146" x2="63.4697" y2="1.0000" stroke-width="0.1429" stroke="#2222bb" stroke-linecap="round"/>
 <path d="M 62.89814100 2.21461600 A 0.2501 0.2501 0 0 1 62.6481 1.9645" stroke-width="0.1429" stroke="#2222bb" stroke-linecap="round" fill="none"/>
 <line x1="64.0770" y1="0.3927" x2="64.0770" y2="2.2146" stroke-width="0.1429" stroke="#2222bb" stroke-linecap="round"/>
 <line x1="63.8627" y1="1.0000" x2="64.4700" y2="1.0000" stroke-width="0.1429" stroke="#2222bb" stroke-linecap="round"/>
 <line x1="64.8630" y1="0.7856" x2="65.2559" y2="0.3927" stroke-width="0.1429" stroke="#2222bb" stroke-linecap="round"/>
 <line x1="65.2559" y1="0.3927" x2="65.2559" y2="2.2146" stroke-width="0.1429" stroke="#2222bb" stroke-linecap="round"/>
 <line x1="49.1520" y1="3.0720" x2="65.5360" y2="3.0720" stroke-width="0.2560" stroke="#2222bb" stroke-linecap="round"/>
 <line x1="65.5360" y1="3.0720" x2="65.5360" y2="27.6480" stroke-width="0.2560" stroke="#2222bb" stroke-linecap="round"/>
 <line x1="53.2480" y1="60.4160" x2="53.2480" y2="56.3200" stroke-width="0.2560" stroke="#2222bb" stroke-linecap="round"/>
 <line x1="53.2480" y1="35.8400" x2="53.2480" y2="27.6480" stroke-width="0.2560" stroke="#2222bb" stroke-linecap="round"/>
 <line x1="65.5360" y1="27.6480" x2="69.6320" y2="27.6480" stroke-width="0.2560" stroke="#2222bb" stroke-linecap="round"/>
 <line x1="53.2480" y1="31.7440" x2="69.6320" y2="31.7440" stroke-width="0.2560" stroke="#2222bb" stroke-linecap="round"/>
 <line x1="61.5834" y1="30.4936" x2="61.5834" y2="30.0650" stroke-width="0.1429" stroke="#2222bb" stroke-linecap="round"/>
 <line x1="62.3980" y1="30.0650" x2="62.3980" y2="30.4936" stroke-width="0.1429" stroke="#2222bb" stroke-linecap="round"/>
 <path d="M 62.39799800 30.49364900 A 0.4073 0.4073 0 0 1 61.5834 30.4936" stroke-width="0.1429" stroke="#2222bb" stroke-linecap="round" fill="none"/>
 <path d="M 62.39799800 30.06495700 A 0.4073 0.4073 0 0 0 61.5834 30.0650" stroke-width="0.1429" stroke="#2222bb" stroke-linecap="round" fill="none"/>
 <line x1="62.6481" y1="29.6720" x2="62.6481" y2="30.6365" stroke-width="0.1429" stroke="#2222bb" stroke-linecap="round"/>
 <line x1="62.8981" y1="30.8866" x2="63.4697" y2="30.8866" stroke-width="0.1429" stroke="#2222bb" stroke-linecap="round"/>
 <line x1="63.4697" y1="30.8866" x2="63.4697" y2="29.6720" stroke-width="0.1429" stroke="#2222bb" stroke-linecap="round"/>
 <path d="M 62.89814100 30.88661600 A 0.2501 0.2501 0 0 1 62.6481 30.6365" stroke-width="0.1429" stroke="#2222bb" stroke-linecap="round" fill="none"/>
 <line x1="64.0770" y1="29.0647" x2="64.0770" y2="30.8866" stroke-width="0.1429" stroke="#2222bb" stroke-linecap="round"/>
 <line x1="63.8627" y1="29.6720" x2="64.4700" y2="29.6720" stroke-width="0.1429" stroke="#2222bb" stroke-linecap="round"/>
 <line x1="64.8767" y1="30.8866" x2="65.6626" y2="30.8866" stroke-width="0.1429" stroke="#2222bb" stroke-linecap="round"/>
 <line x1="64.8767" y1="30.8866" x2="65.6373" y2="29.7139" stroke-width="0.1429" stroke="#2222bb" stroke-linecap="round"/>
 <path d="M 65.63727500 29.71392800 A 0.4287 0.4287 0 1 0 64.8630 29.3578" stroke-width="0.1429" stroke="#2222bb" stroke-linecap="round" fill="none"/>
 <line x1="65.5360" y1="35.8400" x2="69.6320" y2="35.8400" stroke-width="0.2560" stroke="#2222bb" stroke-linecap="round"/>
 <line x1="65.5360" y1="60.4160" x2="65.5360" y2="35.8400" stroke-width="0.2560" stroke="#2222bb" stroke-linecap="round"/>
 <line x1="53.2480" y1="3.0720" x2="53.2480" y2="3.0720" stroke-width="1.0240" stroke="#2222bb" stroke-linecap="round"/>
 <line x1="53.2480" y1="31.7440" x2="53.2480" y2="31.7440" stroke-width="1.0240" stroke="#2222bb" stroke-linecap="round"/>
 <line x1="35.9379" y1="0.9308" x2="34.1722" y2="0.9308" stroke-width="0.1861" stroke="#119911" stroke-linecap="round"/>
 <line x1="35.1416" y1="0.3769" x2="35.1416" y2="0.9308" stroke-width="0.1861" stroke="#119911" stroke-linecap="round"/>
 <line x1="34.1722" y1="0.3769" x2="34.1722" y2="0.9308" stroke-width="0.1861" stroke="#119911" stroke-linecap="round"/>
 <line x1="34.5877" y1="-0.0386" x2="34.7262" y2="-0.0386" stroke-width="0.1861" stroke="#119911" stroke-linecap="round"/>
 <line x1="35.9379" y1="-0.0386" x2="35.1416" y2="0.3423" stroke-width="0.1861" stroke="#119911" stroke-linecap="round"/>
 <path d="M 34.17224600 0.37688600 A 0.4154 0.4154 0 0 1 34.5877 -0.0386" stroke-width="0.1861" stroke="#119911" stroke-linecap="round" fill="none"/>
 <path d="M 35.14162500 0.37688600 A 0.4154 0.4154 0 0 0 34.7262 -0.0386" stroke-width="0.1861" stroke="#119911" stroke-linecap="round" fill="none"/>
 <line x1="34.5531" y1="-0.2333" x2="34.1722" y2="-0.6141" stroke-width="0.1861" stroke="#119911" stroke-linecap="round"/>
 <line x1="34.1722" y1="-0.6141" x2="35.9379" y2="-0.6141" stroke-width="0.1861" stroke="#119911" stroke-linecap="round"/>
 <line x1="32.7680" y1="1.0240" x2="32.7680" y2="5.1200" stroke-width="0.1280" stroke="#119911" stroke-linecap="round"/>
 <line x1="32.7680" y1="5.1200" x2="45.0560" y2="5.1200" stroke-width="0.1280" stroke="#119911" stroke-linecap="round"/>
 <line x1="45.0560" y1="5.1200" x2="45.0560" y2="1.0240" stroke-width="0.1280" stroke="#119911" stroke-linecap="round"/>
 <line x1="45.0560" y1="1.0240" x2="32.7680" y2="1.0240" stroke-width="0.1280" stroke="#119911" stroke-linecap="round"/>
 <line x1="55.2960" y1="11.2640" x2="51.2000" y2="11.2640" stroke-width="0.1280" stroke="#119911" stroke-linecap="round"/>
 <line x1="51.2000" y1="11.2640" x2="51.2000" y2="23.5520" stroke-width="0.1280" stroke="#119911" stroke-linecap="round"/>
 <line x1="51.2000" y1="23.5520" x2="55.2960" y2="23.5520" stroke-width="0.1280" stroke="#119911" stroke-linecap="round"/>
 <line x1="55.2960" y1="23.5520" x2="55.2960" y2="11.2640" stroke-width="0.1280" stroke="#119911" stroke-linecap="round"/>
 <line x1="55.3892" y1="17.1451" x2="55.7700" y2="16.7642" stroke-width="0.1861" stroke="#119911" stroke-linecap="round"/>
 <line x1="55.7700" y1="16.7642" x2="55.7700" y2="18.5299" stroke-width="0.1861" stroke="#119911" stroke-linecap="round"/>
 <line x1="56.1508" y1="16.7642" x2="56.1508" y2="18.5299" stroke-width="0.1861" stroke="#119911" stroke-linecap="round"/>
 <line x1="56.9471" y1="17.3528" x2="56.1508" y2="17.9760" stroke-width="0.1861" stroke="#119911" stroke-linecap="round"/>
 <line x1="56.9471" y1="18.5299" x2="56.5004" y2="17.7024" stroke-width="0.1861" stroke="#119911" stroke-linecap="round"/>
 <line x1="13.3234" y1="10.6202" x2="13.7734" y2="10.6202" stroke-width="0.1861" stroke="#119911" stroke-linecap="round"/>
 <line x1="13.3234" y1="12.3859" x2="13.7734" y2="12.3859" stroke-width="0.1861" stroke="#119911" stroke-linecap="round"/>
 <line x1="12.9772" y1="10.9665" x2="12.9772" y2="12.0397" stroke-width="0.1861" stroke="#119911" stroke-linecap="round"/>
 <path d="M 13.32335800 12.38589900 A 0.3462 0.3462 0 0 1 12.9772 12.0397" stroke-width="0.1861" stroke="#119911" stroke-linecap="round" fill="none"/>
 <path d="M 13.32335800 10.62024700 A 0.3462 0.3462 0 0 0 12.9772 10.9665" stroke-width="0.1861" stroke="#119911" stroke-linecap="round" fill="none"/>
 <line x1="14.1543" y1="12.3859" x2="14.1543" y2="10.6202" stroke-width="0.1861" stroke="#119911" stroke-linecap="round"/>
 <line x1="15.1583" y1="12.3859" x2="15.1583" y2="10.6202" stroke-width="0.1861" stroke="#119911" stroke-linecap="round"/>
 <line x1="14.1543" y1="10.6202" x2="15.1583" y2="12.3859" stroke-width="0.1861" stroke="#119911" stroke-linecap="round"/>
 <line x1="15.5391" y1="11.0011" x2="15.9199" y2="10.6202" stroke-width="0.1861" stroke="#119911" stroke-linecap="round"/>
 <line x1="15.9199" y1="10.6202" x2="15.9199" y2="12.3859" stroke-width="0.1861" stroke="#119911" stroke-linecap="round"/>
 <line x1="16.3840" y1="9.2160" x2="16.3840" y2="1.0240" stroke-width="0.1280" stroke="#119911" stroke-linecap="round"/>
 <line x1="16.3840" y1="1.0240" x2="12.2880" y2="1.0240" stroke-width="0.1280" stroke="#119911" stroke-linecap="round"/>
 <line x1="12.2880" y1="1.0240" x2="12.2880" y2="9.2160" stroke-width="0.1280" stroke="#119911" stroke-linecap="round"/>
 <line x1="12.2880" y1="9.2160" x2="16.3840" y2="9.2160" stroke-width="0.1280" stroke="#119911" stroke-linecap="round"/>
 <line x1="40.0339" y1="0.8243" x2="40.0339" y2="0.0627" stroke-width="0.1861" stroke="#119911" stroke-linecap="round"/>
 <line x1="40.0339" y1="0.8243" x2="38.8974" y2="0.0873" stroke-width="0.1861" stroke="#119911" stroke-linecap="round"/>
 <path d="M 38.89744000 0.08725900 A 0.4154 0.4154 0 1 0 38.5523 0.8376" stroke-width="0.1861" stroke="#119911" stroke-linecap="round" fill="none"/>
 <line x1="40.0789" y1="-0.1667" x2="39.9647" y2="-0.1736" stroke-width="0.1861" stroke="#119911" stroke-linecap="round"/>
 <line x1="40.0339" y1="-0.5677" x2="40.0339" y2="-1.3294" stroke-width="0.1861" stroke="#119911" stroke-linecap="round"/>
 <line x1="40.0339" y1="-0.5677" x2="38.8974" y2="-1.3048" stroke-width="0.1861" stroke="#119911" stroke-linecap="round"/>
 <path d="M 38.89744000 -1.30481100 A 0.4154 0.4154 0 1 0 38.5523 -0.5544" stroke-width="0.1861" stroke="#119911" stroke-linecap="round" fill="none"/>
 <line x1="38.2682" y1="-1.5588" x2="40.0339" y2="-1.5588" stroke-width="0.1861" stroke="#119911" stroke-linecap="round"/>
 <line x1="38.8568" y1="-2.3550" x2="39.4800" y2="-1.5588" stroke-width="0.1861" stroke="#119911" stroke-linecap="round"/>
 <line x1="40.0339" y1="-2.3550" x2="39.2064" y2="-1.9083" stroke-width="0.1861" stroke="#119911" stroke-linecap="round"/>
 <line x1="55.3892" y1="14.4339" x2="55.3892" y2="12.6682" stroke-width="0.1861" stroke="#119911" stroke-linecap="round"/>
 <line x1="55.9431" y1="13.6376" x2="55.3892" y2="13.6376" stroke-width="0.1861" stroke="#119911" stroke-linecap="round"/>
 <line x1="55.9431" y1="12.6682" x2="55.3892" y2="12.6682" stroke-width="0.1861" stroke="#119911" stroke-linecap="round"/>
 <line x1="56.3586" y1="13.0837" x2="56.3586" y2="13.2222" stroke-width="0.1861" stroke="#119911" stroke-linecap="round"/>
 <line x1="56.3586" y1="14.4339" x2="55.9777" y2="13.6376" stroke-width="0.1861" stroke="#119911" stroke-linecap="round"/>
 <path d="M 55.94311400 12.66824600 A 0.4154 0.4154 0 0 1 56.3586 13.0837" stroke-width="0.1861" stroke="#119911" stroke-linecap="round" fill="none"/>
 <path d="M 55.94311400 13.63762500 A 0.4154 0.4154 0 0 0 56.3586 13.2222" stroke-width="0.1861" stroke="#119911" stroke-linecap="round" fill="none"/>
 <line x1="56.5666" y1="14.4339" x2="57.3283" y2="14.4339" stroke-width="0.1861" stroke="#119911" stroke-linecap="round"/>
 <line x1="56.5666" y1="14.4339" x2="57.3037" y2="13.2974" stroke-width="0.1861" stroke="#119911" stroke-linecap="round"/>
 <path d="M 57.30367700 13.29744000 A 0.4154 0.4154 0 1 0 56.5533 12.9523" stroke-width="0.1861" stroke="#119911" stroke-linecap="round" fill="none"/>
 <line x1="55.3892" y1="45.8171" x2="55.7700" y2="45.4362" stroke-width="0.1861" stroke="#119911" stroke-linecap="round"/>
 <line x1="55.7700" y1="45.4362" x2="55.7700" y2="47.2019" stroke-width="0.1861" stroke="#119911" stroke-linecap="round"/>
 <line x1="56.1508" y1="45.4362" x2="56.1508" y2="47.2019" stroke-width="0.1861" stroke="#119911" stroke-linecap="round"/>
 <line x1="56.9471" y1="46.0248" x2="56.1508" y2="46.6480" stroke-width="0.1861" stroke="#119911" stroke-linecap="round"/>
 <line x1="56.9471" y1="47.2019" x2="56.5004" y2="46.3744" stroke-width="0.1861" stroke="#119911" stroke-linecap="round"/>
 <line x1="55.2960" y1="39.9360" x2="51.2000" y2="39.9360" stroke-width="0.1280" stroke="#119911" stroke-linecap="round"/>
 <line x1="51.2000" y1="39.9360" x2="51.2000" y2="52.2240" stroke-width="0.1280" stroke="#119911" stroke-linecap="round"/>
 <line x1="51.2000" y1="52.2240" x2="55.2960" y2="52.2240" stroke-width="0.1280" stroke="#119911" stroke-linecap="round"/>
 <line x1="55.2960" y1="52.2240" x2="55.2960" y2="39.9360" stroke-width="0.1280" stroke="#119911" stroke-linecap="round"/>
 <line x1="51.7120" y1="65.5360" x2="54.7840" y2="65.5360" stroke-width="0.1280" stroke="#119911" stroke-linecap="round"/>
 <line x1="55.3892" y1="43.1059" x2="55.3892" y2="41.3402" stroke-width="0.1861" stroke="#119911" stroke-linecap="round"/>
 <line x1="55.9431" y1="42.3096" x2="55.3892" y2="42.3096" stroke-width="0.1861" stroke="#119911" stroke-linecap="round"/>
 <line x1="55.9431" y1="41.3402" x2="55.3892" y2="41.3402" stroke-width="0.1861" stroke="#119911" stroke-linecap="round"/>
 <line x1="56.3586" y1="41.7557" x2="56.3586" y2="41.8942" stroke-width="0.1861" stroke="#119911" stroke-linecap="round"/>
 <line x1="56.3586" y1="43.1059" x2="55.9777" y2="42.3096" stroke-width="0.1861" stroke="#119911" stroke-linecap="round"/>
 <path d="M 55.94311400 41.34024600 A 0.4154 0.4154 0 0 1 56.3586 41.7557" stroke-width="0.1861" stroke="#119911" stroke-linecap="round" fill="none"/>
 <path d="M 55.94311400 42.30962500 A 0.4154 0.4154 0 0 0 56.3586 41.8942" stroke-width="0.1861" stroke="#119911" stroke-linecap="round" fill="none"/>
 <line x1="56.5533" y1="41.3402" x2="57.0034" y2="41.3402" stroke-width="0.1861" stroke="#119911" stroke-linecap="round"/>
 <line x1="56.7264" y1="42.1365" x2="57.0034" y2="42.1365" stroke-width="0.1861" stroke="#119911" stroke-linecap="round"/>
 <line x1="57.3496" y1="42.5173" x2="57.3496" y2="42.6905" stroke-width="0.1861" stroke="#119911" stroke-linecap="round"/>
 <line x1="56.5533" y1="43.1059" x2="56.9341" y2="43.1059" stroke-width="0.1861" stroke="#119911" stroke-linecap="round"/>
 <path d="M 57.34957900 42.69045100 A 0.4154 0.4154 0 0 1 56.9341 43.1059" stroke-width="0.1861" stroke="#119911" stroke-linecap="round" fill="none"/>
 <path d="M 56.96875100 42.13652100 A 0.3808 0.3808 0 0 1 57.3496 42.5173" stroke-width="0.1861" stroke="#119911" stroke-linecap="round" fill="none"/>
 <path d="M 56.89951000 42.13652100 A 0.4501 0.4501 0 0 0 57.3496 41.6865" stroke-width="0.1861" stroke="#119911" stroke-linecap="round" fill="none"/>
 <path d="M 57.34957800 41.68645300 A 0.3462 0.3462 0 0 0 57.0034 41.3402" stroke-width="0.1861" stroke="#119911" stroke-linecap="round" fill="none"/>
 <line x1="50.6880" y1="64.5120" x2="55.8080" y2="64.5120" stroke-width="0.1280" stroke="#119911" stroke-linecap="round"/>
 <line x1="62.9760" y1="64.5120" x2="68.0960" y2="64.5120" stroke-width="0.1280" stroke="#119911" stroke-linecap="round"/>
 <line x1="64.0000" y1="65.5360" x2="67.0720" y2="65.5360" stroke-width="0.1280" stroke="#119911" stroke-linecap="round"/>
 <line x1="65.0240" y1="66.5600" x2="66.0480" y2="66.5600" stroke-width="0.1280" stroke="#119911" stroke-linecap="round"/>
 <line x1="74.2606" y1="39.2922" x2="74.7106" y2="39.2922" stroke-width="0.1861" stroke="#119911" stroke-linecap="round"/>
 <line x1="74.2606" y1="41.0579" x2="74.7106" y2="41.0579" stroke-width="0.1861" stroke="#119911" stroke-linecap="round"/>
 <line x1="73.9144" y1="39.6385" x2="73.9144" y2="40.7117" stroke-width="0.1861" stroke="#119911" stroke-linecap="round"/>
 <path d="M 74.26057400 41.05789900 A 0.3462 0.3462 0 0 1 73.9144 40.7117" stroke-width="0.1861" stroke="#119911" stroke-linecap="round" fill="none"/>
 <path d="M 74.26057400 39.29224700 A 0.3462 0.3462 0 0 0 73.9144 39.6385" stroke-width="0.1861" stroke="#119911" stroke-linecap="round" fill="none"/>
 <line x1="75.0915" y1="41.0579" x2="75.0915" y2="39.2922" stroke-width="0.1861" stroke="#119911" stroke-linecap="round"/>
 <line x1="76.0955" y1="41.0579" x2="76.0955" y2="39.2922" stroke-width="0.1861" stroke="#119911" stroke-linecap="round"/>
 <line x1="75.0915" y1="39.2922" x2="76.0955" y2="41.0579" stroke-width="0.1861" stroke="#119911" stroke-linecap="round"/>
 <line x1="76.4896" y1="41.0579" x2="77.2513" y2="41.0579" stroke-width="0.1861" stroke="#119911" stroke-linecap="round"/>
 <line x1="76.4896" y1="41.0579" x2="77.2267" y2="39.9214" stroke-width="0.1861" stroke="#119911" stroke-linecap="round"/>
 <path d="M 77.22667000 39.92144000 A 0.4154 0.4154 0 1 0 76.4763 39.5763" stroke-width="0.1861" stroke="#119911" stroke-linecap="round" fill="none"/>
 <line x1="73.7280" y1="37.8880" x2="73.7280" y2="25.6000" stroke-width="0.1280" stroke="#119911" stroke-linecap="round"/>
 <line x1="73.7280" y1="25.6000" x2="77.8240" y2="25.6000" stroke-width="0.1280" stroke="#119911" stroke-linecap="round"/>
 <line x1="77.8240" y1="25.6000" x2="77.8240" y2="37.8880" stroke-width="0.1280" stroke="#119911" stroke-linecap="round"/>
 <line x1="77.8240" y1="37.8880" x2="73.7280" y2="37.8880" stroke-width="0.1280" stroke="#119911" stroke-linecap="round"/>
 <line x1="23.0400" y1="65.5360" x2="26.1120" y2="65.5360" stroke-width="0.1280" stroke="#119911" stroke-linecap="round"/>
 <line x1="22.0160" y1="64.5120" x2="27.1360" y2="64.5120" stroke-width="0.1280" stroke="#119911" stroke-linecap="round"/>
 <line x1="24.0640" y1="66.5600" x2="25.0880" y2="66.5600" stroke-width="0.1280" stroke="#119911" stroke-linecap="round"/>
 <line x1="52.7360" y1="66.5600" x2="53.7600" y2="66.5600" stroke-width="0.1280" stroke="#119911" stroke-linecap="round"/>
 <line x1="28.6720" y1="3.0720" x2="32.7680" y2="3.0720" stroke-width="0.2560" stroke="#222222" stroke-linecap="round"/>
 <line x1="31.0845" y1="0.7611" x2="31.4654" y2="0.3802" stroke-width="0.1861" stroke="#222222" stroke-linecap="round"/>
 <line x1="31.4654" y1="0.3802" x2="31.4654" y2="2.1459" stroke-width="0.1861" stroke="#222222" stroke-linecap="round"/>
 <line x1="24.5760" y1="60.4160" x2="24.5760" y2="64.5120" stroke-width="0.2560" stroke="#222222" stroke-linecap="round"/>
 <line x1="49.1520" y1="3.0720" x2="45.0560" y2="3.0720" stroke-width="0.2560" stroke="#222222" stroke-linecap="round"/>
 <line x1="46.2797" y1="2.1459" x2="47.0413" y2="2.1459" stroke-width="0.1861" stroke="#222222" stroke-linecap="round"/>
 <line x1="46.2797" y1="2.1459" x2="47.0167" y2="1.0094" stroke-width="0.1861" stroke="#222222" stroke-linecap="round"/>
 <path d="M 47.01674100 1.00944000 A 0.4154 0.4154 0 1 0 46.2664 0.6643" stroke-width="0.1861" stroke="#222222" stroke-linecap="round" fill="none"/>
 <line x1="53.2480" y1="27.6480" x2="53.2480" y2="23.5520" stroke-width="0.2560" stroke="#222222" stroke-linecap="round"/>
 <line x1="53.2480" y1="7.1680" x2="53.2480" y2="11.2640" stroke-width="0.2560" stroke="#222222" stroke-linecap="round"/>
 <line x1="54.1741" y1="24.7757" x2="54.1741" y2="25.5373" stroke-width="0.1861" stroke="#222222" stroke-linecap="round"/>
 <line x1="54.1741" y1="24.7757" x2="55.3106" y2="25.5127" stroke-width="0.1861" stroke="#222222" stroke-linecap="round"/>
 <path d="M 55.31056000 25.51274100 A 0.4154 0.4154 0 1 0 55.6557 24.7624" stroke-width="0.1861" stroke="#222222" stroke-linecap="round" fill="none"/>
 <line x1="72.0445" y1="33.5291" x2="72.4254" y2="33.1482" stroke-width="0.1861" stroke="#222222" stroke-linecap="round"/>
 <line x1="72.4254" y1="33.1482" x2="72.4254" y2="34.9139" stroke-width="0.1861" stroke="#222222" stroke-linecap="round"/>
 <line x1="71.3503" y1="30.8179" x2="72.1119" y2="30.8179" stroke-width="0.1861" stroke="#222222" stroke-linecap="round"/>
 <line x1="71.3503" y1="30.8179" x2="72.0873" y2="29.6814" stroke-width="0.1861" stroke="#222222" stroke-linecap="round"/>
 <path d="M 72.08733300 29.68144000 A 0.4154 0.4154 0 1 0 71.3370 29.3363" stroke-width="0.1861" stroke="#222222" stroke-linecap="round" fill="none"/>
 <line x1="71.5366" y1="24.9562" x2="71.9867" y2="24.9562" stroke-width="0.1861" stroke="#222222" stroke-linecap="round"/>
 <line x1="71.7097" y1="25.7525" x2="71.9867" y2="25.7525" stroke-width="0.1861" stroke="#222222" stroke-linecap="round"/>
 <line x1="72.3329" y1="26.1333" x2="72.3329" y2="26.3065" stroke-width="0.1861" stroke="#222222" stroke-linecap="round"/>
 <line x1="71.5366" y1="26.7219" x2="71.9175" y2="26.7219" stroke-width="0.1861" stroke="#222222" stroke-linecap="round"/>
 <path d="M 72.33291500 26.30645100 A 0.4154 0.4154 0 0 1 71.9175 26.7219" stroke-width="0.1861" stroke="#222222" stroke-linecap="round" fill="none"/>
 <path d="M 71.95208800 25.75252100 A 0.3808 0.3808 0 0 1 72.3329 26.1333" stroke-width="0.1861" stroke="#222222" stroke-linecap="round" fill="none"/>
 <path d="M 71.88284600 25.75252100 A 0.4501 0.4501 0 0 0 72.3329 25.3025" stroke-width="0.1861" stroke="#222222" stroke-linecap="round" fill="none"/>
 <path d="M 72.33291400 25.30245300 A 0.3462 0.3462 0 0 0 71.9867 24.9562" stroke-width="0.1861" stroke="#222222" stroke-linecap="round" fill="none"/>
 <line x1="73.7280" y1="27.6480" x2="69.6320" y2="27.6480" stroke-width="0.2560" stroke="#222222" stroke-linecap="round"/>
 <line x1="73.7280" y1="35.8400" x2="69.6320" y2="35.8400" stroke-width="0.2560" stroke="#222222" stroke-linecap="round"/>
 <line x1="73.7280" y1="31.7440" x2="69.6320" y2="31.7440" stroke-width="0.2560" stroke="#222222" stroke-linecap="round"/>
 <line x1="53.2480" y1="56.3200" x2="53.2480" y2="52.2240" stroke-width="0.2560" stroke="#222222" stroke-linecap="round"/>
 <line x1="54.1741" y1="53.4477" x2="54.1741" y2="54.2093" stroke-width="0.1861" stroke="#222222" stroke-linecap="round"/>
 <line x1="54.1741" y1="53.4477" x2="55.3106" y2="54.1847" stroke-width="0.1861" stroke="#222222" stroke-linecap="round"/>
 <path d="M 55.31056000 54.18474100 A 0.4154 0.4154 0 1 0 55.6557 53.4344" stroke-width="0.1861" stroke="#222222" stroke-linecap="round" fill="none"/>
 <line x1="53.2480" y1="35.8400" x2="53.2480" y2="39.9360" stroke-width="0.2560" stroke="#222222" stroke-linecap="round"/>
 <line x1="55.5589" y1="38.2525" x2="55.9398" y2="38.6334" stroke-width="0.1861" stroke="#222222" stroke-linecap="round"/>
 <line x1="55.9398" y1="38.6334" x2="54.1741" y2="38.6334" stroke-width="0.1861" stroke="#222222" stroke-linecap="round"/>
 <line x1="53.2480" y1="60.4160" x2="53.2480" y2="64.5120" stroke-width="0.2560" stroke="#222222" stroke-linecap="round"/>
 <line x1="65.5360" y1="60.4160" x2="65.5360" y2="64.5120" stroke-width="0.2560" stroke="#222222" stroke-linecap="round"/>
 <line x1="16.3840" y1="7.1680" x2="20.4800" y2="7.1680" stroke-width="0.2560" stroke="#222222" stroke-linecap="round"/>
 <line x1="17.5012" y1="4.8571" x2="17.8820" y2="4.4762" stroke-width="0.1861" stroke="#222222" stroke-linecap="round"/>
 <line x1="17.8820" y1="4.4762" x2="17.8820" y2="6.2419" stroke-width="0.1861" stroke="#222222" stroke-linecap="round"/>
 <line x1="16.3840" y1="3.0720" x2="20.4800" y2="3.0720" stroke-width="0.2560" stroke="#222222" stroke-linecap="round"/>
 <line x1="17.6077" y1="2.1459" x2="18.3693" y2="2.1459" stroke-width="0.1861" stroke="#222222" stroke-linecap="round"/>
 <line x1="17.6077" y1="2.1459" x2="18.3447" y2="1.0094" stroke-width="0.1861" stroke="#222222" stroke-linecap="round"/>
 <path d="M 18.34474100 1.00944000 A 0.4154 0.4154 0 1 0 17.5944 0.6643" stroke-width="0.1861" stroke="#222222" stroke-linecap="round" fill="none"/>
 <line x1="55.5589" y1="9.5805" x2="55.9398" y2="9.9614" stroke-width="0.1861" stroke="#222222" stroke-linecap="round"/>
 <line x1="55.9398" y1="9.9614" x2="54.1741" y2="9.9614" stroke-width="0.1861" stroke="#222222" stroke-linecap="round"/>
 <line x1="1.6315" y1="91.8146" x2="1.6315" y2="89.9927" stroke-width="0.1429" stroke="#777777" stroke-linecap="round"/>
 <line x1="1.0957" y1="89.9927" x2="2.1317" y2="89.9927" stroke-width="0.1429" stroke="#777777" stroke-linecap="round"/>
 <line x1="2.5247" y1="91.8146" x2="2.5247" y2="89.9927" stroke-width="0.1429" stroke="#777777" stroke-linecap="round"/>
 <line x1="3.4535" y1="91.8146" x2="3.4535" y2="89.9927" stroke-width="0.1429" stroke="#777777" stroke-linecap="round"/>
 <line x1="2.9176" y1="89.9927" x2="3.9536" y2="89.9927" stroke-width="0.1429" stroke="#777777" stroke-linecap="round"/>
 <line x1="4.3466" y1="91.8146" x2="4.3466" y2="89.9927" stroke-width="0.1429" stroke="#777777" stroke-linecap="round"/>
 <line x1="4.3466" y1="91.8146" x2="5.1325" y2="91.8146" stroke-width="0.1429" stroke="#777777" stroke-linecap="round"/>
 <line x1="5.5255" y1="91.8146" x2="5.5255" y2="89.9927" stroke-width="0.1429" stroke="#777777" stroke-linecap="round"/>
 <line x1="5.5255" y1="89.9927" x2="6.3114" y2="89.9927" stroke-width="0.1429" stroke="#777777" stroke-linecap="round"/>
 <line x1="6.3114" y1="91.8146" x2="5.5255" y2="91.8146" stroke-width="0.1429" stroke="#777777" stroke-linecap="round"/>
 <line x1="6.1328" y1="90.8143" x2="5.5255" y2="90.8143" stroke-width="0.1429" stroke="#777777" stroke-linecap="round"/>
 <line x1="1.0598" y1="103.5073" x2="1.0598" y2="102.5963" stroke-width="0.0714" stroke="#777777" stroke-linecap="round"/>
 <line x1="1.3456" y1="103.0965" x2="1.0598" y2="103.0965" stroke-width="0.0714" stroke="#777777" stroke-linecap="round"/>
 <line x1="1.3456" y1="102.5963" x2="1.0598" y2="102.5963" stroke-width="0.0714" stroke="#777777" stroke-linecap="round"/>
 <line x1="1.5600" y1="102.8107" x2="1.5600" y2="102.8821" stroke-width="0.0714" stroke="#777777" stroke-linecap="round"/>
 <path d="M 1.34563500 102.59633800 A 0.2143 0.2143 0 0 1 1.5600 102.8107" stroke-width="0.0714" stroke="#777777" stroke-linecap="round" fill="none"/>
 <path d="M 1.34563500 103.09647800 A 0.2143 0.2143 0 0 0 1.5600 102.8821" stroke-width="0.0714" stroke="#777777" stroke-linecap="round" fill="none"/>
 <line x1="1.6850" y1="103.5073" x2="1.6850" y2="102.5963" stroke-width="0.0714" stroke="#777777" stroke-linecap="round"/>
 <line x1="1.9708" y1="103.0965" x2="1.6850" y2="103.0965" stroke-width="0.0714" stroke="#777777" stroke-linecap="round"/>
 <line x1="1.9708" y1="102.5963" x2="1.6850" y2="102.5963" stroke-width="0.0714" stroke="#777777" stroke-linecap="round"/>
 <line x1="2.1852" y1="102.8107" x2="2.1852" y2="102.8821" stroke-width="0.0714" stroke="#777777" stroke-linecap="round"/>
 <line x1="2.1852" y1="103.5073" x2="1.9887" y2="103.0965" stroke-width="0.0714" stroke="#777777" stroke-linecap="round"/>
 <path d="M 1.97081100 102.59633800 A 0.2143 0.2143 0 0 1 2.1852 102.8107" stroke-width="0.0714" stroke="#777777" stroke-linecap="round" fill="none"/>
 <path d="M 1.97081100 103.09647800 A 0.2143 0.2143 0 0 0 2.1852 102.8821" stroke-width="0.0714" stroke="#777777" stroke-linecap="round" fill="none"/>
 <line x1="2.5245" y1="102.5963" x2="2.6138" y2="102.5963" stroke-width="0.0714" stroke="#777777" stroke-linecap="round"/>
 <line x1="2.5245" y1="103.5073" x2="2.6138" y2="103.5073" stroke-width="0.0714" stroke="#777777" stroke-linecap="round"/>
 <line x1="2.3102" y1="102.8107" x2="2.3102" y2="103.2930" stroke-width="0.0714" stroke="#777777" stroke-linecap="round"/>
 <line x1="2.8282" y1="103.2930" x2="2.8282" y2="102.8107" stroke-width="0.0714" stroke="#777777" stroke-linecap="round"/>
 <path d="M 2.61385000 102.59633800 A 0.2143 0.2143 0 0 1 2.8282 102.8107" stroke-width="0.0714" stroke="#777777" stroke-linecap="round" fill="none"/>
 <path d="M 2.61385000 103.50730800 A 0.2143 0.2143 0 0 0 2.8282 103.2930" stroke-width="0.0714" stroke="#777777" stroke-linecap="round" fill="none"/>
 <path d="M 2.52453900 103.50730800 A 0.2143 0.2143 0 0 1 2.3102 103.2930" stroke-width="0.0714" stroke="#777777" stroke-linecap="round" fill="none"/>
 <path d="M 2.52453900 102.59633800 A 0.2143 0.2143 0 0 0 2.3102 102.8107" stroke-width="0.0714" stroke="#777777" stroke-linecap="round" fill="none"/>
 <line x1="3.2748" y1="103.3287" x2="3.2748" y2="102.5963" stroke-width="0.0714" stroke="#777777" stroke-linecap="round"/>
 <line x1="3.0961" y1="103.5073" x2="2.9532" y2="103.5073" stroke-width="0.0714" stroke="#777777" stroke-linecap="round"/>
 <path d="M 3.27475100 103.32868700 A 0.1786 0.1786 0 0 1 3.0961 103.5073" stroke-width="0.0714" stroke="#777777" stroke-linecap="round" fill="none"/>
 <line x1="3.3998" y1="103.5073" x2="3.3998" y2="102.5963" stroke-width="0.0714" stroke="#777777" stroke-linecap="round"/>
 <line x1="3.3998" y1="102.5963" x2="3.7928" y2="102.5963" stroke-width="0.0714" stroke="#777777" stroke-linecap="round"/>
 <line x1="3.7928" y1="103.5073" x2="3.3998" y2="103.5073" stroke-width="0.0714" stroke="#777777" stroke-linecap="round"/>
 <line x1="3.7034" y1="103.0072" x2="3.3998" y2="103.0072" stroke-width="0.0714" stroke="#777777" stroke-linecap="round"/>
 <line x1="4.1679" y1="102.5963" x2="4.4001" y2="102.5963" stroke-width="0.0714" stroke="#777777" stroke-linecap="round"/>
 <line x1="4.1679" y1="103.5073" x2="4.4001" y2="103.5073" stroke-width="0.0714" stroke="#777777" stroke-linecap="round"/>
 <line x1="3.9892" y1="102.7750" x2="3.9892" y2="103.3287" stroke-width="0.0714" stroke="#777777" stroke-linecap="round"/>
 <path d="M 4.16786000 103.50730900 A 0.1786 0.1786 0 0 1 3.9892 103.3287" stroke-width="0.0714" stroke="#777777" stroke-linecap="round" fill="none"/>
 <path d="M 4.16786000 102.59633700 A 0.1786 0.1786 0 0 0 3.9892 102.7750" stroke-width="0.0714" stroke="#777777" stroke-linecap="round" fill="none"/>
 <line x1="4.8645" y1="103.5073" x2="4.8645" y2="102.5963" stroke-width="0.0714" stroke="#777777" stroke-linecap="round"/>
 <line x1="4.5966" y1="102.5963" x2="5.1146" y2="102.5963" stroke-width="0.0714" stroke="#777777" stroke-linecap="round"/>
 <line x1="5.3110" y1="102.9893" x2="5.3110" y2="102.9536" stroke-width="0.0714" stroke="#777777" stroke-linecap="round"/>
 <line x1="5.3110" y1="103.4001" x2="5.3110" y2="103.3644" stroke-width="0.0714" stroke="#777777" stroke-linecap="round"/>
 <line x1="13.9250" y1="100.3944" x2="13.8371" y2="100.4922" stroke-width="0.1905" stroke="#777777" stroke-linecap="round"/>
 <line x1="14.2252" y1="102.7620" x2="14.3130" y2="102.6642" stroke-width="0.1905" stroke="#777777" stroke-linecap="round"/>
 <line x1="14.2252" y1="100.3944" x2="14.3130" y2="100.4922" stroke-width="0.1905" stroke="#777777" stroke-linecap="round"/>
 <line x1="13.8371" y1="102.6642" x2="13.9250" y2="102.7620" stroke-width="0.1905" stroke="#777777" stroke-linecap="round"/>
 <line x1="14.6467" y1="101.5544" x2="14.6467" y2="101.6020" stroke-width="0.1905" stroke="#777777" stroke-linecap="round"/>
 <line x1="13.5035" y1="101.5544" x2="13.5035" y2="101.6020" stroke-width="0.1905" stroke="#777777" stroke-linecap="round"/>
 <path d="M 14.31302600 100.49217900 A 1.8577 1.8577 0 0 1 14.6467 101.5544" stroke-width="0.1905" stroke="#777777" stroke-linecap="round" fill="none"/>
 <path d="M 13.83712800 102.66420900 A 1.8577 1.8577 0 0 1 13.5035 101.6020" stroke-width="0.1905" stroke="#777777" stroke-linecap="round" fill="none"/>
 <path d="M 14.31302600 102.66420900 A 1.8577 1.8577 0 0 0 14.6467 101.6020" stroke-width="0.1905" stroke="#777777" stroke-linecap="round" fill="none"/>
 <path d="M 13.92497000 102.76201100 A 0.3811 0.3811 0 0 0 14.2252 102.7620" stroke-width="0.1905" stroke="#777777" stroke-linecap="round" fill="none"/>
 <path d="M 13.83712800 100.49217900 A 1.8577 1.8577 0 0 0 13.5035 101.5544" stroke-width="0.1905" stroke="#777777" stroke-linecap="round" fill="none"/>
 <path d="M 14.22518400 100.39437700 A 0.3811 0.3811 0 0 0 13.9250 100.3944" stroke-width="0.1905" stroke="#777777" stroke-linecap="round" fill="none"/>
 <line x1="14.9801" y1="100.8875" x2="15.5041" y2="100.3636" stroke-width="0.1905" stroke="#777777" stroke-linecap="round"/>
 <line x1="15.5041" y1="100.3636" x2="15.5041" y2="102.7928" stroke-width="0.1905" stroke="#777777" stroke-linecap="round"/>
 <line x1="16.0280" y1="103.0786" x2="17.1712" y2="103.0786" stroke-width="0.1905" stroke="#777777" stroke-linecap="round"/>
 <line x1="18.7907" y1="100.3159" x2="18.7907" y2="102.7928" stroke-width="0.1905" stroke="#777777" stroke-linecap="round"/>
 <line x1="17.9809" y1="102.7928" x2="18.7907" y2="102.7928" stroke-width="0.1905" stroke="#777777" stroke-linecap="round"/>
 <line x1="17.6951" y1="101.4591" x2="17.6951" y2="102.5070" stroke-width="0.1905" stroke="#777777" stroke-linecap="round"/>
 <line x1="17.9809" y1="101.1733" x2="18.7907" y2="101.1733" stroke-width="0.1905" stroke="#777777" stroke-linecap="round"/>
 <path d="M 17.98094300 101.17331800 A 0.2858 0.2858 0 0 0 17.6951 101.4591" stroke-width="0.1905" stroke="#777777" stroke-linecap="round" fill="none"/>
 <path d="M 17.69514800 102.50702700 A 0.2858 0.2858 0 0 0 17.9809 102.7928" stroke-width="0.1905" stroke="#777777" stroke-linecap="round" fill="none"/>
 <line x1="19.6004" y1="102.7928" x2="20.1244" y2="102.7928" stroke-width="0.1905" stroke="#777777" stroke-linecap="round"/>
 <line x1="19.3147" y1="101.4591" x2="19.3147" y2="102.5070" stroke-width="0.1905" stroke="#777777" stroke-linecap="round"/>
 <line x1="19.6004" y1="101.1733" x2="20.1244" y2="101.1733" stroke-width="0.1905" stroke="#777777" stroke-linecap="round"/>
 <path d="M 19.60044800 101.17331800 A 0.2858 0.2858 0 0 0 19.3147 101.4591" stroke-width="0.1905" stroke="#777777" stroke-linecap="round" fill="none"/>
 <path d="M 19.31465300 102.50702700 A 0.2858 0.2858 0 0 0 19.6004 102.7928" stroke-width="0.1905" stroke="#777777" stroke-linecap="round" fill="none"/>
 <line x1="1.0598" y1="108.6273" x2="1.0598" y2="107.7163" stroke-width="0.0714" stroke="#777777" stroke-linecap="round"/>
 <line x1="1.3456" y1="108.2165" x2="1.0598" y2="108.2165" stroke-width="0.0714" stroke="#777777" stroke-linecap="round"/>
 <line x1="1.3456" y1="107.7163" x2="1.0598" y2="107.7163" stroke-width="0.0714" stroke="#777777" stroke-linecap="round"/>
 <line x1="1.5600" y1="107.9307" x2="1.5600" y2="108.0021" stroke-width="0.0714" stroke="#777777" stroke-linecap="round"/>
 <path d="M 1.34563500 107.71633800 A 0.2143 0.2143 0 0 1 1.5600 107.9307" stroke-width="0.0714" stroke="#777777" stroke-linecap="round" fill="none"/>
 <path d="M 1.34563500 108.21647800 A 0.2143 0.2143 0 0 0 1.5600 108.0021" stroke-width="0.0714" stroke="#777777" stroke-linecap="round" fill="none"/>
 <line x1="1.6850" y1="108.6273" x2="1.9887" y2="107.7163" stroke-width="0.0714" stroke="#777777" stroke-linecap="round"/>
 <line x1="2.2923" y1="108.6273" x2="1.9887" y2="107.7163" stroke-width="0.0714" stroke="#777777" stroke-linecap="round"/>
 <line x1="1.7684" y1="108.3772" x2="2.2090" y2="108.3772" stroke-width="0.0714" stroke="#777777" stroke-linecap="round"/>
 <line x1="2.6674" y1="107.7163" x2="2.9890" y2="107.7163" stroke-width="0.0714" stroke="#777777" stroke-linecap="round"/>
 <line x1="2.6674" y1="108.6273" x2="2.9890" y2="108.6273" stroke-width="0.0714" stroke="#777777" stroke-linecap="round"/>
 <line x1="2.4888" y1="107.8950" x2="2.4888" y2="108.4487" stroke-width="0.0714" stroke="#777777" stroke-linecap="round"/>
 <line x1="2.8282" y1="108.1272" x2="2.9890" y2="108.1272" stroke-width="0.0714" stroke="#777777" stroke-linecap="round"/>
 <line x1="2.9890" y1="108.1272" x2="2.9890" y2="108.6273" stroke-width="0.0714" stroke="#777777" stroke-linecap="round"/>
 <path d="M 2.66743600 108.62730900 A 0.1786 0.1786 0 0 1 2.4888 108.4487" stroke-width="0.0714" stroke="#777777" stroke-linecap="round" fill="none"/>
 <path d="M 2.66743600 107.71633700 A 0.1786 0.1786 0 0 0 2.4888 107.8950" stroke-width="0.0714" stroke="#777777" stroke-linecap="round" fill="none"/>
 <line x1="3.1854" y1="108.6273" x2="3.1854" y2="107.7163" stroke-width="0.0714" stroke="#777777" stroke-linecap="round"/>
 <line x1="3.1854" y1="107.7163" x2="3.5784" y2="107.7163" stroke-width="0.0714" stroke="#777777" stroke-linecap="round"/>
 <line x1="3.5784" y1="108.6273" x2="3.1854" y2="108.6273" stroke-width="0.0714" stroke="#777777" stroke-linecap="round"/>
 <line x1="3.4891" y1="108.1272" x2="3.1854" y2="108.1272" stroke-width="0.0714" stroke="#777777" stroke-linecap="round"/>
 <line x1="3.7749" y1="108.1093" x2="3.7749" y2="108.0736" stroke-width="0.0714" stroke="#777777" stroke-linecap="round"/>
 <line x1="3.7749" y1="108.5201" x2="3.7749" y2="108.4844" stroke-width="0.0714" stroke="#777777" stroke-linecap="round"/>
 <line x1="40.9600" y1="99.3280" x2="40.9600" y2="109.5680" stroke-width="0.2560" stroke="#777777" stroke-linecap="round"/>
 <line x1="10.3352" y1="106.0075" x2="10.8592" y2="105.4836" stroke-width="0.1905" stroke="#777777" stroke-linecap="round"/>
 <line x1="10.8592" y1="105.4836" x2="10.8592" y2="107.9128" stroke-width="0.1905" stroke="#777777" stroke-linecap="round"/>
 <line x1="12.8598" y1="107.3889" x2="12.8598" y2="106.8173" stroke-width="0.1905" stroke="#777777" stroke-linecap="round"/>
 <line x1="13.9459" y1="106.8173" x2="13.9459" y2="107.3889" stroke-width="0.1905" stroke="#777777" stroke-linecap="round"/>
 <path d="M 13.94593800 107.38886500 A 0.5431 0.5431 0 0 1 12.8598 107.3889" stroke-width="0.1905" stroke="#777777" stroke-linecap="round" fill="none"/>
 <path d="M 13.94593800 106.81727500 A 0.5431 0.5431 0 0 0 12.8598 106.8173" stroke-width="0.1905" stroke="#777777" stroke-linecap="round" fill="none"/>
 <line x1="14.8986" y1="105.4836" x2="15.0891" y2="105.4836" stroke-width="0.1905" stroke="#777777" stroke-linecap="round"/>
 <line x1="14.2794" y1="106.2933" x2="15.0891" y2="106.2933" stroke-width="0.1905" stroke="#777777" stroke-linecap="round"/>
 <line x1="14.5652" y1="105.8170" x2="14.5652" y2="107.9128" stroke-width="0.1905" stroke="#777777" stroke-linecap="round"/>
 <path d="M 14.89858900 105.48356700 A 0.3334 0.3334 0 0 0 14.5652 105.8170" stroke-width="0.1905" stroke="#777777" stroke-linecap="round" fill="none"/>
 <line x1="17.0897" y1="106.0075" x2="17.6136" y2="105.4836" stroke-width="0.1905" stroke="#777777" stroke-linecap="round"/>
 <line x1="17.6136" y1="105.4836" x2="17.6136" y2="107.9128" stroke-width="0.1905" stroke="#777777" stroke-linecap="round"/>
 <line x1="42.0198" y1="103.5073" x2="42.0198" y2="102.5963" stroke-width="0.0714" stroke="#777777" stroke-linecap="round"/>
 <line x1="42.0198" y1="102.5963" x2="42.4128" y2="102.5963" stroke-width="0.0714" stroke="#777777" stroke-linecap="round"/>
 <line x1="42.4128" y1="103.0072" x2="42.0198" y2="103.0072" stroke-width="0.0714" stroke="#777777" stroke-linecap="round"/>
 <line x1="42.6093" y1="103.5073" x2="42.6093" y2="102.5963" stroke-width="0.0714" stroke="#777777" stroke-linecap="round"/>
 <line x1="42.8058" y1="103.5073" x2="42.8058" y2="102.5963" stroke-width="0.0714" stroke="#777777" stroke-linecap="round"/>
 <line x1="42.8058" y1="103.5073" x2="43.1987" y2="103.5073" stroke-width="0.0714" stroke="#777777" stroke-linecap="round"/>
 <line x1="43.3952" y1="103.5073" x2="43.3952" y2="102.5963" stroke-width="0.0714" stroke="#777777" stroke-linecap="round"/>
 <line x1="43.3952" y1="102.5963" x2="43.7882" y2="102.5963" stroke-width="0.0714" stroke="#777777" stroke-linecap="round"/>
 <line x1="43.7882" y1="103.5073" x2="43.3952" y2="103.5073" stroke-width="0.0714" stroke="#777777" stroke-linecap="round"/>
 <line x1="43.6989" y1="103.0072" x2="43.3952" y2="103.0072" stroke-width="0.0714" stroke="#777777" stroke-linecap="round"/>
 <line x1="43.9847" y1="102.9893" x2="43.9847" y2="102.9536" stroke-width="0.0714" stroke="#777777" stroke-linecap="round"/>
 <line x1="43.9847" y1="103.4001" x2="43.9847" y2="103.3644" stroke-width="0.0714" stroke="#777777" stroke-linecap="round"/>
 <line x1="42.0198" y1="108.6273" x2="42.0198" y2="107.7163" stroke-width="0.0714" stroke="#777777" stroke-linecap="round"/>
 <line x1="42.0198" y1="107.7163" x2="42.3235" y2="108.2343" stroke-width="0.0714" stroke="#777777" stroke-linecap="round"/>
 <line x1="42.6272" y1="107.7163" x2="42.6272" y2="108.6273" stroke-width="0.0714" stroke="#777777" stroke-linecap="round"/>
 <line x1="42.6272" y1="107.7163" x2="42.3235" y2="108.2343" stroke-width="0.0714" stroke="#777777" stroke-linecap="round"/>
 <line x1="42.8236" y1="108.6273" x2="43.1273" y2="107.7163" stroke-width="0.0714" stroke="#777777" stroke-linecap="round"/>
 <line x1="43.4310" y1="108.6273" x2="43.1273" y2="107.7163" stroke-width="0.0714" stroke="#777777" stroke-linecap="round"/>
 <line x1="42.9070" y1="108.3772" x2="43.3476" y2="108.3772" stroke-width="0.0714" stroke="#777777" stroke-linecap="round"/>
 <line x1="43.6274" y1="108.6273" x2="43.6274" y2="107.7163" stroke-width="0.0714" stroke="#777777" stroke-linecap="round"/>
 <line x1="43.8239" y1="108.6273" x2="43.8239" y2="107.7163" stroke-width="0.0714" stroke="#777777" stroke-linecap="round"/>
 <line x1="44.3419" y1="108.6273" x2="44.3419" y2="107.7163" stroke-width="0.0714" stroke="#777777" stroke-linecap="round"/>
 <line x1="43.8239" y1="107.7163" x2="44.3419" y2="108.6273" stroke-width="0.0714" stroke="#777777" stroke-linecap="round"/>
 <line x1="44.8063" y1="108.6273" x2="44.8063" y2="107.7163" stroke-width="0.0714" stroke="#777777" stroke-linecap="round"/>
 <line x1="44.5384" y1="107.7163" x2="45.0564" y2="107.7163" stroke-width="0.0714" stroke="#777777" stroke-linecap="round"/>
 <line x1="45.2529" y1="108.6273" x2="45.5566" y2="107.7163" stroke-width="0.0714" stroke="#777777" stroke-linecap="round"/>
 <line x1="45.8602" y1="108.6273" x2="45.5566" y2="107.7163" stroke-width="0.0714" stroke="#777777" stroke-linecap="round"/>
 <line x1="45.3363" y1="108.3772" x2="45.7769" y2="108.3772" stroke-width="0.0714" stroke="#777777" stroke-linecap="round"/>
 <line x1="46.0567" y1="108.6273" x2="46.0567" y2="107.7163" stroke-width="0.0714" stroke="#777777" stroke-linecap="round"/>
 <line x1="46.2532" y1="108.6273" x2="46.2532" y2="107.7163" stroke-width="0.0714" stroke="#777777" stroke-linecap="round"/>
 <line x1="46.7712" y1="108.6273" x2="46.7712" y2="107.7163" stroke-width="0.0714" stroke="#777777" stroke-linecap="round"/>
 <line x1="46.2532" y1="107.7163" x2="46.7712" y2="108.6273" stroke-width="0.0714" stroke="#777777" stroke-linecap="round"/>
 <line x1="46.9677" y1="108.6273" x2="46.9677" y2="107.7163" stroke-width="0.0714" stroke="#777777" stroke-linecap="round"/>
 <line x1="46.9677" y1="107.7163" x2="47.3606" y2="107.7163" stroke-width="0.0714" stroke="#777777" stroke-linecap="round"/>
 <line x1="47.3606" y1="108.6273" x2="46.9677" y2="108.6273" stroke-width="0.0714" stroke="#777777" stroke-linecap="round"/>
 <line x1="47.2713" y1="108.1272" x2="46.9677" y2="108.1272" stroke-width="0.0714" stroke="#777777" stroke-linecap="round"/>
 <line x1="47.5571" y1="108.6273" x2="47.5571" y2="107.7163" stroke-width="0.0714" stroke="#777777" stroke-linecap="round"/>
 <line x1="47.8429" y1="108.2165" x2="47.5571" y2="108.2165" stroke-width="0.0714" stroke="#777777" stroke-linecap="round"/>
 <line x1="47.8429" y1="107.7163" x2="47.5571" y2="107.7163" stroke-width="0.0714" stroke="#777777" stroke-linecap="round"/>
 <line x1="48.0573" y1="107.9307" x2="48.0573" y2="108.0021" stroke-width="0.0714" stroke="#777777" stroke-linecap="round"/>
 <line x1="48.0573" y1="108.6273" x2="47.8608" y2="108.2165" stroke-width="0.0714" stroke="#777777" stroke-linecap="round"/>
 <path d="M 47.84291200 107.71633800 A 0.2143 0.2143 0 0 1 48.0573 107.9307" stroke-width="0.0714" stroke="#777777" stroke-linecap="round" fill="none"/>
 <path d="M 47.84291200 108.21647800 A 0.2143 0.2143 0 0 0 48.0573 108.0021" stroke-width="0.0714" stroke="#777777" stroke-linecap="round" fill="none"/>
 <line x1="48.1823" y1="108.1093" x2="48.1823" y2="108.0736" stroke-width="0.0714" stroke="#777777" stroke-linecap="round"/>
 <line x1="48.1823" y1="108.5201" x2="48.1823" y2="108.4844" stroke-width="0.0714" stroke="#777777" stroke-linecap="round"/>
 <line x1="0.0000" y1="99.3280" x2="81.9200" y2="99.3280" stroke-width="0.2560" stroke="#777777" stroke-linecap="round"/>
 <line x1="1.1551" y1="93.8384" x2="1.1551" y2="97.2441" stroke-width="0.2620" stroke="#777777" stroke-linecap="round"/>
 <line x1="2.6614" y1="95.4103" x2="2.6614" y2="97.2441" stroke-width="0.2620" stroke="#777777" stroke-linecap="round"/>
 <line x1="1.1551" y1="95.0173" x2="2.2685" y2="95.0173" stroke-width="0.2620" stroke="#777777" stroke-linecap="round"/>
 <path d="M 2.26848000 95.01731300 A 0.3930 0.3930 0 0 1 2.6614 95.4103" stroke-width="0.2620" stroke="#777777" stroke-linecap="round" fill="none"/>
 <line x1="3.1199" y1="93.9039" x2="3.1199" y2="94.1004" stroke-width="0.2620" stroke="#777777" stroke-linecap="round"/>
 <line x1="3.1199" y1="95.0173" x2="3.1199" y2="97.2441" stroke-width="0.2620" stroke="#777777" stroke-linecap="round"/>
 <line x1="5.3467" y1="97.9646" x2="5.3467" y2="95.0173" stroke-width="0.2620" stroke="#777777" stroke-linecap="round"/>
 <line x1="4.2333" y1="95.0173" x2="5.3467" y2="95.0173" stroke-width="0.2620" stroke="#777777" stroke-linecap="round"/>
 <line x1="3.8404" y1="96.8512" x2="3.8404" y2="95.4103" stroke-width="0.2620" stroke="#777777" stroke-linecap="round"/>
 <line x1="4.2333" y1="97.2441" x2="5.3467" y2="97.2441" stroke-width="0.2620" stroke="#777777" stroke-linecap="round"/>
 <line x1="4.0368" y1="98.4230" x2="4.8883" y2="98.4230" stroke-width="0.2620" stroke="#777777" stroke-linecap="round"/>
 <path d="M 5.34673200 97.96457000 A 0.4585 0.4585 0 0 1 4.8883 98.4230" stroke-width="0.2620" stroke="#777777" stroke-linecap="round" fill="none"/>
 <path d="M 4.23332400 97.24413000 A 0.3930 0.3930 0 0 1 3.8404 96.8512" stroke-width="0.2620" stroke="#777777" stroke-linecap="round" fill="none"/>
 <path d="M 3.84035600 95.41028100 A 0.3930 0.3930 0 0 1 4.2333 95.0173" stroke-width="0.2620" stroke="#777777" stroke-linecap="round" fill="none"/>
 <line x1="5.8052" y1="93.8384" x2="5.8052" y2="97.2441" stroke-width="0.2620" stroke="#777777" stroke-linecap="round"/>
 <line x1="7.3116" y1="95.4103" x2="7.3116" y2="97.2441" stroke-width="0.2620" stroke="#777777" stroke-linecap="round"/>
 <line x1="5.8052" y1="95.0173" x2="6.9186" y2="95.0173" stroke-width="0.2620" stroke="#777777" stroke-linecap="round"/>
 <path d="M 6.91860500 95.01731300 A 0.3930 0.3930 0 0 1 7.3116 95.4103" stroke-width="0.2620" stroke="#777777" stroke-linecap="round" fill="none"/>
 <line x1="9.8004" y1="93.9039" x2="9.8004" y2="96.8512" stroke-width="0.2620" stroke="#777777" stroke-linecap="round"/>
 <path d="M 10.19333800 97.24413000 A 0.3930 0.3930 0 0 1 9.8004 96.8512" stroke-width="0.2620" stroke="#777777" stroke-linecap="round" fill="none"/>
 <line x1="10.6518" y1="96.7857" x2="10.6518" y2="95.7378" stroke-width="0.2620" stroke="#777777" stroke-linecap="round"/>
 <line x1="10.6518" y1="96.1307" x2="12.0927" y2="96.1307" stroke-width="0.2620" stroke="#777777" stroke-linecap="round"/>
 <line x1="12.0927" y1="96.1307" x2="12.0927" y2="95.7378" stroke-width="0.2620" stroke="#777777" stroke-linecap="round"/>
 <line x1="11.1103" y1="97.2441" x2="12.0927" y2="97.2441" stroke-width="0.2620" stroke="#777777" stroke-linecap="round"/>
 <path d="M 12.09268500 95.73775400 A 0.7204 0.7204 0 0 0 10.6518 95.7378" stroke-width="0.2620" stroke="#777777" stroke-linecap="round" fill="none"/>
 <path d="M 11.11026500 97.24412900 A 0.4585 0.4585 0 0 1 10.6518 96.7857" stroke-width="0.2620" stroke="#777777" stroke-linecap="round" fill="none"/>
 <line x1="12.5511" y1="95.0173" x2="13.2716" y2="97.2441" stroke-width="0.2620" stroke="#777777" stroke-linecap="round"/>
 <line x1="13.9920" y1="95.0173" x2="13.2716" y2="97.2441" stroke-width="0.2620" stroke="#777777" stroke-linecap="round"/>
 <line x1="14.7125" y1="96.7857" x2="14.7125" y2="95.7378" stroke-width="0.2620" stroke="#777777" stroke-linecap="round"/>
 <line x1="14.7125" y1="96.1307" x2="16.1534" y2="96.1307" stroke-width="0.2620" stroke="#777777" stroke-linecap="round"/>
 <line x1="16.1534" y1="96.1307" x2="16.1534" y2="95.7378" stroke-width="0.2620" stroke="#777777" stroke-linecap="round"/>
 <line x1="15.1709" y1="97.2441" x2="16.1534" y2="97.2441" stroke-width="0.2620" stroke="#777777" stroke-linecap="round"/>
 <path d="M 16.15335600 95.73775400 A 0.7204 0.7204 0 0 0 14.7125 95.7378" stroke-width="0.2620" stroke="#777777" stroke-linecap="round" fill="none"/>
 <path d="M 15.17093600 97.24412900 A 0.4585 0.4585 0 0 1 14.7125 96.7857" stroke-width="0.2620" stroke="#777777" stroke-linecap="round" fill="none"/>
 <line x1="16.6118" y1="93.9039" x2="16.6118" y2="96.8512" stroke-width="0.2620" stroke="#777777" stroke-linecap="round"/>
 <path d="M 17.00478800 97.24413000 A 0.3930 0.3930 0 0 1 16.6118 96.8512" stroke-width="0.2620" stroke="#777777" stroke-linecap="round" fill="none"/>
 <line x1="20.4760" y1="97.2441" x2="20.8690" y2="97.2441" stroke-width="0.2620" stroke="#777777" stroke-linecap="round"/>
 <line x1="20.9986" y1="95.8709" x2="20.0109" y2="95.3630" stroke-width="0.2620" stroke="#777777" stroke-linecap="round"/>
 <line x1="20.2140" y1="93.9039" x2="20.4760" y2="93.9039" stroke-width="0.2620" stroke="#777777" stroke-linecap="round"/>
 <line x1="21.3929" y1="96.7202" x2="21.3929" y2="96.5892" stroke-width="0.2620" stroke="#777777" stroke-linecap="round"/>
 <path d="M 20.99861100 95.87086500 A 0.8514 0.8514 0 0 1 21.3929 96.5892" stroke-width="0.2620" stroke="#777777" stroke-linecap="round" fill="none"/>
 <path d="M 21.39292900 96.72017300 A 0.5240 0.5240 0 0 1 20.8690 97.2441" stroke-width="0.2620" stroke="#777777" stroke-linecap="round" fill="none"/>
 <path d="M 20.01093300 95.36296200 A 0.7859 0.7859 0 0 1 19.4936 94.6243" stroke-width="0.2620" stroke="#777777" stroke-linecap="round" fill="none"/>
 <path d="M 20.21402600 93.90390400 A 0.7204 0.7204 0 0 0 19.4936 94.6243" stroke-width="0.2620" stroke="#777777" stroke-linecap="round" fill="none"/>
 <path d="M 21.19793900 94.09781000 A 1.4409 1.4409 0 0 0 20.4760 93.9039" stroke-width="0.2620" stroke="#777777" stroke-linecap="round" fill="none"/>
 <path d="M 19.52717800 96.88762100 A 1.4409 1.4409 0 0 0 20.4760 97.2441" stroke-width="0.2620" stroke="#777777" stroke-linecap="round" fill="none"/>
 <line x1="21.8514" y1="97.2441" x2="21.8514" y2="93.9039" stroke-width="0.2620" stroke="#777777" stroke-linecap="round"/>
 <line x1="22.5718" y1="97.2441" x2="22.5718" y2="93.9039" stroke-width="0.2620" stroke="#777777" stroke-linecap="round"/>
 <line x1="22.5718" y1="93.9039" x2="23.6852" y2="95.8032" stroke-width="0.2620" stroke="#777777" stroke-linecap="round"/>
 <line x1="24.7987" y1="93.9039" x2="24.7987" y2="97.2441" stroke-width="0.2620" stroke="#777777" stroke-linecap="round"/>
 <line x1="24.7987" y1="93.9039" x2="23.6852" y2="95.8032" stroke-width="0.2620" stroke="#777777" stroke-linecap="round"/>
 <line x1="25.5191" y1="95.3448" x2="25.5191" y2="95.2138" stroke-width="0.2620" stroke="#777777" stroke-linecap="round"/>
 <line x1="25.5191" y1="96.8512" x2="25.5191" y2="96.7202" stroke-width="0.2620" stroke="#777777" stroke-linecap="round"/>
 <line x1="28.2699" y1="93.9039" x2="29.4488" y2="93.9039" stroke-width="0.2620" stroke="#777777" stroke-linecap="round"/>
 <line x1="28.2699" y1="97.2441" x2="29.4488" y2="97.2441" stroke-width="0.2620" stroke="#777777" stroke-linecap="round"/>
 <line x1="30.1037" y1="94.5589" x2="30.1037" y2="96.5892" stroke-width="0.2620" stroke="#777777" stroke-linecap="round"/>
 <line x1="28.2699" y1="93.9039" x2="28.2699" y2="97.2441" stroke-width="0.2620" stroke="#777777" stroke-linecap="round"/>
 <path d="M 29.44877600 97.24413000 A 0.6549 0.6549 0 0 0 30.1037 96.5892" stroke-width="0.2620" stroke="#777777" stroke-linecap="round" fill="none"/>
 <path d="M 29.44877600 93.90390500 A 0.6549 0.6549 0 0 1 30.1037 94.5589" stroke-width="0.2620" stroke="#777777" stroke-linecap="round" fill="none"/>
 <line x1="31.2171" y1="93.9039" x2="32.0686" y2="93.9039" stroke-width="0.2620" stroke="#777777" stroke-linecap="round"/>
 <line x1="31.2171" y1="97.2441" x2="32.0686" y2="97.2441" stroke-width="0.2620" stroke="#777777" stroke-linecap="round"/>
 <line x1="30.5622" y1="94.5589" x2="30.5622" y2="96.5892" stroke-width="0.2620" stroke="#777777" stroke-linecap="round"/>
 <path d="M 31.21713300 97.24413000 A 0.6549 0.6549 0 0 1 30.5622 96.5892" stroke-width="0.2620" stroke="#777777" stroke-linecap="round" fill="none"/>
 <path d="M 31.21713300 93.90390500 A 0.6549 0.6549 0 0 0 30.5622 94.5589" stroke-width="0.2620" stroke="#777777" stroke-linecap="round" fill="none"/>
 <line x1="34.8193" y1="96.5237" x2="34.8193" y2="95.7378" stroke-width="0.2620" stroke="#777777" stroke-linecap="round"/>
 <line x1="36.3128" y1="95.7378" x2="36.3128" y2="96.5237" stroke-width="0.2620" stroke="#777777" stroke-linecap="round"/>
 <path d="M 36.31284300 96.52368900 A 0.7468 0.7468 0 0 1 34.8193 96.5237" stroke-width="0.2620" stroke="#777777" stroke-linecap="round" fill="none"/>
 <path d="M 36.31284300 95.73775400 A 0.7468 0.7468 0 0 0 34.8193 95.7378" stroke-width="0.2620" stroke="#777777" stroke-linecap="round" fill="none"/>
 <line x1="36.7713" y1="95.0173" x2="36.7713" y2="98.4230" stroke-width="0.2620" stroke="#777777" stroke-linecap="round"/>
 <line x1="36.7713" y1="95.0173" x2="37.8847" y2="95.0173" stroke-width="0.2620" stroke="#777777" stroke-linecap="round"/>
 <line x1="38.2777" y1="95.4103" x2="38.2777" y2="96.8512" stroke-width="0.2620" stroke="#777777" stroke-linecap="round"/>
 <line x1="36.7713" y1="97.2441" x2="37.8847" y2="97.2441" stroke-width="0.2620" stroke="#777777" stroke-linecap="round"/>
 <path d="M 37.88471700 97.24413000 A 0.3930 0.3930 0 0 0 38.2777 96.8512" stroke-width="0.2620" stroke="#777777" stroke-linecap="round" fill="none"/>
 <path d="M 38.27768500 95.41028100 A 0.3930 0.3930 0 0 0 37.8847 95.0173" stroke-width="0.2620" stroke="#777777" stroke-linecap="round" fill="none"/>
 <line x1="38.7361" y1="96.7857" x2="38.7361" y2="95.7378" stroke-width="0.2620" stroke="#777777" stroke-linecap="round"/>
 <line x1="38.7361" y1="96.1307" x2="40.1770" y2="96.1307" stroke-width="0.2620" stroke="#777777" stroke-linecap="round"/>
 <line x1="40.1770" y1="96.1307" x2="40.1770" y2="95.7378" stroke-width="0.2620" stroke="#777777" stroke-linecap="round"/>
 <line x1="39.1946" y1="97.2441" x2="40.1770" y2="97.2441" stroke-width="0.2620" stroke="#777777" stroke-linecap="round"/>
 <path d="M 40.17703100 95.73775400 A 0.7204 0.7204 0 0 0 38.7361 95.7378" stroke-width="0.2620" stroke="#777777" stroke-linecap="round" fill="none"/>
 <path d="M 39.19461100 97.24412900 A 0.4585 0.4585 0 0 1 38.7361 96.7857" stroke-width="0.2620" stroke="#777777" stroke-linecap="round" fill="none"/>
 <line x1="40.6355" y1="97.2441" x2="40.6355" y2="95.0173" stroke-width="0.2620" stroke="#777777" stroke-linecap="round"/>
 <line x1="40.6355" y1="95.0173" x2="41.3559" y2="95.0173" stroke-width="0.2620" stroke="#777777" stroke-linecap="round"/>
 <path d="M 41.35593600 95.01731300 A 0.3930 0.3930 0 0 1 41.7489 95.4103" stroke-width="0.2620" stroke="#777777" stroke-linecap="round" fill="none"/>
 <line x1="42.4693" y1="95.0173" x2="43.2553" y2="95.0173" stroke-width="0.2620" stroke="#777777" stroke-linecap="round"/>
 <line x1="42.7968" y1="97.2441" x2="43.7137" y2="97.2441" stroke-width="0.2620" stroke="#777777" stroke-linecap="round"/>
 <line x1="43.7137" y1="95.4758" x2="43.7137" y2="97.2441" stroke-width="0.2620" stroke="#777777" stroke-linecap="round"/>
 <line x1="42.7968" y1="96.0652" x2="43.7137" y2="96.0652" stroke-width="0.2620" stroke="#777777" stroke-linecap="round"/>
 <path d="M 42.79682000 96.06522700 A 0.5895 0.5895 0 0 0 42.7968 97.2441" stroke-width="0.2620" stroke="#777777" stroke-linecap="round" fill="none"/>
 <path d="M 43.25528200 95.01731300 A 0.4585 0.4585 0 0 1 43.7137 95.4758" stroke-width="0.2620" stroke="#777777" stroke-linecap="round" fill="none"/>
 <line x1="44.5652" y1="93.9039" x2="44.5652" y2="97.2441" stroke-width="0.2620" stroke="#777777" stroke-linecap="round"/>
 <line x1="44.1722" y1="95.0173" x2="45.2856" y2="95.0173" stroke-width="0.2620" stroke="#777777" stroke-linecap="round"/>
 <line x1="46.0061" y1="93.9039" x2="46.0061" y2="94.1004" stroke-width="0.2620" stroke="#777777" stroke-linecap="round"/>
 <line x1="46.0061" y1="95.0173" x2="46.0061" y2="97.2441" stroke-width="0.2620" stroke="#777777" stroke-linecap="round"/>
 <line x1="46.7265" y1="95.0173" x2="47.6434" y2="95.0173" stroke-width="0.2620" stroke="#777777" stroke-linecap="round"/>
 <line x1="48.2329" y1="95.6068" x2="48.2329" y2="97.2441" stroke-width="0.2620" stroke="#777777" stroke-linecap="round"/>
 <line x1="46.7265" y1="95.0173" x2="46.7265" y2="97.2441" stroke-width="0.2620" stroke="#777777" stroke-linecap="round"/>
 <path d="M 48.23288000 95.60676500 A 0.5895 0.5895 0 0 0 47.6434 95.0173" stroke-width="0.2620" stroke="#777777" stroke-linecap="round" fill="none"/>
 <line x1="50.1977" y1="97.9646" x2="50.1977" y2="95.0173" stroke-width="0.2620" stroke="#777777" stroke-linecap="round"/>
 <line x1="49.0843" y1="95.0173" x2="50.1977" y2="95.0173" stroke-width="0.2620" stroke="#777777" stroke-linecap="round"/>
 <line x1="48.6913" y1="96.8512" x2="48.6913" y2="95.4103" stroke-width="0.2620" stroke="#777777" stroke-linecap="round"/>
 <line x1="49.0843" y1="97.2441" x2="50.1977" y2="97.2441" stroke-width="0.2620" stroke="#777777" stroke-linecap="round"/>
 <line x1="48.8878" y1="98.4230" x2="49.7393" y2="98.4230" stroke-width="0.2620" stroke="#777777" stroke-linecap="round"/>
 <path d="M 50.19772100 97.96457000 A 0.4585 0.4585 0 0 1 49.7393 98.4230" stroke-width="0.2620" stroke="#777777" stroke-linecap="round" fill="none"/>
 <path d="M 49.08431300 97.24413000 A 0.3930 0.3930 0 0 1 48.6913 96.8512" stroke-width="0.2620" stroke="#777777" stroke-linecap="round" fill="none"/>
 <path d="M 48.69134500 95.41028100 A 0.3930 0.3930 0 0 1 49.0843 95.0173" stroke-width="0.2620" stroke="#777777" stroke-linecap="round" fill="none"/>
 <line x1="52.6865" y1="95.0173" x2="52.6865" y2="98.4230" stroke-width="0.2620" stroke="#777777" stroke-linecap="round"/>
 <line x1="52.6865" y1="95.0173" x2="53.7999" y2="95.0173" stroke-width="0.2620" stroke="#777777" stroke-linecap="round"/>
 <line x1="54.1929" y1="95.4103" x2="54.1929" y2="96.8512" stroke-width="0.2620" stroke="#777777" stroke-linecap="round"/>
 <line x1="52.6865" y1="97.2441" x2="53.7999" y2="97.2441" stroke-width="0.2620" stroke="#777777" stroke-linecap="round"/>
 <path d="M 53.79992700 97.24413000 A 0.3930 0.3930 0 0 0 54.1929 96.8512" stroke-width="0.2620" stroke="#777777" stroke-linecap="round" fill="none"/>
 <path d="M 54.19289500 95.41028100 A 0.3930 0.3930 0 0 0 53.7999 95.0173" stroke-width="0.2620" stroke="#777777" stroke-linecap="round" fill="none"/>
 <line x1="54.6514" y1="96.5237" x2="54.6514" y2="95.7378" stroke-width="0.2620" stroke="#777777" stroke-linecap="round"/>
 <line x1="56.1449" y1="95.7378" x2="56.1449" y2="96.5237" stroke-width="0.2620" stroke="#777777" stroke-linecap="round"/>
 <path d="M 56.14486400 96.52368900 A 0.7468 0.7468 0 0 1 54.6514 96.5237" stroke-width="0.2620" stroke="#777777" stroke-linecap="round" fill="none"/>
 <path d="M 56.14486400 95.73775400 A 0.7468 0.7468 0 0 0 54.6514 95.7378" stroke-width="0.2620" stroke="#777777" stroke-linecap="round" fill="none"/>
 <line x1="56.6033" y1="93.9039" x2="56.6033" y2="94.1004" stroke-width="0.2620" stroke="#777777" stroke-linecap="round"/>
 <line x1="56.6033" y1="95.0173" x2="56.6033" y2="97.2441" stroke-width="0.2620" stroke="#777777" stroke-linecap="round"/>
 <line x1="57.3238" y1="95.0173" x2="58.2407" y2="95.0173" stroke-width="0.2620" stroke="#777777" stroke-linecap="round"/>
 <line x1="58.8301" y1="95.6068" x2="58.8301" y2="97.2441" stroke-width="0.2620" stroke="#777777" stroke-linecap="round"/>
 <line x1="57.3238" y1="95.0173" x2="57.3238" y2="97.2441" stroke-width="0.2620" stroke="#777777" stroke-linecap="round"/>
 <path d="M 58.83014700 95.60676500 A 0.5895 0.5895 0 0 0 58.2407 95.0173" stroke-width="0.2620" stroke="#777777" stroke-linecap="round" fill="none"/>
 <line x1="59.6816" y1="93.9039" x2="59.6816" y2="97.2441" stroke-width="0.2620" stroke="#777777" stroke-linecap="round"/>
 <line x1="59.2886" y1="95.0173" x2="60.4020" y2="95.0173" stroke-width="0.2620" stroke="#777777" stroke-linecap="round"/>
 <line x1="49.7650" y1="100.3944" x2="49.6771" y2="100.4922" stroke-width="0.1905" stroke="#777777" stroke-linecap="round"/>
 <line x1="50.0652" y1="102.7620" x2="50.1530" y2="102.6642" stroke-width="0.1905" stroke="#777777" stroke-linecap="round"/>
 <line x1="50.0652" y1="100.3944" x2="50.1530" y2="100.4922" stroke-width="0.1905" stroke="#777777" stroke-linecap="round"/>
 <line x1="49.6771" y1="102.6642" x2="49.7650" y2="102.7620" stroke-width="0.1905" stroke="#777777" stroke-linecap="round"/>
 <line x1="50.4867" y1="101.5544" x2="50.4867" y2="101.6020" stroke-width="0.1905" stroke="#777777" stroke-linecap="round"/>
 <line x1="49.3435" y1="101.5544" x2="49.3435" y2="101.6020" stroke-width="0.1905" stroke="#777777" stroke-linecap="round"/>
 <path d="M 50.15302600 100.49217900 A 1.8577 1.8577 0 0 1 50.4867 101.5544" stroke-width="0.1905" stroke="#777777" stroke-linecap="round" fill="none"/>
 <path d="M 49.67712800 102.66420900 A 1.8577 1.8577 0 0 1 49.3435 101.6020" stroke-width="0.1905" stroke="#777777" stroke-linecap="round" fill="none"/>
 <path d="M 50.15302600 102.66420900 A 1.8577 1.8577 0 0 0 50.4867 101.6020" stroke-width="0.1905" stroke="#777777" stroke-linecap="round" fill="none"/>
 <path d="M 49.76497000 102.76201100 A 0.3811 0.3811 0 0 0 50.0652 102.7620" stroke-width="0.1905" stroke="#777777" stroke-linecap="round" fill="none"/>
 <path d="M 49.67712800 100.49217900 A 1.8577 1.8577 0 0 0 49.3435 101.5544" stroke-width="0.1905" stroke="#777777" stroke-linecap="round" fill="none"/>
 <path d="M 50.06518400 100.39437700 A 0.3811 0.3811 0 0 0 49.7650 100.3944" stroke-width="0.1905" stroke="#777777" stroke-linecap="round" fill="none"/>
 <line x1="50.8201" y1="100.8875" x2="51.3441" y2="100.3636" stroke-width="0.1905" stroke="#777777" stroke-linecap="round"/>
 <line x1="51.3441" y1="100.3636" x2="51.3441" y2="102.7928" stroke-width="0.1905" stroke="#777777" stroke-linecap="round"/>
 <line x1="51.8680" y1="103.0786" x2="53.0112" y2="103.0786" stroke-width="0.1905" stroke="#777777" stroke-linecap="round"/>
 <line x1="54.6307" y1="100.3159" x2="54.6307" y2="102.7928" stroke-width="0.1905" stroke="#777777" stroke-linecap="round"/>
 <line x1="53.8209" y1="102.7928" x2="54.6307" y2="102.7928" stroke-width="0.1905" stroke="#777777" stroke-linecap="round"/>
 <line x1="53.5351" y1="101.4591" x2="53.5351" y2="102.5070" stroke-width="0.1905" stroke="#777777" stroke-linecap="round"/>
 <line x1="53.8209" y1="101.1733" x2="54.6307" y2="101.1733" stroke-width="0.1905" stroke="#777777" stroke-linecap="round"/>
 <path d="M 53.82094300 101.17331800 A 0.2858 0.2858 0 0 0 53.5351 101.4591" stroke-width="0.1905" stroke="#777777" stroke-linecap="round" fill="none"/>
 <path d="M 53.53514800 102.50702700 A 0.2858 0.2858 0 0 0 53.8209 102.7928" stroke-width="0.1905" stroke="#777777" stroke-linecap="round" fill="none"/>
 <line x1="55.4404" y1="102.7928" x2="55.9644" y2="102.7928" stroke-width="0.1905" stroke="#777777" stroke-linecap="round"/>
 <line x1="55.1547" y1="101.4591" x2="55.1547" y2="102.5070" stroke-width="0.1905" stroke="#777777" stroke-linecap="round"/>
 <line x1="55.4404" y1="101.1733" x2="55.9644" y2="101.1733" stroke-width="0.1905" stroke="#777777" stroke-linecap="round"/>
 <path d="M 55.44044800 101.17331800 A 0.2858 0.2858 0 0 0 55.1547 101.4591" stroke-width="0.1905" stroke="#777777" stroke-linecap="round" fill="none"/>
 <path d="M 55.15465300 102.50702700 A 0.2858 0.2858 0 0 0 55.4404 102.7928" stroke-width="0.1905" stroke="#777777" stroke-linecap="round" fill="none"/>
 <line x1="56.4884" y1="102.8547" x2="56.4979" y2="102.6976" stroke-width="0.1905" stroke="#777777" stroke-linecap="round"/>
 <line x1="57.0218" y1="102.7928" x2="57.0218" y2="101.1733" stroke-width="0.1905" stroke="#777777" stroke-linecap="round"/>
 <line x1="57.0218" y1="101.1733" x2="57.5458" y2="101.1733" stroke-width="0.1905" stroke="#777777" stroke-linecap="round"/>
 <path d="M 57.54580600 101.17331800 A 0.2858 0.2858 0 0 1 57.8316 101.4591" stroke-width="0.1905" stroke="#777777" stroke-linecap="round" fill="none"/>
 <line x1="58.5491" y1="101.9384" x2="58.9361" y2="101.9794" stroke-width="0.1905" stroke="#777777" stroke-linecap="round"/>
 <path d="M 58.22359900 102.67153000 A 2.2387 2.2387 0 0 0 58.8793 102.7697" stroke-width="0.1905" stroke="#777777" stroke-linecap="round" fill="none"/>
 <path d="M 58.87930000 102.76970600 A 0.3950 0.3950 0 1 0 58.9361 101.9831" stroke-width="0.1905" stroke="#777777" stroke-linecap="round" fill="none"/>
 <path d="M 59.22379900 101.29306700 A 2.2387 2.2387 0 0 0 58.5490 101.1738" stroke-width="0.1905" stroke="#777777" stroke-linecap="round" fill="none"/>
 <path d="M 58.54905400 101.17035400 A 0.3840 0.3840 0 0 0 58.5491 101.9384" stroke-width="0.1905" stroke="#777777" stroke-linecap="round" fill="none"/>
 <line x1="57.0614" y1="107.8369" x2="57.0614" y2="105.6119" stroke-width="0.1745" stroke="#777777" stroke-linecap="round"/>
 <line x1="56.4070" y1="105.6119" x2="57.6722" y2="105.6119" stroke-width="0.1745" stroke="#777777" stroke-linecap="round"/>
 <line x1="58.1521" y1="105.6119" x2="58.1521" y2="105.7428" stroke-width="0.1745" stroke="#777777" stroke-linecap="round"/>
 <line x1="58.1521" y1="106.3536" x2="58.1521" y2="107.8369" stroke-width="0.1745" stroke="#777777" stroke-linecap="round"/>
 <line x1="58.6320" y1="105.5683" x2="58.6320" y2="107.8369" stroke-width="0.1745" stroke="#777777" stroke-linecap="round"/>
 <line x1="58.6320" y1="107.8369" x2="59.3737" y2="107.8369" stroke-width="0.1745" stroke="#777777" stroke-linecap="round"/>
 <line x1="59.6354" y1="106.6154" x2="59.6354" y2="107.5752" stroke-width="0.1745" stroke="#777777" stroke-linecap="round"/>
 <line x1="58.6320" y1="106.3536" x2="59.3737" y2="106.3536" stroke-width="0.1745" stroke="#777777" stroke-linecap="round"/>
 <path d="M 59.37367900 106.35360300 A 0.2618 0.2618 0 0 1 59.6354 106.6154" stroke-width="0.1745" stroke="#777777" stroke-linecap="round" fill="none"/>
 <path d="M 59.63544100 107.57515900 A 0.2618 0.2618 0 0 1 59.3737 107.8369" stroke-width="0.1745" stroke="#777777" stroke-linecap="round" fill="none"/>
 <line x1="59.9408" y1="107.3570" x2="59.9408" y2="106.8335" stroke-width="0.1745" stroke="#777777" stroke-linecap="round"/>
 <line x1="60.9357" y1="106.8335" x2="60.9357" y2="107.3570" stroke-width="0.1745" stroke="#777777" stroke-linecap="round"/>
 <path d="M 60.93567800 107.35702400 A 0.4974 0.4974 0 0 1 59.9408 107.3570" stroke-width="0.1745" stroke="#777777" stroke-linecap="round" fill="none"/>
 <path d="M 60.93567800 106.83350000 A 0.4974 0.4974 0 0 0 59.9408 106.8335" stroke-width="0.1745" stroke="#777777" stroke-linecap="round" fill="none"/>
 <line x1="61.2411" y1="107.8369" x2="61.2411" y2="106.3536" stroke-width="0.1745" stroke="#777777" stroke-linecap="round"/>
 <line x1="61.2411" y1="106.3536" x2="61.7210" y2="106.3536" stroke-width="0.1745" stroke="#777777" stroke-linecap="round"/>
 <path d="M 61.72096600 106.35360300 A 0.2618 0.2618 0 0 1 61.9827 106.6154" stroke-width="0.1745" stroke="#777777" stroke-linecap="round" fill="none"/>
 <line x1="63.6406" y1="105.6119" x2="63.7714" y2="105.1320" stroke-width="0.1745" stroke="#777777" stroke-linecap="round"/>
 <line x1="64.2513" y1="107.8369" x2="64.2513" y2="105.6119" stroke-width="0.1745" stroke="#777777" stroke-linecap="round"/>
 <line x1="65.7347" y1="108.3168" x2="65.7347" y2="106.3536" stroke-width="0.1745" stroke="#777777" stroke-linecap="round"/>
 <line x1="64.9930" y1="106.3536" x2="65.7347" y2="106.3536" stroke-width="0.1745" stroke="#777777" stroke-linecap="round"/>
 <line x1="64.7312" y1="107.5752" x2="64.7312" y2="106.6154" stroke-width="0.1745" stroke="#777777" stroke-linecap="round"/>
 <line x1="64.9930" y1="107.8369" x2="65.7347" y2="107.8369" stroke-width="0.1745" stroke="#777777" stroke-linecap="round"/>
 <line x1="64.8621" y1="108.6222" x2="65.4293" y2="108.6222" stroke-width="0.1745" stroke="#777777" stroke-linecap="round"/>
 <path d="M 65.73465500 108.31681800 A 0.3054 0.3054 0 0 1 65.4293 108.6222" stroke-width="0.1745" stroke="#777777" stroke-linecap="round" fill="none"/>
 <path d="M 64.99299600 107.83692100 A 0.2618 0.2618 0 0 1 64.7312 107.5752" stroke-width="0.1745" stroke="#777777" stroke-linecap="round" fill="none"/>
 <path d="M 64.73123400 106.61536500 A 0.2618 0.2618 0 0 1 64.9930 106.3536" stroke-width="0.1745" stroke="#777777" stroke-linecap="round" fill="none"/>
 <line x1="66.0400" y1="107.3570" x2="66.0400" y2="106.8335" stroke-width="0.1745" stroke="#777777" stroke-linecap="round"/>
 <line x1="67.0349" y1="106.8335" x2="67.0349" y2="107.3570" stroke-width="0.1745" stroke="#777777" stroke-linecap="round"/>
 <path d="M 67.03489200 107.35702400 A 0.4974 0.4974 0 0 1 66.0400 107.3570" stroke-width="0.1745" stroke="#777777" stroke-linecap="round" fill="none"/>
 <path d="M 67.03489200 106.83350000 A 0.4974 0.4974 0 0 0 66.0400 106.8335" stroke-width="0.1745" stroke="#777777" stroke-linecap="round" fill="none"/>
 <line x1="67.3403" y1="107.8369" x2="67.3403" y2="106.3536" stroke-width="0.1745" stroke="#777777" stroke-linecap="round"/>
 <line x1="67.3403" y1="106.3536" x2="67.8202" y2="106.3536" stroke-width="0.1745" stroke="#777777" stroke-linecap="round"/>
 <path d="M 67.82018000 106.35360300 A 0.2618 0.2618 0 0 1 68.0819 106.6154" stroke-width="0.1745" stroke="#777777" stroke-linecap="round" fill="none"/>
 <line x1="68.4041" y1="107.8369" x2="69.3639" y2="107.8369" stroke-width="0.1745" stroke="#777777" stroke-linecap="round"/>
 <line x1="68.4041" y1="107.8369" x2="69.3329" y2="106.4048" stroke-width="0.1745" stroke="#777777" stroke-linecap="round"/>
 <path d="M 69.33290900 106.40481900 A 0.5235 0.5235 0 1 0 68.3873 105.9699" stroke-width="0.1745" stroke="#777777" stroke-linecap="round" fill="none"/>
 <line x1="69.7129" y1="105.6119" x2="69.8438" y2="105.1320" stroke-width="0.1745" stroke="#777777" stroke-linecap="round"/>
 <line x1="71.6761" y1="107.8369" x2="71.6761" y2="105.6119" stroke-width="0.1745" stroke="#777777" stroke-linecap="round"/>
 <line x1="72.3742" y1="106.8335" x2="71.6761" y2="106.8335" stroke-width="0.1745" stroke="#777777" stroke-linecap="round"/>
 <line x1="72.3742" y1="105.6119" x2="71.6761" y2="105.6119" stroke-width="0.1745" stroke="#777777" stroke-linecap="round"/>
 <line x1="72.8977" y1="106.1355" x2="72.8977" y2="106.3100" stroke-width="0.1745" stroke="#777777" stroke-linecap="round"/>
 <path d="M 72.37415400 105.61194400 A 0.5235 0.5235 0 0 1 72.8977 106.1355" stroke-width="0.1745" stroke="#777777" stroke-linecap="round" fill="none"/>
 <path d="M 72.37415400 106.83350000 A 0.5235 0.5235 0 0 0 72.8977 106.3100" stroke-width="0.1745" stroke="#777777" stroke-linecap="round" fill="none"/>
 <line x1="73.3776" y1="106.3536" x2="73.9011" y2="106.3536" stroke-width="0.1745" stroke="#777777" stroke-linecap="round"/>
 <line x1="73.5957" y1="107.8369" x2="74.2065" y2="107.8369" stroke-width="0.1745" stroke="#777777" stroke-linecap="round"/>
 <line x1="74.2065" y1="106.6590" x2="74.2065" y2="107.8369" stroke-width="0.1745" stroke="#777777" stroke-linecap="round"/>
 <line x1="73.5957" y1="107.0516" x2="74.2065" y2="107.0516" stroke-width="0.1745" stroke="#777777" stroke-linecap="round"/>
 <path d="M 73.59571200 107.05163500 A 0.3926 0.3926 0 0 0 73.5957 107.8369" stroke-width="0.1745" stroke="#777777" stroke-linecap="round" fill="none"/>
 <path d="M 73.90110100 106.35360300 A 0.3054 0.3054 0 0 1 74.2065 106.6590" stroke-width="0.1745" stroke="#777777" stroke-linecap="round" fill="none"/>
 <line x1="74.5119" y1="105.6119" x2="74.5119" y2="107.5752" stroke-width="0.1745" stroke="#777777" stroke-linecap="round"/>
 <path d="M 74.77364200 107.83692100 A 0.2618 0.2618 0 0 1 74.5119 107.5752" stroke-width="0.1745" stroke="#777777" stroke-linecap="round" fill="none"/>
 <line x1="75.0790" y1="105.6119" x2="75.0790" y2="105.7428" stroke-width="0.1745" stroke="#777777" stroke-linecap="round"/>
 <line x1="75.0790" y1="106.3536" x2="75.0790" y2="107.8369" stroke-width="0.1745" stroke="#777777" stroke-linecap="round"/>
 <line x1="75.5589" y1="106.3536" x2="76.1697" y2="106.3536" stroke-width="0.1745" stroke="#777777" stroke-linecap="round"/>
 <line x1="76.5624" y1="106.7462" x2="76.5624" y2="107.8369" stroke-width="0.1745" stroke="#777777" stroke-linecap="round"/>
 <line x1="75.5589" y1="106.3536" x2="75.5589" y2="107.8369" stroke-width="0.1745" stroke="#777777" stroke-linecap="round"/>
 <path d="M 76.56235300 106.74624600 A 0.3926 0.3926 0 0 0 76.1697 106.3536" stroke-width="0.1745" stroke="#777777" stroke-linecap="round" fill="none"/>
 <line x1="76.8677" y1="105.6119" x2="76.8677" y2="107.8369" stroke-width="0.1745" stroke="#777777" stroke-linecap="round"/>
 <line x1="77.8712" y1="106.3536" x2="76.8677" y2="107.1389" stroke-width="0.1745" stroke="#777777" stroke-linecap="round"/>
 <line x1="77.8712" y1="107.8369" x2="77.3083" y2="106.7941" stroke-width="0.1745" stroke="#777777" stroke-linecap="round"/>
 <line x1="78.5256" y1="106.3536" x2="79.0491" y2="106.3536" stroke-width="0.1745" stroke="#777777" stroke-linecap="round"/>
 <line x1="78.7437" y1="107.8369" x2="79.3545" y2="107.8369" stroke-width="0.1745" stroke="#777777" stroke-linecap="round"/>
 <line x1="79.3545" y1="106.6590" x2="79.3545" y2="107.8369" stroke-width="0.1745" stroke="#777777" stroke-linecap="round"/>
 <line x1="78.7437" y1="107.0516" x2="79.3545" y2="107.0516" stroke-width="0.1745" stroke="#777777" stroke-linecap="round"/>
 <path d="M 78.74370600 107.05163500 A 0.3926 0.3926 0 0 0 78.7437 107.8369" stroke-width="0.1745" stroke="#777777" stroke-linecap="round" fill="none"/>
 <path d="M 79.04909500 106.35360300 A 0.3054 0.3054 0 0 1 79.3545 106.6590" stroke-width="0.1745" stroke="#777777" stroke-linecap="round" fill="none"/>
 <line x1="80.0116" y1="107.0543" x2="80.3661" y2="107.0919" stroke-width="0.1745" stroke="#777777" stroke-linecap="round"/>
 <path d="M 79.71351900 107.72582900 A 2.0505 2.0505 0 0 0 80.3141 107.8157" stroke-width="0.1745" stroke="#777777" stroke-linecap="round" fill="none"/>
 <path d="M 80.31408200 107.81575000 A 0.3617 0.3617 0 1 0 80.3661 107.0953" stroke-width="0.1745" stroke="#777777" stroke-linecap="round" fill="none"/>
 <path d="M 80.62961200 106.46328200 A 2.0505 2.0505 0 0 0 80.0116 106.3541" stroke-width="0.1745" stroke="#777777" stroke-linecap="round" fill="none"/>
 <path d="M 80.01160600 106.35088800 A 0.3517 0.3517 0 0 0 80.0116 107.0543" stroke-width="0.1745" stroke="#777777" stroke-linecap="round" fill="none"/>
</g>
</svg>
