%!PS-Adobe-3.0 EPSF-3.0
%%Creator: cairo 1.12.14 (http://cairographics.org)
%%CreationDate: Sun Dec 10 03:21:32 2017
%%Pages: 1
%%DocumentData: Clean7Bit
%%LanguageLevel: 2
%%BoundingBox: 0 -1 820 820
%%EndComments
%%BeginProlog
save
50 dict begin
/q { gsave } bind def
/Q { grestore } bind def
/cm { 6 array astore concat } bind def
/w { setlinewidth } bind def
/J { setlinecap } bind def
/j { setlinejoin } bind def
/M { setmiterlimit } bind def
/d { setdash } bind def
/m { moveto } bind def
/l { lineto } bind def
/c { curveto } bind def
/h { closepath } bind def
/re { exch dup neg 3 1 roll 5 3 roll moveto 0 rlineto
      0 exch rlineto 0 rlineto closepath } bind def
/S { stroke } bind def
/f { fill } bind def
/f* { eofill } bind def
/n { newpath } bind def
/W { clip } bind def
/W* { eoclip } bind def
/BT { } bind def
/ET { } bind def
/pdfmark where { pop globaldict /?pdfmark /exec load put }
    { globaldict begin /?pdfmark /pop load def /pdfmark
    /cleartomark load def end } ifelse
/BDC { mark 3 1 roll /BDC pdfmark } bind def
/EMC { mark /EMC pdfmark } bind def
/cairo_store_point { /cairo_point_y exch def /cairo_point_x exch def } def
/Tj { show currentpoint cairo_store_point } bind def
/TJ {
  {
    dup
    type /stringtype eq
    { show } { -0.001 mul 0 cairo_font_matrix dtransform rmoveto } ifelse
  } forall
  currentpoint cairo_store_point
} bind def
/cairo_selectfont { cairo_font_matrix aload pop pop pop 0 0 6 array astore
    cairo_font exch selectfont cairo_point_x cairo_point_y moveto } bind def
/Tf { pop /cairo_font exch def /cairo_font_matrix where
      { pop cairo_selectfont } if } bind def
/Td { matrix translate cairo_font_matrix matrix concatmatrix dup
      /cairo_font_matrix exch def dup 4 get exch 5 get cairo_store_point
      /cairo_font where { pop cairo_selectfont } if } bind def
/Tm { 2 copy 8 2 roll 6 array astore /cairo_font_matrix exch def
      cairo_store_point /cairo_font where { pop cairo_selectfont } if } bind def
/g { setgray } bind def
/rg { setrgbcolor } bind def
/d1 { setcachedevice } bind def
%%EndProlog
%%Page: 1 1
%%BeginPageSetup
%%PageBoundingBox: 0 -1 820 820
%%EndPageSetup
q 0 -1 820 821 rectclip q
0.847059 0.968627 0.984314 rg
4.516 820.001 m 815.484 820.001 l 817.984 820.001 820 817.985 820 815.485
 c 820 4.516 l 820 2.013 817.984 0.001 815.484 0.001 c 4.516 0.001 l 2.016
 0.001 0 2.013 0 4.516 c 0 815.485 l 0 817.985 2.016 820.001 4.516 820.001
 c h
f
0.00784314 g
120 136.001 m 120 122.747 109.254 112.001 96 112.001 c 82.746 112.001 72
 122.747 72 136.001 c 72 149.255 82.746 160.001 96 160.001 c 109.254 160.001
 120 149.255 120 136.001 c h
f
0 g
0.32 w
1 J
0 j
[] 0.0 d
4 M q 1 0 0 -1 0 819.200012 cm
120 683.199 m 120 696.453 109.254 707.199 96 707.199 c 82.746 707.199 72
 696.453 72 683.199 c 72 669.945 82.746 659.199 96 659.199 c 109.254 659.199
 120 669.945 120 683.199 c h
S Q
0.00784314 g
120 696.001 m 120 682.747 109.254 672.001 96 672.001 c 82.746 672.001 72
 682.747 72 696.001 c 72 709.255 82.746 720.001 96 720.001 c 109.254 720.001
 120 709.255 120 696.001 c h
f
0 g
q 1 0 0 -1 0 819.200012 cm
120 123.199 m 120 136.453 109.254 147.199 96 147.199 c 82.746 147.199 72
 136.453 72 123.199 c 72 109.945 82.746 99.199 96 99.199 c 109.254 99.199
 120 109.945 120 123.199 c h
S Q
0.00784314 g
744 144.001 m 744 130.747 733.254 120.001 720 120.001 c 706.746 120.001
 696 130.747 696 144.001 c 696 157.255 706.746 168.001 720 168.001 c 733.254
 168.001 744 157.255 744 144.001 c h
f
0 g
q 1 0 0 -1 0 819.200012 cm
744 675.199 m 744 688.453 733.254 699.199 720 699.199 c 706.746 699.199
 696 688.453 696 675.199 c 696 661.945 706.746 651.199 720 651.199 c 733.254
 651.199 744 661.945 744 675.199 c h
S Q
0.00784314 g
744 696.001 m 744 682.747 733.254 672.001 720 672.001 c 706.746 672.001
 696 682.747 696 696.001 c 696 709.255 706.746 720.001 720 720.001 c 733.254
 720.001 744 709.255 744 696.001 c h
f
0 g
q 1 0 0 -1 0 819.200012 cm
744 123.199 m 744 136.453 733.254 147.199 720 147.199 c 706.746 147.199
 696 136.453 696 123.199 c 696 109.945 706.746 99.199 720 99.199 c 733.254
 99.199 744 109.945 744 123.199 c h
S Q
24 w
q 1 0 0 -1 0 819.200012 cm
656 123.199 m 720 123.199 l 176 123.199 m 96 123.199 l 656 123.199 m 608
 195.199 l 512 51.199 m 608 195.199 l 512 51.199 m 416 195.199 l 320 51.199
 m 416 195.199 l 320 51.199 m 224 195.199 l 176 123.199 m 224 195.199 l S Q
q 1 0 0 -1 0 819.200012 cm
96 123.199 m 96 375.199 l 20 375.199 m 172 375.199 l S Q
q 1 0 0 -1 0 819.200012 cm
96 683.199 m 96 439.199 l 20 439.199 m 172 439.199 l S Q
q 1 0 0 -1 0 819.200012 cm
528 675.199 m 576 611.199 584 611.199 600 675.199 c 720 675.199 l 232 683.199
 m 96 683.199 l 424 683.199 m 496 595.199 488 611.199 520 683.199 c 592 
811.199 424 795.199 528 675.199 c 328 683.199 m 400 595.199 392 611.199 
424 683.199 c 496 811.199 328 795.199 432 675.199 c 232 683.199 m 304 595.199
 296 611.199 328 683.199 c 400 811.199 232 795.199 336 675.199 c S Q
0.00784314 g
752 320.001 m 752 302.325 737.672 288.001 720 288.001 c 702.328 288.001
 688 302.325 688 320.001 c 688 337.673 702.328 352.001 720 352.001 c 737.672
 352.001 752 337.673 752 320.001 c h
f
0 g
0.426667 w
q 1 0 0 -1 0 819.200012 cm
752 499.199 m 752 516.875 737.672 531.199 720 531.199 c 702.328 531.199
 688 516.875 688 499.199 c 688 481.527 702.328 467.199 720 467.199 c 737.672
 467.199 752 481.527 752 499.199 c h
S Q
0.0666667 0.584314 0.662745 rg
32 w
1 M q 1 0 0 -1 0 819.200012 cm
528 285.352 m 501.824 264 468.41 251.199 432 251.199 c 348.051 251.199 
280 319.254 280 403.199 c 280 487.148 348.051 555.199 432 555.199 c 468.41
 555.199 501.824 542.398 528 521.051 c S Q
588 496.001 m 458.25 501.282 l 494.25 557.282 l 588 496.001 m 530.25 609.282
 l 494.25 557.282 l f
0 g
24 w
4 M q 1 0 0 -1 0 819.200012 cm
720 675.199 m 720 499.199 l S Q
0.00784314 g
752 500.001 m 752 517.673 737.672 532.001 720 532.001 c 702.328 532.001
 688 517.673 688 500.001 c 688 482.325 702.328 468.001 720 468.001 c 737.672
 468.001 752 482.325 752 500.001 c h
f
0 g
0.426667 w
q 1 0 0 1 0 819.200012 cm
752 -319.199 m 752 -301.527 737.672 -287.199 720 -287.199 c 702.328 -287.199
 688 -301.527 688 -319.199 c 688 -336.875 702.328 -351.199 720 -351.199 
c 737.672 -351.199 752 -336.875 752 -319.199 c h
S Q
24 w
q 1 0 0 -1 0 819.200012 cm
720 123.199 m 720 319.199 l S Q
Q Q
showpage
%%Trailer
end restore
%%EOF
