cschem abstract model v1
components
 S0
  OMIT
  attributes
  ports
 TP11
  attributes
   spice/omit=yes
   role=symbol
   name=TP11
  ports
   1
    attributes
     role=terminal
     display/name=1
     name=1
 TP12
  attributes
   spice/omit=yes
   role=symbol
   name=TP12
  ports
   1
    attributes
     role=terminal
     display/name=1
     name=1
 TP13
  attributes
   spice/omit=yes
   role=symbol
   name=TP13
   connect []
    1:v/foo
  ports
   1
    attributes
     role=terminal
     display/name=1
     name=1
 S0/S1
  OMIT
  attributes
  ports
 TP21
  attributes
   spice/omit=yes
   role=symbol
   name=TP21
  ports
   1
    attributes
     role=terminal
     display/name=1
     name=1
 TP22
  attributes
   spice/omit=yes
   role=symbol
   name=TP22
  ports
   1
    attributes
     role=terminal
     display/name=1
     name=1
 TP23
  attributes
   spice/omit=yes
   role=symbol
   name=TP23
   connect []
    1:^/foo
  ports
   1
    attributes
     role=terminal
     display/name=1
     name=1
 TP01
  attributes
   spice/omit=yes
   role=symbol
   name=TP01
  ports
   1
    attributes
     role=terminal
     display/name=1
     name=1
 TP02
  attributes
   spice/omit=yes
   role=symbol
   name=TP02
  ports
   1
    attributes
     role=terminal
     display/name=1
     name=1
nets
 S0/foo
  attributes
   role=wire-net
   name=foo
  conns 6
   TP21-1
   TP22-1
   TP11-1
   TP12-1
   TP13-1
   TP23-1
 foo
  attributes
   role=wire-net
   name=foo
  conns 2
   TP01-1
   TP02-1
