prg:
 VAR1: [0]
 VAR1: [6]
 SNQ
 VAR1: [13]
 VAR1: [19]
 SEQ
 &&
 VAR1: [26]
 STR: [32]
 SEQ
 &&
 VAR1: [36]
 STR: [42]
 SNQ
 &&
 STR: [46]
 STR: [50]
 SEQ
 &&
 STR: [54]
 STR: [58]
 SNQ
 &&
strings:
 [0] 'first'
 [6] 'second'
 [13] 'first'
 [19] 'fourth'
 [26] 'first'
 [32] 'one'
 [36] 'first'
 [42] 'foo'
 [46] 'foo'
 [50] 'foo'
 [54] 'foo'
 [58] 'bar'
-- compile --
-- AST --
-- execute --
res=1
