.title sch-rnd export using export_spice

*** circuit ***
V1 in 0 PULSE (0 5 1u 1u 1u 1 1)
C1 mid 0 1u
C2 out 0 1.2u
R1 in mid 10k
R2 mid out 15k

*** sch-rnd/export_spice: commands ***
.control

tran 0.1ms 200ms
plot v(in) v(mid) v(out) xlimit 0 200ms

.endc
.end
