.title sch-rnd export using export_spice

*** circuit ***
US1/U1__1 div1 anon_net_5 div1 Vcc 0
US1/U1__2 div2 anon_net_7 div2 Vcc 0
R1 Vcc anon_net_5 100k
R2 Vcc anon_net_7 100k
R3 anon_net_5 0 100k
R4 anon_net_7 0 120k
.end
