<?xml version="1.0" encoding="UTF-8" standalone="no"?>
<!DOCTYPE svg PUBLIC "-//W3C//DTD SVG 1.1//EN"
 "http://www.w3.org/Graphics/SVG/1.1/DTD/svg11.dtd">
<!-- Generated by graphviz version 2.40.1 (20161225.0304)
 -->
<!-- Title: ha:line.ID Pages: 1 -->
<svg width="583pt" height="153pt"
 viewBox="0.00 0.00 583.00 152.89" xmlns="http://www.w3.org/2000/svg" xmlns:xlink="http://www.w3.org/1999/xlink">
<g id="graph0" class="graph" transform="scale(1 1) rotate(0) translate(4 148.8944)">
<title>ha:line.ID</title>
<polygon fill="#ffffff" stroke="transparent" points="-4,4 -4,-148.8944 579.0036,-148.8944 579.0036,4 -4,4"/>
<!-- /lht_tree_doc/comm/line.ID -->
<g id="node1" class="node">
<title>/lht_tree_doc/comm/line.ID</title>
<g id="a_node1"><a xlink:href="tree.html#/lht_tree_doc/comm/line.ID" xlink:title=" Drawing object: straight line ">
<ellipse fill="none" stroke="#000000" cx="285.234" cy="-117.3173" rx="50.41" ry="27.6545"/>
<text text-anchor="middle" x="285.234" y="-121.6173" font-family="Times,serif" font-size="14.00" fill="#000000">ha:line.ID</text>
</a>
</g>
</g>
<!-- /lht_tree_doc/comm/line.ID/children/x1 -->
<g id="node2" class="node">
<title>/lht_tree_doc/comm/line.ID/children/x1</title>
<g id="a_node2"><a xlink:href="tree.html#/lht_tree_doc/comm/line.ID/children/x1" xlink:title="start point, x coord ">
<ellipse fill="none" stroke="#000000" cx="33.234" cy="-26.8701" rx="33.4697" ry="26.7407"/>
<text text-anchor="middle" x="33.234" y="-30.6701" font-family="Times,serif" font-size="14.00" fill="#000000">x1</text>
<text text-anchor="middle" x="33.234" y="-15.6701" font-family="Times,serif" font-size="14.00" fill="#000000">coord</text>
</a>
</g>
</g>
<!-- /lht_tree_doc/comm/line.ID&#45;&gt;/lht_tree_doc/comm/line.ID/children/x1 -->
<g id="edge1" class="edge">
<title>/lht_tree_doc/comm/line.ID&#45;&gt;/lht_tree_doc/comm/line.ID/children/x1</title>
<path fill="none" stroke="#000000" d="M238.4272,-107.0711C194.9596,-96.6514 129.037,-78.517 75.234,-53.7401 72.5804,-52.5181 69.8965,-51.1513 67.2364,-49.6991"/>
<polygon fill="#000000" stroke="#000000" points="68.7632,-46.5377 58.3625,-44.519 65.2343,-52.5831 68.7632,-46.5377"/>
</g>
<!-- /lht_tree_doc/comm/line.ID/children/y1 -->
<g id="node3" class="node">
<title>/lht_tree_doc/comm/line.ID/children/y1</title>
<g id="a_node3"><a xlink:href="tree.html#/lht_tree_doc/comm/line.ID/children/y1" xlink:title="start point, y coord ">
<ellipse fill="none" stroke="#000000" cx="117.234" cy="-26.8701" rx="33.4697" ry="26.7407"/>
<text text-anchor="middle" x="117.234" y="-30.6701" font-family="Times,serif" font-size="14.00" fill="#000000">y1</text>
<text text-anchor="middle" x="117.234" y="-15.6701" font-family="Times,serif" font-size="14.00" fill="#000000">coord</text>
</a>
</g>
</g>
<!-- /lht_tree_doc/comm/line.ID&#45;&gt;/lht_tree_doc/comm/line.ID/children/y1 -->
<g id="edge2" class="edge">
<title>/lht_tree_doc/comm/line.ID&#45;&gt;/lht_tree_doc/comm/line.ID/children/y1</title>
<path fill="none" stroke="#000000" d="M246.9349,-99.2504C221.6846,-87.0333 188.075,-70.1855 159.234,-53.7401 156.7666,-52.3332 154.2418,-50.8455 151.7147,-49.3208"/>
<polygon fill="#000000" stroke="#000000" points="153.5417,-46.3356 143.1945,-44.0584 149.8633,-52.2912 153.5417,-46.3356"/>
</g>
<!-- /lht_tree_doc/comm/line.ID/children/x2 -->
<g id="node4" class="node">
<title>/lht_tree_doc/comm/line.ID/children/x2</title>
<g id="a_node4"><a xlink:href="tree.html#/lht_tree_doc/comm/line.ID/children/x2" xlink:title="end point, x coord ">
<ellipse fill="none" stroke="#000000" cx="201.234" cy="-26.8701" rx="33.4697" ry="26.7407"/>
<text text-anchor="middle" x="201.234" y="-30.6701" font-family="Times,serif" font-size="14.00" fill="#000000">x2</text>
<text text-anchor="middle" x="201.234" y="-15.6701" font-family="Times,serif" font-size="14.00" fill="#000000">coord</text>
</a>
</g>
</g>
<!-- /lht_tree_doc/comm/line.ID&#45;&gt;/lht_tree_doc/comm/line.ID/children/x2 -->
<g id="edge3" class="edge">
<title>/lht_tree_doc/comm/line.ID&#45;&gt;/lht_tree_doc/comm/line.ID/children/x2</title>
<path fill="none" stroke="#000000" d="M262.2806,-92.6022C251.7609,-81.275 239.2187,-67.7702 228.2469,-55.9563"/>
<polygon fill="#000000" stroke="#000000" points="230.6704,-53.4226 221.3007,-48.4769 225.5413,-58.1862 230.6704,-53.4226"/>
</g>
<!-- /lht_tree_doc/comm/line.ID/children/y2 -->
<g id="node5" class="node">
<title>/lht_tree_doc/comm/line.ID/children/y2</title>
<g id="a_node5"><a xlink:href="tree.html#/lht_tree_doc/comm/line.ID/children/y2" xlink:title="end point, y coord ">
<ellipse fill="none" stroke="#000000" cx="285.234" cy="-26.8701" rx="33.4697" ry="26.7407"/>
<text text-anchor="middle" x="285.234" y="-30.6701" font-family="Times,serif" font-size="14.00" fill="#000000">y2</text>
<text text-anchor="middle" x="285.234" y="-15.6701" font-family="Times,serif" font-size="14.00" fill="#000000">coord</text>
</a>
</g>
</g>
<!-- /lht_tree_doc/comm/line.ID&#45;&gt;/lht_tree_doc/comm/line.ID/children/y2 -->
<g id="edge4" class="edge">
<title>/lht_tree_doc/comm/line.ID&#45;&gt;/lht_tree_doc/comm/line.ID/children/y2</title>
<path fill="none" stroke="#000000" d="M285.234,-89.6887C285.234,-81.6371 285.234,-72.704 285.234,-64.1607"/>
<polygon fill="#000000" stroke="#000000" points="288.7341,-64.0187 285.234,-54.0187 281.7341,-64.0187 288.7341,-64.0187"/>
</g>
<!-- /lht_tree_doc/comm/line.ID/children/stroke -->
<g id="node6" class="node">
<title>/lht_tree_doc/comm/line.ID/children/stroke</title>
<g id="a_node6"><a xlink:href="tree.html#/lht_tree_doc/comm/line.ID/children/stroke" xlink:title="pen to use ">
<ellipse fill="none" stroke="#000000" cx="372.234" cy="-26.8701" rx="35.2113" ry="26.7407"/>
<text text-anchor="middle" x="372.234" y="-30.6701" font-family="Times,serif" font-size="14.00" fill="#000000">stroke</text>
<text text-anchor="middle" x="372.234" y="-15.6701" font-family="Times,serif" font-size="14.00" fill="#000000">pen</text>
</a>
</g>
</g>
<!-- /lht_tree_doc/comm/line.ID&#45;&gt;/lht_tree_doc/comm/line.ID/children/stroke -->
<g id="edge5" class="edge">
<title>/lht_tree_doc/comm/line.ID&#45;&gt;/lht_tree_doc/comm/line.ID/children/stroke</title>
<path fill="none" stroke="#000000" d="M309.0072,-92.6022C319.82,-81.3609 332.696,-67.9747 343.9978,-56.2251"/>
<polygon fill="#000000" stroke="#000000" points="346.7499,-58.4127 351.1599,-48.7792 341.705,-53.56 346.7499,-58.4127"/>
</g>
<!-- /lht_tree_doc/comm/line.ID/children/lock -->
<g id="node7" class="node">
<title>/lht_tree_doc/comm/line.ID/children/lock</title>
<g id="a_node7"><a xlink:href="tree.html#/lht_tree_doc/comm/line.ID/children/lock" xlink:title="object is locked ">
<ellipse fill="none" stroke="#000000" cx="454.234" cy="-26.8701" rx="28.9828" ry="26.7407"/>
<text text-anchor="middle" x="454.234" y="-30.6701" font-family="Times,serif" font-size="14.00" fill="#000000">lock</text>
<text text-anchor="middle" x="454.234" y="-15.6701" font-family="Times,serif" font-size="14.00" fill="#000000">bool</text>
</a>
</g>
</g>
<!-- /lht_tree_doc/comm/line.ID&#45;&gt;/lht_tree_doc/comm/line.ID/children/lock -->
<g id="edge6" class="edge">
<title>/lht_tree_doc/comm/line.ID&#45;&gt;/lht_tree_doc/comm/line.ID/children/lock</title>
<path fill="none" stroke="#000000" d="M324.7985,-100.1651C351.2538,-88.2031 386.525,-71.2934 416.234,-53.7401 418.4253,-52.4454 420.6526,-51.0625 422.874,-49.6327"/>
<polygon fill="#000000" stroke="#000000" points="424.9628,-52.4462 431.3232,-43.973 421.067,-46.6305 424.9628,-52.4462"/>
</g>
<!-- /lht_tree_doc/comm/line.ID/children/floater -->
<g id="node8" class="node">
<title>/lht_tree_doc/comm/line.ID/children/floater</title>
<g id="a_node8"><a xlink:href="tree.html#/lht_tree_doc/comm/line.ID/children/floater" xlink:title="&quot;group lock&quot; doesn&#39;t apply ">
<ellipse fill="none" stroke="#000000" cx="538.234" cy="-26.8701" rx="36.5405" ry="26.7407"/>
<text text-anchor="middle" x="538.234" y="-30.6701" font-family="Times,serif" font-size="14.00" fill="#000000">floater</text>
<text text-anchor="middle" x="538.234" y="-15.6701" font-family="Times,serif" font-size="14.00" fill="#000000">bool</text>
</a>
</g>
</g>
<!-- /lht_tree_doc/comm/line.ID&#45;&gt;/lht_tree_doc/comm/line.ID/children/floater -->
<g id="edge7" class="edge">
<title>/lht_tree_doc/comm/line.ID&#45;&gt;/lht_tree_doc/comm/line.ID/children/floater</title>
<path fill="none" stroke="#000000" d="M331.5525,-106.3671C374.2418,-95.5153 438.8699,-77.1454 492.234,-53.7401 495.1985,-52.4399 498.2122,-50.993 501.2063,-49.4637"/>
<polygon fill="#000000" stroke="#000000" points="502.917,-52.5178 510.0607,-44.6935 499.5969,-46.3552 502.917,-52.5178"/>
</g>
</g>
</svg>
