{
  "id": "merriweather",
  "family": "Merriweather",
  "subsets": ["cyrillic", "cyrillic-ext", "latin", "latin-ext", "vietnamese"],
  "weights": [300, 400, 700, 900],
  "styles": ["italic", "normal"],
  "defSubset": "latin",
  "variable": false,
  "lastModified": "2024-09-04",
  "version": "v30",
  "category": "serif",
  "license": {
    "type": "OFL-1.1",
    "url": "https://openfontlicense.org",
    "attribution": "Copyright 2016 The Merriweather Project Authors (https://github.com/EbenSorkin/Merriweather), with Reserved Font Name \"Merriweather\"."
  },
  "source": "https://github.com/google/fonts",
  "type": "google"
}