
Cyrus IMAP 3.0 Releases
***********************

* Cyrus IMAP 3.0.0 Release Notes

* Cyrus IMAP 3.0.0 beta1 Release Notes

* Cyrus IMAP 3.0.0 beta2 Release Notes

* Cyrus IMAP 3.0.0 beta3 Release Notes

* Cyrus IMAP 3.0.0 beta4 Release Notes

* Cyrus IMAP 3.0.0 beta5 Release Notes

* Cyrus IMAP 3.0.0 beta6 Release Notes

* Cyrus IMAP 3.0.0 rc1 Release Notes

* Cyrus IMAP 3.0.0 rc2 Release Notes

* Cyrus IMAP 3.0.0 rc3 Release Notes

* Cyrus IMAP 3.0.0 rc4 Release Notes

* Cyrus IMAP 3.0.1 Release Notes

* Cyrus IMAP 3.0.2 Release Notes

* Cyrus IMAP 3.0.3 Release Notes

* Cyrus IMAP 3.0.4 Release Notes

* Cyrus IMAP 3.0.5 Release Notes

* Cyrus IMAP 3.0.6 Release Notes

* Cyrus IMAP 3.0.7 Release Notes

* Cyrus IMAP 3.0.8 Release Notes
