
Man pages
*********


(5) Configuration Files
=======================

* **cyrus.conf**

* imapd.conf

* **krb.equiv**


(8) System Commands
===================

* **arbitron**

* **backupd**

* **chk_cyrus**

* **ctl_backups**

* **ctl_conversationsdb**

* **ctl_cyrusdb**

* **ctl_deliver**

* **ctl_mboxlist**

* **ctl_zoneinfo**

* **cvt_cyrusdb**

* **cvt_xlist_specialuse**

* **cyr_backup**

* **cyr_buildinfo**

* **cyr_dbtool**

* **cyr_deny**

* **cyr_df**

* **cyr_expire**

* **cyr_info**

* **cyr_sequence**

* **cyr_synclog**

* **cyr_userseen**

* **cyr_virusscan**

* **cyradm**

* **cyrdump**

* **deliver**

* **fetchnews**

* **fud**

* **httpd**

* **idled**

* **imapd**

* **ipurge**

* **lmtpd**

* **lmtpproxyd**

* **masssievec**

* **master**

* **mbexamine**

* **mbpath**

* **mbtool**

* **mkimap**

* **mknewsgroups**

* **mupdate**

* **nntpd**

* **notifyd**

* **pop3d**

* **pop3proxyd**

* **proxyd**

* **ptdump**

* **ptexpire**

* **ptloader**

* **quota**

* **reconstruct**

* **rehash**

* **restore**

* **rmnews**

* **sievec**

* **sieved**

* **smmapd**

* **squatter**

* **sync_client**

* **sync_reset**

* **sync_server**

* **timsieved**

* **tls_prune**

* **translatesieve**

* **unexpunge**


(1) User Commands
=================

* **arbitronsort.pl**

* **dav_reconstruct**

* **httptest**

* **imtest**

* **installsieve**

* **lmtptest**

* **mupdatetest**

* **nntptest**

* **pop3test**

* **sieveshell**

* **sivtest**

* **smtptest**

* **synctest**
