/*
  Copyright (C) 2003 Rene Jager <renej_frog@users.sourceforge.net>

  This library is free software; you can redistribute it and/or
  modify it under the terms of the GNU Library General Public
  License as published by the Free Software Foundation; either
  version 2 of the License, or (at your option) any later version.

  This library is distributed in the hope that it will be useful,
  but WITHOUT ANY WARRANTY; without even the implied warranty of
  MERCHANTABILITY or FITNESS FOR A PARTICULAR PURPOSE.  See the GNU
  Library General Public License for more details.

  You should have received a copy of the GNU Library General Public
  License along with this library; if not, write to the Free
  Software Foundation, Inc., 675 Mass Ave, Cambridge, MA 02139, USA.
*/

#ifdef SWIGPYTHON

#ifndef CS_MICRO_SWIG

#ifndef SWIGIMPORTED

%template (csPyEventPlugParent) scfImplementation1<csPyEventPlug, iEventPlug>;

%inline %{
  struct csPyEventPlug : public scfImplementation1<csPyEventPlug,iEventPlug>
  {
    csPyEventPlug () : scfImplementationType(this) { }
    virtual ~csPyEventPlug () { }
    virtual unsigned GetPotentiallyConflictingEvents () { return CSEVTYPE_Joystick|CSEVTYPE_Mouse|CSEVTYPE_Keyboard; }
    virtual unsigned QueryEventPriority (unsigned) { return 110; }
  };
%}


%template (csPyEventHandlerParent) scfImplementation1<_csPyEventHandler, iEventHandler>;
%inline %{


  struct _csPyEventHandler : public scfImplementation1<_csPyEventHandler, iEventHandler>
  {
    _csPyEventHandler (PyObject * obj) : scfImplementationType(this), _pySelf(obj)
    { }
    virtual ~_csPyEventHandler ()
    { }
    virtual bool HandleEvent (iEvent & event)
    {
      PyObject * event_obj = SWIG_NewPointerObj(
        (void *) &event, SWIG_TypeQuery("iEvent *"), 0
      );
      PyObject * result = PyObject_CallMethod(_pySelf, "HandleEvent", "(O)",
        event_obj
      );
      Py_DECREF(event_obj);
      if (!result)
      {
        if (PyErr_Occurred ())
                PyErr_Print ();
        return false;
      }
      bool res = PyInt_AsLong(result);
      Py_DECREF(result);
      return res;
    }

  static const char * StaticHandlerName() {return "crystalspace.cspython";};
  static const csHandlerID StaticID(csRef<iEventHandlerRegistry> &reg) 
  { return reg->GetGenericID(StaticHandlerName()); }			;
  virtual const char * GenericName() const		
  { return StaticHandlerName(); }					;
  virtual csHandlerID GenericID(csRef<iEventHandlerRegistry> &reg) const 
  { return StaticID(reg); };


  virtual const csHandlerID * GenericPrec (		
    csRef<iEventHandlerRegistry> &, csRef<iEventNameRegistry> &, 	
    csEventID) const { return 0; }	
  virtual const csHandlerID * GenericSucc (		
    csRef<iEventHandlerRegistry> &, csRef<iEventNameRegistry> &, 	
    csEventID) const { return 0; }

  virtual const csHandlerID * InstancePrec (		
      csRef<iEventHandlerRegistry> &r1, csRef<iEventNameRegistry> &r2, 	
    csEventID e) const { return GenericPrec(r1, r2, e); } 
  virtual const csHandlerID * InstanceSucc (		
    csRef<iEventHandlerRegistry> &r1, csRef<iEventNameRegistry> &r2, 	
    csEventID e) const { return GenericSucc(r1, r2, e); }

  private:
    PyObject * _pySelf;
  };

%}

%pythoncode %{

  class csPyEventHandler (_csPyEventHandler):
    """Python version of iEventHandler implementation.
       This class can be used as base class for event handlers in Python.
       Call csPyEventHandler.__init__(self) in __init__ of derived class.
    """
    def __init__ (self):
      _csPyEventHandler.__init__(self, self)

  class _EventHandlerFuncWrapper (csPyEventHandler):
    def __init__ (self, func):
      csPyEventHandler.__init__(self)
      self._func = func
      # Make sure a reference keeps to this wrapper instance.
      self._func._cs_event_handler_wrapper = self
    def HandleEvent (self, event):
      return self._func(event)
  def _csInitializer_SetupEventHandler (reg, obj,
      eventids=None):
    """Replacement of C++ versions."""
    if callable(obj):
      # obj is a function
      hdlr = _EventHandlerFuncWrapper(obj)
      hdlr.thisown = 1
    else:
      # assume it is a iEventHandler
      hdlr = obj
    if eventids==None:
      eventids=[csevFrame(reg), csevInput(reg), csevKeyboardEvent(reg), \
                csevMouseEvent(reg), csevQuit(reg), CS_EVENTLIST_END]
    return csInitializer._SetupEventHandler(reg, hdlr, eventids)
  
  csInitializer.SetupEventHandler = \
    staticmethod(_csInitializer_SetupEventHandler)
%}

#endif // SWIGIMPORTED

%pythoncode %{

  def csevCommandLineHelp(reg):
    csEventNameRegistry.GetID(reg, "crystalspace.application.commandlinehelp")
    
  CS_EVENTLIST_END = csInvalidStringID
%}

#ifdef USE_DIRECTORS

%feature("director") iEventHandler;

#endif // USE_DIRECTORS

#endif // CS_MICRO_SWIG

#endif // SWIGPYTHON
