/* XPM */
static char * intro_back_2_xpm[] = {
"320 200 33 1",
" 	c None",
".	c #020204",
"+	c #09605F",
"@	c #727271",
"#	c #023234",
"$	c #47439A",
"%	c #3E664C",
"&	c #025151",
"*	c #A29A3C",
"=	c #345350",
"-	c #43724A",
";	c #236662",
">	c #D38534",
",	c #4F595A",
"'	c #656564",
")	c #025A5C",
"!	c #888F3F",
"~	c #2B436F",
"{	c #C6AA34",
"]	c #693D99",
"^	c #6E7274",
"/	c #9D783C",
"(	c #021A1C",
"_	c #024140",
":	c #5E4ACC",
"<	c #026E6C",
"[	c #50655F",
"}	c #264E8C",
"|	c #DAB234",
"1	c #5E7E44",
"2	c #326E54",
"3	c #1A4F51",
"4	c #8A7644",
"))++++)))))))++<<++)))))))++++))))++++)))))))++<<++)))))))++++))))++++)))))))++<<++)))))))++++))))++++)))))))++<<++)))))))++++))))++++)))))))++++)&&_######################_&&&&)++++++))+++))))))))+++))++++++))++++++))+++))))))))+++))++++++))++++++))+++))))))))+++))++++++))&&&_######################_&&&_(...............",
")))++++))))))+<<<<+))))))++++))))))++++))))))+<<<<+))))))++++))))))++++))))))+<<<<+))))))++++))))))++++))))))+<<<<+))))))++++))))))++++))))))+<++)&&_######################_&&&&)+;++;+))+;+))))))))+;+))+;++;+))+;++;+))+;+))))))))+;+))+;++;+))+;++;+))+;+))))))))+;+))+;++;+))&&&_######################_&&&_(...............",
"))))++++++++++<<<<++++++++++))))))))++++++++++<<<<++++++++++))))))))++++++++++<<<<++++++++++))))))))++++++++++<<<<++++++++++))))))))++++++++++<++)&&_######################_&&&&)++++++))+++))))))))+++))++++++))++++++))+++))))))))+++))++++++))++++++))+++))))))))+++))++++++))&&&_######################_&&&_(...............",
"))))++++++++<<<<<<<<++++++++))))))))++++++++<<<<<<<<++++++++))))))))++++++++<<<<<<<<++++++++))))))))++++++++<<<<<<<<++++++++))))))))++++++++<<<++)&&_######################_&&&&)))))))))))))))))))))))))))))))))))))))))))))))))))))))))))))))))))))))))))))))))))))))))))))))))&&&_######################_&&&_(...............",
"))))++<+++++<<<<<<<<+++++<++))))))))++<+++++<<<<<<<<+++++<++))))))))++<+++++<<<<<<<<+++++<++))))))))++<+++++<<<<<<<<+++++<++))))))))++<+++++<<<++)&&_######################_&&&&)))))))))))))))))))))))))))))))))))))))))))))))))))))))))))))))))))))))))))))))))))))))))))))))))&&&_######################_&&&_(...............",
"))))++++++++++<<<<++++++++++))))))))++++++++++<<<<++++++++++))))))))++++++++++<<<<++++++++++))))))))++++++++++<<<<++++++++++))))))))++++++++++<++)&&_######################_&&&&)++++++))+++))))))))+++))++++++))++++++))+++))))))))+++))++++++))++++++))+++))))))))+++))++++++))&&&_######################_&&&_(...............",
")))++++))))))+<<<<+))))))++++))))))++++))))))+<<<<+))))))++++))))))++++))))))+<<<<+))))))++++))))))++++))))))+<<<<+))))))++++))))))++++))))))+<++)&&_######################_&&&&)+;++;+))+;+))))))))+;+))+;++;+))+;++;+))+;+))))))))+;+))+;++;+))+;++;+))+;+))))))))+;+))+;++;+))&&&_######################_&&&_(...............",
"))++++)))))))++<<++)))))))++++))))++++)))))))++<<++)))))))++++))))++++)))))))++<<++)))))))++++))))++++)))))))++<<++)))))))++++))))++++)))))))++++)&&_######################_&&&&)++++++))+++))))))))+++))++++++))++++++))+++))))))))+++))++++++))++++++))+++))))))))+++))++++++))&&&_######################_&&&_(...............",
"+++++))))))))++<<++))))))))++++++++++))))))))++<<++))))))))++++++++++))))))))++<<++))))))))++++++++++))))))))++<<++))))))))++++++++++))))))))++++)&&_######################_&&&&)++++++)))))+++))+++)))))++++++))++++++)))))+++))+++)))))++++++))++++++)))))+++))+++)))))++++++))&&&_######################_&&&_(...............",
"++++)))))))))++<<++)))))))))++++++++)))))))))++<<++)))))))))++++++++)))))))))++<<++)))))))))++++++++)))))))))++<<++)))))))))++++++++)))))))))++++)&&_######################_&&&&)+;++;+)))))+;+))+;+)))))+;++;+))+;++;+)))))+;+))+;+)))))+;++;+))+;++;+)))))+;+))+;+)))))+;++;+))&&&_######################_&&&_(...............",
"<++))))))))))++<<++))))))))))+++<++))))))))))++<<++))))))))))+++<++))))))))))++<<++))))))))))+++<++))))))))))++<<++))))))))))+++<++))))))))))++++)&&_######################_&&&&)++++++)))))+++))+++)))))++++++))++++++)))))+++))+++)))))++++++))++++++)))))+++))+++)))))++++++))&&&_######################_&&&_(...............",
"++)))))))))))++<<++)))))))))))++++)))))))))))++<<++)))))))))))++++)))))))))))++<<++)))))))))))++++)))))))))))++<<++)))))))))))++++)))))))))))++++)&&_######################_&&&&)))))))))))))))))))))))))))))))))))))))))))))))))))))))))))))))))))))))))))))))))))))))))))))))))&&&_######################_&&&_(...............",
"++)))))))))))++<<++)))))))))))++++)))))))))))++<<++)))))))))))++++)))))))))))++<<++)))))))))))++++)))))))))))++<<++)))))))))))++++)))))))))))++++)&&_######################_&&&&)))))))))))))))))))))))))))))))))))))))))))))))))))))))))))))))))))))))))))))))))))))))))))))))))&&&_######################_&&&_(...............",
"++)))))))))))++<<++)))))))))))++++)))))))))))++<<++)))))))))))++++)))))))))))++<<++)))))))))))++++)))))))))))++<<++)))))))))))++++)))))))))))++++)&&_######################_&&&&)))))))))++++++))++++++))))))))))))))))))++++++))++++++))))))))))))))))))++++++))++++++))))))))))&&&_######################_&&&_(...............",
"++)))))))))))++<<++)))))))))))++++)))))))))))++<<++)))))))))))++++)))))))))))++<<++)))))))))))++++)))))))))))++<<++)))))))))))++++)))))))))))++++)&&_######################_&&&&)))))))))+;++;+))+;++;+))))))))))))))))))+;++;+))+;++;+))))))))))))))))))+;++;+))+;++;+))))))))))&&&_######################_&&&_(...............",
"++)))))))))))++<<++)))))))))))++++)))))))))))++<<++)))))))))))++++)))))))))))++<<++)))))))))))++++)))))))))))++<<++)))))))))))++++)))))))))))++++)&&_######################_&&&&)))))))))++++++))++++++))))))))))))))))))++++++))++++++))))))))))))))))))++++++))++++++))))))))))&&&_######################_&&&_(...............",
"<+)))))))))))++<<++)))))))))))+<<+)))))))))))++<<++)))))))))))+<<+)))))))))))++<<++)))))))))))+<<+)))))))))))++<<++)))))))))))+<<+)))))))))))++++)&&_######################_&&&&)))))))))++++++))++++++))))))))))))))))))++++++))++++++))))))))))))))))))++++++))++++++))))))))))&&&_######################_&&&_(...............",
"<+++++++++++++<<<<+++++++++++++<<+++++++++++++<<<<+++++++++++++<<+++++++++++++<<<<+++++++++++++<<+++++++++++++<<<<+++++++++++++<<+++++++++++++<++)&&_######################_&&&&)))))))))+;++;+))+;++;+))))))))))))))))))+;++;+))+;++;+))))))))))))))))))+;++;+))+;++;+))))))))))&&&_######################_&&&_(...............",
"<<<++++++++++<<<<<<++++++++++<<<<<<++++++++++<<<<<<++++++++++<<<<<<++++++++++<<<<<<++++++++++<<<<<<++++++++++<<<<<<++++++++++<<<<<<++++++++++<<++)&&_######################_&&&&)))))))))++++++))++++++))))))))))))))))))++++++))++++++))))))))))))))))))++++++))++++++))))))))))&&&_######################_&&&_(...............",
"<<<<<<<<<<<<<<<<<<<<<<<<<<<<<<<<<<<<<<<<<<<<<<<<<<<<<<<<<<<<<<<<<<<<<<<<<<<<<<<<<<<<<<<<<<<<<<<<<<<<<<<<<<<<<<<<<<<<<<<<<<<<<<<<<<<<<<<<<<<<<<<++)&&_######################_&&&&)))))))))))))))))))))))))))))))))))))))))))))))))))))))))))))))))))))))))))))))))))))))))))))))))&&&_######################_&&&_(...............",
"<<<<<<<<<<<<<<<<<<<<<<<<<<<<<<<<<<<<<<<<<<<<<<<<<<<<<<<<<<<<<<<<<<<<<<<<<<<<<<<<<<<<<<<<<<<<<<<<<<<<<<<<<<<<<<<<<<<<<<<<<<<<<<<<<<<<<<<<<<<<<<<++)&&_######################_&&&&)))))))))))))))))))))))))))))))))))))))))))))))))))))))))))))))))))))))))))))))))))))))))))))))))&&&_######################_&&&_(...............",
"<<<++++++++++<<<<<<++++++++++<<<<<<++++++++++<<<<<<++++++++++<<<<<<++++++++++<<<<<<++++++++++<<<<<<++++++++++<<<<<<++++++++++<<<<<<++++++++++<<++)&&__####################__&&&&)))))))))++++++))++++++))))))))))))))))))++++++))++++++))))))))))))))))))++++++))++++++))))))))))&&&_######################_&&&_(...............",
"<+++++++++++++<<<<+++++++++++++<<+++++++++++++<<<<+++++++++++++<<+++++++++++++<<<<+++++++++++++<<+++++++++++++<<<<+++++++++++++<<+++++++++++++<++)&&________________________&&&&)))))))))+;++;+))+;++;+))))))))))))))))))+;++;+))+;++;+))))))))))))))))))+;++;+))+;++;+))))))))))&&&_######################_&&&_(...............",
"<+)))))))))))++<<++)))))))))))+<<+)))))))))))++<<++)))))))))))+<<+)))))))))))++<<++)))))))))))+<<+)))))))))))++<<++)))))))))))+<<+)))))))))))++++)&&________________________&&&&)))))))))++++++))++++++))))))))))))))))))++++++))++++++))))))))))))))))))++++++))++++++))))))))))&&&_######################_&&&_(...............",
"++)))))))))))++<<++)))))))))))++++)))))))))))++<<++)))))))))))++++)))))))))))++<<++)))))))))))++++)))))))))))++<<++)))))))))))++++)))))))))))++++)&&&&&&3333333333333333&&&&&&&&)))))))))++++++))++++++))))))))))))))))))++++++))++++++))))))))))))))))))++++++))++++++))))))))))&&&_######################_&&&_(...............",
"++)))))))))))++<<++)))))))))))++++)))))))))))++<<++)))))))))))++++)))))))))))++<<++)))))))))))++++)))))))))))++<<++)))))))))))++++)))))))))))++++)&&&&&3===[[[[[[[[[[===3&&&&&&&)))))))))+;++;+))+;++;+))))))))))))))))))+;++;+))+;++;+))))))))))))))))))+;++;+))+;++;+))))))))))&&&_######################_&&&_(...............",
"++)))))))))))++<<++)))))))))))++++)))))))))))++<<++)))))))))))++++)))))))))))++<<++)))))))))))++++)))))))))))++<<++)))))))))))++++)))))))))))++++)&&&&&3=,,'''^^^^^'',,=3&&&&&&&)))))))))++++++))++++++))))))))))))))))))++++++))++++++))))))))))))))))))++++++))++++++))))))))))&&&_######################_&&&_(...............",
"++)))))))))))++<<++)))))))))))++++)))))))))))++<<++)))))))))))++++)))))))))))++<<++)))))))))))++++)))))))))))++<<++)))))))))))++++)))))))))))++++))&&&&3=,,''@@@@@@'',,=3&&&&&&))))))))))))))))))))))))))))))))))))))))))))))))))))))))))))))))))))))))))))))))))))))))))))))))))&&&_######################_&&&_(...............",
"++)))))))))))++<<++)))))))))))++++)))))))))))++<<++)))))))))))++++)))))))))))++<<++)))))))))))++++)))))))))))++<<++)))))))))))++++)))))))))))++++)))))&3=,''@@@@@@@@'',=3&&))))))))))))))))))))))))))))))))))))))))))))))))))))))))))))))))))))))))))))))))))))))))))))))))))))))&&&_######################_&&&_(...............",
"<++))))))))))++<<++))))))))))+++<++))))))))))++<<++))))))))))+++<++))))))))))++<<++))))))))))+++<++))))))))))++<<++))))))))))+++<++))))))))))++++)))))&3=,''@@@@@@@@'',=3&&))))))++++++)))))+++))+++)))))++++++))++++++)))))+++))+++)))))++++++))++++++)))))+++))+++)))))++++++))&&&_######################_&&&_(...............",
"++++)))))))))++<<++)))))))))++++++++)))))))))++<<++)))))))))++++++++)))))))))++<<++)))))))))++++++++)))))))))++<<++)))))))))++++++++)))))))))++++)))))&3=,''@@@@@@@@'',=3&&))))))+;++;+)))))+;+))+;+)))))+;++;+))+;++;+)))))+;+))+;+)))))+;++;+))+;++;+)))))+;+))+;+)))))+;++;+))&&&_######################_&&&_(...............",
"+++++))))))))++<<++))))))))++++++++++))))))))++<<++))))))))++++++++++))))))))++<<++))))))))++++++++++))))))))++<<++))))))))++++++++++))))))))++++)))))&3=,''@@@@@@@@'',=3&&))))))++++++)))))+++))+++)))))++++++))++++++)))))+++))+++)))))++++++))++++++)))))+++))+++)))))++++++))&&&_######################_&&&_(...............",
"))++++)))))))++<<++)))))))++++))))++++)))))))++<<++)))))))++++))))++++)))))))++<<++)))))))++++))))++++)))))))++<<++)))))))++++))))++++)))))))++++)))))&3=,,'''@@@@@'',,=3&&))))))++++++))+++))))))))+++))++++++))++++++))+++))))))))+++))++++++))++++++))+++))))))))+++))++++++))&&&_######################_&&&_(...............",
")))++++))))))+<<<<+))))))++++))))))++++))))))+<<<<+))))))++++))))))++++))))))+<<<<+))))))++++))))))++++))))))+<<<<+))))))++++))))))++++))))))+<++)))))&3=,,'''''''''',,=3&&))))))+;++;+))+;+))))))))+;+))+;++;+))+;++;+))+;+))))))))+;+))+;++;+))+;++;+))+;+))))))))+;+))+;++;+))&&&_######################_&&&_(...............",
"))))++++++++++<<<<++++++++++))))))))++++++++++<<<<++++++++++))))))))++++++++++<<<<++++++++++))))))))++++++++++<<<<++++++++++))))))))++++++++++<++))))))3=,,'''''''''',,=3&&))))))++++++))+++))))))))+++))++++++))++++++))+++))))))))+++))++++++))++++++))+++))))))))+++))++++++))&&&_######################_&&&_(...............",
"))))++++++++<<<<<<<<++++++++))))))))++++++++<<<<<<<<++++++++))))))))++++++++<<<<<<<<++++++++))))))))++++++++<<<<<<<<++++++++))))))))++++++++<<<++))))))3=,,,,,,,,,,,,,,=3&&))))))))))))))))))))))))))))))))))))))))))))))))))))))))))))))))))))))))))))))))))))))))))))))))))))))&&&_######################_&&&_(...............",
"))))++<+++++<<<<<<<<+++++<++))))))))++<+++++<<<<<<<<+++++<++))))))))++<+++++<<<<<<<<+++++<++))))))))++<+++++<<<<<<<<+++++<++))))))))++<+++++<<<++)))))&3=,,,,,,,,,,,,,,=3))))))))))))))))))))))))))))))))))))))))))))))))))))))))))))))))))))))))))))))))))))))))))))))))))))))))&&&_######################_&&&_(...............",
"))))++++++++++<<<<++++++++++))))))))++++++++++<<<<++++++++++))))))))++++++++++<<<<++++++++++))))))))++++++++++<<<<++++++++++))))))))++++++++++<++)))))&3=,,''''''''',,,=3))))))))++++++))+++))))))))+++))++++++))++++++))+++))))))))+++))++++++))++++++))+++))))))))+++))++++++))&&&_######################_&&&_(...............",
")))++++))))))+<<<<+))))))++++))))))++++))))))+<<<<+))))))++++))))))++++))))))+<<<<+))))))++++))))))++++))))))+<<<<+))))))++++))))))++++))))))+<++)))))&3=,,'''''''''',,=3&&))))))+;++;+))+;+))))))))+;+))+;++;+))+;++;+))+;+))))))))+;+))+;++;+))+;++;+))+;+))))))))+;+))+;++;+))&&&_######################_&&&_(...............",
"))++++)))))))++<<++)))))))++++))))++++)))))))++<<++)))))))++++))))++++)))))))++<<++)))))))++++))))++++)))))))++<<++)))))))++++))))++++)))))))++++)))))&3=,,'''@@@@@'',,=3&&))))))++++++))+++))))))))+++))++++++))++++++))+++))))))))+++))++++++))++++++))+++))))))))+++))++++++))&&&_######################_&&&_(...............",
"+++++))))))))++<<++))))))))++++++++++))))))))++<<++))))))))++++++++++))))))))++<<++))))))))++++++++++))))))))++<<++))))))))++++++++++))))))))++++)))))&3=,'''@@@@@@''',=3&&))))))++++++)))))+++))+++)))))++++++))++++++)))))+++))+++)))))++++++))++++++)))))+++))+++)))))++++++))&&&_######################_&&&_(...............",
"++++)))))))))++<<++)))))))))++++++++)))))))))++<<++)))))))))++++++++)))))))))++<<++)))))))))++++++++)))))))))++<<++)))))))))++++++++)))))))))++++)))))&3=,''@@@@@@@@'',=3&&))))))+;++;+)))))+;+))+;+)))))+;++;+))+;++;+)))))+;+))+;+)))))+;++;+))+;++;+)))))+;+))+;+)))))+;++;+))&&&_######################_&&&_(...............",
"<++))))))))))++<<++))))))))))+++<++))))))))))++<<++))))))))))+++<++))))))))))++<<++))))))))))+++<++))))))))))++<<++))))))))))+++<++))))))))))++++)))))&3=,''@@@@@@@@'',=3&&))))))++++++)))))+++))+++)))))++++++))++++++)))))+++))+++)))))++++++))++++++)))))+++))+++)))))++++++))&&&_######################_&&&_(...............",
"++)))))))))))++<<++)))))))))))++++)))))))))))++<<++)))))))))))++++)))))))))))++<<++)))))))))))++++)))))))))))++<<++)))))))))))++++)))))))))))++++)))))&3=,''@@@@@@@@'',=3&&))))))))))))))))))))))))))))))))))))))))))))))))))))))))))))))))))))))))))))))))))))))))))))))))))))))&&&_######################_&&&_(...............",
"++)))))))))))++<<++)))))))))))++++)))))))))))++<<++)))))))))))++++)))))))))))++<<++)))))))))))++++)))))))))))++<<++)))))))))))++++)))))))))))++++)))))&3=,''@@@@@@@@'',=3&&))))))))))))))))))))))))))))))))))))))))))))))))))))))))))))))))))))))))))))))))))))))))))))))))))))))&&&_######################_&&&_(...............",
"++)))))))))))++<<++)))))))))))++++)))))))))))++<<++)))))))))))++++)))))))))))++<<++)))))))))))++++)))))))))))++<<++)))))))))))++++)))))))))))++++))&&&&3=,,'''^^^^^'',,=3&&&&&&))))))))))++++++))++++++))))))))))))))))))++++++))++++++))))))))))))))))))++++++))++++++))))))))))&&&_######################_&&&_(...............",
"++)))))))))))++<<++)))))))))))++++)))))))))))++<<++)))))))))))++++)))))))))))++<<++)))))))))))++++)))))))))))++<<++)))))))))))++++)))))))))))++++)&&&&&3===[[[[[[[[[[===3&&&&&&&)))))))))+;++;+))+;++;+))))))))))))))))))+;++;+))+;++;+))))))))))))))))))+;++;+))+;++;+))))))))))&&&_######################_&&&_(...............",
"++)))))))))))++<<++)))))))))))++++)))))))))))++<<++)))))))))))++++)))))))))))++<<++)))))))))))++++)))))))))))++<<++)))))))))))++++)))))))))))++++)&&&&&&3333333333333333&&&&&&&&)))))))))++++++))++++++))))))))))))))))))++++++))++++++))))))))))))))))))++++++))++++++))))))))))&&&_######################_&&&_(...............",
"<+)))))))))))++<<++)))))))))))+<<+)))))))))))++<<++)))))))))))+<<+)))))))))))++<<++)))))))))))+<<+)))))))))))++<<++)))))))))))+<<+)))))))))))++++)&&________________________&&&&)))))))))++++++))++++++))))))))))))))))))++++++))++++++))))))))))))))))))++++++))++++++))))))))))&&&_######################_&&&_(...............",
"<+++++++++++++<<<<+++++++++++++<<+++++++++++++<<<<+++++++++++++<<+++++++++++++<<<<+++++++++++++<<+++++++++++++<<<<+++++++++++++<<+++++++++++++<++)&&________________________&&&&)))))))))+;++;+))+;++;+))))))))))))))))))+;++;+))+;++;+))))))))))))))))))+;++;+))+;++;+))))))))))&&&_######################_&&&_(...............",
"<<<++++++++++<<<<<<++++++++++<<<<<<++++++++++<<<<<<++++++++++<<<<<<++++++++++<<<<<<++++++++++<<<<<<++++++++++<<<<<<++++++++++<<<<<<++++++++++<<++)&&__####################__&&&&)))))))))++++++))++++++))))))))))))))))))++++++))++++++))))))))))))))))))++++++))++++++))))))))))&&&_######################_&&&_(...............",
"+++++++++++++++++++++++++++++++++++++++++++++++++++++++++++++++++++++++++++++++++++++++++++++++++++++++++++++++++++++++++++++++++++++++++++++++++&&&_######################_&&&&)))))))))))))))))))))))))))))))))))))))))))))))))))))))))))))))))))))))))))))))))))))))))))))))))&&&_######################_&&&_(...............",
"++++++++++++++++++++++++++++++++++++++++++++++++++++++++++++++++++++++++++++++++++++++++++++++++++++++++++++++++++++++++++++++++++++++++++++++++)&&&_######################_&&&&)))))))))))))))))))))))))))))))))))))))))))))))))))))))))))))))))))))))))))))))))))))))))))))))))&&&_######################_&&&_(...............",
"))))))))))))))))))))))))))))))))))))))))))))))))))))))))))))))))))))))))))))))))))))))))))))))))))))))))))))))))))))))))))))))))))))))))))))))&&&&&&_######################_&&&&&&&&&&&&&&&&&&&&&&&&&&&&&&&&&&&&&&&&&&&&&&&&&&&&&&&&&&&&&&&&&&&&&&&&&&&&&&&&&&&&&&&&&&&&&&&&&&&&&&&&_######################_&&&_(...............",
"&&&&&&&&&&&&&&&&&&&&&&&&&&&&&&&&&&&&&&&&&&&&&&&&&&&&&&&&&&&&&&&&&&&&&&&&&&&&&&&&&&&&&&&&&&&&&&&&&&&&&&&&&&&&&&&&&&&&&&&&)))))))))))))))))&&&&&&&&&&__######################__&&&&&&&&&&&&&&&&&&&&&&&&&&&&&&&&&&&&&&&&&&&&&&&&&&&&&&&&&&&&&&&&&&&&&&&&&&&&&&&&&&&&&&&&&&&&&&&&&&&&&&__######################_&&&_(...............",
"&&&&&&&&&&&&&&&&&&&&&&&&&&&&&&&&&&&&&&&&&&&&&&&&&&&&&&&&&&&&&&&&&&&&&&&&&&&&&&&&&&&&&&&&&&&&&&&&&&&&&&&&&&&&&&&&&&&&&&&&)))))))))))))))))&&&&&&&&&___######################___&&&&&&&&&&&&&&&&&&&&&&&&&&&&&&&&&&&&&&&&&&&&&&&&&&&&&&&&&&&&&&&&&&&&&&&&&&&&&&&&&&&&&&&&&&&&&&&&&&&&___######################_&&&_(...............",
"____________________________________________________________________________________________________________________&&&&)))))))))))))))))&&&________########################________________________________________________________________________________________________________#######################_&&&_(...............",
"#################################################################################################################___&&&&)))))))))))))))))&&&___############################################################################################################################################################_&&&_(...............",
"##################################################################################################################__&&&&&&&&&&&&&&&&&&&&&&&&__#############################################################################################################################################################_&&&_(...............",
"##################################################################################################################__&3333333333333333333333&__#############################################################################################################################################################_&&&_(...............",
"##################################################################################################################__3======================3__#############################################################################################################################################################_&&&_(...............",
"##################################################################################################################__3=,,,,,,,,,,,,,,,,,,,,=3__#############################################################################################################################################################_&&&_(...............",
"##################################################################################################################__3=,,'''',,,,,,,,,'''',=3__#############################################################################################################################################################_&&&_(...............",
"##################################################################################################################__3[''''''''',,'''''''''[3__#############################################################################################################################################################_&&&_(...............",
"##################################################################################################################__3[''@@@@''',,''''@@@@'[3__#############################################################################################################################################################_&&&_(...............",
"##################################################################################################################__3['@@@@@''',,'''@@@@@'[3__#############################################################################################################################################################_&&&_(...............",
"##################################################################################################################__3[^@@@@@@'',,''@@@@@@^[3__#############################################################################################################################################################_&&&_(...............",
"##################################################################################################################__3[^@@@@@@'',,''@@@@@@^[3__#############################################################################################################################################################_&&&_(...............",
"##################################################################################################################__3[^@@@@@@'',,''@@@@@@^[3__#############################################################################################################################################################_&&&_(...............",
"##################################################################################################################__3[^@@@@@@'',,''@@@@@@^[3__#############################################################################################################################################################_&&&_(...............",
"##################################################################################################################__3[^@@@@@@'',,''@@@@@@^[3__#############################################################################################################################################################_&&&_(...............",
"##################################################################################################################__3[''@@@@''',,''''@@@@'[3__#############################################################################################################################################################_&&&_(...............",
"##################################################################################################################__3[''''''''',,'''''''''[3__#############################################################################################################################################################_&&&_(...............",
"##################################################################################################################__3=,,'''',,,,,,,,,'''',=3__#############################################################################################################################################################_&&&_(...............",
"##################################################################################################################__3=,,,,,,,,,,,,,,,,,,,,=3__#############################################################################################################################################################_&&&_(...............",
"##################################################################################################################__3======================3__#############################################################################################################################################################_&&&_(...............",
"##################################################################################################################__&3333333333333333333333&__#############################################################################################################################################################_&&&_(...............",
"##################################################################################################################__&&&&&&&&&&&&&&&&&&&&&&&&__#############################################################################################################################################################_&&&_(...............",
"#################################################################################################################___&&&&&&&&&&&&&&&&&&&&&&&&___############################################################################################################################################################_&&&_(...............",
"____________________________________________________________________________________________________________________&&&&)))))))))))))))))&&&________________________________________########################________________________________________________________________________#######################_&&&_(...............",
"&&&&&&&&&&&&&&&&&&&&&&&&&&&&&&&&&&&&&&&&&&&&&&&&&&&&&&&&&&&&&&&&&&&&&&&&&&&&&&&&&&&&&&&&&&&&&&&&&&&&&&&&&&&&&&&&&&&&&&&&)))))))))))))))))&&&&&&&&&&&&&&&&&&&&&&&&&&&&&&&&&&&&&&&&&___######################___&&&&&&&&&&&&&&&&&&&&&&&&&&&&&&&&&&&&&&&&&&&&&&&&&&&&&&&&&&&&&&&&&&&&___######################_&&&_(...............",
"&&&&&&&&&&&&&&&&&&&&&&&&&&&&&&&&&&&&&&&&&&&&&&&&&&&&&&&&&&&&&&&&&&&&&&&&&&&&&&&&&&&&&&&&&&&&&&&&&&&&&&&&&&&&&&&&&&&&&&&&)))))))))))))))))&&&&&&&&&&&&&&&&&&&&&&&&&&&&&&&&&&&&&&&&&&__######################__&&&&&&&&&&&&&&&&&&&&&&&&&&&&&&&&&&&&&&&&&&&&&&&&&&&&&&&&&&&&&&&&&&&&&&__######################_&&&_(...............",
"&&&&&&&&&&&&&&&&&&&&&&&&&&&&&&&&&&&&&&&&&&&&&&&&&&&&&&&&&&&&&&&&&&&&&&&&&&&&&&&&&&&&&&&&&&&&&&&&&&&&&&&&&&&&&&&&&&&&&&&&)))))))))))))))))&&&&&&&&&&&&&&&&&&&&&&&&&&&&&&&&&&&&&&&&&&&_######################_&&&&&&&&&&&&&&&&&&&&&&&&&&&&&&&&&&&&&&&&&&&&&&&&&&&&&&&&&&&&&&&&&&&&&&&&_######################_&&&_(...............",
"&&&&&&&&&&&&&&&&&&&&&&&&&&&&&&&&&&&&&&&&&&&&&&&&&&&&&&&&&&&&&&&&&&&&&&&&&&&&&&&&&&&&&&&&&&&&&&&&&&&&&&&&&&&&&&&&&&&&&&&)))))))))))))))))))&&&&&&&&&&&&&&&&&&&&&&&&&&&&&&&&&&&&&&&&&&_######################_&&&&&&&&&&&&&&&&&&&&&&&&&&&&&&&&&&&&&&&&&&&&&&&&&&&&&&&&&&&&&&&&&&&&&&&&_######################_&&&_(...............",
")))))))))))))))))))))))))))))))))))))))))))))))))))))))))))))))))))))))))))))))))))))))))))))))))))))))))))))))))))))))))))))))))))))))))))))))))))))))))))))))))))))))))))))))))&&&_######################_&&&&)))))))))))))))))))))))))))))))))))))))))))))))))))))))))))))))))&&&_######################_&&&_(...............",
")))))))))))))))))))))))))))))))))))))))))))))))))))))))))))))))))))))))))))))))))))))))))))))))))))))))))))))))))))))))))))))))))))))))))))))))))))))))))))))))))))))))))))))))))&&&__####################__&&&&)))))))))++++++))++++++))))))))))))))))))++++++))++++++))))))))))&&&_######################_&&&_(...............",
")))))))))))))))))))+++++++++++++++++++++++++)))))))))))))))))))))))))))))))))))))))+++++++++++++++++++++++++)))))))))))))))))))))))))))))))))))))))+++++++++++++++++++++++++)))))&&&________________________&&&&)))))))))+;++;+))+;++;+))))))))))))))))))+;++;+))+;++;+))))))))))&&&_######################_&&&_(...............",
")))))))))))))))))))+++++++++++++++++++++++++)&&&)))))))))))))))))))))))))))))))))))+++++++++++++++++++++++++)&&&)))))))))))))))))))))))))))))))))))+++++++++++++++++++++++++)&&&)&&&________________________&&&&)))))))))++++++))++++++))))))))))))))))))++++++))++++++))))))))))&&&_######################_&&&_(...............",
"))))))))))))))))))++++++++++++++++++++++++)&&&&&))))))))))))))))))))))))))))))))))++++++++++++++++++++++++)&&&&&))))))))))))))))))))))))))))))))))++++++++++++++++++++++++)&&&&&)&&&&&&&3333333333333333&&&&&&&&)))))))))++++++))++++++))))))))))))))))))++++++))++++++))))))))))&&&_######################_&&&_(...............",
"))))))))))))))))))+++)))))))))))))))))))))&&_&&&))))))))))))))))))))))))))))))))))+++)))))))))))))))))))))&&_&&&))))))))))))))))))))))))))))))))))+++)))))))))))))))))))))&&_&&&)&&&&&&3===[[[[[[[[[[===3&&&&&&&)))))))))+;++;+))+;++;+))))))))))))))))))+;++;+))+;++;+))))))))))&&&_######################_&&&_(...............",
"))))))))))))))))))+++)))))))))))))))))))))&&_&&&))))))))))))))))))))))))))))))))))+++)))))))))))))))))))))&&_&&&))))))))))))))))))))))))))))))))))+++)))))))))))))))))))))&&_&&&)&&&&&&3=,,'''^^^^^'',,=3&&&&&&&)))))))))++++++))++++++))))))))))))))))))++++++))++++++))))))))))&&&_######################_&&&_(...............",
"))))))))))))))))))+++)))))))))))))))))))))&&_&&&))))))))))))))))))))))))))))))))))+++)))))))))))))))))))))&&_&&&))))))))))))))))))))))))))))))))))+++)))))))))))))))))))))&&_&&&))&&&&&3=,,''@@@@@@'',,=3&&&&&&))))))))))))))))))))))))))))))))))))))))))))))))))))))))))))))))))&&&_######################_&&&_(...............",
"))))))))))))))))))+++)))))))))))))))))))))&&_&&&))))))))))))))))))))))))))))))))))+++)))))))))))))))))))))&&_&&&))))))))))))))))))))))))))))))))))+++)))))))))))))))))))))&&_&&&))))))&3=,''@@@@@@@@'',=3&&))))))))))))))))))))))))))))))))))))))))))))))))))))))))))))))))))))))&&&_######################_&&&_(...............",
"))))))))))))))))))+++)))))))))))))))))))))&&_&&&))))))))))))))))))))))))))))))))))+++)))))))))))))))))))))&&_&&&))))))))))))))))))))))))))))))))))+++)))))))))))))))))))))&&_&&&))))))&3=,''@@@@@@@@'',=3&&))))))++++++)))))+++))+++)))))++++++))++++++)))))+++))+++)))))++++++))&&&_######################_&&&_(...............",
"))))))))))))))))))+++)))))))))))))))))))))&&_&&&))))))))))))))))))))))))))))))))))+++)))))))))))))))))))))&&_&&&))))))))))))))))))))))))))))))))))+++)))))))))))))))))))))&&_&&&))))))&3=,''@@@@@@@@'',=3&&))))))+;++;+)))))+;+))+;+)))))+;++;+))+;++;+)))))+;+))+;+)))))+;++;+))&&&_######################_&&&_(...............",
"))))))))))))))))))+++)))))))))))))))))))))&&_&&&))))))))))))))))))))))))))))))))))+++)))))))))))))))))))))&&_&&&))))))))))))))))))))))))))))))))))+++)))))))))))))))))))))&&_&&&))))))&3=,''@@@@@@@@'',=3&&))))))++++++)))))+++))+++)))))++++++))++++++)))))+++))+++)))))++++++))&&&_######################_&&&_(...............",
"))))))))))))))))))+++)))))))))))))))))))))&&_&&&))))))))))))))))))))))))))))))))))+++)))))))))))))))))))))&&_&&&))))))))))))))))))))))))))))))))))+++)))))))))))))))))))))&&_&&&))))))&3=,,'''@@@@@'',,=3&&))))))++++++))+++))))))))+++))++++++))++++++))+++))))))))+++))++++++))&&&_######################_&&&_(...............",
"))))))))))))))))))+++)))))))))))))))))))))&&_&&&))))))))))))))))))))))))))))))))))+++)))))))))))))))))))))&&_&&&))))))))))))))))))))))))))))))))))+++)))))))))))))))))))))&&_&&&))))))&3=,,'''''''''',,=3&&))))))+;++;+))+;+))))))))+;+))+;++;+))+;++;+))+;+))))))))+;+))+;++;+))&&&_######################_&&&_(...............",
"))))))))))))))))))+++)))))))))))))))))))))&&_&&&))))))))))))))))))))))))))))))))))+++)))))))))))))))))))))&&_&&&))))))))))))))))))))))))))))))))))+++)))))))))))))))))))))&&_&&&)))))))3=,,'''''''''',,=3&&))))))++++++))+++))))))))+++))++++++))++++++))+++))))))))+++))++++++))&&&_######################_&&&_(...............",
"))))))))))))))))))+++)))))))))))))))))))))&&_&&&))))))))))))))))))))))))))))))))))+++)))))))))))))))))))))&&_&&&))))))))))))))))))))))))))))))))))+++)))))))))))))))))))))&&_&&&)))))))3=,,,,,,,,,,,,,,=3&&))))))))))))))))))))))))))))))))))))))))))))))))))))))))))))))))))))))&&&_######################_&&&_(...............",
"))))))))))))))))))+++)))))))))))))))))))))&&_&&&))))))))))))))))))))))))))))))))))+++)))))))))))))))))))))&&_&&&))))))))))))))))))))))))))))))))))+++)))))))))))))))))))))&&_&&&))))))&3=,,,,,,,,,,,,,,=3))))))))))))))))))))))))))))))))))))))))))))))))))))))))))))))))))))))))&&&_######################_&&&_(...............",
"))))))))))))))))))+++)))))))))))))))))))))&&_&&&))))))))))))))))))))))))))))))))))+++)))))))))))))))))))))&&_&&&))))))))))))))))))))))))))))))))))+++)))))))))))))))))))))&&_&&&))))))&3=,,''''''''',,,=3))))))))++++++))+++))))))))+++))++++++))++++++))+++))))))))+++))++++++))&&&_######################_&&&_(...............",
"))))))))))))))))))+++)))))))))))))))))))))&&_&&&))))))))))))))))))))))))))))))))))+++)))))))))))))))))))))&&_&&&))))))))))))))))))))))))))))))))))+++)))))))))))))))))))))&&_&&&))))))&3=,,'''''''''',,=3&&))))))+;++;+))+;+))))))))+;+))+;++;+))+;++;+))+;+))))))))+;+))+;++;+))&&&_######################_&&&_(...............",
"))))))))))))))))))+++)))))))))))))))))))))&&_&&&))))))))))))))))))))))))))))))))))+++)))))))))))))))))))))&&_&&&))))))))))))))))))))))))))))))))))+++)))))))))))))))))))))&&_&&&))))))&3=,,'''@@@@@'',,=3&&))))))++++++))+++))))))))+++))++++++))++++++))+++))))))))+++))++++++))&&&_######################_&&&_(...............",
"))))))))))))))))))+++)))))))))))))))))))))&&_&&&))))))))))))))))))))))))))))))))))+++)))))))))))))))))))))&&_&&&))))))))))))))))))))))))))))))))))+++)))))))))))))))))))))&&_&&&))))))&3=,'''@@@@@@''',=3&&))))))++++++)))))+++))+++)))))++++++))++++++)))))+++))+++)))))++++++))&&&_######################_&&&_(...............",
"))))))))))))))))))+++)))))))))))))))))))))&&_&&&))))))))))))))))))))))))))))))))))+++)))))))))))))))))))))&&_&&&))))))))))))))))))))))))))))))))))+++)))))))))))))))))))))&&_&&&))))))&3=,''@@@@@@@@'',=3&&))))))+;++;+)))))+;+))+;+)))))+;++;+))+;++;+)))))+;+))+;+)))))+;++;+))&&&_######################_&&&_(...............",
"))))))))))))))))))+++)))))))))))))))))))))&&_&&&))))))))))))))))))))))))))))))))))+++)))))))))))))))))))))&&_&&&))))))))))))))))))))))))))))))))))+++)))))))))))))))))))))&&_&&&))))))&3=,''@@@@@@@@'',=3&&))))))++++++)))))+++))+++)))))++++++))++++++)))))+++))+++)))))++++++))&&&_######################_&&&_(...............",
"))))))))))))))))))+++)))))))))))))))))))))&&_&&&))))))))))))))))))))))))))))))))))+++)))))))))))))))))))))&&_&&&))))))))))))))))))))))))))))))))))+++)))))))))))))))))))))&&_&&&))))))&3=,''@@@@@@@@'',=3&&))))))))))))))))))))))))))))))))))))))))))))))))))))))))))))))))))))))&&&_######################_&&&_(...............",
"))))))))))))))))))+++)))))))))))))))))))))&&_&&&))))))))))))))))))))))))))))))))))+++)))))))))))))))))))))&&_&&&))))))))))))))))))))))))))))))))))+++)))))))))))))))))))))&&_&&&))))))&3=,''@@@@@@@@'',=3&&))))))))))))))))))))))))))))))))))))))))))))))))))))))))))))))))))))))&&&_######################_&&&_(...............",
"))))))))))))))))))+++)))))))))))))))))))))&&_&&&))))))))))))))))))))))))))))))))))+++)))))))))))))))))))))&&_&&&))))))))))))))))))))))))))))))))))+++)))))))))))))))))))))&&_&&&))&&&&&3=,,'''^^^^^'',,=3&&&&&&))))))))))++++++))++++++))))))))))))))))))++++++))++++++))))))))))&&&_######################_&&&_(...............",
"))))))))))))))))))++)&&&&&&&&&&&&&&&&&&&&&&&_&&&))))))))))))))))))))))))))))))))))++)&&&&&&&&&&&&&&&&&&&&&&&_&&&))))))))))))))))))))))))))))))))))++)&&&&&&&&&&&&&&&&&&&&&&&_&&&)&&&&&&3===[[[[[[[[[[===3&&&&&&&)))))))))+;++;+))+;++;+))))))))))))))))))+;++;+))+;++;+))))))))))&&&_######################_&&&_(...............",
"))))))))))))))))))++&&&&&&&&&&&&&&&&&&&&&&&__&&&))))))))))))))))))))))))))))))))))++&&&&&&&&&&&&&&&&&&&&&&&__&&&))))))))))))))))))))))))))))))))))++&&&&&&&&&&&&&&&&&&&&&&&__&&&)&&&&&&&3333333333333333&&&&&&&&)))))))))++++++))++++++))))))))))))))))))++++++))++++++))))))))))&&&_######################_&&&_(...............",
"))))))))))))))))))))&________________________&&&))))))))))))))))))))))))))))))))))))&________________________&&&))))))))))))))))))))))))))))))))))))&________________________&&&)&&&________________________&&&&)))))))))++++++))++++++))))))))))))))))))++++++))++++++))))))))))&&&_######################_&&&_(...............",
")))))))))))))))))))&&&&&&&&&&&&&&&&&&&&&&&&&&&&&)))))))))))))))))))))))))))))))))))&&&&&&&&&&&&&&&&&&&&&&&&&&&&&)))))))))))))))))))))))))))))))))))&&&&&&&&&&&&&&&&&&&&&&&&&&&&&)&&&________________________&&&&)))))))))+;++;+))+;++;+))))))))))))))))))+;++;+))+;++;+))))))))))&&&_######################_&&&_(...............",
"))))))))))))))))))&&&&&&&&&&&&&&&&&&&&&&&&&&&&&&))))))))))))))))))))))))))))))))))&&&&&&&&&&&&&&&&&&&&&&&&&&&&&&))))))))))))))))))))))))))))))))))&&&&&&&&&&&&&&&&&&&&&&&&&&&&&&)&&&__####################__&&&&)))))))))++++++))++++++))))))))))))))))))++++++))++++++))))))))))&&&_######################_&&&_(...............",
"))))))))))))))))))&&&&&&&&&&&&&&&&&&&&&&&&&&&&&&))))))))))))))))))))))))))))))))))&&&&&&&&&&&&&&&&&&&&&&&&&&&&&&))))))))))))))))))))))))))))))))))&&&&&&&&&&&&&&&&&&&&&&&&&&&&&&)&&&_######################_&&&&)))))))))))))))))))))))))))))))))))))))))))))))))))))))))))))))))&&&_######################_&&&_(...............",
")))))))))))))))))))))))))))))))))))))))))))))))))))))))))))))))))))))))))))))))))))))))))))))))))))))))))))))))))))))))))))))))))))))))))))))))))))))))))))))))))))))))))))))))))&&&_######################_&&&&)))))))))))))))))))))))))))))))))))))))))))))))))))))))))))))))))&&&_######################_&&&_(...............",
")))))))))))))))))))))))))))))))))))))))))))))))))))))))))))))))))))))))))))))))))))))))))))))))))))))))))))))))))))))))))))))))))))))))))))))))))))))))))))))))))))))))))))))))))&&&_######################_&&&&)))))))))++++++))++++++))))))))))))))))))++++++))++++++))))))))))&&&_######################_&&&_(...............",
"++++++++++++)))))))))))))))))))))))))))))))))))))))+++++++++++++++++++++++++)))))))))))))))))))))))))))))))))))))))+++++++++++++++++++++++++)))))))))))))))))))))))))))))))))))))&&&_######################_&&&&)))))))))+;++;+))+;++;+))))))))))))))))))+;++;+))+;++;+))))))))))&&&_######################_&&&_(...............",
"++++++++++++)&&&)))))))))))))))))))))))))))))))))))+++++++++++++++++++++++++)&&&)))))))))))))))))))))))))))))))))))+++++++++++++++++++++++++)&&&)))))))))))))))))))))))))))))))))&&&_######################_&&&&)))))))))++++++))++++++))))))))))))))))))++++++))++++++))))))))))&&&_######################_&&&_(...............",
"++++++++++)&&&&&))))))))))))))))))))))))))))))))))++++++++++++++++++++++++)&&&&&))))))))))))))))))))))))))))))))))++++++++++++++++++++++++)&&&&&)))))))))))))))))))))))))))))))))&&&_######################_&&&&)))))))))++++++))++++++))))))))))))))))))++++++))++++++))))))))))&&&_######################_&&&_(...............",
"))))))))))&&_&&&))))))))))))))))))))))))))))))))))+++)))))))))))))))))))))&&_&&&))))))))))))))))))))))))))))))))))+++)))))))))))))))))))))&&_&&&)))))))))))))))))))))))))))))))))&&&_######################_&&&&)))))))))+;++;+))+;++;+))))))))))))))))))+;++;+))+;++;+))))))))))&&&_######################_&&&_(...............",
"))))))))))&&_&&&))))))))))))))))))))))))))))))))))+++)))))))))))))))))))))&&_&&&))))))))))))))))))))))))))))))))))+++)))))))))))))))))))))&&_&&&)))))))))))))))))))))))))))))))))&&&_######################_&&&&)))))))))++++++))++++++))))))))))))))))))++++++))++++++))))))))))&&&_######################_&&&_(...............",
"))))))))))&&_&&&))))))))))))))))))))))))))))))))))+++)))))))))))))))))))))&&_&&&))))))))))))))))))))))))))))))))))+++)))))))))))))))))))))&&_&&&)))))))))))))))))))))))))))))))))&&&_######################_&&&&)))))))))))))))))))))))))))))))))))))))))))))))))))))))))))))))))&&&_######################_&&&_(...............",
"))))))))))&&_&&&))))))))))))))))))))))))))))))))))+++)))))))))))))))))))))&&_&&&))))))))))))))))))))))))))))))))))+++)))))))))))))))))))))&&_&&&)))))))))))))))))))))))))))))))))&&&_######################_&&&&)))))))))))))))))))))))))))))))))))))))))))))))))))))))))))))))))&&&_######################_&&&_(...............",
"))))))))))&&_&&&))))))))))))))))))))))))))))))))))+++)))))))))))))))))))))&&_&&&))))))))))))))))))))))))))))))))))+++)))))))))))))))))))))&&_&&&)))))))))))))))))))))))))))))))))&&&_######################_&&&&)++++++)))))+++))+++)))))++++++))++++++)))))+++))+++)))))++++++))&&&_######################_&&&_(...............",
"))))))))))&&_&&&))))))))))))))))))))))))))))))))))+++)))))))))))))))))))))&&_&&&))))))))))))))))))))))))))))))))))+++)))))))))))))))))))))&&_&&&)))))))))))))))))))))))))))))))))&&&_######################_&&&&)+;++;+)))))+;+))+;+)))))+;++;+))+;++;+)))))+;+))+;+)))))+;++;+))&&&_######################_&&&_(...............",
"))))))))))&&_&&&))))))))))))))))))))))))))))))))))+++)))))))))))))))))))))&&_&&&))))))))))))))))))))))))))))))))))+++)))))))))))))))))))))&&_&&&)))))))))))))))))))))))))))))))))&&&_######################_&&&&)++++++)))))+++))+++)))))++++++))++++++)))))+++))+++)))))++++++))&&&_######################_&&&_(...............",
"))))))))))&&_&&&))))))))))))))))))))))))))))))))))+++)))))))))))))))))))))&&_&&&))))))))))))))))))))))))))))))))))+++)))))))))))))))))))))&&_&&&)))))))))))))))))))))))))))))))))&&&_######################_&&&&)++++++))+++))))))))+++))++++++))++++++))+++))))))))+++))++++++))&&&_######################_&&&_(...............",
"))))))))))&&_&&&))))))))))))))))))))))))))))))))))+++)))))))))))))))))))))&&_&&&))))))))))))))))))))))))))))))))))+++)))))))))))))))))))))&&_&&&)))))))))))))))))))))))))))))))))&&&_######################_&&&&)+;++;+))+;+))))))))+;+))+;++;+))+;++;+))+;+))))))))+;+))+;++;+))&&&_######################_&&&_(...............",
"))))))))))&&_&&&))))))))))))))))))))))))))))))))))+++)))))))))))))))))))))&&_&&&))))))))))))))))))))))))))))))))))+++)))))))))))))))))))))&&_&&&)))))))))))))))))))))))))))))))))&&&_######################_&&&&)++++++))+++))))))))+++))++++++))++++++))+++))))))))+++))++++++))&&&_######################_&&&_(...............",
"))))))))))&&_&&&))))))))))))))))))))))))))))))))))+++)))))))))))))))))))))&&_&&&))))))))))))))))))))))))))))))))))+++)))))))))))))))))))))&&_&&&)))))))))))))))))))))))))))))))))&&&_######################_&&&&)))))))))))))))))))))))))))))))))))))))))))))))))))))))))))))))))&&&_######################_&&&_(...............",
"))))))))))&&_&&&))))))))))))))))))))))))))))))))))+++)))))))))))))))))))))&&_&&&))))))))))))))))))))))))))))))))))+++)))))))))))))))))))))&&_&&&)))))))))))))))))))))))))))))))))&&&_######################_&&&&)))))))))))))))))))))))))))))))))))))))))))))))))))))))))))))))))&&&_######################_&&&_(...............",
"))))))))))&&_&&&))))))))))))))))))))))))))))))))))+++)))))))))))))))))))))&&_&&&))))))))))))))))))))))))))))))))))+++)))))))))))))))))))))&&_&&&)))))))))))))))))))))))))))))))))&&&_######################_&&&&)++++++))+++))))))))+++))++++++))++++++))+++))))))))+++))++++++))&&&_######################_&&&_(...............",
"))))))))))&&_&&&))))))))))))))))))))))))))))))))))+++)))))))))))))))))))))&&_&&&))))))))))))))))))))))))))))))))))+++)))))))))))))))))))))&&_&&&)))))))))))))))))))))))))))))))))&&&_######################_&&&&)+;++;+))+;+))))))))+;+))+;++;+))+;++;+))+;+))))))))+;+))+;++;+))&&&_######################_&&&_(...............",
"))))))))))&&_&&&))))))))))))))))))))))))))))))))))+++)))))))))))))))))))))&&_&&&))))))))))))))))))))))))))))))))))+++)))))))))))))))))))))&&_&&&)))))))))))))))))))))))))))))))))&&&_######################_&&&&)++++++))+++))))))))+++))++++++))++++++))+++))))))))+++))++++++))&&&_######################_&&&_(...............",
"))))))))))&&_&&&))))))))))))))))))))))))))))))))))+++)))))))))))))))))))))&&_&&&))))))))))))))))))))))))))))))))))+++)))))))))))))))))))))&&_&&&)))))))))))))))))))))))))))))))))&&&_######################_&&&&)++++++)))))+++))+++)))))++++++))++++++)))))+++))+++)))))++++++))&&&_######################_&&&_(...............",
"))))))))))&&_&&&))))))))))))))))))))))))))))))))))+++)))))))))))))))))))))&&_&&&))))))))))))))))))))))))))))))))))+++)))))))))))))))))))))&&_&&&)))))))))))))))))))))))))))))))))&&&_######################_&&&&)+;++;+)))))+;+))+;+)))))+;++;+))+;++;+)))))+;+))+;+)))))+;++;+))&&&_######################_&&&_(...............",
"))))))))))&&_&&&))))))))))))))))))))))))))))))))))+++)))))))))))))))))))))&&_&&&))))))))))))))))))))))))))))))))))+++)))))))))))))))))))))&&_&&&)))))))))))))))))))))))))))))))))&&&_######################_&&&&)++++++)))))+++))+++)))))++++++))++++++)))))+++))+++)))))++++++))&&&_######################_&&&_(...............",
"))))))))))&&_&&&))))))))))))))))))))))))))))))))))+++)))))))))))))))))))))&&_&&&))))))))))))))))))))))))))))))))))+++)))))))))))))))))))))&&_&&&)))))))))))))))))))))))))))))))))&&&_######################_&&&&)))))))))))))))))))))))))))))))))))))))))))))))))))))))))))))))))&&&_######################_&&&_(...............",
"))))))))))&&_&&&))))))))))))))))))))))))))))))))))+++)))))))))))))))))))))&&_&&&))))))))))))))))))))))))))))))))))+++)))))))))))))))))))))&&_&&&)))))))))))))))))))))))))))))))))&&&_######################_&&&&)))))))))))))))))))))))))))))))))))))))))))))))))))))))))))))))))&&&_######################_&&&_(...............",
"))))))))))&&_&&&))))))))))))))))))))))))))))))))))+++)))))))))))))))))))))&&_&&&))))))))))))))))))))))))))))))))))+++)))))))))))))))))))))&&_&&&)))))))))))))))))))))))))))))))))&&&_######################_&&&&)))))))))++++++))++++++))))))))))))))))))++++++))++++++))))))))))&&&_######################_&&&_(...............",
"&&&&&&&&&&&&_&&&))))))))))))))))))))))))))))))))))++)&&&&&&&&&&&&&&&&&&&&&&&_&&&))))))))))))))))))))))))))))))))))++)&&&&&&&&&&&&&&&&&&&&&&&_&&&)))))))))))))))))))))))))))))))))&&&_######################_&&&&)))))))))+;++;+))+;++;+))))))))))))))))))+;++;+))+;++;+))))))))))&&&_######################_&&&_(...............",
"&&&&&&&&&&&__&&&))))))))))))))))))))))))))))))))))++&&&&&&&&&&&&&&&&&&&&&&&__&&&))))))))))))))))))))))))))))))))))++&&&&&&&&&&&&&&&&&&&&&&&__&&&)))))))))))))))))))))))))))))))))&&&_######################_&&&&)))))))))++++++))++++++))))))))))))))))))++++++))++++++))))))))))&&&_######################_&&&_(...............",
"_____________&&&))))))))))))))))))))))))))))))))))))&________________________&&&))))))))))))))))))))))))))))))))))))&________________________&&&)))))))))))))))))))))))))))))))))&&&_######################_&&&&)))))))))++++++))++++++))))))))))))))))))++++++))++++++))))))))))&&&_######################_&&&_(...............",
"&&&&&&&&&&&&&&&&)))))))))))))))))))))))))))))))))))&&&&&&&&&&&&&&&&&&&&&&&&&&&&&)))))))))))))))))))))))))))))))))))&&&&&&&&&&&&&&&&&&&&&&&&&&&&&)))))))))))))))))))))))))))))))))&&&_######################_&&&&)))))))))+;++;+))+;++;+))))))))))))))))))+;++;+))+;++;+))))))))))&&&_######################_&&&_(...............",
"&&&&&&&&&&&&&&&&))))))))))))))))))))))))))))))))))&&&&&&&&&&&&&&&&&&&&&&&&&&&&&&))))))))))))))))))))))))))))))))))&&&&&&&&&&&&&&&&&&&&&&&&&&&&&&)))))))))))))))))))))))))))))))))&&&_######################_&&&&)))))))))++++++))++++++))))))))))))))))))++++++))++++++))))))))))&&&_######################_&&&_(...............",
"&&&&&&&&&&&&&&&&))))))))))))))))))))))))))))))))))&&&&&&&&&&&&&&&&&&&&&&&&&&&&&&))))))))))))))))))))))))))))))))))&&&&&&&&&&&&&&&&&&&&&&&&&&&&&&)))))))))))))))))))))))))))))))))&&&_######################_&&&&)))))))))))))))))))))))))))))))3%%%%%%%%%%%;3)&&&&)+;22--------2+)&&_######################_&&&_(...............",
")))))))))))))))))))))))))))))))))))))))))))))))))))))))))))))))))))))))))))))))))))))))))))))))))))))))))))))))))))))))))))))))))))))))))))))))))))))))))))))))))))))))))))))))))&&&_######################_&&&&)))))))))))))))))))))))))))))))%4///////44'%3&&&&&&+-1!!*******!2)&&_######################_&&&_(...............",
")))))))))))))))))))))))))))))))))))))))))))))))))))))))))))))))))))))))))))))))))))))))))))))))))))))))))))))))))))))))))))))))))))))))))))))))))))))))))))))))))))))))))))))))))&&&_######################_&&&&)))))))))++++++))++++++))))))))%/>>>>>>/4[%=3&&&&&&3;2-!*{||||{*-)&&_######################_&&&_(...............",
")))))))))))))))))))+++++++++++++++++++++++++)))))))))))))))))))))))))))))))))))))))+++++++++++++++++++++++++)))))))))))))))))))))))))))))))))))))))+++++++++++++++++++++++++)))))&&&_######################_&&&&)))))))))+;++;+))+;++;+))))))))%/>>>>>/'=33&________&33%1!{||||*-)&&_######################_&&&_(...............",
")))))))))))))))))))+++++++++++++++++++++++++)&&&)))))))))))))))))))))))))))))))))))+++++++++++++++++++++++++)&&&)))))))))))))))))))))))))))))))))))+++++++++++++++++++++++++)&&&)&&&_######################_&&&&)))))))))++++++))++++++))))))))%/>>>>/[33______________&3-!{|||*-)&&_######################_&&&_(...............",
"))))))))))))))))))++++++++++++++++++++++++)&&&&&))))))))))))))))))))))))))))))))))++++++++++++++++++++++++)&&&&&))))))))))))))))))))))))))))))))))++++++++++++++++++++++++)&&&&&)&&&_######################_&&&&)))))))))++++++))++++++))))))))%/>>>/[3_________________&3-!{||*-)&&_######################_&&&_(...............",
"))))))))))))))))))+++)))))))))))))))))))))&&_&&&))))))))))))))))))))))))))))))))))+++)))))))))))))))))))))&&_&&&))))))))))))))))))))))))))))))))))+++)))))))))))))))))))))&&_&&&)&&&_######################_&&&&)))))))))+;++;+))+;++;+))))))))%/>>/[3___________________&3-!{|*-)&&_######################_&&&_(...............",
"))))))))))))))))))+++)))))))))))))))))))))&&_&&&))))))))))))))))))))))))))))))))))+++)))))))))))))))))))))&&_&&&))))))))))))))))))))))))))))))))))+++)))))))))))))))))))))&&_&&&)&&&_######################_&&&&)))))))))++++++))++++++))))))))%/>/[3_________~~~~___~~~__&3-!{*-)&&_######################_&&&_(...............",
"))))))))))))))))))+++)))))))))))))))))))))&&_&&&))))))))))))))))))))))))))))))))))+++)))))))))))))))))))))&&_&&&))))))))))))))))))))))))))))))))))+++)))))))))))))))))))))&&_&&&)&&&_######################_&&&&)))))))))))))))))))))))))))))))%//'3_____~3&__~]]~__~$$$~__&31**-)&&_######################_&&&_(...............",
"))))))))))))))))))+++)))))))))))))))))))))&&_&&&))))))))))))))))))))))))))))))))))+++)))))))))))))))))))))&&_&&&))))))))))))))))))))))))))))))))))+++)))))))))))))))))))))&&_&&&)&&&_######################_&&&&)))))))))))))))))))))))))))))))%44=3____~$}3__~]]~__~$:$~___&%!!-)&&_######################_&&&_(...............",
"))))))))))))))))))+++)))))))))))))))))))))&&_&&&))))))))))))))))))))))))))))))))))+++)))))))))))))))))))))&&_&&&))))))))))))))))))))))))))))))))))+++)))))))))))))))))))))&&_&&&)&&&_######################_&&&&)++++++)))))+++))+++)))))++++++%4[3_____~$$~__~]]~__~$$$~____3-!2)&&_######################_&&&_(...............",
"))))))))))))))))))+++)))))))))))))))))))))&&_&&&))))))))))))))))))))))))))))))))))+++)))))))))))))))))))))&&_&&&))))))))))))))))))))))))))))))))))+++)))))))))))))))))))))&&_&&&)&&&_######################_&&&&)+;++;+)))))+;+))+;+)))))+;++;+%'%3______~~___~~~~___~~~_____3212)&&_######################_&&&_(...............",
"))))))))))))))))))+++)))))))))))))))))))))&&_&&&))))))))))))))))))))))))))))))))))+++)))))))))))))))))))))&&_&&&))))))))))))))))))))))))))))))))))+++)))))))))))))))))))))&&_&&&)&&&_######################_&&&&)++++++)))))+++))+++)))))++++++;[=&__________________________&;-;)&&_######################_&&&_(...............",
"))))))))))))))))))+++)))))))))))))))))))))&&_&&&))))))))))))))))))))))))))))))))))+++)))))))))))))))))))))&&_&&&))))))))))))))))))))))))))))))))))+++)))))))))))))))))))))&&_&&&)&&&_######################_&&&&)++++++))+++))))))))+++))++++++333____________________________3++)&&_######################_&&&_(...............",
"))))))))))))))))))+++)))))))))))))))))))))&&_&&&))))))))))))))))))))))))))))))))))+++)))))))))))))))))))))&&_&&&))))))))))))))))))))))))))))))))))+++)))))))))))))))))))))&&_&&&)&&&_######################_&&&&)+;++;+))+;+))))))))+;+))+;++;+)&&____________________________&&&&&&_######################_&&&_(...............",
"))))))))))))))))))+++)))))))))))))))))))))&&_&&&))))))))))))))))))))))))))))))))))+++)))))))))))))))))))))&&_&&&))))))))))))))))))))))))))))))))))+++)))))))))))))))))))))&&_&&&)&&&_######################_&&&&)++++++))+++))))))))+++))++++++)&&____________________________&&&&&&_######################_&&&_(...............",
"))))))))))))))))))+++)))))))))))))))))))))&&_&&&))))))))))))))))))))))))))))))))))+++)))))))))))))))))))))&&_&&&))))))))))))))))))))))))))))))))))+++)))))))))))))))))))))&&_&&&)&&&_######################_&&&&)))))))))))))))))))))))))))))))&&&____________________________&&&&&&_######################_&&&_(...............",
"))))))))))))))))))+++)))))))))))))))))))))&&_&&&))))))))))))))))))))))))))))))))))+++)))))))))))))))))))))&&_&&&))))))))))))))))))))))))))))))))))+++)))))))))))))))))))))&&_&&&)&&&_######################_&&&&)))))))))))))))))))))))))))))))&&&____________________________&&&&&&_######################_&&&_(...............",
"))))))))))))))))))+++)))))))))))))))))))))&&_&&&))))))))))))))))))))))))))))))))))+++)))))))))))))))))))))&&_&&&))))))))))))))))))))))))))))))))))+++)))))))))))))))))))))&&_&&&)&&&_######################_&&&&)++++++))+++))))))))+++))++++++)&&____________________________&&&&&&_######################_&&&_(...............",
"))))))))))))))))))+++)))))))))))))))))))))&&_&&&))))))))))))))))))))))))))))))))))+++)))))))))))))))))))))&&_&&&))))))))))))))))))))))))))))))))))+++)))))))))))))))))))))&&_&&&)&&&_######################_&&&&)+;++;+))+;+))))))))+;+))+;++;+)&&___________________~~_______&&&&&&_######################_&&&_(...............",
"))))))))))))))))))+++)))))))))))))))))))))&&_&&&))))))))))))))))))))))))))))))))))+++)))))))))))))))))))))&&_&&&))))))))))))))))))))))))))))))))))+++)))))))))))))))))))))&&_&&&)&&&_######################_&&&&)++++++))+++))))))))+++))++++++333_____~~___________~$$~______333&&&_######################_&&&_(...............",
"))))))))))))))))))+++)))))))))))))))))))))&&_&&&))))))))))))))))))))))))))))))))))+++)))))))))))))))))))))&&_&&&))))))))))))))))))))))))))))))))))+++)))))))))))))))))))))&&_&&&)&&&_######################_&&&&)++++++)))))+++))+++)))))++++++;%=&___~$$~__________~$$3_____&=%;)&&_######################_&&&_(...............",
"))))))))))))))))))+++)))))))))))))))))))))&&_&&&))))))))))))))))))))))))))))))))))+++)))))))))))))))))))))&&_&&&))))))))))))))))))))))))))))))))))+++)))))))))))))))))))))&&_&&&)&&&_######################_&&&&)+;++;+)))))+;+))+;+)))))+;++;+%'%3___~$$3____~~~~__~$$~_____3%'%)&&_######################_&&&_(...............",
"))))))))))))))))))+++)))))))))))))))))))))&&_&&&))))))))))))))))))))))))))))))))))+++)))))))))))))))))))))&&_&&&))))))))))))))))))))))))))))))))))+++)))))))))))))))))))))&&_&&&)&&&_######################_&&&&)++++++)))))+++))+++)))))++++++%4[3___~$$~____~]]~___~~______3[4%)&&_######################_&&&_(...............",
"))))))))))))))))))+++)))))))))))))))))))))&&_&&&))))))))))))))))))))))))))))))))))+++)))))))))))))))))))))&&_&&&))))))))))))))))))))))))))))))))))+++)))))))))))))))))))))&&_&&&)&&&_######################_&&&&)))))))))))))))))))))))))))))))%44=3___~~_____~]]~__________&=44%)&&_######################_&&&_(...............",
"))))))))))))))))))+++)))))))))))))))))))))&&_&&&))))))))))))))))))))))))))))))))))+++)))))))))))))))))))))&&_&&&))))))))))))))))))))))))))))))))))+++)))))))))))))))))))))&&_&&&)&&&_######################_&&&&)))))))))))))))))))))))))))))))%//'3__________~]]~__________3'//%)&&_######################_&&&_(...............",
"))))))))))))))))))+++)))))))))))))))))))))&&_&&&))))))))))))))))))))))))))))))))))+++)))))))))))))))))))))&&_&&&))))))))))))))))))))))))))))))))))+++)))))))))))))))))))))&&_&&&)&&&_######################_&&&&)))))))))++++++))++++++))))))))%/>/[3_________~~~~_________3[/>/%)&&_######################_&&&_(...............",
"))))))))))))))))))++)&&&&&&&&&&&&&&&&&&&&&&&_&&&))))))))))))))))))))))))))))))))))++)&&&&&&&&&&&&&&&&&&&&&&&_&&&))))))))))))))))))))))))))))))))))++)&&&&&&&&&&&&&&&&&&&&&&&_&&&)&&&_######################_&&&&)))))))))+;++;+))+;++;+))))))))%/>>/[3____________________3[/>>/%)&&_######################_&&&_(...............",
"))))))))))))))))))++&&&&&&&&&&&&&&&&&&&&&&&__&&&))))))))))))))))))))))))))))))))))++&&&&&&&&&&&&&&&&&&&&&&&__&&&))))))))))))))))))))))))))))))))))++&&&&&&&&&&&&&&&&&&&&&&&__&&&)&&&_######################_&&&&)))))))))++++++))++++++))))))))%/>>>/[3__________________3[/>>>/%)&&_######################_&&&_(...............",
"))))))))))))))))))))&________________________&&&))))))))))))))))))))))))))))))))))))&________________________&&&))))))))))))))))))))))))))))))))))))&________________________&&&)&&&_######################_&&&&)))))))))++++++))++++++))))))))%/>>>>/[33______________&3[/>>>>/%)&&_######################_&&&_(...............",
")))))))))))))))))))&&&&&&&&&&&&&&&&&&&&&&&&&&&&&)))))))))))))))))))))))))))))))))))&&&&&&&&&&&&&&&&&&&&&&&&&&&&&)))))))))))))))))))))))))))))))))))&&&&&&&&&&&&&&&&&&&&&&&&&&&&&)&&&_######################_&&&&)))))))))+;++;+))+;++;+))))))))%/>>>>>/'=33&________&33='/>>>>>/%)&&_######################_&&&_(...............",
"))))))))))))))))))&&&&&&&&&&&&&&&&&&&&&&&&&&&&&&))))))))))))))))))))))))))))))))))&&&&&&&&&&&&&&&&&&&&&&&&&&&&&&))))))))))))))))))))))))))))))))))&&&&&&&&&&&&&&&&&&&&&&&&&&&&&&)&&&_######################_&&&&)))))))))++++++))++++++))))))))%/>>>>>>/4[%=3&&&&&&3=%[4/>>>>>>/%)&&_######################_&&&_(...............",
"))))))))))))))))))&&&&&&&&&&&&&&&&&&&&&&&&&&&&&&))))))))))))))))))))))))))))))))))&&&&&&&&&&&&&&&&&&&&&&&&&&&&&&))))))))))))))))))))))))))))))))))&&&&&&&&&&&&&&&&&&&&&&&&&&&&&&)&&&_######################_&&&&)))))))))))))))))))))))))))))))%4///////44'%3&&&&&&3%'44///////4%)&&_######################_&&&_(...............",
")))))))))))))))))))))))))))))))))))))))))))))))))))))))))))))))))))))))))))))))))))))))))))))))))))))))))))))))))))))))))))))))))))))))))))))))))))))))))))))))))))))))))))))))))&&&_######################_&&&&)))))))))))))))))))))))))))))))3%%%%%%%%%%%;3&&&&&&3;%%%%%%%%%%%3&&&_######################_&&&_(...............",
"&&&&&&&&&&&&&&&&&&&&&&&&&&&&&&&&&&&&&&&&&&&&&&&&&&&&&&&&&&&&&&&&&&&&&&&&&&&&&&&&&&&&&&&&&&&&&&&&&&&&&&&&&&&&&&&&&&&&&&&&&&&&&&&&&&&&&&&&&&&&&&&&&&&&&&&&&&&&&&&&&&&&&&&&&&&&&&&&&&&&_######################_&&&&&&&&&&&&&&&&&&&&&&&&&&&&&&&&&&&&))))))))))))&&&&&&&&))))))))))))&&&&_######################_&&&_(...............",
"&&&&&&&&&&&&&&&&&&&&&&&&&&&&&&&&&&&&&&&&&&&&&&&&&&&&&&&&&&&&&&&&&&&&&&&&&&&&&&&&&&&&&&&&&&&&&&&&&&&&&&&&&&&&&&&&&&&&&&&&&&&&&&&&&&&&&&&&&&&&&&&&&&&&&&&&&&&&&&&&&&&&&&&&&&&&&&&&&&&__######################__&&&&&&&&&&&&&&&&&&&&&&&&&&&&&&&&&&&&&&&&&&&&&&&&&&&&&&&&&&&&&&&&&&&&&&__######################_&&&_(...............",
"&&&&&&&&&&&&&&&&&&&&&&&&&&&&&&&&&&&&&&&&&&&&&&&&&&&&&&&&&&&&&&&&&&&&&&&&&&&&&&&&&&&&&&&&&&&&&&&&&&&&&&&&&&&&&&&&&&&&&&&&&&&&&&&&&&&&&&&&&&&&&&&&&&&&&&&&&&&&&&&&&&&&&&&&&&&&&&&&&&___######################___&&&&&&&&&&&&&&&&&&&&&&&&&&&&&&&&&&&&&&&&&&&&&&&&&&&&&&&&&&&&&&&&&&&&___######################_&&&_(...............",
"____________________________________________________________________________________________________________________________________________________________________________________########################________________________________________________________________________#######################_&&&_(...............",
"###########################################################################################################################################################################################################################################################################################################_&&&_(...............",
"###########################################################################################################################################################################################################################################################################################################_&&&_(...............",
"###########################################################################################################################################################################################################################################################################################################_&&&_(...............",
"###########################################################################################################################################################################################################################################################################################################_&&&_(...............",
"###########################################################################################################################################################################################################################################################################################################_&&&_(...............",
"###########################################################################################################################################################################################################################################################################################################_&&&_(...............",
"###########################################################################################################################################################################################################################################################################################################_&&&_(...............",
"###########################################################################################################################################################################################################################################################################################################_&&&_(...............",
"###########################################################################################################################################################################################################################################################################################################_&&&_(...............",
"###########################################################################################################################################################################################################################################################################################################_&&&_(...............",
"###########################################################################################################################################################################################################################################################################################################_&&&_(...............",
"###########################################################################################################################################################################################################################################################################################################_&&&_(...............",
"###########################################################################################################################################################################################################################################################################################################_&&&_(...............",
"###########################################################################################################################################################################################################################################################################################################_&&&_(...............",
"###########################################################################################################################################################################################################################################################################################################_&&&_(..............."};
