/* XPM */
static char * intro_back_4_xpm[] = {
"320 200 33 1",
" 	c None",
".	c #022E2C",
"+	c #3E7A5B",
"@	c #055351",
"#	c #494B5B",
"$	c #7EA23C",
"%	c #025A5C",
"&	c #475E1C",
"*	c #7A7E0C",
"=	c #7B1E98",
"-	c #404645",
";	c #726E6C",
">	c #8A8D09",
",	c #2D2D2F",
"'	c #A2BA3C",
")	c #2A6263",
"!	c #56686E",
"~	c #6E516A",
"{	c #A2A20C",
"]	c #B2993B",
"^	c #647824",
"/	c #76328C",
"(	c #C4C721",
"_	c #7E7274",
":	c #3E506E",
"<	c #373B3C",
"[	c #B4B114",
"}	c #526E24",
"|	c #2A6E54",
"1	c #7E9A34",
"2	c #023E3C",
"3	c #9A7A7C",
"4	c #55565F",
";;_33333333;)%%%%%%);333333333__;;_33333333;)%%%%%%);333333333__;;_33333333;)%%%%%%);333333333__;;_33333333;)%%%%%%);333333333__;;_33333333;)%%%%%%);333333333__;;_33333333;)%%%%%%);333333333__;;_33333333;)%%%%%%);333333333__;;_33333333;)%%%%%@@<<----------<<-4~~~~~;!)%%%%%%%);333333333__;;_33333333;)%%%%%@@<<----------",
"))!_3333333;)%%%%%%);33333333_!)))!_3333333;)%%%%%%);33333333_!)))!_3333333;)%%%%%%);33333333_!)))!_3333333;)%%%%%%);33333333_!)))!_3333333;)%%%%%%);33333333_!)))!_3333333;)%%%%%%);33333333_!)))!_3333333;)%%%%%%);33333333_!)))!_3333333;)%%%%%@@<<<<<<<<<<<<,,-4~~~~~;!)%%%%%%%);33333333_!)))!_3333333;)%%%%%@@<<<<<<<<<<<<",
"%%);3333333;)%%%%%%);3333333_!)%%%);3333333;)%%%%%%);3333333_!)%%%);3333333;)%%%%%%);3333333_!)%%%);3333333;)%%%%%%);3333333_!)%%%);3333333;)%%%%%%);3333333_!)%%%);3333333;)%%%%%%);3333333_!)%%%);3333333;)%%%%%%);3333333_!)%%%);3333333;)%%%%%@@,,,,,,,,,,,,,,-4~/=/~;!)%%%%%%%);3333333_!)%%%);3333333;)%%%%%@@,,,,,,,,,,,,",
"%%);3333333;)%%%%%%);3333333;)%%%%);3333333;)%%%%%%);3333333;)%%%%);3333333;)%%%%%%);3333333;)%%%%);3333333;)%%%%%%);3333333;)%%%%);3333333;)%%%%%%);3333333;)%%%%);3333333;)%%%%%%);3333333;)%%%%);3333333;)%%%%%%);3333333;)%%%%);3333333;)%%%%%@@,,,,,,,,,,,,,,-4~===~;!)%%%%%%%);3333333;)%%%%);3333333;)%%%%%@@,,,,,,,,,,,,",
"%%);3333333;)%%%%%%);3333333;)%%%%);3333333;)%%%%%%);3333333;)%%%%);3333333;)%%%%%%);3333333;)%%%%);3333333;)%%%%%%);3333333;)%%%%);3333333;)%%%%%%);3333333;)%%%%);3333333;)%%%%%%);3333333;)%%%%);3333333;)%%%%%%);3333333;)%%%%);3333333;)%%%%%@@,,,,,,,,,,,,,,-4~===~;!)%%%%%%%);3333333;)%%%%);3333333;)%%%%%@@,,,,,,,,,,,,",
"%))_3333333;)%%%%%%);3333333;)%%%))_3333333;)%%%%%%);3333333;)%%%))_3333333;)%%%%%%);3333333;)%%%))_3333333;)%%%%%%);3333333;)%%%))_3333333;)%%%%%%);3333333;)%%%))_3333333;)%%%%%%);3333333;)%%%))_3333333;)%%%%%%);3333333;)%%%))_3333333;)%%%%%@@,,,,,,,,,,,,,,-4~/=/~;!)%%%%%%%);3333333;)%%%))_3333333;)%%%%%@@,,,,,,,,,,,,",
")!_33333333;)%%%%%%);3333333_!)))!_33333333;)%%%%%%);3333333_!)))!_33333333;)%%%%%%);3333333_!)))!_33333333;)%%%%%%);3333333_!)))!_33333333;)%%%%%%);3333333_!)))!_33333333;)%%%%%%);3333333_!)))!_33333333;)%%%%%%);3333333_!)))!_33333333;)%%%%%@@,,,,,,,,,,,,,,-4~~~~~;!)%%%%%%%);3333333_!)))!_33333333;)%%%%%@@,,,,,,,,,,,,",
"__333333333;)%%%%%%);33333333_;;__333333333;)%%%%%%);33333333_;;__333333333;)%%%%%%);33333333_;;__333333333;)%%%%%%);33333333_;;__333333333;)%%%%%%);33333333_;;__333333333;)%%%%%%);33333333_;;__333333333;)%%%%%%);33333333_;;__333333333;)%%%%%@@<<<<<<<<<<<<<<-4~~~~;;!)%%%%%%%);33333333_;;__333333333;)%%%%%@@<<<<<<<<<<<<",
"33333333333;)%%%%%%);3333333333333333333333;)%%%%%%);3333333333333333333333;)%%%%%%);3333333333333333333333;)%%%%%%);3333333333333333333333;)%%%%%%);3333333333333333333333;)%%%%%%);3333333333333333333333;)%%%%%%);3333333333333333333333;)%%%%%@@<------------<-4~;;;;;!)%%%%%%%);3333333333333333333333;)%%%%%@@<-----------",
"33333333333;)%%%%%%);3333333333333333333333;)%%%%%%);3333333333333333333333;)%%%%%%);3333333333333333333333;)%%%%%%);3333333333333333333333;)%%%%%%);3333333333333333333333;)%%%%%%);3333333333333333333333;)%%%%%%);3333333333333333333333;)%%%%%@@--##########---4~;33;;!)%%%%%%%);3333333333333333333333;)%%%%%@@--##########",
"33333333333;)%%%%%%);3333333333333333333333;)%%%%%%);3333333333333333333333;)%%%%%%);3333333333333333333333;)%%%%%%);3333333333333333333333;)%%%%%%);3333333333333333333333;)%%%%%%);3333333333333333333333;)%%%%%%);3333333333333333333333;)%%%%%@@-############-#4~;33;;!)%%%%%%%);3333333333333333333333;)%%%%%@@-###########",
"33333333333;)%%%%%%);3333333333333333333333;)%%%%%%);3333333333333333333333;)%%%%%%);3333333333333333333333;)%%%%%%);3333333333333333333333;)%%%%%%);3333333333333333333333;)%%%%%%);3333333333333333333333;)%%%%%%);3333333333333333333333;)%%%%%%@:44::::::::::::444;;;;!)%%%%%%%);3333333333333333333333;)%%%%%%@:44:::::::::",
"33333333333;)%%%%%%);3333333333333333333333;)%%%%%%);3333333333333333333333;)%%%%%%);3333333333333333333333;)%%%%%%);3333333333333333333333;)%%%%%%);3333333333333333333333;)%%%%%%);3333333333333333333333;)%%%%%%);3333333333333333333333;)%%%%%%)!!:::::::::::::::::4!!!)%%%%%%%);3333333333333333333333;)%%%%%%)!!::::::::::",
"333333333__!)%%%%%%);33333333333333333333__!)%%%%%%);33333333333333333333__!)%%%%%%);33333333333333333333__!)%%%%%%);33333333333333333333__!)%%%%%%);33333333333333333333__!)%%%%%%);33333333333333333333__!)%%%%%%);33333333333333333333__!)%%%%%%)!!!!!!!!!!!!!!!!!!!!!;!)%%%%%%%);33333333333333333333__!)%%%%%%)!!!!!!!!!!!!",
"3333333__!))%%%%%%%)!_33333333333333333__!))%%%%%%%)!_33333333333333333__!))%%%%%%%)!_33333333333333333__!))%%%%%%%)!_33333333333333333__!))%%%%%%%)!_33333333333333333__!))%%%%%%%)!_33333333333333333__!))%%%%%%%)!_33333333333333333__!))%%%%%%%@)!!!!!!!!!!!!!!!!!!!!!+)%%%%%%%)!_33333333333333333__!))%%%%%%%@)!!!!!!!!!!!",
";;;;;;;!))%%%%%%%%%%)!;;;;;;;;;;;;;;;;;!))%%%%%%%%%%)!;;;;;;;;;;;;;;;;;!))%%%%%%%%%%)!;;;;;;;;;;;;;;;;;!))%%%%%%%%%%)!;;;;;;;;;;;;;;;;;!))%%%%%%%%%%)!;;;;;;;;;;;;;;;;;!))%%%%%%%%%%)!;;;;;;;;;;;;;;;;;!))%%%%%%%%%%)!;;;;;;;;;;;;;;;;;!))%%%%%%%%%%)))))))))))))))))))))))%%%%%%%%%)!;;;;;;;;;;;;;;;;;!))%%%%%%%%%%))))))))))))",
"))))))))%%%%%%%%%%%%%)))))))))))))))))))%%%%%%%%%%%%%)))))))))))))))))))%%%%%%%%%%%%%)))))))))))))))))))%%%%%%%%%%%%%)))))))))))))))))))%%%%%%%%%%%%%)))))))))))))))))))%%%%%%%%%%%%%)))))))))))))))))))%%%%%%%%%%%%%)))))))))))))))))))%%%%%%%%%%%%%%%%%%%%%%%%%%%%%%%%%%%%%%%%%%%%%)))))))))))))))))))%%%%%%%%%%%%%%%%%%%%%%%%",
"%%%%%%%%%%%%%%%%%%%%%%%%%%%%%%%%%%%%%%%%%%%%%%%%%%%%%%%%%%%%%%%%%%%%%%%%%%%%%%%%%%%%%%%%%%%%%%%%%%%%%%%%%%%%%%%%%%%%%%%%%%%%%%%%%%%%%%%%%%%%%%%%%%%%%%%%%%%%%%%%%%%%%%%%%%%%%%%%%%%%%%%%%%%%%%%%%%%%%%%%%%%%%%%%%%%%%%%%%%%%%%%%%%%%%%%%%%%%%%%%%%%%%%%%%%%%%%%%%%%%%%%%%%%%%%%%%%%%%%%%%%%%%%%%%%%%%%%%%%%%%%%%%%%%%%%%%%%%%%%%",
"%%%%%%%%%%%%%%%%%%%%%%%%%%%%%%%%%%%%%%%%%%%%%%%%%%%%%%%%%%%%%%%%%%%%%%%%%%%%%%%%%%%%%%%%%%%%%%%%%%%%%%%%%%%%%%%%%%%%%%%%%%%%%%%%%%%%%%%%%%%%%%%%%%%%%%%%%%%%%%%%%%%%%%%%%%%%%%%%%%%%%%%%%%%%%%%%%%%%%%%%%%%%%%%%%%%%%%%%%%%%%%%%%%%%%%%%%%%%%%%%%%%%%%%%%%%%%%%%%%%%%%%%%%%%%%%%%%%%%%%%%%%%%%%%%%%%%%%%%%%%%%%%%%%%%%%%%%%%%%%%",
"%%%%%%%%%%%%%%%%%%%%%%%%%%%%%%%%%%%%%%%%%%%%%%%%%%%%%%%%%%%%%%%%%%%%%%%%%%%%%%%%%%%%%%%%%%%%%%%%%%%%%%%%%%%%%%%%%%%%%%%%%%%%%%%%%%%%%%%%%%%%%%%%%%%%%%%%%%%%%%%%%%%%%%%%%%%%%%%%%%%%%%%%%%%%%%%%%%%%%%%%%%%%%%%%%%%%%%%%%%%%%%%%%%%%%%%%%%%%%%%%%%%%%%%%%%%%%%%%%%%%%%%%%%%%%%%%%%%%%%%%%%%%%%%%%%%%%%%%%%%%%%%%%%%%%%%%%%%%%%%%",
"%%%%%%%%%%%%%%%%%%%%%%%%%%%%%%%%%%%%%%%%%%%%%%%%%%%%%%%%%%%%%%%%%%%%%%%%%%%%%%%%%%%%%%%%%%%%%%%%%%%%%%%%%%%%%%%%%%%%%%%%%%%%%%%%%%%%%%%%%%%%%%%%%%%%%%%%%%%%%%%%%%%%%%%%%%%%%%%%%%%%%%%%%%%%%%%%%%%%%%%%%%%%%%%%%%%%%%%%%%%%%%%%%%%%%%%%%%%%%%%%%%%%%%%%%%%%%%%%%%%%%%%%%%%%%%%%%%%%%%%%%%%%%%%%%%%%%%%%%%%%%%%%%%%%%%%%%%%%%%%%",
"%%|+++++++++|%%%%%%%%%%%%%%%%%%%%%%%%%%%%%%%%%%%%%%%%%%%%%%%%%%%%%%%%%%%%%%%%%%%%%@@@@@@@@@@@@@@@@@@@@@@@@@@@@@@@@@@@@@@@@@@@@@@@@@@@@@@@@@@@@@@@@@@@@@@@@@@@@@@@@@@@@@@@@@@@@@%%%%%%%%%%%%%%%%%%%%%%%%%%%%%%%%%%%%%%%%%%%%%%%%%%%%%%%%%%%%%%%%%%%%%%%%%%%%%%%%%%%%%%%%%%%%%%%%%%%%%%%%%%%%%%%%%%%%%%%%%%%%%%%%%%%%%%%%%%%%%%%%%",
"%|$''''''''$^)%%%%%%%%%%%%%%%%%%%%%%%%%%%%%%%%%%%%%%%%%%%%%%%%%%%%%%%%%%%%%%%%%%%@@@@@@@@@@@@@@@@@@@@@@@@@@@@@@@@@@@@@@@@@@@@@@@@@@@@@@@@@@@@@@@@@@@@@@@@@@@@@@@@@@@@@@@@@@@@@@@%%%%%%%%%%%%%%%%%%%%%%%%%%%%%%%%%%%%%%%%%%%%%%%%%%%%%%%%%%%%%%%%%%%%%%%%%%%%%%%%%%%%%%%%%%%%%%%%%%%%%%%%%%%%%%%%%%%%%%%%%%%%%%%%%%%%%%%%%%%%%%%%",
"%+'(((((((({^)%%%%%%%%%%)))))))))))))))))))%%%%%%%%%%%%%)))))))))))))))))))%%%%%%@@@@@@@@@@@@@@@@@@@@@@@@@@@@@@@@@@@@@@@@@@@@@@@@@@@@@@@@@@@@@@@@@@@@@@@@@@@@@@@@@@@@@@@@@@@@@@@%%%%%%%%)))))))))))))))))))%%%%%%%%%%%%%)))))))))))))))))))%%%%%%%%%%%%%)))))))))))))))))))%%%%%%%%%%%%%)))))))))))))))))))%%%%%%%%%%%%%))))))))",
"%+'((((((([>&@@@%%%%%%))!;;;;;;;;;;;;;;;;;!)%%%%%%%%%%))!;;;;;;;;;;;;;;;;;!)%%%%%@@@@22222222222222222222222222222222222222222222222222222222222222222222222222222222222222@@@@@%%%%%%))!;;;;;;;;;;;;;;;;;!)%%%%%%%%%%))!;;;;;;;;;;;;;;;;;!)%%%%%%%%%%))!;;;;;;;;;;;;;;;;;!)%%%%%%%%%%))!;;;;;;;;;;;;;;;;;!)%%%%%%%%%%))!;;;;;;;",
"%+'(([[[[[{*&@@@%%%%))!__33333333333333333_!)%%%%%%%))!__33333333333333333_!)%%%%@@@22....................................................................................22@@@@%%%%))!__33333333333333333_!)%%%%%%%))!__33333333333333333_!)%%%%%%%))!__33333333333333333_!)%%%%%%%))!__33333333333333333_!)%%%%%%%))!__3333333",
"%+'(([[[[[{*&@@@%%%)!__33333333333333333333;)%%%%%%)!__33333333333333333333;)%%%%@@@2......................................................................................2@@@@%%%)!__33333333333333333333;)%%%%%%)!__33333333333333333333;)%%%%%%)!__33333333333333333333;)%%%%%%)!__33333333333333333333;)%%%%%%)!__333333333",
"%+'(([]]][{*&@@@%%%);3333333333333333333333;)%%%%%%);3333333333333333333333;)%%%%@@@2......................................................................................2@@@@%%%);3333333333333333333333;)%%%%%%);3333333333333333333333;)%%%%%%);3333333333333333333333;)%%%%%%);3333333333333333333333;)%%%%%%);33333333333",
"%+'([]]]][{*&@@@%%%);3333333333333333333333;)%%%%%%);3333333333333333333333;)%%%%@@@2......................................................................................2@@@@%%%);3333333333333333333333;)%%%%%%);3333333333333333333333;)%%%%%%);3333333333333333333333;)%%%%%%);3333333333333333333333;)%%%%%%);33333333333",
"%+'([]]]][{*&@@@%%%);3333333333333333333333;)%%%%%%);3333333333333333333333;)%%%%@@@2......................................................................................2@@@@%%%);3333333333333333333333;)%%%%%%);3333333333333333333333;)%%%%%%);3333333333333333333333;)%%%%%%);3333333333333333333333;)%%%%%%);33333333333",
"%+'(([]]][{*&@@@%%%);3333333333333333333333;)%%%%%%);3333333333333333333333;)%%%%@@@2......................................................................................2@@@@%%%);3333333333333333333333;)%%%%%%);3333333333333333333333;)%%%%%%);3333333333333333333333;)%%%%%%);3333333333333333333333;)%%%%%%);33333333333",
"%+'(([[[[[{*&@@@%%%);3333333333333333333333;)%%%%%%);3333333333333333333333;)%%%%@@@2......................................................................................2@@@@%%%);3333333333333333333333;)%%%%%%);3333333333333333333333;)%%%%%%);3333333333333333333333;)%%%%%%);3333333333333333333333;)%%%%%%);33333333333",
"%+'(([[[[[{*&@@@%%%);333333333__;;_33333333;)%%%%%%);333333333__;;_33333333;)%%%%@@@2......................................................................................2@@@@%%%);333333333__;;_33333333;)%%%%%%);333333333__;;_33333333;)%%%%%%);333333333__;;_33333333;)%%%%%%);333333333__;;_33333333;)%%%%%%);333333333__",
"%+'(([[[[[{*&@@@%%%);33333333_!)))!_3333333;)%%%%%%);33333333_!)))!_3333333;)%%%%@@@2......................................................................................2@@@@%%%);33333333_!)))!_3333333;)%%%%%%);33333333_!)))!_3333333;)%%%%%%);33333333_!)))!_3333333;)%%%%%%);33333333_!)))!_3333333;)%%%%%%);33333333_!)",
"%+'(([[[[[{*&@@@%%%);3333333_!)%%%);3333333;)%%%%%%);3333333_!)%%%);3333333;)%%%%@@@2......................................................................................2@@@@%%%);3333333_!)%%%);3333333;)%%%%%%);3333333_!)%%%);3333333;)%%%%%%);3333333_!)%%%);3333333;)%%%%%%);3333333_!)%%%);3333333;)%%%%%%);3333333_!)%",
"%+'(([[[[[{*&@@@%%%);3333333;)%%%%);3333333;)%%%%%%);3333333;)%%%%);3333333;)%%%%@@@2......................................................................................2@@@@%%%);3333333;)%%%%);3333333;)%%%%%%);3333333;)%%%%);3333333;)%%%%%%);3333333;)%%%%);3333333;)%%%%%%);3333333;)%%%%);3333333;)%%%%%%);3333333;)%%",
"%+'(([[[[[{*&@@@%%%);3333333;)%%%%);3333333;)%%%%%%);3333333;)%%%%);3333333;)%%%%@@@2......................................................................................2@@@@%%%);3333333;)%%%%);3333333;)%%%%%%);3333333;)%%%%);3333333;)%%%%%%);3333333;)%%%%);3333333;)%%%%%%);3333333;)%%%%);3333333;)%%%%%%);3333333;)%%",
"%+'(([[[[[{*&@@@%%%);3333333;)%%%))_3333333;)%%%%%%);3333333;)%%%))_3333333;)%%%%@@@2......................................................................................2@@@@%%%);3333333;)%%%))_3333333;)%%%%%%);3333333;)%%%))_3333333;)%%%%%%);3333333;)%%%))_3333333;)%%%%%%);3333333;)%%%))_3333333;)%%%%%%);3333333;)%%",
"%+'(([[[[[{*&@@@%%%);3333333_!)))!_33333333;)%%%%%%);3333333_!)))!_33333333;)%%%%@@@2......................................................................................2@@@@%%%);3333333_!)))!_33333333;)%%%%%%);3333333_!)))!_33333333;)%%%%%%);3333333_!)))!_33333333;)%%%%%%);3333333_!)))!_33333333;)%%%%%%);3333333_!))",
"%+'(([]]][{*&@@@%%%);33333333_;;__333333333;)%%%%%%);33333333_;;__333333333;)%%%%@@@2......................................................................................2@@@@%%%);33333333_;;__333333333;)%%%%%%);33333333_;;__333333333;)%%%%%%);33333333_;;__333333333;)%%%%%%);33333333_;;__333333333;)%%%%%%);33333333_;;",
"%+'([]]]][{*&@@@%%%);3333333333333333333333;)%%%%%%);3333333333333333333333;)%%%%@@@2......................................................................................2@@@@%%%);3333333333333333333333;)%%%%%%);3333333333333333333333;)%%%%%%);3333333333333333333333;)%%%%%%);3333333333333333333333;)%%%%%%);33333333333",
"%+'([]]]][{*&@@@%%%);3333333333333333333333;)%%%%%%);3333333333333333333333;)%%%%@@@2......................................................................................2@@@@%%%);3333333333333333333333;)%%%%%%);3333333333333333333333;)%%%%%%);3333333333333333333333;)%%%%%%);3333333333333333333333;)%%%%%%);33333333333",
"%+'(([]]][{*&@@@%%%);3333333333333333333333;)%%%%%%);3333333333333333333333;)%%%%@@@2......................................................................................2@@@@%%%);3333333333333333333333;)%%%%%%);3333333333333333333333;)%%%%%%);3333333333333333333333;)%%%%%%);3333333333333333333333;)%%%%%%);33333333333",
"%+'(([[[[[{*&@@@%%%);3333333333333333333333;)%%%%%%);3333333333333333333333;)%%%%@@@2......................................................................................2@@@@%%%);3333333333333333333333;)%%%%%%);3333333333333333333333;)%%%%%%);3333333333333333333333;)%%%%%%);3333333333333333333333;)%%%%%%);33333333333",
"%+'(([[[[[{*&@@@%%%);3333333333333333333333;)%%%%%%);3333333333333333333333;)%%%%@@@2......................................................................................2@@@@%%%);3333333333333333333333;)%%%%%%);3333333333333333333333;)%%%%%%);3333333333333333333333;)%%%%%%);3333333333333333333333;)%%%%%%);33333333333",
"%+'(([[[[[{*&@@@%%%);33333333333333333333__!)%%%%%%);33333333333333333333__!)%%%%@@@2......................................................................................2@@@@%%%);33333333333333333333__!)%%%%%%);33333333333333333333__!)%%%%%%);33333333333333333333__!)%%%%%%);33333333333333333333__!)%%%%%%);33333333333",
"%+'(([[[[[{*&@@@%%%)!_33333333333333333__!))%%%%%%%)!_33333333333333333__!))%%%%%@@@2......................................................................................2@@@@%%%)!_33333333333333333__!))%%%%%%%)!_33333333333333333__!))%%%%%%%)!_33333333333333333__!))%%%%%%%)!_33333333333333333__!))%%%%%%%)!_3333333333",
"%+'([{{{{{>^&@@@%%%%)!;;;;;;;;;;;;;;;;;!))%%%%%%%%%%)!;;;;;;;;;;;;;;;;;!))%%%%%%%@@@2.......................2222222222222222222222222222222222222222.......................2@@@@%%%%)!;;;;;;;;;;;;;;;;;!))%%%%%%%%%%)!;;;;;;;;;;;;;;;;;!))%%%%%%%%%%)!;;;;;;;;;;;;;;;;;!))%%%%%%%%%%)!;;;;;;;;;;;;;;;;;!))%%%%%%%%%%)!;;;;;;;;;;",
"%|1{>*****^}:@@@%%%%%)))))))))))))))))))%%%%%%%%%%%%%)))))))))))))))))))%%%%%%%%%@@@2......................22@@@@@@@@@@@@@@@@@@@@@@@@@@@@@@@@@@@@@@22......................2@@@@%%%%%)))))))))))))))))))%%%%%%%%%%%%%)))))))))))))))))))%%%%%%%%%%%%%)))))))))))))))))))%%%%%%%%%%%%%)))))))))))))))))))%%%%%%%%%%%%%)))))))))))",
"%)^}&&&&&&&:)@@@%%%%%%%%%%%%%%%%%%%%%%%%%%%%%%%%%%%%%%%%%%%%%%%%%%%%%%%%%%%%%%%%%@@@2......................2@@@@@@@@@@@@@@@@@@@@@@@@@@@@@@@@@@@@@@@@2......................2@@@@%%%%%%%%%%%%%%%%%%%%%%%%%%%%%%%%%%%%%%%%%%%%%%%%%%%%%%%%%%%%%%%%%%%%%%%%%%%%%%%%%%%%%%%%%%%%%%%%%%%%%%%%%%%%%%%%%%%%%%%%%%%%%%%%%%%%%%%%%%%%%%%%",
"%%%@@@@@@@@@@@@@%%%%%%%%%%%%%%%%%%%%%%%%%%%%%%%%%%%%%%%%%%%%%%%%%%%%%%%%%%%%%%%%%@@@2......................2@@@@@@@@@@@@@@@@@@@@@@@@@@@@@@@@@@@@@@@@2......................2@@@@%%%%%%%%%%%%%%%%%%%%%%%%%%%%%%%%%%%%%%%%%%%%%%%%%%%%%%%%%%%%%%%%%%%%%%%%%%%%%%%%%%%%%%%%%%%%%%%%%%%%%%%%%%%%%%%%%%%%%%%%%%%%%%%%%%%%%%%%%%%%%%%%",
"%%%@@@@@@@@@@@@@%%%%%%%%%%%%%%%%%%%%%%%%%%%%%%%%%%%%%%%%%%%%%%%%%%%%%%%%%%%%%%%%%@@@2......................2@@@@@@@@@@@@@@@@@@@@@@@@@@@@@@@@@@@@@@@@2......................2@@@@%%%%%%%%%%%%%%%%%%%%%%%%%%%%%%%%%%%%%%%%%%%%%%%%%%%%%%%%%%%%%%%%%%%%%%%%%%%%%%%%%%%%%%%%%%%%%%%%%%%%%%%%%%%%%%%%%%%%%%%%%%%%%%%%%%%%%%%%%%%%%%%%",
"%@@@@@@@@@@@@@@@%%%%%%%%%%%%%%%%%%%%%%%%%%%%%%%%%%%%%%%%%%%%%%%%%%%%%%%%%%%%%%%%%@@@2......................2@@@@%%%%%%%%%%%%%%%%%%%%%%%%%%%%%%%%%@@@2......................2@@@@%%%%%%%%%%%%%%%%%%%%%%%%%%%%%%%%%%%%%%%%%%%%%%%%%%%%%%%%%%%%%%%%%%%%%%%%%%%%%%%%%%%%%%%%%%%%%%%%%%%%%%%%%%%%%%%%%%%%%%%%%%%%%%%%%%%%%%%%%%%%%%%%",
"%%%%%%%%%%%%%%%%%%%%%%%%%%%%%%%%%%%%%%%%%%%%%%%%%%%%%%%%%%%%%%%%%%%%%%%%%%%%%%%%%@@@2......................2@@@@%%))))))))))))))))))))))))))))%%%@@@22....................22@@@@%%%%%%%%%%%%%%%%%%%%%%%%%%%%%%%%%%%%%%%%%%%%%%%%%%%%%%%%%%%%%%%%%%%%%%%%%%%%%%%%%%%%%%%%%%%%%%%%%%%%%%%%%%%%%%%%%%%%%%%%%%%%%%%%%%%%%%%%%%%%%%%%",
"%%%%%%%%%%%%%%%%%%%%%%%%%%%%%%%%%%%%%%%%%%%%%%%%%%%%%%%%%%%%%%%%%%%%%%%%%%%%%%%%%@@@2......................2@@@@%)++++++++++++++++++++++++++))@%%@@@222222222222222222222222@@@@%%%%%%%%%%%%%%%%%%%%%%%%%%%%%%%%%%%%%%%%%%%%%%%%%%%%%%%%%%%%%%%%%%%%%%%%%%%%%%%%%%%%%%%%%%%%%%%%%%%%%%%%%%%%%%%%%%%%%%%%%%%%%%%%%%%%%%%%%%%%%%%%",
")))))))))))%%%%%%%%%%%%%)))))))))))))))))))%%%%%%%%%%%%%)))))))))))))))))))%%%%%%@@@2......................2@@@@%)++))))))))))))))))))))))))))@@@@@@@222222222@@@@@22222222@@@@@%%%%%%%%)))))))))))))))))))%%%%%%%%%%%%%)))))))))))))))))))%%%%%%%%%%%%%%%%%%%%%%%%%%%%%%%%%%%%%%%%%%%%%)))))))))))))))))))%%%%%%%%%%%%%%%%%%%%%",
";;;;;;;;;;!)%%%%%%%%%%))!;;;;;;;;;;;;;;;;;!)%%%%%%%%%%))!;;;;;;;;;;;;;;;;;!)%%%%%@@@2......................2@@@@%)+)%%@@@@@@@@@@@@@@@@@@@@%@@@@@@@@@@@@@@@@@@@@@@@@@@@@@@@@@@@@@%%%%%%))!;;;;;;;;;;;;;;;;;!)%%%%%%%%%%))!;;;;;;;;;;;;;;;;;!)%%%%%%%%)))))))))))))))))))))))%%%%%%%%%%%))!;;;;;;;;;;;;;;;;;!)%%%%%%%%))))))))))))",
"3333333333_!)%%%%%%%))!__33333333333333333_!)%%%%%%%))!__33333333333333333_!)%%%%@@@2......................2@@@@%)+)%@@@@@222222222222@@@@@@@2@@@@@@@@@@--:!!!!!!!!!!:--@@@@@@@@%%%%))!__33333333333333333_!)%%%%%%%))!__33333333333333333_!)%%%%%%@)!!!!!!!!!!!!!!!!!!!!!+)%%%%%%%%))!__33333333333333333_!)%%%%%%@)!!!!!!!!!!!",
"33333333333;)%%%%%%)!__33333333333333333333;)%%%%%%)!__33333333333333333333;)%%%%@@@2......................2@@@@%)+)%@@@@2............2@@@@@@2@@@@@@@@@@:44!;;;;;;;;!44:@@@@@@@@%%%)!__33333333333333333333;)%%%%%%)!__33333333333333333333;)%%%%%%)!!!!!!!!!!!!!!!!!!!!!;!)%%%%%%%)!__33333333333333333333;)%%%%%%)!!!!!!!!!!!!",
"33333333333;)%%%%%%);3333333333333333333333;)%%%%%%);3333333333333333333333;)%%%%@@@2......................2@@@@%)+)@@@@@22...........2@@@@@@2@@@%@@@@@@:44;;;;;;;;;;44:@@@@@@@%%%%);3333333333333333333333;)%%%%%%);3333333333333333333333;)%%%%%%)!!:::::::::::::::::4!!!)%%%%%%%);3333333333333333333333;)%%%%%%)!!::::::::::",
"33333333333;)%%%%%%);3333333333333333333333;)%%%%%%);3333333333333333333333;)%%%%@@@2......................2@@@@%)+)@@@@@@22........22@@@@@@@2@@@%%%%%@@:4!;;;;;;;;;;!4:@@@%%%%%%%%);3333333333333333333333;)%%%%%%);3333333333333333333333;)%%%%%%@:44::::::::::::444;;;;!)%%%%%%%);3333333333333333333333;)%%%%%%@:44:::::::::",
"33333333333;)%%%%%%);3333333333333333333333;)%%%%%%);3333333333333333333333;)%%%%@@@2......................2@@@@%)+)@@22@@@@22222222@@@@22@@@2@@@%%%%%@@:4!;;;;;;;;;;!4:@@@%%%%%%%%);3333333333333333333333;)%%%%%%);3333333333333333333333;)%%%%%@@-############-#4~;33;;!)%%%%%%%);3333333333333333333333;)%%%%%@@-###########",
"33333333333;)%%%%%%);3333333333333333333333;)%%%%%%);3333333333333333333333;)%%%%@@@2......................2@@@@%)+)@2..2@@@@@@@@@@@@@@2..2@@2@@@%%%%%@@:4!;;;;;;;;;;!4:@@@%%%%%%%%);3333333333333333333333;)%%%%%%);3333333333333333333333;)%%%%%@@--##########---4~;33;;!)%%%%%%%);3333333333333333333333;)%%%%%@@--##########",
"33333333333;)%%%%%%);3333333333333333333333;)%%%%%%);3333333333333333333333;)%%%%@@@2......................2@@@@%)+)@2..2@@@@@@@@@@@@@@2..2@@2@@@%%%%%@@:4!;;;;;;;;;;!4:@@@%%%%%%%%);3333333333333333333333;)%%%%%%);3333333333333333333333;)%%%%%@@--##########---4~;;;;;!)%%%%%%%);3333333333333333333333;)%%%%%@@--##########",
";;_33333333;)%%%%%%);333333333__;;_33333333;)%%%%%%);333333333__;;_33333333;)%%%%@@@2......................2@@@@%)+)@2...2@@@@@@@@@@@@2...2@@2@@@%%%%%@@:4!;;;;;;;;;;!4:@@@%%%%%%%%);333333333__;;_33333333;)%%%%%%);333333333__;;_33333333;)%%%%%@@<<-----------<-4~~~~;;!)%%%%%%%);333333333__;;_33333333;)%%%%%@@<<----------",
"))!_3333333;)%%%%%%);33333333_!)))!_3333333;)%%%%%%);33333333_!)))!_3333333;)%%%%@@@2......................2@@@@%)+)@2...2@@@@@@@@@@@@2...2@@2@@@%%%%%@@:44;;;;;;;;;;44:@@@%%%%%%%%);33333333_!)))!_3333333;)%%%%%%);33333333_!)))!_3333333;)%%%%%@@<<<<<<<<<<<<,,-4~~~~~;!)%%%%%%%);33333333_!)))!_3333333;)%%%%%@@<<<<<<<<<<<<",
"%%);3333333;)%%%%%%);3333333_!)%%%);3333333;)%%%%%%);3333333_!)%%%);3333333;)%%%%@@@2......................2@@@@%)+)@2...2@@@@%))%@@@@2...2@@2@@@%%%%%%@:444!!!!!!!!!44:@@@%%%%%%%%);3333333_!)%%%);3333333;)%%%%%%);3333333_!)%%%);3333333;)%%%%%@@,,,,,,,,,,,,,,-4~/=/~;!)%%%%%%%);3333333_!)%%%);3333333;)%%%%%@@,,,,,,,,,,,,",
"%%);3333333;)%%%%%%);3333333;)%%%%);3333333;)%%%%%%);3333333;)%%%%);3333333;)%%%%@@@2......................2@@@@%)+)@2...2@@@@)++)@@@@2...2@@2@@@%%%%%%@:44444444444444:@@@%%%%%%%%);3333333;)%%%%);3333333;)%%%%%%);3333333;)%%%%);3333333;)%%%%%@@,,,,,,,,,,,,,,-4~===~;!)%%%%%%%);3333333;)%%%%);3333333;)%%%%%@@,,,,,,,,,,,,",
"%%);3333333;)%%%%%%);3333333;)%%%%);3333333;)%%%%%%);3333333;)%%%%);3333333;)%%%%@@@2......................2@@@@%)+)@2...2@@@@)++)@@@@2...2@@2@@@%%%%%@@:44444444444444:@%%%%%%%%%%);3333333;)%%%%);3333333;)%%%%%%);3333333;)%%%%);3333333;)%%%%%@@,,,,,,,,,,,,,,-4~===~;!)%%%%%%%);3333333;)%%%%);3333333;)%%%%%@@,,,,,,,,,,,,",
"%))_3333333;)%%%%%%);3333333;)%%%))_3333333;)%%%%%%);3333333;)%%%))_3333333;)%%%%@@@2......................2@@@@%)+)@2...2@@@@%))%@@@@2...2@@2@@@%%%%%@@:44!!!!!!!!!444:@%%%%%%%%%%);3333333;)%%%))_3333333;)%%%%%%);3333333;)%%%))_3333333;)%%%%%@@,,,,,,,,,,,,,,-4~/=/~;!)%%%%%%%);3333333;)%%%))_3333333;)%%%%%@@,,,,,,,,,,,,",
")!_33333333;)%%%%%%);3333333_!)))!_33333333;)%%%%%%);3333333_!)))!_33333333;)%%%%@@@2......................2@@@@%)+)@2...2@@@@@@@@@@@@2...2@@2@@@%%%%%@@:44;;;;;;;;;;44:@@@%%%%%%%%);3333333_!)))!_33333333;)%%%%%%);3333333_!)))!_33333333;)%%%%%@@,,,,,,,,,,,,,,-4~~~~~;!)%%%%%%%);3333333_!)))!_33333333;)%%%%%@@,,,,,,,,,,,,",
"__333333333;)%%%%%%);33333333_;;__333333333;)%%%%%%);33333333_;;__333333333;)%%%%@@@2......................2@@@@%)+)@2...2@@@@@@@@@@@@2...2@@2@@@%%%%%@@:44;;;;;;;;;;44:@@@%%%%%%%%);33333333_;;__333333333;)%%%%%%);33333333_;;__333333333;)%%%%%@@<<<<<<<<<<<<<<-4~~~~;;!)%%%%%%%);33333333_;;__333333333;)%%%%%@@<<<<<<<<<<<<",
"33333333333;)%%%%%%);3333333333333333333333;)%%%%%%);3333333333333333333333;)%%%%@@@2......................2@@@@%)+)@2..2@@@@@@@@@@@@@@2..2@@2@@@%%%%%@@:4!;;;;;;;;;;!4:@@@%%%%%%%%);3333333333333333333333;)%%%%%%);3333333333333333333333;)%%%%%@@<------------<-4~;;;;;!)%%%%%%%);3333333333333333333333;)%%%%%@@<-----------",
"33333333333;)%%%%%%);3333333333333333333333;)%%%%%%);3333333333333333333333;)%%%%@@@2......................2@@@@%)+)@2..2@@@@@@@@@@@@@@2..2@@2@@@%%%%%@@:4!;;;;;;;;;;!4:@@@%%%%%%%%);3333333333333333333333;)%%%%%%);3333333333333333333333;)%%%%%@@--##########---4~;33;;!)%%%%%%%);3333333333333333333333;)%%%%%@@--##########",
"33333333333;)%%%%%%);3333333333333333333333;)%%%%%%);3333333333333333333333;)%%%%@@@2......................2@@@@%)+)@@22@@@@22222222@@@@22@@@2@@@%%%%%@@:4!;;;;;;;;;;!4:@@@%%%%%%%%);3333333333333333333333;)%%%%%%);3333333333333333333333;)%%%%%@@-############-#4~;33;;!)%%%%%%%);3333333333333333333333;)%%%%%@@-###########",
"33333333333;)%%%%%%);3333333333333333333333;)%%%%%%);3333333333333333333333;)%%%%@@@2......................2@@@@%)+)@@@@@@22........22@@@@@@@2@@@%%%%%@@:4!;;;;;;;;;;!4:@@@%%%%%%%%);3333333333333333333333;)%%%%%%);3333333333333333333333;)%%%%%%@:44::::::::::::444;;;;!)%%%%%%%);3333333333333333333333;)%%%%%%@:44:::::::::",
"33333333333;)%%%%%%);3333333333333333333333;)%%%%%%);3333333333333333333333;)%%%%@@@2......................2@@@@%)+)@@@@@22...........2@@@@@@2@@@%%%%%@@:4!;;;;;;;;;;!4:@@@%%%%%%%%);3333333333333333333333;)%%%%%%);3333333333333333333333;)%%%%%%)!!:::::::::::::::::4!!!)%%%%%%%);3333333333333333333333;)%%%%%%)!!::::::::::",
"333333333__!)%%%%%%);33333333333333333333__!)%%%%%%);33333333333333333333__!)%%%%@@@2......................2@@@@%)+)%@@@@2............2@@@@@@2@@@%@@@@@@:44!;;;;;;;;!44:@@@@@@@%%%%);33333333333333333333__!)%%%%%%);33333333333333333333__!)%%%%%%)!!!!!!!!!!!!!!!!!!!!!;!)%%%%%%%);33333333333333333333__!)%%%%%%)!!!!!!!!!!!!",
"3333333__!))%%%%%%%)!_33333333333333333__!))%%%%%%%)!_33333333333333333__!))%%%%%@@@2......................2@@@@%)+)%@@@@@222222222222@@@@@@@2@@@@@@@@@@--:!!!!!!!!!!:--@@@@@@@@%%%)!_33333333333333333__!))%%%%%%%)!_33333333333333333__!))%%%%%%%@)!!!!!!!!!!!!!!!!!!!!!+)%%%%%%%)!_33333333333333333__!))%%%%%%%@)!!!!!!!!!!!",
";;;;;;;!))%%%%%%%%%%)!;;;;;;;;;;;;;;;;;!))%%%%%%%%%%)!;;;;;;;;;;;;;;;;;!))%%%%%%%@@@2......................2@@@@%)+)%@@@@@@@@@@@@@@@@@@@@@@@@2@@@@@@@@@@@@@@@@@@@@@@@@@@@@@@@@@@%%%%)!;;;;;;;;;;;;;;;;;!))%%%%%%%%%%)!;;;;;;;;;;;;;;;;;!))%%%%%%%%%%)))))))))))))))))))))))%%%%%%%%%)!;;;;;;;;;;;;;;;;;!))%%%%%%%%%%))))))))))))",
"))))))))%%%%%%%%%%%%%)))))))))))))))))))%%%%%%%%%%%%%)))))))))))))))))))%%%%%%%%%@@@2......................2@@@@%)))@@@@@@@@@@@@@@@@@@@@@@@@@2@@@@@@@222222@@@@@@@@@@222222@@@@@%%%%%)))))))))))))))))))%%%%%%%%%%%%%)))))))))))))))))))%%%%%%%%%%%%%%%%%%%%%%%%%%%%%%%%%%%%%%%%%%%%%)))))))))))))))))))%%%%%%%%%%%%%%%%%%%%%%%%",
"%%%%%%%%%%%%%%%%%%%%%%%%%%%%%%%%%%%%%%%%%%%%%%%%%%%%%%%%%%%%%%%%%%%%%%%%%%%%%%%%%@@@2......................2@@@@%)))@2222222222222222222222222@@@@@@222222222222222222222222@@@@%%%%%%%%%%%%%%%%%%%%%%%%%%%%%%%%%%%%%%%%%%%%%%%%%%%%%%%%%%%%%%%%%%%%%%%%%%%%%%%%%%%%%%%%%%%%%%%%%%%%%%%%%%%%%%%%%%%%%%%%%%%%%%%%%%%%%%%%%%%%%%%%",
"%%%%%%%%%%%%%%%%%%%%%%%%%%%%%%%%%%%%%%%%%%%%%%%%%%%%%%%%%%%%%%%%%%%%%%%%%%%%%%%%%@@@2......................2@@@@%%@@@@@@@@@@@@@@@@@@@@@@@@@@@@@@@@@@22....................22@@@@%%%%%%%%%%%%%%%%%%%%%%%%%%%%%%%%%%%%%%%%%%%%%%%%%%%%%%%%%%%%%%%%%%%%%%%%%%%%%%%%%%%%%%%%%%%%%%%%%%%%%%%%%%%%%%%%%%%%%%%%%%%%%%%%%%%%%%%%%%%%%%%%",
"%%%%%%%%%%%%%%%%%%%%%%%%%%%%%%%%%%%%%%%%%%%%%%%%%%%%%%%%%%%%%%%%%%%%%%%%%%%%%%%%%@@@2......................2@@@@%%%@@@@@@@@@@@@@@@@@@@@@@@@@@@@@@@@@2......................2@@@@%%%%%%%%%%%%%%%%%%%%%%%%%%%%%%%%%%%%%%%%%%%%%%%%%%%%%%%%%%%%%%%%%%%%%%%%%%%%%%%%%%%%%%%%%%%%%%%%%%%%%%%%%%%%%%%%%%%%%%%%%%%%%%%%%%%%%%%%%%%%%%%%",
"%%%%%%%%%%%%%%%%%%%%%%%%%%%%%%%%%%%%%%%%%%%%%%%%%%%%%%%%%%%%%%%%%%%%%%%%%%%%%%%%%@@@2......................2@@@@%@@@@@@@@@@@@@@@@@@@@@@@@@@@@@@@@@@@2......................2@@@@%%%%%%%%%%%%%%%%%%%%%%%%%%%%%%%%%%%%%%%%%%%%%%%%%%%%%%%%%%%%%%%%%%%%%%%%%%%%%%%%%%%%%%%%%%%%%%%%%%%%%%%%%%%%%%%%%%%%%%%%%%%%%%%%%%%%%%%%%%%%%%%%",
"%%|+++++++++|%%%%%%%%%%%%%%%%%%%%%%%%%%%%%%%%%%%%%%%%%%%%%%%%%%%%%%%%%%%%%%%%%%%%@@@2......................2@@@@@@@@@@@@@@@@@@@@@@@@@@@@@@@@@@@@@@@@2......................2@@@@%%%%%%%%%%%%%%%%%%%%%%%%%%%%%%%%%%%%%%%%%%%%%%%%%%%%%%%%%%%%%%%%%%%%%%%%%%%%%%%%%%%%%%%%%%%%%%%%%%%%%%%%%%%%%%%%%%%%%%%%%%%%%%%%%%%%%%%%%%%%%%%%",
"%|$''''''''$^)%%%%%%%%%%%%%%%%%%%%%%%%%%%%%%%%%%%%%%%%%%%%%%%%%%%%%%%%%%%%%%%%%%%@@@2......................2@@@@@@@@@@@@@@@@@@@@@@@@@@@@@@@@@@@@@@@@2......................2@@@@%%%%%%%%%%%%%%%%%%%%%%%%%%%%%%%%%%%%%%%%%%%%%%%%%%%%%%%%%%%%%%%%%%%%%%%%%%%%%%%%%%%%%%%%%%%%%%%%%%%%%%%%%%%%%%%%%%%%%%%%%%%%%%%%%%%%%%%%%%%%%%%%",
"%+'(((((((({^)%%%%%%%%%%)))))))))))))))))))%%%%%%%%%%%%%)))))))))))))))))))%%%%%%@@@2......................22@@@@@@@@@@@@@@@@@@@@@@@@@@@@@@@@@@@@@@22......................2@@@@%%%%%%%%)))))))))))))))))))%%%%%%%%%%%%%)))))))))))))))))))%%%%%%%%%%%%%)))))))))))))))))))%%%%%%%%%%%%%)))))))))))))))))))%%%%%%%%%%%%%))))))))",
"%+'((((((([>&@@@%%%%%%))!;;;;;;;;;;;;;;;;;!)%%%%%%%%%%))!;;;;;;;;;;;;;;;;;!)%%%%%@@@2.......................2222222222222222222222222222222222222222.......................2@@@@%%%%%%))!;;;;;;;;;;;;;;;;;!)%%%%%%%%%%))!;;;;;;;;;;;;;;;;;!)%%%%%%%%%%))!;;;;;;;;;;;;;;;;;!)%%%%%%%%%%))!;;;;;;;;;;;;;;;;;!)%%%%%%%%%%))!;;;;;;;",
"%+'(([[[[[{*&@@@%%%%))!__33333333333333333_!)%%%%%%%))!__33333333333333333_!)%%%%@@@2......................................................................................2@@@@%%%%))!__33333333333333333_!)%%%%%%%))!__33333333333333333_!)%%%%%%%))!__33333333333333333_!)%%%%%%%))!__33333333333333333_!)%%%%%%%))!__3333333",
"%+'(([[[[[{*&@@@%%%)!__33333333333333333333;)%%%%%%)!__33333333333333333333;)%%%%@@@2......................................................................................2@@@@%%%)!__33333333333333333333;)%%%%%%)!__33333333333333333333;)%%%%%%)!__33333333333333333333;)%%%%%%)!__33333333333333333333;)%%%%%%)!__333333333",
"%+'(([]]][{*&@@@%%%);3333333333333333333333;)%%%%%%);3333333333333333333333;)%%%%@@@2......................................................................................2@@@@%%%);3333333333333333333333;)%%%%%%);3333333333333333333333;)%%%%%%);3333333333333333333333;)%%%%%%);3333333333333333333333;)%%%%%%);33333333333",
"%+'([]]]][{*&@@@%%%);3333333333333333333333;)%%%%%%);3333333333333333333333;)%%%%@@@2......................................................................................2@@@@%%%);3333333333333333333333;)%%%%%%);3333333333333333333333;)%%%%%%);3333333333333333333333;)%%%%%%);3333333333333333333333;)%%%%%%);33333333333",
"%+'([]]]][{*&@@@%%%);3333333333333333333333;)%%%%%%);3333333333333333333333;)%%%%@@@2......................................................................................2@@@@%%%);3333333333333333333333;)%%%%%%);3333333333333333333333;)%%%%%%);3333333333333333333333;)%%%%%%);3333333333333333333333;)%%%%%%);33333333333",
"%+'(([]]][{*&@@@%%%);3333333333333333333333;)%%%%%%);3333333333333333333333;)%%%%@@@2......................................................................................2@@@@%%%);3333333333333333333333;)%%%%%%);3333333333333333333333;)%%%%%%);3333333333333333333333;)%%%%%%);3333333333333333333333;)%%%%%%);33333333333",
"%+'(([[[[[{*&@@@%%%);3333333333333333333333;)%%%%%%);3333333333333333333333;)%%%%@@@2......................................................................................2@@@@%%%);3333333333333333333333;)%%%%%%);3333333333333333333333;)%%%%%%);3333333333333333333333;)%%%%%%);3333333333333333333333;)%%%%%%);33333333333",
"%+'(([[[[[{*&@@@%%%);333333333__;;_33333333;)%%%%%%);333333333__;;_33333333;)%%%%@@@2......................................................................................2@@@@%%%);333333333__;;_33333333;)%%%%%%);333333333__;;_33333333;)%%%%%%);333333333__;;_33333333;)%%%%%%);333333333__;;_33333333;)%%%%%%);333333333__",
"%+'(([[[[[{*&@@@%%%);33333333_!)))!_3333333;)%%%%%%);33333333_!)))!_3333333;)%%%%@@@2......................................................................................2@@@@%%%);33333333_!)))!_3333333;)%%%%%%);33333333_!)))!_3333333;)%%%%%%);33333333_!)))!_3333333;)%%%%%%);33333333_!)))!_3333333;)%%%%%%);33333333_!)",
"%+'(([[[[[{*&@@@%%%);3333333_!)%%%);3333333;)%%%%%%);3333333_!)%%%);3333333;)%%%%@@@2......................................................................................2@@@@%%%);3333333_!)%%%);3333333;)%%%%%%);3333333_!)%%%);3333333;)%%%%%%);3333333_!)%%%);3333333;)%%%%%%);3333333_!)%%%);3333333;)%%%%%%);3333333_!)%",
"%+'(([[[[[{*&@@@%%%);3333333;)%%%%);3333333;)%%%%%%);3333333;)%%%%);3333333;)%%%%@@@2......................................................................................2@@@@%%%);3333333;)%%%%);3333333;)%%%%%%);3333333;)%%%%);3333333;)%%%%%%);3333333;)%%%%);3333333;)%%%%%%);3333333;)%%%%);3333333;)%%%%%%);3333333;)%%",
"%+'(([[[[[{*&@@@%%%);3333333;)%%%%);3333333;)%%%%%%);3333333;)%%%%);3333333;)%%%%@@@2......................................................................................2@@@@%%%);3333333;)%%%%);3333333;)%%%%%%);3333333;)%%%%);3333333;)%%%%%%);3333333;)%%%%);3333333;)%%%%%%);3333333;)%%%%);3333333;)%%%%%%);3333333;)%%",
"%+'(([[[[[{*&@@@%%%);3333333;)%%%))_3333333;)%%%%%%);3333333;)%%%))_3333333;)%%%%@@@2......................................................................................2@@@@%%%);3333333;)%%%))_3333333;)%%%%%%);3333333;)%%%))_3333333;)%%%%%%);3333333;)%%%))_3333333;)%%%%%%);3333333;)%%%))_3333333;)%%%%%%);3333333;)%%",
"%+'(([[[[[{*&@@@%%%);3333333_!)))!_33333333;)%%%%%%);3333333_!)))!_33333333;)%%%%@@@2......................................................................................2@@@@%%%);3333333_!)))!_33333333;)%%%%%%);3333333_!)))!_33333333;)%%%%%%);3333333_!)))!_33333333;)%%%%%%);3333333_!)))!_33333333;)%%%%%%);3333333_!))",
"%+'(([]]][{*&@@@%%%);33333333_;;__333333333;)%%%%%%);33333333_;;__333333333;)%%%%@@@2......................................................................................2@@@@%%%);33333333_;;__333333333;)%%%%%%);33333333_;;__333333333;)%%%%%%);33333333_;;__333333333;)%%%%%%);33333333_;;__333333333;)%%%%%%);33333333_;;",
"%+'([]]]][{*&@@@%%%);3333333333333333333333;)%%%%%%);3333333333333333333333;)%%%%@@@2......................................................................................2@@@@%%%);3333333333333333333333;)%%%%%%);3333333333333333333333;)%%%%%%);3333333333333333333333;)%%%%%%);3333333333333333333333;)%%%%%%);33333333333",
"%+'([]]]][{*&@@@%%%);3333333333333333333333;)%%%%%%);3333333333333333333333;)%%%%@@@2......................................................................................2@@@@%%%);3333333333333333333333;)%%%%%%);3333333333333333333333;)%%%%%%);3333333333333333333333;)%%%%%%);3333333333333333333333;)%%%%%%);33333333333",
"%+'(([]]][{*&@@@%%%);3333333333333333333333;)%%%%%%);3333333333333333333333;)%%%%@@@2......................................................................................2@@@@%%%);3333333333333333333333;)%%%%%%);3333333333333333333333;)%%%%%%);3333333333333333333333;)%%%%%%);3333333333333333333333;)%%%%%%);33333333333",
"%+'(([[[[[{*&@@@%%%);3333333333333333333333;)%%%%%%);3333333333333333333333;)%%%%@@@2......................................................................................2@@@@%%%);3333333333333333333333;)%%%%%%);3333333333333333333333;)%%%%%%);3333333333333333333333;)%%%%%%);3333333333333333333333;)%%%%%%);33333333333",
"%+'(([[[[[{*&@@@%%%);3333333333333333333333;)%%%%%%);3333333333333333333333;)%%%%@@@2......................................................................................2@@@@%%%);3333333333333333333333;)%%%%%%);3333333333333333333333;)%%%%%%);3333333333333333333333;)%%%%%%);3333333333333333333333;)%%%%%%);33333333333",
"%+'(([[[[[{*&@@@%%%);33333333333333333333__!)%%%%%%);33333333333333333333__!)%%%%@@@2......................................................................................2@@@@%%%);33333333333333333333__!)%%%%%%);33333333333333333333__!)%%%%%%);33333333333333333333__!)%%%%%%);33333333333333333333__!)%%%%%%);33333333333",
"%+'(([[[[[{*&@@@%%%)!_33333333333333333__!))%%%%%%%)!_33333333333333333__!))%%%%%@@@22....................................................................................22@@@@%%%)!_33333333333333333__!))%%%%%%%)!_33333333333333333__!))%%%%%%%)!_33333333333333333__!))%%%%%%%)!_33333333333333333__!))%%%%%%%)!_3333333333",
"%+'([{{{{{>^&@@@%%%%)!;;;;;;;;;;;;;;;;;!))%%%%%%%%%%)!;;;;;;;;;;;;;;;;;!))%%%%%%%@@@@22222222222222222222222222222222222222222222222222222222222222222222222222222222222222@@@@@%%%%)!;;;;;;;;;;;;;;;;;!))%%%%%%%%%%)!;;;;;;;;;;;;;;;;;!))%%%%%%%%%%)!;;;;;;;;;;;;;;;;;!))%%%%%%%%%%)!;;;;;;;;;;;;;;;;;!))%%%%%%%%%%)!;;;;;;;;;;",
"%|1{>*****^}:@@@%%%%%)))))))))))))))))))%%%%%%%%%%%%%)))))))))))))))))))%%%%%%%%%@@@@@@@@@@@@@@@@@@@@@@@@@@@@@@@@@@@@@@@@@@@@@@@@@@@@@@@@@@@@@@@@@@@@@@@@@@@@@@@@@@@@@@@@@@@@@@@%%%%%)))))))))))))))))))%%%%%%%%%%%%%)))))))))))))))))))%%%%%%%%%%%%%)))))))))))))))))))%%%%%%%%%%%%%)))))))))))))))))))%%%%%%%%%%%%%)))))))))))",
"%)^}&&&&&&&:)@@@%%%%%%%%%%%%%%%%%%%%%%%%%%%%%%%%%%%%%%%%%%%%%%%%%%%%%%%%%%%%%%%%%@@@@@@@@@@@@@@@@@@@@@@@@@@@@@@@@@@@@@@@@@@@@@@@@@@@@@@@@@@@@@@@@@@@@@@@@@@@@@@@@@@@@@@@@@@@@@@@%%%%%%%%%%%%%%%%%%%%%%%%%%%%%%%%%%%%%%%%%%%%%%%%%%%%%%%%%%%%%%%%%%%%%%%%%%%%%%%%%%%%%%%%%%%%%%%%%%%%%%%%%%%%%%%%%%%%%%%%%%%%%%%%%%%%%%%%%%%%%%%%",
"%%%@@@@@@@@@@@@@%%%%%%%%%%%%%%%%%%%%%%%%%%%%%%%%%%%%%%%%%%%%%%%%%%%%%%%%%%%%%%%%%@@@@@@@@@@@@@@@@@@@@@@@@@@@@@@@@@@@@@@@@@@@@@@@@@@@@@@@@@@@@@@@@@@@@@@@@@@@@@@@@@@@@@@@@@@@@@@@%%%%%%%%%%%%%%%%%%%%%%%%%%%%%%%%%%%%%%%%%%%%%%%%%%%%%%%%%%%%%%%%%%%%%%%%%%%%%%%%%%%%%%%%%%%%%%%%%%%%%%%%%%%%%%%%%%%%%%%%%%%%%%%%%%%%%%%%%%%%%%%%",
"%%%@@@@@@@@@@@@@%%%%%%%%%%%%%%%%%%%%%%%%%%%%%%%%%%%%%%%%%%%%%%%%%%%%%%%%%%%%%%%%%%@@@@@@@@@@@@@@@@@@@@@@@@@@@@@@@@@@@@@@@@@@@@@@@@@@@@@@@@@@@@@@@@@@@@@@@@@@@@@@@@@@@@@@@@@@@@@%%%%%%%%%%%%%%%%%%%%%%%%%%%%%%%%%%%%%%%%%%%%%%%%%%%%%%%%%%%%%%%%%%%%%%%%%%%%%%%%%%%%%%%%%%%%%%%%%%%%%%%%%%%%%%%%%%%%%%%%%%%%%%%%%%%%%%%%%%%%%%%%%",
"%@@@@@@@@@@@@@@@%%%%%%%%%%%%%%%%%%%%%%%%%%%%%%%%%%%%%%%%%%%%%%%%%%%%%%%%%%%%%%%%%%%%%%%%%%%%%%%%%%%%%%%%%%%%%%%%%%%%%%%%%%%%%%%%%%%%%%%%%%%%%%%%%%%%%%%%%%%%%%%%%%%%%%%%%%%%%%%%%%%%%%%%%%%%%%%%%%%%%%%%%%%%%%%%%%%%%%%%%%%%%%%%%%%%%%%%%%%%%%%%%%%%%%%%%%%%%%%%%%%%%%%%%%%%%%%%%%%%%%%%%%%%%%%%%%%%%%%%%%%%%%%%%%%%%%%%%%%%%%%%",
"%%%%%%%%%%%%%%%%%%%%%%%%%%%%%%%%%%%%%%%%%%%%%%%%%%%%%%%%%%%%%%%%%%%%%%%%%%%%%%%%%%%%%%%%%%%%%%%%%%%%%%%%%%%%%%%%%%%%%%%%%%%%%%%%%%%%%%%%%%%%%%%%%%%%%%%%%%%%%%%%%%%%%%%%%%%%%%%%%%%%%%%%%%%%%%%%%%%%%%%%%%%%%%%%%%%%%%%%%%%%%%%%%%%%%%%%%%%%%%%%%%%%%%%%%%%%%%%%%%%%%%%%%%%%%%%%%%%%%%%%%%%%%%%%%%%%%%%%%%%%%%%%%%%%%%%%%%%%%%%%",
"%%%%%%%%%%%%%%%%%%%%%%%%%%%%%%%%%%%%%%%%%%%%%%%%%%%%%%%%%%%%%%%%%%%%%%%%%%%%%%%%%%%%%%%%%%%%%%%%%%%%%%%%%%%%%%%%%%%%%%%%%%%%%%%%%%%%%%%%%%%%%%%%%%%%%%%%%%%%%%%%%%%%%%%%%%%%%%%%%%%%%%%%%%%%%%%%%%%%%%%%%%%%%%%%%%%%%%%%%%%%%%%%%%%%%%%%%%%%%%%%%%%%%%%%%%%%%%%%%%%%%%%%%%%%%%%%%%%%%%%%%%%%%%%%%%%%%%%%%%%%%%%%%%%%%%%%%%%%%%%%",
")))))))))))%%%%%%%%%%%%%)))))))))))))))))))%%%%%%%%%%%%%)))))))))))))))))))%%%%%%%%%%%%%)))))))))))))))))))%%%%%%%%%%%%%)))))))))))))))))))%%%%%%%%%%%%%)))))))))))))))))))%%%%%%%%%%%%%)))))))))))))))))))%%%%%%%%%%%%%)))))))))))))))))))%%%%%%%%%%%%%%%%%%%%%%%%%%%%%%%%%%%%%%%%%%%%%)))))))))))))))))))%%%%%%%%%%%%%%%%%%%%%",
";;;;;;;;;;!)%%%%%%%%%%))!;;;;;;;;;;;;;;;;;!)%%%%%%%%%%))!;;;;;;;;;;;;;;;;;!)%%%%%%%%%%))!;;;;;;;;;;;;;;;;;!)%%%%%%%%%%))!;;;;;;;;;;;;;;;;;!)%%%%%%%%%%))!;;;;;;;;;;;;;;;;;!)%%%%%%%%%%))!;;;;;;;;;;;;;;;;;!)%%%%%%%%%%))!;;;;;;;;;;;;;;;;;!)%%%%%%%%)))))))))))))))))))))))%%%%%%%%%%%))!;;;;;;;;;;;;;;;;;!)%%%%%%%%))))))))))))",
"3333333333_!)%%%%%%%))!__33333333333333333_!)%%%%%%%))!__33333333333333333_!)%%%%%%%))!__33333333333333333_!)%%%%%%%))!__33333333333333333_!)%%%%%%%))!__33333333333333333_!)%%%%%%%))!__33333333333333333_!)%%%%%%%))!__33333333333333333_!)%%%%%%@)!!!!!!!!!!!!!!!!!!!!!+)%%%%%%%%))!__33333333333333333_!)%%%%%%@)!!!!!!!!!!!",
"33333333333;)%%%%%%)!__33333333333333333333;)%%%%%%)!__33333333333333333333;)%%%%%%)!__33333333333333333333;)%%%%%%)!__33333333333333333333;)%%%%%%)!__33333333333333333333;)%%%%%%)!__33333333333333333333;)%%%%%%)!__33333333333333333333;)%%%%%%)!!!!!!!!!!!!!!!!!!!!!;!)%%%%%%%)!__33333333333333333333;)%%%%%%)!!!!!!!!!!!!",
"33333333333;)%%%%%%);3333333333333333333333;)%%%%%%);3333333333333333333333;)%%%%%%);3333333333333333333333;)%%%%%%);3333333333333333333333;)%%%%%%);3333333333333333333333;)%%%%%%);3333333333333333333333;)%%%%%%);3333333333333333333333;)%%%%%%)!!:::::::::::::::::4!!!)%%%%%%%);3333333333333333333333;)%%%%%%)!!::::::::::",
"33333333333;)%%%%%%);3333333333333333333333;)%%%%%%);3333333333333333333333;)%%%%%%);3333333333333333333333;)%%%%%%);3333333333333333333333;)%%%%%%);3333333333333333333333;)%%%%%%);3333333333333333333333;)%%%%%%);3333333333333333333333;)%%%%%%@:44::::::::::::444;;;;!)%%%%%%%);3333333333333333333333;)%%%%%%@:44:::::::::",
"33333333333;)%%%%%%);3333333333333333333333;)%%%%%%);3333333333333333333333;)%%%%%%);3333333333333333333333;)%%%%%%);3333333333333333333333;)%%%%%%);3333333333333333333333;)%%%%%%);3333333333333333333333;)%%%%%%);3333333333333333333333;)%%%%%@@-############-#4~;33;;!)%%%%%%%);3333333333333333333333;)%%%%%@@-###########",
"33333333333;)%%%%%%);3333333333333333333333;)%%%%%%);3333333333333333333333;)%%%%%%);3333333333333333333333;)%%%%%%);3333333333333333333333;)%%%%%%);3333333333333333333333;)%%%%%%);3333333333333333333333;)%%%%%%);3333333333333333333333;)%%%%%@@--##########---4~;33;;!)%%%%%%%);3333333333333333333333;)%%%%%@@--##########",
"33333333333;)%%%%%%);3333333333333333333333;)%%%%%%);3333333333333333333333;)%%%%%%);3333333333333333333333;)%%%%%%);3333333333333333333333;)%%%%%%);3333333333333333333333;)%%%%%%);3333333333333333333333;)%%%%%%);3333333333333333333333;)%%%%%@@--##########---4~;;;;;!)%%%%%%%);3333333333333333333333;)%%%%%@@--##########",
";;_33333333;)%%%%%%);333333333__;;_33333333;)%%%%%%);333333333__;;_33333333;)%%%%%%);333333333__;;_33333333;)%%%%%%);333333333__;;_33333333;)%%%%%%);333333333__;;_33333333;)%%%%%%);333333333__;;_33333333;)%%%%%%);333333333__;;_33333333;)%%%%%@@<<-----------<-4~~~~;;!)%%%%%%%);333333333__;;_33333333;)%%%%%@@<<----------",
"))!_3333333;)%%%%%%);33333333_!)))!_3333333;)%%%%%%);33333333_!)))!_3333333;)%%%%%%);33333333_!)))!_3333333;)%%%%%%);33333333_!)))!_3333333;)%%%%%%);33333333_!)))!_3333333;)%%%%%%);33333333_!)))!_3333333;)%%%%%%);33333333_!)))!_3333333;)%%%%%@@<<<<<<<<<<<<,,-4~~~~~;!)%%%%%%%);33333333_!)))!_3333333;)%%%%%@@<<<<<<<<<<<<",
"%%);3333333;)%%%%%%);3333333_!)%%%);3333333;)%%%%%%);3333333_!)%%%);3333333;)%%%%%%);3333333_!)%%%);3333333;)%%%%%%);3333333_!)%%%);3333333;)%%%%%%);3333333_!)%%%);3333333;)%%%%%%);3333333_!)%%%);3333333;)%%%%%%);3333333_!)%%%);3333333;)%%%%%@@,,,,,,,,,,,,,,-4~/=/~;!)%%%%%%%);3333333_!)%%%);3333333;)%%%%%@@,,,,,,,,,,,,",
"%%);3333333;)%%%%%%);3333333;)%%%%);3333333;)%%%%%%);3333333;)%%%%);3333333;)%%%%%%);3333333;)%%%%);3333333;)%%%%%%);3333333;)%%%%);3333333;)%%%%%%);3333333;)%%%%);3333333;)%%%%%%);3333333;)%%%%);3333333;)%%%%%%);3333333;)%%%%);3333333;)%%%%%@@,,,,,,,,,,,,,,-4~===~;!)%%%%%%%);3333333;)%%%%);3333333;)%%%%%@@,,,,,,,,,,,,",
"%%);3333333;)%%%%%%);3333333;)%%%%);3333333;)%%%%%%);3333333;)%%%%);3333333;)%%%%%%);3333333;)%%%%);3333333;)%%%%%%);3333333;)%%%%);3333333;)%%%%%%);3333333;)%%%%);3333333;)%%%%%%);3333333;)%%%%);3333333;)%%%%%%);3333333;)%%%%);3333333;)%%%%%@@,,,,,,,,,,,,,,-4~===~;!)%%%%%%%);3333333;)%%%%);3333333;)%%%%%@@,,,,,,,,,,,,",
"%))_3333333;)%%%%%%);3333333;)%%%))_3333333;)%%%%%%);3333333;)%%%))_3333333;)%%%%%%);3333333;)%%%))_3333333;)%%%%%%);3333333;)%%%))_3333333;)%%%%%%);3333333;)%%%))_3333333;)%%%%%%);3333333;)%%%))_3333333;)%%%%%%);3333333;)%%%))_3333333;)%%%%%@@,,,,,,,,,,,,,,-4~/=/~;!)%%%%%%%);3333333;)%%%))_3333333;)%%%%%@@,,,,,,,,,,,,",
")!_33333333;)%%%%%%);3333333_!)))!_33333333;)%%%%%%);3333333_!)))!_33333333;)%%%%%%);3333333_!)))!_33333333;)%%%%%%);3333333_!)))!_33333333;)%%%%%%);3333333_!)))!_33333333;)%%%%%%);3333333_!)))!_33333333;)%%%%%%);3333333_!)))!_33333333;)%%%%%@@,,,,,,,,,,,,,,-4~~~~~;!)%%%%%%%);3333333_!)))!_33333333;)%%%%%@@,,,,,,,,,,,,",
"__333333333;)%%%%%%);33333333_;;__333333333;)%%%%%%);33333333_;;__333333333;)%%%%%%);33333333_;;__333333333;)%%%%%%);33333333_;;__333333333;)%%%%%%);33333333_;;__333333333;)%%%%%%);33333333_;;__333333333;)%%%%%%);33333333_;;__333333333;)%%%%%@@<<<<<<<<<<<<<<-4~~~~;;!)%%%%%%%);33333333_;;__333333333;)%%%%%@@<<<<<<<<<<<<",
"33333333333;)%%%%%%);3333333333333333333333;)%%%%%%);3333333333333333333333;)%%%%%%);3333333333333333333333;)%%%%%%);3333333333333333333333;)%%%%%%);3333333333333333333333;)%%%%%%);3333333333333333333333;)%%%%%%);3333333333333333333333;)%%%%%@@<------------<-4~;;;;;!)%%%%%%%);3333333333333333333333;)%%%%%@@<-----------",
"33333333333;)%%%%%%);3333333333333333333333;)%%%%%%);3333333333333333333333;)%%%%%%);3333333333333333333333;)%%%%%%);3333333333333333333333;)%%%%%%);3333333333333333333333;)%%%%%%);3333333333333333333333;)%%%%%%);3333333333333333333333;)%%%%%@@--##########---4~;33;;!)%%%%%%%);3333333333333333333333;)%%%%%@@--##########",
"33333333333;)%%%%%%);3333333333333333333333;)%%%%%%);3333333333333333333333;)%%%%%%);3333333333333333333333;)%%%%%%);3333333333333333333333;)%%%%%%);3333333333333333333333;)%%%%%%);3333333333333333333333;)%%%%%%);3333333333333333333333;)%%%%%@@-############-#4~;33;;!)%%%%%%%);3333333333333333333333;)%%%%%@@-###########",
"33333333333;)%%%%%%);3333333333333333333333;)%%%%%%);3333333333333333333333;)%%%%%%);3333333333333333333333;)%%%%%%);3333333333333333333333;)%%%%%%);3333333333333333333333;)%%%%%%);3333333333333333333333;)%%%%%%);3333333333333333333333;)%%%%%%@:44::::::::::::444;;;;!)%%%%%%%);3333333333333333333333;)%%%%%%@:44:::::::::",
"33333333333;)%%%%%%);3333333333333333333333;)%%%%%%);3333333333333333333333;)%%%%%%);3333333333333333333333;)%%%%%%);3333333333333333333333;)%%%%%%);3333333333333333333333;)%%%%%%);3333333333333333333333;)%%%%%%);3333333333333333333333;)%%%%%%)!!:::::::::::::::::4!!!)%%%%%%%);3333333333333333333333;)%%%%%%)!!::::::::::",
"333333333__!)%%%%%%);33333333333333333333__!)%%%%%%);33333333333333333333__!)%%%%%%);33333333333333333333__!)%%%%%%);33333333333333333333__!)%%%%%%);33333333333333333333__!)%%%%%%);33333333333333333333__!)%%%%%%);33333333333333333333__!)%%%%%%)!!!!!!!!!!!!!!!!!!!!!;!)%%%%%%%);33333333333333333333__!)%%%%%%)!!!!!!!!!!!!",
"3333333__!))%%%%%%%)!_33333333333333333__!))%%%%%%%)!_33333333333333333__!))%%%%%%%)!_33333333333333333__!))%%%%%%%)!_33333333333333333__!))%%%%%%%)!_33333333333333333__!))%%%%%%%)!_33333333333333333__!))%%%%%%%)!_33333333333333333__!))%%%%%%%@)!!!!!!!!!!!!!!!!!!!!!+)%%%%%%%)!_33333333333333333__!))%%%%%%%@)!!!!!!!!!!!",
";;;;;;;!))%%%%%%%%%%)!;;;;;;;;;;;;;;;;;!))%%%%%%%%%%)!;;;;;;;;;;;;;;;;;!))%%%%%%%%%%)!;;;;;;;;;;;;;;;;;!))%%%%%%%%%%)!;;;;;;;;;;;;;;;;;!))%%%%%%%%%%)!;;;;;;;;;;;;;;;;;!))%%%%%%%%%%)!;;;;;;;;;;;;;;;;;!))%%%%%%%%%%)!;;;;;;;;;;;;;;;;;!))%%%%%%%%%%)))))))))))))))))))))))%%%%%%%%%)!;;;;;;;;;;;;;;;;;!))%%%%%%%%%%))))))))))))",
"))))))))%%%%%%%%%%%%%)))))))))))))))))))%%%%%%%%%%%%%)))))))))))))))))))%%%%%%%%%%%%%)))))))))))))))))))%%%%%%%%%%%%%)))))))))))))))))))%%%%%%%%%%%%%)))))))))))))))))))%%%%%%%%%%%%%)))))))))))))))))))%%%%%%%%%%%%%)))))))))))))))))))%%%%%%%%%%%%%%%%%%%%%%%%%%%%%%%%%%%%%%%%%%%%%)))))))))))))))))))%%%%%%%%%%%%%%%%%%%%%%%%",
"%%%%%%%%%%%%%%%%%%%%%%%%%%%%%%%%%%%%%%%%%%%%%%%%%%%%%%%%%%%%%%%%%%%%%%%%%%%%%%%%%%%%%%%%%%%%%%%%%%%%%%%%%%%%%%%%%%%%%%%%%%%%%%%%%%%%%%%%%%%%%%%%%%%%%%%%%%%%%%%%%%%%%%%%%%%%%%%%%%%%%%%%%%%%%%%%%%%%%%%%%%%%%%%%%%%%%%%%%%%%%%%%%%%%%%%%%%%%%%%%%%%%%%%%%%%%%%%%%%%%%%%%%%%%%%%%%%%%%%%%%%%%%%%%%%%%%%%%%%%%%%%%%%%%%%%%%%%%%%%%",
"%%%%%%%%%%%%%%%%%%%%%%%%%%%%%%%%%%%%%%%%%%%%%%%%%%%%%%%%%%%%%%%%%%%%%%%%%%%%%%%%%%%%%%%%%%%%%%%%%%%%%%%%%%%%%%%%%%%%%%%%%%%%%%%%%%%%%%%%%%%%%%%%%%%%%%%%%%%%%%%%%%%%%%%%%%%%%%%%%%%%%%%%%%%%%%%%%%%%%%%%%%%%%%%%%%%%%%%%%%%%%%%%%%%%%%%%%%%%%%%%%%%%%%%%%%%%%%%%%%%%%%%%%%%%%%%%%%%%%%%%%%%%%%%%%%%%%%%%%%%%%%%%%%%%%%%%%%%%%%%%",
"%%%%%%%%%%%%%%%%%%%%%%%%%%%%%%%%%%%%%%%%%%%%%%%%%%%%%%%%%%%%%%%%%%%%%%%%%%%%%%%%%%%%%%%%%%%%%%%%%%%%%%%%%%%%%%%%%%%%%%%%%%%%%%%%%%%%%%%%%%%%%%%%%%%%%%%%%%%%%%%%%%%%%%%%%%%%%%%%%%%%%%%%%%%%%%%%%%%%%%%%%%%%%%%%%%%%%%%%%%%%%%%%%%%%%%%%%%%%%%%%%%%%%%%%%%%%%%%%%%%%%%%%%%%%%%%%%%%%%%%%%%%%%%%%%%%%%%%%%%%%%%%%%%%%%%%%%%%%%%%%",
"%%%%%%%%%%%%%%%%%%%%%%%%%%%%%%%%%%%%%%%%%%%%%%%%%%%%%%%%%%%%%%%%%%%%%%%%%%%%%%%%%%%%%%%%%%%%%%%%%%%%%%%%%%%%%%%%%%%%%%%%%%%%%%%%%%%%%%%%%%%%%%%%%%%%%%%%%%%%%%%%%%%%%%%%%%%%%%%%%%%%%%%%%%%%%%%%%%%%%%%%%%%%%%%%%%%%%%%%%%%%%%%%%%%%%%%%%%%%%%%%%%%%%%%%%%%%%%%%%%%%%%%%%%%%%%%%%%%%%%%%%%%%%%%%%%%%%%%%%%%%%%%%%%%%%%%%%%%%%%%%",
"%%|+++++++++|%%%%%%%%%%%%%%%%%%%%%%%%%%%%%%%%%%%%%%%%%%%%%%%%%%%%%%%%%%%%%%%%%%%%%%%%%%%%%%%%%%%%%%%%%%%%%%%%%%%%%%%%%%%%%%%%%%%%%%%%%%%%%%%%%%%%%%%%%%%%%%%%%%%%%%%%%%%%%%%%%%%%%%%%%%%%%%%%%%%%%%%%%%%%%%%%%%%%%%%%%%%%%%%%%%%%%%%%%%%%%%%%%%%%%%%%%%%%%%%%%%%%%%%%%%%%%%%%%%%%%%%%%%%%%%%%%%%%%%%%%%%%%%%%%%%%%%%%%%%%%%%%%%%",
"%|$''''''''$^)%%%%%%%%%%%%%%%%%%%%%%%%%%%%%%%%%%%%%%%%%%%%%%%%%%%%%%%%%%%%%%%%%%%%%%%%%%%%%%%%%%%%%%%%%%%%%%%%%%%%%%%%%%%%%%%%%%%%%%%%%%%%%%%%%%%%%%%%%%%%%%%%%%%%%%%%%%%%%%%%%%%%%%%%%%%%%%%%%%%%%%%%%%%%%%%%%%%%%%%%%%%%%%%%%%%%%%%%%%%%%%%%%%%%%%%%%%%%%%%%%%%%%%%%%%%%%%%%%%%%%%%%%%%%%%%%%%%%%%%%%%%%%%%%%%%%%%%%%%%%%%%%%%",
"%+'(((((((({^)%%%%%%%%%%)))))))))))))))))))%%%%%%%%%%%%%)))))))))))))))))))%%%%%%%%%%%%%)))))))))))))))))))%%%%%%%%%%%%%)))))))))))))))))))%%%%%%%%%%%%%)))))))))))))))))))%%%%%%%%%%%%%)))))))))))))))))))%%%%%%%%%%%%%)))))))))))))))))))%%%%%%%%%%%%%%%%%%%%%%%%%%%%%%%%%%%%%%%%%%%%%)))))))))))))))))))%%%%%%%%%%%%%%%%%%%%%",
"%+'((((((([>&@@@%%%%%%))!;;;;;;;;;;;;;;;;;!)%%%%%%%%%%))!;;;;;;;;;;;;;;;;;!)%%%%%%%%%%))!;;;;;;;;;;;;;;;;;!)%%%%%%%%%%))!;;;;;;;;;;;;;;;;;!)%%%%%%%%%%))!;;;;;;;;;;;;;;;;;!)%%%%%%%%%%))!;;;;;;;;;;;;;;;;;!)%%%%%%%%%%))!;;;;;;;;;;;;;;;;;!)%%%%%%%%)))))))))))))))))))))))%%%%%%%%%%%))!;;;;;;;;;;;;;;;;;!)%%%%%%%%))))))))))))",
"%+'(([[[[[{*&@@@%%%%))!__33333333333333333_!)%%%%%%%))!__33333333333333333_!)%%%%%%%))!__33333333333333333_!)%%%%%%%))!__33333333333333333_!)%%%%%%%))!__33333333333333333_!)%%%%%%%))!__33333333333333333_!)%%%%%%%))!__33333333333333333_!)%%%%%%@)!!!!!!!!!!!!!!!!!!!!!+)%%%%%%%%))!__33333333333333333_!)%%%%%%@)!!!!!!!!!!!",
"%+'(([[[[[{*&@@@%%%)!__33333333333333333333;)%%%%%%)!__33333333333333333333;)%%%%%%)!__33333333333333333333;)%%%%%%)!__33333333333333333333;)%%%%%%)!__33333333333333333333;)%%%%%%)!__33333333333333333333;)%%%%%%)!__33333333333333333333;)%%%%%%)!!!!!!!!!!!!!!!!!!!!!;!)%%%%%%%)!__33333333333333333333;)%%%%%%)!!!!!!!!!!!!",
"%+'(([]]][{*&@@@%%%);3333333333333333333333;)%%%%%%);3333333333333333333333;)%%%%%%);3333333333333333333333;)%%%%%%);3333333333333333333333;)%%%%%%);3333333333333333333333;)%%%%%%);3333333333333333333333;)%%%%%%);3333333333333333333333;)%%%%%%)!!:::::::::::::::::4!!!)%%%%%%%);3333333333333333333333;)%%%%%%)!!::::::::::",
"%+'([]]]][{*&@@@%%%);3333333333333333333333;)%%%%%%);3333333333333333333333;)%%%%%%);3333333333333333333333;)%%%%%%);3333333333333333333333;)%%%%%%);3333333333333333333333;)%%%%%%);3333333333333333333333;)%%%%%%);3333333333333333333333;)%%%%%%@:44::::::::::::444;;;;!)%%%%%%%);3333333333333333333333;)%%%%%%@:44:::::::::",
"%+'([]]]][{*&@@@%%%);3333333333333333333333;)%%%%%%);3333333333333333333333;)%%%%%%);3333333333333333333333;)%%%%%%);3333333333333333333333;)%%%%%%);3333333333333333333333;)%%%%%%);3333333333333333333333;)%%%%%%);3333333333333333333333;)%%%%%@@-############-#4~;33;;!)%%%%%%%);3333333333333333333333;)%%%%%@@-###########",
"%+'(([]]][{*&@@@%%%);3333333333333333333333;)%%%%%%);3333333333333333333333;)%%%%%%);3333333333333333333333;)%%%%%%);3333333333333333333333;)%%%%%%);3333333333333333333333;)%%%%%%);3333333333333333333333;)%%%%%%);3333333333333333333333;)%%%%%@@--##########---4~;33;;!)%%%%%%%);3333333333333333333333;)%%%%%@@--##########",
"%+'(([[[[[{*&@@@%%%);3333333333333333333333;)%%%%%%);3333333333333333333333;)%%%%%%);3333333333333333333333;)%%%%%%);3333333333333333333333;)%%%%%%);3333333333333333333333;)%%%%%%);3333333333333333333333;)%%%%%%);3333333333333333333333;)%%%%%@@--##########---4~;;;;;!)%%%%%%%);3333333333333333333333;)%%%%%@@--##########",
"%+'(([[[[[{*&@@@%%%);333333333__;;_33333333;)%%%%%%);333333333__;;_33333333;)%%%%%%);333333333__;;_33333333;)%%%%%%);333333333__;;_33333333;)%%%%%%);333333333__;;_33333333;)%%%%%%);333333333__;;_33333333;)%%%%%%);333333333__;;_33333333;)%%%%%@@<<-----------<-4~~~~;;!)%%%%%%%);333333333__;;_33333333;)%%%%%@@<<----------",
"%+'(([[[[[{*&@@@%%%);33333333_!)))!_3333333;)%%%%%%);33333333_!)))!_3333333;)%%%%%%);33333333_!)))!_3333333;)%%%%%%);33333333_!)))!_3333333;)%%%%%%);33333333_!)))!_3333333;)%%%%%%);33333333_!)))!_3333333;)%%%%%%);33333333_!)))!_3333333;)%%%%%@@<<<<<<<<<<<<,,-4~~~~~;!)%%%%%%%);33333333_!)))!_3333333;)%%%%%@@<<<<<<<<<<<<",
"%+'(([[[[[{*&@@@%%%);3333333_!)%%%);3333333;)%%%%%%);3333333_!)%%%);3333333;)%%%%%%);3333333_!)%%%);3333333;)%%%%%%);3333333_!)%%%);3333333;)%%%%%%);3333333_!)%%%);3333333;)%%%%%%);3333333_!)%%%);3333333;)%%%%%%);3333333_!)%%%);3333333;)%%%%%@@,,,,,,,,,,,,,,-4~/=/~;!)%%%%%%%);3333333_!)%%%);3333333;)%%%%%@@,,,,,,,,,,,,",
"%+'(([[[[[{*&@@@%%%);3333333;)%%%%);3333333;)%%%%%%);3333333;)%%%%);3333333;)%%%%%%);3333333;)%%%%);3333333;)%%%%%%);3333333;)%%%%);3333333;)%%%%%%);3333333;)%%%%);3333333;)%%%%%%);3333333;)%%%%);3333333;)%%%%%%);3333333;)%%%%);3333333;)%%%%%@@,,,,,,,,,,,,,,-4~===~;!)%%%%%%%);3333333;)%%%%);3333333;)%%%%%@@,,,,,,,,,,,,",
"%+'(([[[[[{*&@@@%%%);3333333;)%%%%);3333333;)%%%%%%);3333333;)%%%%);3333333;)%%%%%%);3333333;)%%%%);3333333;)%%%%%%);3333333;)%%%%);3333333;)%%%%%%);3333333;)%%%%);3333333;)%%%%%%);3333333;)%%%%);3333333;)%%%%%%);3333333;)%%%%);3333333;)%%%%%@@,,,,,,,,,,,,,,-4~===~;!)%%%%%%%);3333333;)%%%%);3333333;)%%%%%@@,,,,,,,,,,,,",
"%+'(([[[[[{*&@@@%%%);3333333;)%%%))_3333333;)%%%%%%);3333333;)%%%))_3333333;)%%%%%%);3333333;)%%%))_3333333;)%%%%%%);3333333;)%%%))_3333333;)%%%%%%);3333333;)%%%))_3333333;)%%%%%%);3333333;)%%%))_3333333;)%%%%%%);3333333;)%%%))_3333333;)%%%%%@@,,,,,,,,,,,,,,-4~/=/~;!)%%%%%%%);3333333;)%%%))_3333333;)%%%%%@@,,,,,,,,,,,,",
"%+'(([[[[[{*&@@@%%%);3333333_!)))!_33333333;)%%%%%%);3333333_!)))!_33333333;)%%%%%%);3333333_!)))!_33333333;)%%%%%%);3333333_!)))!_33333333;)%%%%%%);3333333_!)))!_33333333;)%%%%%%);3333333_!)))!_33333333;)%%%%%%);3333333_!)))!_33333333;)%%%%%@@,,,,,,,,,,,,,,-4~~~~~;!)%%%%%%%);3333333_!)))!_33333333;)%%%%%@@,,,,,,,,,,,,",
"%+'(([]]][{*&@@@%%%);33333333_;;__333333333;)%%%%%%);33333333_;;__333333333;)%%%%%%);33333333_;;__333333333;)%%%%%%);33333333_;;__333333333;)%%%%%%);33333333_;;__333333333;)%%%%%%);33333333_;;__333333333;)%%%%%%);33333333_;;__333333333;)%%%%%@@<<<<<<<<<<<<<<-4~~~~;;!)%%%%%%%);33333333_;;__333333333;)%%%%%@@<<<<<<<<<<<<",
"%+'([]]]][{*&@@@%%%);3333333333333333333333;)%%%%%%);3333333333333333333333;)%%%%%%);3333333333333333333333;)%%%%%%);3333333333333333333333;)%%%%%%);3333333333333333333333;)%%%%%%);3333333333333333333333;)%%%%%%);3333333333333333333333;)%%%%%@@<------------<-4~;;;;;!)%%%%%%%);3333333333333333333333;)%%%%%@@<-----------",
"%+'([]]]][{*&@@@%%%);3333333333333333333333;)%%%%%%);3333333333333333333333;)%%%%%%);3333333333333333333333;)%%%%%%);3333333333333333333333;)%%%%%%);3333333333333333333333;)%%%%%%);3333333333333333333333;)%%%%%%);3333333333333333333333;)%%%%%@@--##########---4~;33;;!)%%%%%%%);3333333333333333333333;)%%%%%@@--##########",
"%+'(([]]][{*&@@@%%%);3333333333333333333333;)%%%%%%);3333333333333333333333;)%%%%%%);3333333333333333333333;)%%%%%%);3333333333333333333333;)%%%%%%);3333333333333333333333;)%%%%%%);3333333333333333333333;)%%%%%%);3333333333333333333333;)%%%%%@@-############-#4~;33;;!)%%%%%%%);3333333333333333333333;)%%%%%@@-###########",
"%+'(([[[[[{*&@@@%%%);3333333333333333333333;)%%%%%%);3333333333333333333333;)%%%%%%);3333333333333333333333;)%%%%%%);3333333333333333333333;)%%%%%%);3333333333333333333333;)%%%%%%);3333333333333333333333;)%%%%%%);3333333333333333333333;)%%%%%%@:44::::::::::::444;;;;!)%%%%%%%);3333333333333333333333;)%%%%%%@:44:::::::::",
"%+'(([[[[[{*&@@@%%%);3333333333333333333333;)%%%%%%);3333333333333333333333;)%%%%%%);3333333333333333333333;)%%%%%%);3333333333333333333333;)%%%%%%);3333333333333333333333;)%%%%%%);3333333333333333333333;)%%%%%%);3333333333333333333333;)%%%%%%)!!:::::::::::::::::4!!!)%%%%%%%);3333333333333333333333;)%%%%%%)!!::::::::::",
"%+'(([[[[[{*&@@@%%%);33333333333333333333__!)%%%%%%);33333333333333333333__!)%%%%%%);33333333333333333333__!)%%%%%%);33333333333333333333__!)%%%%%%);33333333333333333333__!)%%%%%%);33333333333333333333__!)%%%%%%);33333333333333333333__!)%%%%%%)!!!!!!!!!!!!!!!!!!!!!;!)%%%%%%%);33333333333333333333__!)%%%%%%)!!!!!!!!!!!!",
"%+'(([[[[[{*&@@@%%%)!_33333333333333333__!))%%%%%%%)!_33333333333333333__!))%%%%%%%)!_33333333333333333__!))%%%%%%%)!_33333333333333333__!))%%%%%%%)!_33333333333333333__!))%%%%%%%)!_33333333333333333__!))%%%%%%%)!_33333333333333333__!))%%%%%%%@)!!!!!!!!!!!!!!!!!!!!!+)%%%%%%%)!_33333333333333333__!))%%%%%%%@)!!!!!!!!!!!",
"%+'([{{{{{>^&@@@%%%%)!;;;;;;;;;;;;;;;;;!))%%%%%%%%%%)!;;;;;;;;;;;;;;;;;!))%%%%%%%%%%)!;;;;;;;;;;;;;;;;;!))%%%%%%%%%%)!;;;;;;;;;;;;;;;;;!))%%%%%%%%%%)!;;;;;;;;;;;;;;;;;!))%%%%%%%%%%)!;;;;;;;;;;;;;;;;;!))%%%%%%%%%%)!;;;;;;;;;;;;;;;;;!))%%%%%%%%%%)))))))))))))))))))))))%%%%%%%%%)!;;;;;;;;;;;;;;;;;!))%%%%%%%%%%))))))))))))",
"%|1{>*****^}:@@@%%%%%)))))))))))))))))))%%%%%%%%%%%%%)))))))))))))))))))%%%%%%%%%%%%%)))))))))))))))))))%%%%%%%%%%%%%)))))))))))))))))))%%%%%%%%%%%%%)))))))))))))))))))%%%%%%%%%%%%%)))))))))))))))))))%%%%%%%%%%%%%)))))))))))))))))))%%%%%%%%%%%%%%%%%%%%%%%%%%%%%%%%%%%%%%%%%%%%%)))))))))))))))))))%%%%%%%%%%%%%%%%%%%%%%%%",
"%)^}&&&&&&&:)@@@%%%%%%%%%%%%%%%%%%%%%%%%%%%%%%%%%%%%%%%%%%%%%%%%%%%%%%%%%%%%%%%%%%%%%%%%%%%%%%%%%%%%%%%%%%%%%%%%%%%%%%%%%%%%%%%%%%%%%%%%%%%%%%%%%%%%%%%%%%%%%%%%%%%%%%%%%%%%%%%%%%%%%%%%%%%%%%%%%%%%%%%%%%%%%%%%%%%%%%%%%%%%%%%%%%%%%%%%%%%%%%%%%%%%%%%%%%%%%%%%%%%%%%%%%%%%%%%%%%%%%%%%%%%%%%%%%%%%%%%%%%%%%%%%%%%%%%%%%%%%%%%%",
"%%%@@@@@@@@@@@@@%%%%%%%%%%%%%%%%%%%%%%%%%%%%%%%%%%%%%%%%%%%%%%%%%%%%%%%%%%%%%%%%%%%%%%%%%%%%%%%%%%%%%%%%%%%%%%%%%%%%%%%%%%%%%%%%%%%%%%%%%%%%%%%%%%%%%%%%%%%%%%%%%%%%%%%%%%%%%%%%%%%%%%%%%%%%%%%%%%%%%%%%%%%%%%%%%%%%%%%%%%%%%%%%%%%%%%%%%%%%%%%%%%%%%%%%%%%%%%%%%%%%%%%%%%%%%%%%%%%%%%%%%%%%%%%%%%%%%%%%%%%%%%%%%%%%%%%%%%%%%%%%",
"%%%@@@@@@@@@@@@@%%%%%%%%%%%%%%%%%%%%%%%%%%%%%%%%%%%%%%%%%%%%%%%%%%%%%%%%%%%%%%%%%%%%%%%%%%%%%%%%%%%%%%%%%%%%%%%%%%%%%%%%%%%%%%%%%%%%%%%%%%%%%%%%%%%%%%%%%%%%%%%%%%%%%%%%%%%%%%%%%%%%%%%%%%%%%%%%%%%%%%%%%%%%%%%%%%%%%%%%%%%%%%%%%%%%%%%%%%%%%%%%%%%%%%%%%%%%%%%%%%%%%%%%%%%%%%%%%%%%%%%%%%%%%%%%%%%%%%%%%%%%%%%%%%%%%%%%%%%%%%%%",
"%@@@@@@@@@@@@@@@%%%%%%%%%%%%%%%%%%%%%%%%%%%%%%%%%%%%%%%%%%%%%%%%%%%%%%%%%%%%%%%%%%%%%%%%%%%%%%%%%%%%%%%%%%%%%%%%%%%%%%%%%%%%%%%%%%%%%%%%%%%%%%%%%%%%%%%%%%%%%%%%%%%%%%%%%%%%%%%%%%%%%%%%%%%%%%%%%%%%%%%%%%%%%%%%%%%%%%%%%%%%%%%%%%%%%%%%%%%%%%%%%%%%%%%%%%%%%%%%%%%%%%%%%%%%%%%%%%%%%%%%%%%%%%%%%%%%%%%%%%%%%%%%%%%%%%%%%%%%%%%%",
"%%%%%%%%%%%%%%%%%%%%%%%%%%%%%%%%%%%%%%%%%%%%%%%%%%%%%%%%%%%%%%%%%%%%%%%%%%%%%%%%%%%%%%%%%%%%%%%%%%%%%%%%%%%%%%%%%%%%%%%%%%%%%%%%%%%%%%%%%%%%%%%%%%%%%%%%%%%%%%%%%%%%%%%%%%%%%%%%%%%%%%%%%%%%%%%%%%%%%%%%%%%%%%%%%%%%%%%%%%%%%%%%%%%%%%%%%%%%%%%%%%%%%%%%%%%%%%%%%%%%%%%%%%%%%%%%%%%%%%%%%%%%%%%%%%%%%%%%%%%%%%%%%%%%%%%%%%%%%%%%",
"%%%%%%%%%%%%%%%%%%%%%%%%%%%%%%%%%%%%%%%%%%%%%%%%%%%%%%%%%%%%%%%%%%%%%%%%%%%%%%%%%%%%%%%%%%%%%%%%%%%%%%%%%%%%%%%%%%%%%%%%%%%%%%%%%%%%%%%%%%%%%%%%%%%%%%%%%%%%%%%%%%%%%%%%%%%%%%%%%%%%%%%%%%%%%%%%%%%%%%%%%%%%%%%%%%%%%%%%%%%%%%%%%%%%%%%%%%%%%%%%%%%%%%%%%%%%%%%%%%%%%%%%%%%%%%%%%%%%%%%%%%%%%%%%%%%%%%%%%%%%%%%%%%%%%%%%%%%%%%%%",
")))))))))))%%%%%%%%%%%%%)))))))))))))))))))%%%%%%%%%%%%%)))))))))))))))))))%%%%%%%%%%%%%)))))))))))))))))))%%%%%%%%%%%%%)))))))))))))))))))%%%%%%%%%%%%%)))))))))))))))))))%%%%%%%%%%%%%)))))))))))))))))))%%%%%%%%%%%%%)))))))))))))))))))%%%%%%%%%%%%%)))))))))))))))))))%%%%%%%%%%%%%)))))))))))))))))))%%%%%%%%%%%%%))))))))",
";;;;;;;;;;!)%%%%%%%%%%))!;;;;;;;;;;;;;;;;;!)%%%%%%%%%%))!;;;;;;;;;;;;;;;;;!)%%%%%%%%%%))!;;;;;;;;;;;;;;;;;!)%%%%%%%%%%))!;;;;;;;;;;;;;;;;;!)%%%%%%%%%%))!;;;;;;;;;;;;;;;;;!)%%%%%%%%%%))!;;;;;;;;;;;;;;;;;!)%%%%%%%%%%))!;;;;;;;;;;;;;;;;;!)%%%%%%%%%%))!;;;;;;;;;;;;;;;;;!)%%%%%%%%%%))!;;;;;;;;;;;;;;;;;!)%%%%%%%%%%))!;;;;;;;",
"3333333333_!)%%%%%%%))!__33333333333333333_!)%%%%%%%))!__33333333333333333_!)%%%%%%%))!__33333333333333333_!)%%%%%%%))!__33333333333333333_!)%%%%%%%))!__33333333333333333_!)%%%%%%%))!__33333333333333333_!)%%%%%%%))!__33333333333333333_!)%%%%%%%))!__33333333333333333_!)%%%%%%%))!__33333333333333333_!)%%%%%%%))!__3333333",
"33333333333;)%%%%%%)!__33333333333333333333;)%%%%%%)!__33333333333333333333;)%%%%%%)!__33333333333333333333;)%%%%%%)!__33333333333333333333;)%%%%%%)!__33333333333333333333;)%%%%%%)!__33333333333333333333;)%%%%%%)!__33333333333333333333;)%%%%%%)!__33333333333333333333;)%%%%%%)!__33333333333333333333;)%%%%%%)!__333333333",
"33333333333;)%%%%%%);3333333333333333333333;)%%%%%%);3333333333333333333333;)%%%%%%);3333333333333333333333;)%%%%%%);3333333333333333333333;)%%%%%%);3333333333333333333333;)%%%%%%);3333333333333333333333;)%%%%%%);3333333333333333333333;)%%%%%%);3333333333333333333333;)%%%%%%);3333333333333333333333;)%%%%%%);33333333333",
"33333333333;)%%%%%%);3333333333333333333333;)%%%%%%);3333333333333333333333;)%%%%%%);3333333333333333333333;)%%%%%%);3333333333333333333333;)%%%%%%);3333333333333333333333;)%%%%%%);3333333333333333333333;)%%%%%%);3333333333333333333333;)%%%%%%);3333333333333333333333;)%%%%%%);3333333333333333333333;)%%%%%%);33333333333",
"33333333333;)%%%%%%);3333333333333333333333;)%%%%%%);3333333333333333333333;)%%%%%%);3333333333333333333333;)%%%%%%);3333333333333333333333;)%%%%%%);3333333333333333333333;)%%%%%%);3333333333333333333333;)%%%%%%);3333333333333333333333;)%%%%%%);3333333333333333333333;)%%%%%%);3333333333333333333333;)%%%%%%);33333333333",
"33333333333;)%%%%%%);3333333333333333333333;)%%%%%%);3333333333333333333333;)%%%%%%);3333333333333333333333;)%%%%%%);3333333333333333333333;)%%%%%%);3333333333333333333333;)%%%%%%);3333333333333333333333;)%%%%%%);3333333333333333333333;)%%%%%%);3333333333333333333333;)%%%%%%);3333333333333333333333;)%%%%%%);33333333333",
"33333333333;)%%%%%%);3333333333333333333333;)%%%%%%);3333333333333333333333;)%%%%%%);3333333333333333333333;)%%%%%%);3333333333333333333333;)%%%%%%);3333333333333333333333;)%%%%%%);3333333333333333333333;)%%%%%%);3333333333333333333333;)%%%%%%);3333333333333333333333;)%%%%%%);3333333333333333333333;)%%%%%%);33333333333",
";;_33333333;)%%%%%%);333333333__;;_33333333;)%%%%%%);333333333__;;_33333333;)%%%%%%);333333333__;;_33333333;)%%%%%%);333333333__;;_33333333;)%%%%%%);333333333__;;_33333333;)%%%%%%);333333333__;;_33333333;)%%%%%%);333333333__;;_33333333;)%%%%%%);333333333__;;_33333333;)%%%%%%);333333333__;;_33333333;)%%%%%%);333333333__",
"))!_3333333;)%%%%%%);33333333_!)))!_3333333;)%%%%%%);33333333_!)))!_3333333;)%%%%%%);33333333_!)))!_3333333;)%%%%%%);33333333_!)))!_3333333;)%%%%%%);33333333_!)))!_3333333;)%%%%%%);33333333_!)))!_3333333;)%%%%%%);33333333_!)))!_3333333;)%%%%%%);33333333_!)))!_3333333;)%%%%%%);33333333_!)))!_3333333;)%%%%%%);33333333_!)",
"%%);3333333;)%%%%%%);3333333_!)%%%);3333333;)%%%%%%);3333333_!)%%%);3333333;)%%%%%%);3333333_!)%%%);3333333;)%%%%%%);3333333_!)%%%);3333333;)%%%%%%);3333333_!)%%%);3333333;)%%%%%%);3333333_!)%%%);3333333;)%%%%%%);3333333_!)%%%);3333333;)%%%%%%);3333333_!)%%%);3333333;)%%%%%%);3333333_!)%%%);3333333;)%%%%%%);3333333_!)%",
"%%);3333333;)%%%%%%);3333333;)%%%%);3333333;)%%%%%%);3333333;)%%%%);3333333;)%%%%%%);3333333;)%%%%);3333333;)%%%%%%);3333333;)%%%%);3333333;)%%%%%%);3333333;)%%%%);3333333;)%%%%%%);3333333;)%%%%);3333333;)%%%%%%);3333333;)%%%%);3333333;)%%%%%%);3333333;)%%%%);3333333;)%%%%%%);3333333;)%%%%);3333333;)%%%%%%);3333333;)%%",
"%%);3333333;)%%%%%%);3333333;)%%%%);3333333;)%%%%%%);3333333;)%%%%);3333333;)%%%%%%);3333333;)%%%%);3333333;)%%%%%%);3333333;)%%%%);3333333;)%%%%%%);3333333;)%%%%);3333333;)%%%%%%);3333333;)%%%%);3333333;)%%%%%%);3333333;)%%%%);3333333;)%%%%%%);3333333;)%%%%);3333333;)%%%%%%);3333333;)%%%%);3333333;)%%%%%%);3333333;)%%",
"%))_3333333;)%%%%%%);3333333;)%%%))_3333333;)%%%%%%);3333333;)%%%))_3333333;)%%%%%%);3333333;)%%%))_3333333;)%%%%%%);3333333;)%%%))_3333333;)%%%%%%);3333333;)%%%))_3333333;)%%%%%%);3333333;)%%%))_3333333;)%%%%%%);3333333;)%%%))_3333333;)%%%%%%);3333333;)%%%))_3333333;)%%%%%%);3333333;)%%%))_3333333;)%%%%%%);3333333;)%%",
")!_33333333;)%%%%%%);3333333_!)))!_33333333;)%%%%%%);3333333_!)))!_33333333;)%%%%%%);3333333_!)))!_33333333;)%%%%%%);3333333_!)))!_33333333;)%%%%%%);3333333_!)))!_33333333;)%%%%%%);3333333_!)))!_33333333;)%%%%%%);3333333_!)))!_33333333;)%%%%%%);3333333_!)))!_33333333;)%%%%%%);3333333_!)))!_33333333;)%%%%%%);3333333_!))",
"__333333333;)%%%%%%);33333333_;;__333333333;)%%%%%%);33333333_;;__333333333;)%%%%%%);33333333_;;__333333333;)%%%%%%);33333333_;;__333333333;)%%%%%%);33333333_;;__333333333;)%%%%%%);33333333_;;__333333333;)%%%%%%);33333333_;;__333333333;)%%%%%%);33333333_;;__333333333;)%%%%%%);33333333_;;__333333333;)%%%%%%);33333333_;;"};
