{
  "exemptions": {
    "github.com/shirou/gopsutil": "https://github.com/shirou/gopsutil/issues/476",
    "github.com/rsc/devweb": "depends on /usr/share/openstack-pkg-tools/pkgos.make (todo investigate)",
    "github.com/coreos/discovery.etcd.io": "depends on /usr/share/openstack-pkg-tools/pkgos.make (todo investigate)",
    "github.com/googleapis/gnostic": "cannot find package github.com/googleapis/gnostic/compiler github.com/googleapis/gnostic/extensions github.com/googleapis/gnostic/jsonschema github.com/googleapis/gnostic/OpenAPIv2 github.com/googleapis/gnostic/OpenAPIv3 github.com/googleapis/gnostic/apps/petstore-builder (todo investigate)",
    "github.com/rkt/rkt": "cannot find package github.com/rkt/rkt/api/v1alpha github.com/rkt/rkt/rkt (todo investigate)",
    "github.com/docker/docker": "*** Missing ENGINE_GITCOMMIT - see debian/helpers/engine-gitcommits.  Stop. (todo investigate)"
  }
}
