module github.com/bufbuild/buf

go 1.14

require (
	github.com/bgentry/go-netrc v0.0.0-20140422174119-9fd32a8b3d3d
	github.com/gofrs/flock v0.8.0
	github.com/gofrs/uuid v3.3.0+incompatible
	github.com/golang/groupcache v0.0.0-20200121045136-8c9f03a8e57e // indirect
	github.com/golang/protobuf v1.4.3
	github.com/google/go-cmp v0.5.4
	github.com/jhump/protoreflect v1.8.1
	github.com/klauspost/compress v1.11.3
	github.com/klauspost/pgzip v1.2.5
	github.com/pkg/profile v1.5.0
	github.com/spf13/cobra v1.0.1-0.20201006035406-b97b5ead31f7
	github.com/spf13/pflag v1.0.5
	github.com/stretchr/testify v1.6.1
	go.opencensus.io v0.22.5
	go.uber.org/multierr v1.6.0
	go.uber.org/zap v1.16.0
	golang.org/x/sys v0.0.0-20201211090839-8ad439b19e0f // indirect
	golang.org/x/xerrors v0.0.0-20200804184101-5ec99f83aff1 // indirect
	google.golang.org/genproto v0.0.0-20201211151036-40ec1c210f7a // indirect
	google.golang.org/protobuf v1.25.1-0.20201020201750-d3470999428b
	gopkg.in/yaml.v3 v3.0.0-20200615113413-eeeca48fe776
)
